{"text_format":"1","workbook":"xlsx","n_sheets":5,"sheets":["Design","Important Notice and Disclaimer","Calculation","STD_VAL","SCH"],"not_rendered":{"charts":11,"images":26,"macros":1,"external_links":1,"defined_names":196,"comments":2,"pivot_tables":0},"unopened":[],"bounds":{"document_bytes":16777216,"sheet_cells":100000,"rows_first":2000,"rows_last":500,"rows_between":2000,"halvings":0,"cell_chars":16384,"cell_head_chars":4096},"cells_cut":0,"cells_raw":0,"read":"whole","date_system":"1900"}

{"sheet":"Design","index":0,"n_rows":95,"n_cols":11,"rows_kept":95,"cut":false,"hidden":false,"merged":[[2,10,2,11]]}
[]
[]
["About",null,"xx",null,null,null,null,"= Input Box",null,null,"TERMS OF USE"]
[]
[]
[null,"Step 1: Operating Specifications"]
[null,null,null,null,null,"Input Voltage – Min, VSUPPLY(min) ",5,"V"]
[null,null,null,null,null,"Input Voltage – Typ, VSUPPLY(typ)",12,"V"]
[null,null,null,null,null,"Input Voltage – Max, VSUPPLY(max)",36,"V"]
[null,null,null,null,null,"Output Voltage, VLOAD ",5,"V"]
[null,null,null,null,null,"Full Load Output Current, ILOAD",3,"A"]
[null,null,null,null,null,"Switching Frequency, fSW",1000,"kHz"]
[null,null,null,null,null,"Frequency Set Resistor, RRT ",{"$f":"Calculation!C40","v":15},"kΩ"]
[]
[null,"Step 2: User's  Selections"]
[null,null,null,null,null,"Device Selection","TPSM64406"]
[null,null,null,null,null,"Number of Phase","1-Phase"]
[null,null,null,null,null,"Switching Mode","FPWM"]
[null,null,null,null,null,"Output Voltage Feedback","External"]
[null,null,null,null,null,"Spread Spectrum","Disable"]
[null,null,null,null,null,"External Clock Synchronization","No"]
[null,null,null,null,null,"CFG Resistor (Primary Device)",{"$f":"Calculation!C34","v":0},"kΩ"]
[null,null,null,null,null,{"$f":"IF(OR(PH=1,PH=2),\"\",\"CFG Resistor (Secondary Device)\")","v":""},{"$f":"IF(OR(PH=1,PH=2),\"\",Calculation!C35)","v":""},{"$f":"IF(OR(PH=1,PH=2),\"\",\"kΩ\")","v":""}]
[]
[null,"Step 3: Internal Buck Inductor"]
[null,null,null,null,null,"Inductance for 35% Ripple Current at VIN(nom)",{"$f":"L.out_typical_calc*10^6","v":2.7777777777777781},"µH"]
[null,null,null,null,null,"Minimum Inductance",{"$f":"L.out_min*10^6","v":1.7045454545454546},"µH"]
[null,null,null,null,null," Internal Buck Inductance, LOUT",2.2000000000000002,"µH"]
[null,null,null,null,null,"Inductor DCR at 25°C",68,"mΩ"]
[null,null,null,null,null,"Peak Inductor Current at VSUPPLY(max) and Full Load",{"$f":"I.sat_softsaturation","v":3.9785353535353538},"Apk"]
[null,null,null,null,null,"Peak Inductor Current Limit at VSUPPLY(max)",{"$f":"I.sat_hardsaturation","v":6.9909595959595965},"Apk"]
[null,null,null,null,null,"Estimate Inductor Core Loss at VSUPPLY(typ)",0.3,"W"]
[null,null,null,null,null,"Frequency Stretch at VSUPPLY(max)",{"$f":"IF(t.on_ideal<0.00000006,\"can happen\", \"No\")","v":"No"}]
[null,null,null,null,null,"Dropout Mode Operation at VSUPPLY(min)",{"$f":"IF(t.off_150<0.0000001,\"can happen below \"&ROUND(V.supply_dropout,1)&\"V\",\"No\")","v":"can happen below 5.9V"}]
[]
[null,"Step 4: Default Component Values"]
[null,null,null,null,null,"VCC Capacitor, CVCC",{"$f":"C.vcc*1000000","v":1},"µF"]
[null,null,null,null,null,"Internal Boot Capacitor, CBOOT1, CBOOT2",{"$f":"C.cb1*1000000000","v":100},"nF"]
[null,null,null,null,null,"Internal VIN pin Capacitor, CVIN1_HF1, CVIN2_HF1",{"$f":"C.vin1_hf1*1000000000","v":100},"nF"]
[null,null,null,null,null,"VIN pin Capacitor, CVIN1_HF2, CVIN2_HF2",{"$f":"C.vin1_hf2*1000000","v":21.428571428571427},"µF"]
[null,null,null,null,null,"Power Good Pull-up Resistor, RPG1, RPG2",{"$f":"R.pg1/1000","v":100},"kΩ"]
[null,null,null,null,null,"VOSNS Capacitor, CVOSNS",100,"nF"]
[null,"Step 5: Enable, Line UVLO"]
[null,null,null,null,null,"Desired Start-up Threshold",5.9,"V"]
[null,null,null,null,null,"UVLO Divider Upper Resistance, RENT",100,"kΩ"]
[null,null,null,null,null,"UVLO Divider Lower Resistance, RENB",{"$f":"Calculation!C90","v":30.1},"kΩ"]
[null,null,null,null,null,"Estimated Shutdown Threshold",{"$f":"V.shutdown","v":4.3222591362126241},"V"]
[]
[null,"Step 6: Output Capacitors"]
[null,null,null,null,null,"Desired Undershoot during 50% Load Transient in FPWM",5,"%"]
[null,null,null,null,null,"Desired Crossover Frequency",40,"kHz"]
[null,null,null,null,null,"Minimum Derated Output Capacitance ",{"$f":"C.out_min_calc*1000000","v":23.873246430472193},"µF"]
[null,null,null,null,null," Rated Output Capacitance",45,"µF"]
[null,null,null,null,null,"Derating Factor",0.7]
[null,null,null,null,null,"Derated Output Capacitance",{"$f":"C.out*1000000","v":31.499999999999993},"µF"]
[null,null,null,null,null,"Effective Output Capacitor ESR",1,"mΩ"]
[null,null,null,null,null,"Estimated Output Voltage Ripple at VSUPPLUY(MAX)",{"$f":"ΔV.load_pkpk_nph_calc_simple*1000","v":8.0089492121812142},"mVpk-pk"]
[null,null,null,null,null,"Estimated Min Overshoot (Full-load to no-load if switching stops)",{"$f":"ΔV.overshoot_typical_calc/V.load*100","v":1.2571428571428571},"%"]
[null,null,null,null,null,"Estimated Max Undershoot (No-load to full-load in FPWM)",{"$f":"ΔV.undershoot_typical_calc1/V.load*100","v":5.5365233426179126},"%"]
[]
[null,{"$f":"IF(PH=1,\"Step 7: Internal Soft-start time is typically 4.5ms\", \"Step 7: Soft-start for Multi-phase Config\")","v":"Step 7: Internal Soft-start time is typically 4.5ms"}]
[null,null,null,null,null,{"$f":"IF(PH=1,\"\",\"Minimum Soft-start Capacitance\")","v":""},{"$f":"IF(PH=1,\"\",C.ss_min*1000000000)","v":""},{"$f":"IF(PH=1,\"\",\"nF\")","v":""}]
[null,null,null,null,null,{"$f":"IF(PH=1,\"\",\"Soft-start Capacitance\")","v":""},100,{"$f":"IF(PH=1,\"\",\"nF\")","v":""}]
[null,null,null,null,null,{"$f":"IF(PH=1,\"\",\"Soft-start Time\")","v":""},{"$f":"G63*0.8/(0.00002)/1000","v":3999.9999999999995},{"$f":"IF(PH=1,\"\",\"us\")","v":""}]
[null,{"$f":"IF(IntFB=1,\"Step 8: Using Internal Feedback\",\"Step 8: Feedback Network\")","v":"Step 8: Feedback Network"}]
[null,null,null,null,null,"Upper Feedback Resistance1, RLP",0.01,{"$f":"IF(IntFB=1,\"\",\"kΩ\")","v":"kΩ"}]
[null,null,null,null,null,"Upper Feedback Resistance2, RFBT",100,{"$f":"IF(IntFB=1,\"\",\"kΩ\")","v":"kΩ"}]
[null,null,null,null,null,"Feedforward Capacitance, CFF",10,{"$f":"IF(IntFB=1,\"\",\"pF\")","v":"pF"}]
[null,null,null,null,null,"Lower Standard Feedback Resistance, RFBB",{"$f":"R.fb_bot/1000","v":19.049523809523809},{"$f":"IF(IntFB=1,\"\",\"kΩ\")","v":"kΩ"}]
[null,null,null,null,null,"Selected CFF Zero Frequency ",{"$f":"1/(2*3.141592*G67*10^3*G68*10^-12)/1000","v":159.15497620314795},{"$f":"IF(IntFB=1,\"\",\"kHz\")","v":"kHz"}]
[]
[]
[null,{"$f":"IF(PH=1,\"Step 9: Using Internal Loop Compensation\",\"Step 9: External Loop Compensation Design\")","v":"Step 9: Using Internal Loop Compensation"}]
[null,null,null,null,null,"Desired Maximum RCOMP Value",{"$f":"R.comp_desired_max/1000","v":620.43979937304061},"kΩ"]
[null,null,null,null,null,"Desired Minimum CCOMP Value",{"$f":"C.comp_desired_min*1000000000","v":6.4129902838267042E-2},"nF"]
[null,null,null,null,null,"Desired CHF Value",{"$f":"C.hf_desired_min*1000000000000","v":5.0770437408804193E-2},"pF"]
[null,null,null,null,null,"Desired Compensation Zero Frequency",{"$f":"f.ea_zero_desired/1000","v":4},"kHz"]
[null,null,null,null,null,"Desired Compensation Pole Frequency",{"$f":"f.ea_pole_desired/1000","v":5052.5389270840642},"kHz"]
[null,null,null,null,null,"Selected RCOMP Value",{"$f":"R.comp_desired_max/1000","v":620.43979937304061},"kΩ"]
[null,null,null,null,null,"Selected CCOMP Value",{"$f":"C.comp_desired_min*1000000000","v":6.4129902838267042E-2},"nF"]
[null,null,null,null,null,"Selected CHF Value",{"$f":"C.hf_desired_min*1000000000000","v":5.0770437408804193E-2},"pF"]
[null,null,null,null,null," Selected Compensation Zero Frequency",{"$f":"f.ea_zero_estimated/1000","v":9.210357419163655},"kHz"]
[null,null,null,null,null,"Selected Compensation Pole Frequency",{"$f":"f.ea_pole_estimated/1000","v":1357.0675407114056},"kHz"]
[]
[]
[null,"Step 9: Power Loss & Thermals"]
[null,null,null,null,null,"Maximum Ambient Temperature, TAMB_MAX",25,"°C"]
[null,null,null,null,null,"Air Flow",20,"LFM"]
[null,null,null,null,null,"Estimated Max Junction Temperature, TJ at VSUPPLY(typ)",{"$f":"Calculation!AO328","v":35.505530125865619},"°C"]
[]
[null,"Step 10: Input Capacitors"]
[null,null,null,null,null,"Input Voltage Ripple Spec",35,"mVpk-pk"]
[null,null,null,null,null,"Minimum Derated Input Capacitance, CVIN1_HF2, CVIN2_HF2",{"$f":"Calculation!F191 *1000000","v":21.428571428571427},"µF"]
[null,null,null,null,null,"Maximum Input Capacitor RMS Current",{"$f":"Calculation!C194","v":1.5},"A(rms)"]
[null,null,null,null,null,"Maximum Input Capacitor ESR ",{"$f":"Calculation!F201","v":11.666666666666668},"mΩ"]

{"sheet":"Important Notice and Disclaimer","index":1,"n_rows":0,"n_cols":0,"rows_kept":0,"cut":false,"hidden":false,"merged":[]}

{"sheet":"Calculation","index":2,"n_rows":487,"n_cols":91,"rows_kept":487,"cut":false,"hidden":true,"merged":[]}
["Macro should be enabled "]
[null,null,null,"User Input"]
[null,null,null,"Calc suggestion / User Input /Output"]
[null,null,null,"FixedParameters"]
[]
["Definitions"]
[null,"Name","Number ","Displayed Unit","multiple ","Value","Arial 8pt"]
[null,"π",null,null,null,3.1415920000000002]
[null,null,null,null,null,null,{"$f":"Design!G16","v":"TPSM64406"}]
["Electrical Specifications Mode/Config Selection"]
[null,"Name","Number ","Displayed Unit","multiple ","Value","Arial 8pt"]
["Min 3.7V","V.supply_min",{"$f":"Design!G7","v":5},null,1,{"$f":"C12*E12","v":5}]
[null,"V.supply_typ",{"$f":"Design!G8","v":12},null,1,12,{"$f":"\" = \"&V.supply_typ&\" Vtyp\"","v":" = 12 Vtyp"}]
["Max 36V","V.supply_max",{"$f":"Design!G9","v":36},null,1,36]
["Min 0.8V,  Max 16V","V.load",{"$f":"Design!G10","v":5},null,1,5,{"$f":"\" = \"&V.load&\" V\"","v":" = 5 V"}]
["Max 12A","I.load_nph",{"$f":"Design!G11","v":3},null,1,3]
["Min 100k, Max 2.2M","f.sw",{"$f":"Design!G12","v":1000},"kHz",{"$f":"1000","v":1000},{"$f":"C17*E17","v":1000000}]
[null,"P.out",{"$f":"V.load*I.load_nph","v":15},null,1,{"$f":"C18*E18","v":15}]
[null,"R.load_nph",{"$f":"V.load/I.load_nph","v":1.6666666666666667},null,1,{"$f":"C19*E19","v":1.6666666666666667}]
["Use dropdown menu","I.rated",{"$f":"IF(Design!G16=STD_VAL!C3,STD_VAL!D3,IF(Design!G16=STD_VAL!C4,STD_VAL!D4,IF(Design!G16=STD_VAL!C5,STD_VAL!D5,444)))","v":3},null,1,{"$f":"C20*E20","v":3},null,"PH_NEW"]
["Use dropdown menu","PH",{"$f":"IF(Design!G17=STD_VAL!C8,STD_VAL!D8,IF(Design!G17=STD_VAL!C9,STD_VAL!D9,IF(Design!G17=STD_VAL!C10,STD_VAL!D10,IF(Design!G17=STD_VAL!C11,STD_VAL!D11,444))))","v":1},null,1,1,null,{"$f":"MIN(2,C21)","v":1}]
["Use dropdown menu","FPWM",{"$f":"IF(Design!G18=STD_VAL!C14,STD_VAL!D14,IF(Design!G18=STD_VAL!C15,STD_VAL!D15,444))","v":1},null,1,1]
["Use dropdown menu","IntFB",{"$f":"IF(Design!G19=STD_VAL!C18,STD_VAL!D18,IF(Design!G19=STD_VAL!C19,STD_VAL!D19,444))","v":0},null,1,0]
["??????? Should be 1 always","ExtBIAS",1,null,1,1]
["Use dropdown menu","SPSP",{"$f":"IF(Design!G20=STD_VAL!C22,STD_VAL!D22,IF(Design!G20=STD_VAL!C23,STD_VAL!D23,444))","v":0},null,1,0]
["Use dropdown menu","SYNC",{"$f":"IF(Design!G21=STD_VAL!C26,STD_VAL!D26,IF(Design!G21=STD_VAL!C27,STD_VAL!D27,444))","v":0},null,1,0,{"$f":"IF(SYNC=1,\"External SYNC Pulse\",IF(FPWM=1,\"Connect to VCC\", \"Connect to AGND\"))","v":"Connect to VCC"}]
[null,"I.load_1ph",{"$f":"I.load_nph/PH","v":3},null,1,3]
[null,"R.load_1ph",{"$f":"V.load/I.load_1ph","v":1.6666666666666667},null,1,1.6666666666666667]
["Multi-phase effective frequecy","f.sw_nph",{"$f":"f.sw*PH","v":1000000},null,1,1000000]
[null,"IntEA",{"$f":"IF(PH=1,1, 0)","v":1},null,1,{"$f":"C30*E30","v":1}]
[null,"RatedIout",{"$f":"I.rated*PH","v":3},null,1,3]
["Rcfg selection (Recommend both Primary and Secondary if N-phase)"]
[null,"Name","Number ","Final Unit","multiple ","Value","Arial 8pt"]
[null,"R.cfg_master",{"$f":"IF(SPSP=0,IF(PH=1,0,IF(PH=2,9.53,IF(PH=4,19.1,IF(PH=6,29.4,4444)))),IF(PH=1,121,IF(PH=2,56.2,IF(PH=4,73.2,IF(PH=6,93.1,4444)))))","v":0},"kOhm",1000,{"$f":"C34*E34","v":0},{"$f":"C34&\"kΩ\"","v":"0kΩ"}]
[null,"R.cfg_slave",{"$f":"IF(PH<>1, 41.2, \"N/A\")","v":"N/A"},"kOhm",1000,{"$f":"C35*E35","v":{"$error":"#VALUE!"}},{"$f":"C35&\"kΩ\"","v":"N/AkΩ"}]
[]
["Rt selection"]
[null,"Name","Number ","Final Unit","multiple ","Value","Arial 8pt"]
[null,"R.t_calc",{"$f":"14.925*10^9/(f.sw-20298)","v":15234.224284527336},null,1,{"$f":"C39*E39","v":15234.224284527336}]
[null,"R.t_std",{"$f":"IF(ISNUMBER(R.t_calc/1000),INDEX(STD_VAL!$A$1:$A$769,MATCH(R.t_calc/1000,STD_VAL!$A$1:$A$769)),R.t_calc/1000)","v":15},"kOhm",1000,{"$f":"C40*E40","v":15000},{"$f":"C40&\"kΩ\"","v":"15kΩ"}]
[]
["Lout Inductor selection"]
[null,"Name","Number ","Final Unit","multiple ","Value","Arial 8pt"]
[null,"RR.desired",0.35,null,1,{"$f":"C44*E44","v":0.35}]
["B0 =B1 = 0.32","V.slope_min",0.32,null,1,0.32]
["B0 = B1 = 0.35","V.slope_max",0.35,null,1,0.35]
[null,"I.ncl_th_min",2,null,1,2]
[null,"I.pcl_th_min",4.68,null,1,4.68]
[null,"I.pcl_th_max",6.8,null,1,6.8]
[null,"L.out_typical_calc",{"$f":"(V.supply_typ-V.load)/RR.desired/I.load_1ph*(V.load/V.supply_typ*1/f.sw)","v":2.7777777777777779E-6},null,1,{"$f":"C50*E50","v":2.7777777777777779E-6}]
[null,"Margin",1.2,null,1,{"$f":"C51*E51","v":1.2}]
["No sub-harmonic OSC","L.out_min1",{"$f":"V.load/f.sw*1/11*6/I.rated*1/V.slope_min*1/2*Margin","v":1.7045454545454546E-6},null,1,{"$f":"C52*E52","v":1.7045454545454546E-6}]
["No DCM  at VSUPPLY_MAX and full load ","L.out_min2",{"$f":"(V.supply_max-V.load)/(2*I.load_1ph)*(V.load/V.supply_max*1/f.sw)","v":7.1759259259259276E-7},null,1,7.1759259259259276E-7]
["No negative current limit at VSUPPLY_MAX in FPWM (0 if AUTO)","L.out_min3",{"$f":"(V.supply_max-V.load)/(I.ncl_th_min*2)*V.load/(V.supply_max*f.sw)","v":1.076388888888889E-6},null,1,1.076388888888889E-6]
["No peak current limit at VSUPPLY_MIN","L.out_min4",{"$f":"(V.supply_min-V.load)/(I.pcl_th_min*(1-V.slope_max*V.load/V.supply_min)-I.load_1ph)*(V.load/V.supply_min/f.sw)*Margin","v":0},null,1,0]
[null,"L.out_min",{"$f":"MAX(C52:C55)","v":1.7045454545454546E-6},null,1,{"$f":"C56*E56","v":1.7045454545454546E-6}]
[null,"L.out",{"$f":"Design!G28","v":2.2000000000000002},"uH",{"$f":"0.000001","v":9.9999999999999995E-7},{"$f":"C57*E57","v":2.2000000000000001E-6},{"$f":"C57&\"µH\"","v":"2.2µH"}]
[null,"t.blank_max",3.5000000000000002E-8,null,1,{"$f":"C58*E58","v":3.5000000000000002E-8}]
["Peak inductor current at VSUPPLY_MAX, Minimum Isat for soft saturation core ","I.sat_softsaturation",{"$f":"I.load_1ph+(V.supply_max-V.load)/L.out*V.load/V.supply_max/f.sw/2","v":3.9785353535353538},null,1,{"$f":"C59*E59","v":3.9785353535353538}]
["Peak current limit at VSUPPLY_MAX, Minimum Isat for ferrite core, use dropdown","I.sat_hardsaturation",{"$f":"I.pcl_th_max*(1-V.slope_min*V.load/V.supply_max)+t.blank_max*(V.supply_max-V.load)/L.out","v":6.9909595959595965},null,1,6.9909595959595965]
[]
["Duty cycle, ton, Toff, Vdropout"]
[null,"Name","Number ","Final Unit","multiple ","Value","Arial 8pt"]
["1st 38, 2nd 34","R.hs_25",{"$f":"0.0357","v":3.5700000000000003E-2},null,1,{"$f":"C64*E64","v":3.5700000000000003E-2}]
["1st 35, 2nd 28","R.ls_25",{"$f":"0.0294","v":2.9399999999999999E-2},null,1,2.9399999999999999E-2]
[null,"R.dcr_25",{"$f":"Design!G29/1000","v":6.8000000000000005E-2},null,1,6.8000000000000005E-2]
["Min 60ns, give a warning.Enters PFM if less than 60ns","t.on_ideal",{"$f":"V.load/V.supply_max/f.sw","v":1.3888888888888891E-7},null,1,{"$f":"C67*E67","v":1.3888888888888891E-7}]
["Min 100ns, give a warning","t.off_150",{"$f":"(1-(V.load+(R.ls_25*2+R.dcr_25*2)*I.load_1ph)/(V.supply_min+(R.ls_25*2-R.hs_25*2)*I.load_1ph))/f.sw","v":-1.2538793277175441E-7},null,1,{"$f":"C68*E68","v":-1.2538793277175441E-7},null,"TOFF_SPEC"]
["Give a warning if <Vin_min. Enters dropout if less than  TOFF","V.supply_dropout",{"$f":"(V.load+(R.ls_fullload+R.dcr_fullload)*I.load_1ph)/(1-f.sw*TOFF_SPEC)-(R.ls_fullload-R.hs_fullload)*I.load_1ph","v":5.9121768866386324},null,1,{"$f":"C69*E69","v":5.9121768866386324},null,8.0000000000000002E-8]
[]
["Default values"]
[null,"Name","Number ","Final Unit","multiple ","Value","Arial 8pt"]
[null,"C.vcc",9.9999999999999995E-7,null,1,{"$f":"C73*E73","v":9.9999999999999995E-7}]
[null,"C.cb1",9.9999999999999995E-8,null,1,9.9999999999999995E-8]
[null,"C.cb2",9.9999999999999995E-8,null,1,9.9999999999999995E-8]
[null,"C.vin1_hf2",{"$f":"F191","v":2.1428571428571428E-5},null,1,2.1428571428571428E-5,{"$f":"H76&\"µF\"","v":"21µF"},{"$f":"INT(C.vin1_hf2*1000000)","v":21}]
[null,"C.vin2_hf2",{"$f":"F191","v":2.1428571428571428E-5},null,1,2.1428571428571428E-5,{"$f":"H77&\"µF\"","v":"21µF"},{"$f":"INT(C.vin1_hf2*1000000)","v":21}]
[null,"C.vin1_hf1",9.9999999999999995E-8,null,1,9.9999999999999995E-8]
[null,"C.vin2_hf1",9.9999999999999995E-8,null,1,9.9999999999999995E-8]
[null,"R.pg1",100000,null,1,100000]
[null,"R.pg2",100000,null,1,100000]
[]
["EN UVLO "]
[null,"Name","Number ","Final Unit","multiple ","Value","Arial 8pt"]
[null,"V.en_rising_max",1.375,null,1,{"$f":"C85*E85","v":1.375}]
[null,"V.en_falling_max",1,null,1,1]
[null,"V.startup",{"$f":"Design!G44","v":5.9},null,1,5.9]
[null,"R.en_top",{"$f":"Design!G45","v":100},"kOhm",{"$f":"1000","v":1000},100000,{"$f":"C88&\"kΩ\"","v":"100kΩ"}]
[null,"R.en_bot_calc",{"$f":"(V.en_rising_max*R.en_top)/(V.startup-V.en_rising_max)","v":30386.74033149171},null,1,{"$f":"C89*E89","v":30386.74033149171}]
[null,"R.en_bot",{"$f":"IF(ISNUMBER(R.en_bot_calc/1000),INDEX(STD_VAL!$A$1:$A$769,MATCH(R.en_bot_calc/1000,STD_VAL!$A$1:$A$769)),R.en_bot_calc/1000)","v":30.1},"kOhm",1000,{"$f":"C90*E90","v":30100},{"$f":"C90&\"kΩ\"","v":"30.1kΩ"}]
[null,"V.shutdown",{"$f":"V.en_falling_max*(R.en_top+R.en_bot)/R.en_bot","v":4.3222591362126241},null,1,{"$f":"C91*E91","v":4.3222591362126241}]
[]
["COUT"]
[null,"Name","Number ","Final Unit","multiple ","Value","Arial 8pt"]
["Min 4% of Vload not to trigger UV, 50% load transient ","ΔV.undershoot_desired",{"$f":"V.load*Design!G50/100","v":0.25},null,1,{"$f":"C95*E95","v":0.25}]
["was f.sw/20/1000","f.cross_desired",{"$f":"Design!G51","v":40},"kHZ",1000,{"$f":"C96*E96","v":40000}]
["Assuming Bulk Cap is aluminum, AL-cap doesn't need a derating by bias voltage , this is for 50% transition","C.out_min_calc",{"$f":"1/(2*π*f.cross_desired*ΔV.undershoot_desired)*(I.load_nph/2)","v":2.3873246430472193E-5},null,1,{"$f":"C97*E97","v":2.3873246430472193E-5}]
["Rated value ","C.out_rated",{"$f":"Design!G53","v":45},"uF",9.9999999999999995E-7,{"$f":"C98*E98","v":4.4999999999999996E-5},{"$f":"H98&\"µF\"","v":"45µF"},{"$f":"INT(C.out_rated*1000000)","v":45}]
["Deating at Vload","Derating.cout",{"$f":"Design!G54","v":0.7},null,1,{"$f":"C99*E99","v":0.7}]
["Derated","C.out",{"$f":"C.out_rated*Derating.cout","v":3.1499999999999993E-5},null,1,3.1499999999999993E-5]
[null,"R.esr_cout",{"$f":"IF(Design!G56<>0, Design!G56/1000,0.0001)","v":1E-3},null,1,{"$f":"C101*E101","v":1E-3}]
[null,"DCatVsupplymax",{"$f":"V.load/V.supply_max","v":0.1388888888888889},null,1,{"$f":"C102*E102","v":0.1388888888888889}]
[null,"DCatPeakRipple",{"$f":"IF(PH=1,V.load/V.supply_max,IF(PH=2,V.load/V.supply_max,IF(PH=4,0.37,IF(PH=6,0.25,4444))))","v":0.1388888888888889},null,1,0.1388888888888889]
[null,"NPH_Factor.Iout_temp1",{"$f":"PH / DCatVsupplymax / (1 - DCatVsupplymax) * (DCatVsupplymax - FLOOR(PH *DCatVsupplymax, 1) / PH) * ((1 + FLOOR(PH * DCatVsupplymax, 1)) / PH - DCatVsupplymax)","v":0.99999999999999989},null,1,{"$f":"C104*E104","v":0.99999999999999989}]
[null,"NPH_Factor.Iout_temp2",{"$f":"PH / DCatPeakRipple / (1 - DCatPeakRipple) * (DCatPeakRipple - FLOOR(PH *DCatPeakRipple, 1) / PH) * ((1 + FLOOR(PH * DCatPeakRipple, 1)) / PH - DCatPeakRipple)","v":0.99999999999999989},null,1,0.99999999999999989]
[null,"NPH_Factor.Iout_rms2",{"$f":"MAX(NPH_Factor.Iout_temp1:NPH_Factor.Iout_temp2)","v":0.99999999999999989},null,1,0.99999999999999989]
[null,"ΔV.load_pkpk_nph_calc_simple",{"$f":"(V.supply_max-V.load)/L.out*V.load/V.supply_max/f.sw*SQRT((1/8/f.sw/C.out)^2+(R.esr_cout)^2)*NPH_Factor.Iout_rms2","v":8.0089492121812149E-3},null,1,{"$f":"C107*E107","v":8.0089492121812149E-3}]
[null,"ΔV.overshoot_typical_calc1",{"$f":"(-2*V.load+SQRT((2*V.load)^2+4*(L.out*I.load_1ph^2/(C.out/PH))))/2","v":6.2466931108926538E-2},null,1,{"$f":"C108*E108","v":6.2466931108926538E-2}]
[null,"ΔV.overshoot_typical_calc2",{"$f":"L.out*I.load_1ph^2/(2*V.load*C.out/PH)","v":6.2857142857142861E-2},null,1,6.2857142857142861E-2]
[null,"ΔV.overshoot_typical_calc",{"$f":"MAX(ΔV.overshoot_typical_calc1,ΔV.overshoot_typical_calc2)","v":6.2857142857142861E-2},null,1,{"$f":"C110*E110","v":6.2857142857142861E-2}]
["Max 4% of V.load","ΔV.undershoot_typical_calc1",{"$f":"I.load_nph/(2*π*FCROSSOVER_FOUND*C.out)","v":0.27682616713089564},null,1,{"$f":"C111*E111","v":0.27682616713089564},{"$f":"ΔV.undershoot_typical_calc1/V.load*100","v":5.5365233426179126}]
[]
["Soft-start (Single output)"]
[null,"Name","Number ","Final Unit","multiple ","Value","Arial 8pt"]
[null,"I.ss_max",2.5000000000000001E-5,null,1,{"$f":"C115*E115","v":2.5000000000000001E-5}]
[null,"V.ref",0.8,null,1,0.8]
[null,"t.ss_min",{"$f":"C.out*V.load/(I.pcl_th_min*(1-V.slope_max*V.load/V.supply_min)+t.blank_max*(V.supply_min-V.load)/L.out-(V.supply_min-V.load)/L.out*V.load/V.supply_min/f.sw-I.load_1ph)/PH","v":3.7500000000000159E-3},null,1,3.7500000000000159E-3]
[null,"C.ss_min",{"$f":"IF(IntEA=1,\"N/A\",I.ss_max*t.ss_min/V.ref)","v":"N/A"},null,1,{"$error":"#VALUE!"}]
[null,"C.ss",{"$f":"Design!G63","v":100},"nF",1.0000000000000001E-9,1.0000000000000001E-7,{"$f":"C119&\"nF\"","v":"100nF"}]
[]
{"$rows_left_out":368}
{"sheet":"STD_VAL","index":3,"n_rows":769,"n_cols":4,"rows_kept":769,"cut":false,"hidden":true,"merged":[]}
[1]
[1.02,null,"Device Rating","Value"]
[1.05,null,"TPSM64404",2]
[1.0699999999999998,null,"TPSM64406",3]
[1.1000000000000001]
[1.1300000000000001]
[1.1499999999999999,null,"Number of Phase","Value"]
[1.1800000000000002,null,"1-Phase",1]
[1.21,null,"2-Phase (1 device)",2]
[1.24,null,"4-Phase (2 devices)",4]
[1.27,null,"6-Phase (3 devices)",6]
[1.3]
[1.33,null,"Switching Mode","Value"]
[1.3699999999999999,null,"FPWM",1]
[1.4,null,"AUTO",0]
[1.4300000000000002]
[1.47,null,"Feedback","Value"]
[1.5,null,"Internal",1]
[1.54,null,"External",0]
[1.58]
[1.6199999999999999,null,"Spread Spectrum","Value"]
[1.65,null,"Enable",1]
[1.69,null,"Disable",0]
[1.7399999999999998]
[1.78,null,"External clock synchronization","Value"]
[1.8199999999999998,null,"Yes",1]
[1.8699999999999999,null,"No",0]
[1.9100000000000001]
[1.9600000000000002]
[2]
[2.0499999999999998]
[2.1]
[2.15]
[2.21]
[2.2600000000000002]
[2.3199999999999998]
[2.37]
[2.4300000000000002]
[2.4899999999999998]
[2.5499999999999998]
[2.6100000000000003]
[2.67]
[2.7399999999999998]
[2.8]
[2.87]
[2.94]
[3.0100000000000002]
[3.09]
[3.16]
[3.2399999999999998]
[3.3200000000000003]
[3.4]
[3.4799999999999995]
[3.5700000000000003]
[3.65]
[3.7399999999999998]
[3.8299999999999996]
[3.9200000000000004]
[4.0200000000000005]
[4.12]
[4.2200000000000006]
[4.32]
[4.42]
[4.5299999999999994]
[4.6399999999999997]
[4.75]
[4.87]
[4.99]
[5.1100000000000003]
[5.2299999999999995]
[5.36]
[5.49]
[5.62]
[5.76]
[5.9]
[6.04]
[6.1899999999999995]
[6.34]
[6.49]
[6.65]
[6.81]
[6.9799999999999995]
[7.15]
[7.32]
[7.5]
[7.68]
[7.87]
[8.0599999999999987]
[8.25]
[8.4499999999999993]
[8.66]
[8.870000000000001]
[9.09]
[9.3099999999999987]
[9.5299999999999994]
[9.76]
[{"$f":"A1*10","v":10}]
[{"$f":"A2*10","v":10.199999999999999}]
[10.5]
[10.7]
[11]
[11.3]
[11.5]
[11.8]
[12.1]
[12.4]
[12.7]
[13]
[13.3]
[13.7]
[14]
[14.3]
[14.7]
[15]
[15.4]
[15.8]
[16.2]
[16.5]
[16.899999999999999]
[17.399999999999999]
{"$rows_left_out":650}
{"sheet":"SCH","index":4,"n_rows":1,"n_cols":4,"rows_kept":1,"cut":false,"hidden":true,"merged":[]}
[null,{"$f":"IF(PH=1,IF(AND(IntFB=1,V.load=5),\"SCH_1PH_5V\",IF(AND(IntFB=1,V.load=3.3),\"SCH_1PH_3P3V\",IF(IntFB=0,\"SCH_1PH_ADJ\",444))),IF(PH=2,IF(AND(IntFB=1,V.load=5),\"SCH_2PH_5V\",IF(AND(IntFB=1,V.load=3.3),\"SCH_2PH_3P3V\",IF(IntFB=0,\"SCH_2PH_ADJ\",444))),IF(PH=4,IF(AND(IntFB=1,V.load=5),\"SCH_4PH_5V\",IF(AND(IntFB=1,V.load=3.3),\"SCH_4PH_3P3V\",IF(IntFB=0,\"SCH_4PH_ADJ\",444))),IF(PH=6,IF(AND(IntFB=1,V.load=5),\"SCH_6PH_5V\",IF(AND(IntFB=1,V.load=3.3),\"SCH_6PH_3P3V\",IF(IntFB=0,\"SCH_6PH_ADJ\",444))),444)) ) )","v":"SCH_1PH_ADJ"},{"$f":"IF(PH=4,\"SCH_4PH_SLAVE\",IF(PH=6,\"SCH_6PH_SLAVE\",\"SCH_BLANK\"))","v":"SCH_BLANK"},{"$f":"IF(PH=6,\"SCH_6PH_SLAVE2\",\"SCH_BLANK\")","v":"SCH_BLANK"}]