{"text_format":"1","workbook":"xlsx","n_sheets":5,"sheets":["Design","Important Notice and Disclaimer","Calculation","STD_VAL","SCH"],"not_rendered":{"charts":11,"images":26,"macros":1,"external_links":1,"defined_names":196,"comments":2,"pivot_tables":0},"unopened":[],"bounds":{"document_bytes":16777216,"sheet_cells":100000,"rows_first":2000,"rows_last":500,"rows_between":2000,"halvings":0,"cell_chars":16384,"cell_head_chars":4096},"cells_cut":0,"cells_raw":0,"read":"whole","date_system":"1900"}

{"sheet":"Design","index":0,"n_rows":95,"n_cols":11,"rows_kept":95,"cut":false,"hidden":false,"merged":[[2,10,2,11]]}
[]
[]
["About",null,"xx",null,null,null,null,"= Input Box",null,null,"TERMS OF USE"]
[]
[]
[null,"Step 1: Operating Specifications"]
[null,null,null,null,null,"Input Voltage – Min, VSUPPLY(min) ",5,"V"]
[null,null,null,null,null,"Input Voltage – Typ, VSUPPLY(typ)",12,"V"]
[null,null,null,null,null,"Input Voltage – Max, VSUPPLY(max)",36,"V"]
[null,null,null,null,null,"Output Voltage, VLOAD ",5,"V"]
[null,null,null,null,null,"Full Load Output Current, ILOAD",3,"A"]
[null,null,null,null,null,"Switching Frequency, fSW",1000,"kHz"]
[null,null,null,null,null,"Frequency Set Resistor, RRT ",{"$f":"Calculation!C40","v":15},"kΩ"]
[]
[null,"Step 2: User's  Selections"]
[null,null,null,null,null,"Device Selection","TPSM64406"]
[null,null,null,null,null,"Number of Phase","1-Phase"]
[null,null,null,null,null,"Switching Mode","FPWM"]
[null,null,null,null,null,"Output Voltage Feedback","External"]
[null,null,null,null,null,"Spread Spectrum","Disable"]
[null,null,null,null,null,"External Clock Synchronization","No"]
[null,null,null,null,null,"CFG Resistor (Primary Device)",{"$f":"Calculation!C34","v":0},"kΩ"]
[null,null,null,null,null,{"$f":"IF(OR(PH=1,PH=2),\"\",\"CFG Resistor (Secondary Device)\")","v":""},{"$f":"IF(OR(PH=1,PH=2),\"\",Calculation!C35)","v":""},{"$f":"IF(OR(PH=1,PH=2),\"\",\"kΩ\")","v":""}]
[]
[null,"Step 3: Internal Buck Inductor"]
[null,null,null,null,null,"Inductance for 35% Ripple Current at VIN(nom)",{"$f":"L.out_typical_calc*10^6","v":2.7777777777777781},"µH"]
[null,null,null,null,null,"Minimum Inductance",{"$f":"L.out_min*10^6","v":1.7045454545454546},"µH"]
[null,null,null,null,null," Internal Buck Inductance, LOUT",2.2000000000000002,"µH"]
[null,null,null,null,null,"Inductor DCR at 25°C",68,"mΩ"]
[null,null,null,null,null,"Peak Inductor Current at VSUPPLY(max) and Full Load",{"$f":"I.sat_softsaturation","v":3.9785353535353538},"Apk"]
[null,null,null,null,null,"Peak Inductor Current Limit at VSUPPLY(max)",{"$f":"I.sat_hardsaturation","v":6.9909595959595965},"Apk"]
[null,null,null,null,null,"Estimate Inductor Core Loss at VSUPPLY(typ)",0.3,"W"]
[null,null,null,null,null,"Frequency Stretch at VSUPPLY(max)",{"$f":"IF(t.on_ideal<0.00000006,\"can happen\", \"No\")","v":"No"}]
[null,null,null,null,null,"Dropout Mode Operation at VSUPPLY(min)",{"$f":"IF(t.off_150<0.0000001,\"can happen below \"&ROUND(V.supply_dropout,1)&\"V\",\"No\")","v":"can happen below 5.9V"}]
[]
[null,"Step 4: Default Component Values"]
[null,null,null,null,null,"VCC Capacitor, CVCC",{"$f":"C.vcc*1000000","v":1},"µF"]
[null,null,null,null,null,"Internal Boot Capacitor, CBOOT1, CBOOT2",{"$f":"C.cb1*1000000000","v":100},"nF"]
[null,null,null,null,null,"Internal VIN pin Capacitor, CVIN1_HF1, CVIN2_HF1",{"$f":"C.vin1_hf1*1000000000","v":100},"nF"]
[null,null,null,null,null,"VIN pin Capacitor, CVIN1_HF2, CVIN2_HF2",{"$f":"C.vin1_hf2*1000000","v":21.428571428571427},"µF"]
[null,null,null,null,null,"Power Good Pull-up Resistor, RPG1, RPG2",{"$f":"R.pg1/1000","v":100},"kΩ"]
[null,null,null,null,null,"VOSNS Capacitor, CVOSNS",100,"nF"]
[null,"Step 5: Enable, Line UVLO"]
[null,null,null,null,null,"Desired Start-up Threshold",5.9,"V"]
[null,null,null,null,null,"UVLO Divider Upper Resistance, RENT",100,"kΩ"]
[null,null,null,null,null,"UVLO Divider Lower Resistance, RENB",{"$f":"Calculation!C90","v":30.1},"kΩ"]
[null,null,null,null,null,"Estimated Shutdown Threshold",{"$f":"V.shutdown","v":4.3222591362126241},"V"]
[]
[null,"Step 6: Output Capacitors"]
[null,null,null,null,null,"Desired Undershoot during 50% Load Transient in FPWM",5,"%"]
[null,null,null,null,null,"Desired Crossover Frequency",40,"kHz"]
[null,null,null,null,null,"Minimum Derated Output Capacitance ",{"$f":"C.out_min_calc*1000000","v":23.873246430472193},"µF"]
[null,null,null,null,null," Rated Output Capacitance",45,"µF"]
[null,null,null,null,null,"Derating Factor",0.7]
[null,null,null,null,null,"Derated Output Capacitance",{"$f":"C.out*1000000","v":31.499999999999993},"µF"]
[null,null,null,null,null,"Effective Output Capacitor ESR",1,"mΩ"]
[null,null,null,null,null,"Estimated Output Voltage Ripple at VSUPPLUY(MAX)",{"$f":"ΔV.load_pkpk_nph_calc_simple*1000","v":8.0089492121812142},"mVpk-pk"]
[null,null,null,null,null,"Estimated Min Overshoot (Full-load to no-load if switching stops)",{"$f":"ΔV.overshoot_typical_calc/V.load*100","v":1.2571428571428571},"%"]
[null,null,null,null,null,"Estimated Max Undershoot (No-load to full-load in FPWM)",{"$f":"ΔV.undershoot_typical_calc1/V.load*100","v":5.5365233426179126},"%"]
[]
[null,{"$f":"IF(PH=1,\"Step 7: Internal Soft-start time is typically 4.5ms\", \"Step 7: Soft-start for Multi-phase Config\")","v":"Step 7: Internal Soft-start time is typically 4.5ms"}]
[null,null,null,null,null,{"$f":"IF(PH=1,\"\",\"Minimum Soft-start Capacitance\")","v":""},{"$f":"IF(PH=1,\"\",C.ss_min*1000000000)","v":""},{"$f":"IF(PH=1,\"\",\"nF\")","v":""}]
[null,null,null,null,null,{"$f":"IF(PH=1,\"\",\"Soft-start Capacitance\")","v":""},100,{"$f":"IF(PH=1,\"\",\"nF\")","v":""}]
[null,null,null,null,null,{"$f":"IF(PH=1,\"\",\"Soft-start Time\")","v":""},{"$f":"G63*0.8/(0.00002)/1000","v":3999.9999999999995},{"$f":"IF(PH=1,\"\",\"us\")","v":""}]
[null,{"$f":"IF(IntFB=1,\"Step 8: Using Internal Feedback\",\"Step 8: Feedback Network\")","v":"Step 8: Feedback Network"}]
[null,null,null,null,null,"Upper Feedback Resistance1, RLP",0.01,{"$f":"IF(IntFB=1,\"\",\"kΩ\")","v":"kΩ"}]
[null,null,null,null,null,"Upper Feedback Resistance2, RFBT",100,{"$f":"IF(IntFB=1,\"\",\"kΩ\")","v":"kΩ"}]
[null,null,null,null,null,"Feedforward Capacitance, CFF",10,{"$f":"IF(IntFB=1,\"\",\"pF\")","v":"pF"}]
[null,null,null,null,null,"Lower Standard Feedback Resistance, RFBB",{"$f":"R.fb_bot/1000","v":19.049523809523809},{"$f":"IF(IntFB=1,\"\",\"kΩ\")","v":"kΩ"}]
[null,null,null,null,null,"Selected CFF Zero Frequency ",{"$f":"1/(2*3.141592*G67*10^3*G68*10^-12)/1000","v":159.15497620314795},{"$f":"IF(IntFB=1,\"\",\"kHz\")","v":"kHz"}]
[]
[]
[null,{"$f":"IF(PH=1,\"Step 9: Using Internal Loop Compensation\",\"Step 9: External Loop Compensation Design\")","v":"Step 9: Using Internal Loop Compensation"}]
[null,null,null,null,null,"Desired Maximum RCOMP Value",{"$f":"R.comp_desired_max/1000","v":620.43979937304061},"kΩ"]
[null,null,null,null,null,"Desired Minimum CCOMP Value",{"$f":"C.comp_desired_min*1000000000","v":6.4129902838267042E-2},"nF"]
[null,null,null,null,null,"Desired CHF Value",{"$f":"C.hf_desired_min*1000000000000","v":5.0770437408804193E-2},"pF"]
[null,null,null,null,null,"Desired Compensation Zero Frequency",{"$f":"f.ea_zero_desired/1000","v":4},"kHz"]
[null,null,null,null,null,"Desired Compensation Pole Frequency",{"$f":"f.ea_pole_desired/1000","v":5052.5389270840642},"kHz"]
[null,null,null,null,null,"Selected RCOMP Value",{"$f":"R.comp_desired_max/1000","v":620.43979937304061},"kΩ"]
[null,null,null,null,null,"Selected CCOMP Value",{"$f":"C.comp_desired_min*1000000000","v":6.4129902838267042E-2},"nF"]
[null,null,null,null,null,"Selected CHF Value",{"$f":"C.hf_desired_min*1000000000000","v":5.0770437408804193E-2},"pF"]
[null,null,null,null,null," Selected Compensation Zero Frequency",{"$f":"f.ea_zero_estimated/1000","v":9.210357419163655},"kHz"]
[null,null,null,null,null,"Selected Compensation Pole Frequency",{"$f":"f.ea_pole_estimated/1000","v":1357.0675407114056},"kHz"]
[]
[]
[null,"Step 9: Power Loss & Thermals"]
[null,null,null,null,null,"Maximum Ambient Temperature, TAMB_MAX",25,"°C"]
[null,null,null,null,null,"Air Flow",20,"LFM"]
[null,null,null,null,null,"Estimated Max Junction Temperature, TJ at VSUPPLY(typ)",{"$f":"Calculation!AO328","v":35.505530125865619},"°C"]
[]
[null,"Step 10: Input Capacitors"]
[null,null,null,null,null,"Input Voltage Ripple Spec",35,"mVpk-pk"]
[null,null,null,null,null,"Minimum Derated Input Capacitance, CVIN1_HF2, CVIN2_HF2",{"$f":"Calculation!F191 *1000000","v":21.428571428571427},"µF"]
[null,null,null,null,null,"Maximum Input Capacitor RMS Current",{"$f":"Calculation!C194","v":1.5},"A(rms)"]
[null,null,null,null,null,"Maximum Input Capacitor ESR ",{"$f":"Calculation!F201","v":11.666666666666668},"mΩ"]

{"sheet":"Important Notice and Disclaimer","index":1,"n_rows":0,"n_cols":0,"rows_kept":0,"cut":false,"hidden":false,"merged":[]}

{"sheet":"Calculation","index":2,"n_rows":487,"n_cols":91,"rows_kept":487,"cut":false,"hidden":true,"merged":[]}
["Macro should be enabled "]
[null,null,null,"User Input"]
[null,null,null,"Calc suggestion / User Input /Output"]
[null,null,null,"FixedParameters"]
[]
["Definitions"]
[null,"Name","Number ","Displayed Unit","multiple ","Value","Arial 8pt"]
[null,"π",null,null,null,3.1415920000000002]
[null,null,null,null,null,null,{"$f":"Design!G16","v":"TPSM64406"}]
["Electrical Specifications Mode/Config Selection"]
[null,"Name","Number ","Displayed Unit","multiple ","Value","Arial 8pt"]
["Min 3.7V","V.supply_min",{"$f":"Design!G7","v":5},null,1,{"$f":"C12*E12","v":5}]
[null,"V.supply_typ",{"$f":"Design!G8","v":12},null,1,12,{"$f":"\" = \"&V.supply_typ&\" Vtyp\"","v":" = 12 Vtyp"}]
["Max 36V","V.supply_max",{"$f":"Design!G9","v":36},null,1,36]
["Min 0.8V,  Max 16V","V.load",{"$f":"Design!G10","v":5},null,1,5,{"$f":"\" = \"&V.load&\" V\"","v":" = 5 V"}]
["Max 12A","I.load_nph",{"$f":"Design!G11","v":3},null,1,3]
["Min 100k, Max 2.2M","f.sw",{"$f":"Design!G12","v":1000},"kHz",{"$f":"1000","v":1000},{"$f":"C17*E17","v":1000000}]
[null,"P.out",{"$f":"V.load*I.load_nph","v":15},null,1,{"$f":"C18*E18","v":15}]
[null,"R.load_nph",{"$f":"V.load/I.load_nph","v":1.6666666666666667},null,1,{"$f":"C19*E19","v":1.6666666666666667}]
["Use dropdown menu","I.rated",{"$f":"IF(Design!G16=STD_VAL!C3,STD_VAL!D3,IF(Design!G16=STD_VAL!C4,STD_VAL!D4,IF(Design!G16=STD_VAL!C5,STD_VAL!D5,444)))","v":3},null,1,{"$f":"C20*E20","v":3},null,"PH_NEW"]
["Use dropdown menu","PH",{"$f":"IF(Design!G17=STD_VAL!C8,STD_VAL!D8,IF(Design!G17=STD_VAL!C9,STD_VAL!D9,IF(Design!G17=STD_VAL!C10,STD_VAL!D10,IF(Design!G17=STD_VAL!C11,STD_VAL!D11,444))))","v":1},null,1,1,null,{"$f":"MIN(2,C21)","v":1}]
["Use dropdown menu","FPWM",{"$f":"IF(Design!G18=STD_VAL!C14,STD_VAL!D14,IF(Design!G18=STD_VAL!C15,STD_VAL!D15,444))","v":1},null,1,1]
["Use dropdown menu","IntFB",{"$f":"IF(Design!G19=STD_VAL!C18,STD_VAL!D18,IF(Design!G19=STD_VAL!C19,STD_VAL!D19,444))","v":0},null,1,0]
["??????? Should be 1 always","ExtBIAS",1,null,1,1]
["Use dropdown menu","SPSP",{"$f":"IF(Design!G20=STD_VAL!C22,STD_VAL!D22,IF(Design!G20=STD_VAL!C23,STD_VAL!D23,444))","v":0},null,1,0]
["Use dropdown menu","SYNC",{"$f":"IF(Design!G21=STD_VAL!C26,STD_VAL!D26,IF(Design!G21=STD_VAL!C27,STD_VAL!D27,444))","v":0},null,1,0,{"$f":"IF(SYNC=1,\"External SYNC Pulse\",IF(FPWM=1,\"Connect to VCC\", \"Connect to AGND\"))","v":"Connect to VCC"}]
[null,"I.load_1ph",{"$f":"I.load_nph/PH","v":3},null,1,3]
[null,"R.load_1ph",{"$f":"V.load/I.load_1ph","v":1.6666666666666667},null,1,1.6666666666666667]
["Multi-phase effective frequecy","f.sw_nph",{"$f":"f.sw*PH","v":1000000},null,1,1000000]
[null,"IntEA",{"$f":"IF(PH=1,1, 0)","v":1},null,1,{"$f":"C30*E30","v":1}]
[null,"RatedIout",{"$f":"I.rated*PH","v":3},null,1,3]
["Rcfg selection (Recommend both Primary and Secondary if N-phase)"]
[null,"Name","Number ","Final Unit","multiple ","Value","Arial 8pt"]
[null,"R.cfg_master",{"$f":"IF(SPSP=0,IF(PH=1,0,IF(PH=2,9.53,IF(PH=4,19.1,IF(PH=6,29.4,4444)))),IF(PH=1,121,IF(PH=2,56.2,IF(PH=4,73.2,IF(PH=6,93.1,4444)))))","v":0},"kOhm",1000,{"$f":"C34*E34","v":0},{"$f":"C34&\"kΩ\"","v":"0kΩ"}]
[null,"R.cfg_slave",{"$f":"IF(PH<>1, 41.2, \"N/A\")","v":"N/A"},"kOhm",1000,{"$f":"C35*E35","v":{"$error":"#VALUE!"}},{"$f":"C35&\"kΩ\"","v":"N/AkΩ"}]
[]
["Rt selection"]
[null,"Name","Number ","Final Unit","multiple ","Value","Arial 8pt"]
[null,"R.t_calc",{"$f":"14.925*10^9/(f.sw-20298)","v":15234.224284527336},null,1,{"$f":"C39*E39","v":15234.224284527336}]
[null,"R.t_std",{"$f":"IF(ISNUMBER(R.t_calc/1000),INDEX(STD_VAL!$A$1:$A$769,MATCH(R.t_calc/1000,STD_VAL!$A$1:$A$769)),R.t_calc/1000)","v":15},"kOhm",1000,{"$f":"C40*E40","v":15000},{"$f":"C40&\"kΩ\"","v":"15kΩ"}]
[]
["Lout Inductor selection"]
[null,"Name","Number ","Final Unit","multiple ","Value","Arial 8pt"]
[null,"RR.desired",0.35,null,1,{"$f":"C44*E44","v":0.35}]
["B0 =B1 = 0.32","V.slope_min",0.32,null,1,0.32]
["B0 = B1 = 0.35","V.slope_max",0.35,null,1,0.35]
[null,"I.ncl_th_min",2,null,1,2]
[null,"I.pcl_th_min",4.68,null,1,4.68]
[null,"I.pcl_th_max",6.8,null,1,6.8]
[null,"L.out_typical_calc",{"$f":"(V.supply_typ-V.load)/RR.desired/I.load_1ph*(V.load/V.supply_typ*1/f.sw)","v":2.7777777777777779E-6},null,1,{"$f":"C50*E50","v":2.7777777777777779E-6}]
[null,"Margin",1.2,null,1,{"$f":"C51*E51","v":1.2}]
["No sub-harmonic OSC","L.out_min1",{"$f":"V.load/f.sw*1/11*6/I.rated*1/V.slope_min*1/2*Margin","v":1.7045454545454546E-6},null,1,{"$f":"C52*E52","v":1.7045454545454546E-6}]
["No DCM  at VSUPPLY_MAX and full load ","L.out_min2",{"$f":"(V.supply_max-V.load)/(2*I.load_1ph)*(V.load/V.supply_max*1/f.sw)","v":7.1759259259259276E-7},null,1,7.1759259259259276E-7]
["No negative current limit at VSUPPLY_MAX in FPWM (0 if AUTO)","L.out_min3",{"$f":"(V.supply_max-V.load)/(I.ncl_th_min*2)*V.load/(V.supply_max*f.sw)","v":1.076388888888889E-6},null,1,1.076388888888889E-6]
["No peak current limit at VSUPPLY_MIN","L.out_min4",{"$f":"(V.supply_min-V.load)/(I.pcl_th_min*(1-V.slope_max*V.load/V.supply_min)-I.load_1ph)*(V.load/V.supply_min/f.sw)*Margin","v":0},null,1,0]
[null,"L.out_min",{"$f":"MAX(C52:C55)","v":1.7045454545454546E-6},null,1,{"$f":"C56*E56","v":1.7045454545454546E-6}]
[null,"L.out",{"$f":"Design!G28","v":2.2000000000000002},"uH",{"$f":"0.000001","v":9.9999999999999995E-7},{"$f":"C57*E57","v":2.2000000000000001E-6},{"$f":"C57&\"µH\"","v":"2.2µH"}]
[null,"t.blank_max",3.5000000000000002E-8,null,1,{"$f":"C58*E58","v":3.5000000000000002E-8}]
["Peak inductor current at VSUPPLY_MAX, Minimum Isat for soft saturation core ","I.sat_softsaturation",{"$f":"I.load_1ph+(V.supply_max-V.load)/L.out*V.load/V.supply_max/f.sw/2","v":3.9785353535353538},null,1,{"$f":"C59*E59","v":3.9785353535353538}]
["Peak current limit at VSUPPLY_MAX, Minimum Isat for ferrite core, use dropdown","I.sat_hardsaturation",{"$f":"I.pcl_th_max*(1-V.slope_min*V.load/V.supply_max)+t.blank_max*(V.supply_max-V.load)/L.out","v":6.9909595959595965},null,1,6.9909595959595965]
[]
["Duty cycle, ton, Toff, Vdropout"]
[null,"Name","Number ","Final Unit","multiple ","Value","Arial 8pt"]
["1st 38, 2nd 34","R.hs_25",{"$f":"0.0357","v":3.5700000000000003E-2},null,1,{"$f":"C64*E64","v":3.5700000000000003E-2}]
["1st 35, 2nd 28","R.ls_25",{"$f":"0.0294","v":2.9399999999999999E-2},null,1,2.9399999999999999E-2]
[null,"R.dcr_25",{"$f":"Design!G29/1000","v":6.8000000000000005E-2},null,1,6.8000000000000005E-2]
["Min 60ns, give a warning.Enters PFM if less than 60ns","t.on_ideal",{"$f":"V.load/V.supply_max/f.sw","v":1.3888888888888891E-7},null,1,{"$f":"C67*E67","v":1.3888888888888891E-7}]
["Min 100ns, give a warning","t.off_150",{"$f":"(1-(V.load+(R.ls_25*2+R.dcr_25*2)*I.load_1ph)/(V.supply_min+(R.ls_25*2-R.hs_25*2)*I.load_1ph))/f.sw","v":-1.2538793277175441E-7},null,1,{"$f":"C68*E68","v":-1.2538793277175441E-7},null,"TOFF_SPEC"]
["Give a warning if <Vin_min. Enters dropout if less than  TOFF","V.supply_dropout",{"$f":"(V.load+(R.ls_fullload+R.dcr_fullload)*I.load_1ph)/(1-f.sw*TOFF_SPEC)-(R.ls_fullload-R.hs_fullload)*I.load_1ph","v":5.9121768866386324},null,1,{"$f":"C69*E69","v":5.9121768866386324},null,8.0000000000000002E-8]
[]
["Default values"]
[null,"Name","Number ","Final Unit","multiple ","Value","Arial 8pt"]
[null,"C.vcc",9.9999999999999995E-7,null,1,{"$f":"C73*E73","v":9.9999999999999995E-7}]
[null,"C.cb1",9.9999999999999995E-8,null,1,9.9999999999999995E-8]
[null,"C.cb2",9.9999999999999995E-8,null,1,9.9999999999999995E-8]
[null,"C.vin1_hf2",{"$f":"F191","v":2.1428571428571428E-5},null,1,2.1428571428571428E-5,{"$f":"H76&\"µF\"","v":"21µF"},{"$f":"INT(C.vin1_hf2*1000000)","v":21}]
[null,"C.vin2_hf2",{"$f":"F191","v":2.1428571428571428E-5},null,1,2.1428571428571428E-5,{"$f":"H77&\"µF\"","v":"21µF"},{"$f":"INT(C.vin1_hf2*1000000)","v":21}]
[null,"C.vin1_hf1",9.9999999999999995E-8,null,1,9.9999999999999995E-8]
[null,"C.vin2_hf1",9.9999999999999995E-8,null,1,9.9999999999999995E-8]
[null,"R.pg1",100000,null,1,100000]
[null,"R.pg2",100000,null,1,100000]
[]
["EN UVLO "]
[null,"Name","Number ","Final Unit","multiple ","Value","Arial 8pt"]
[null,"V.en_rising_max",1.375,null,1,{"$f":"C85*E85","v":1.375}]
[null,"V.en_falling_max",1,null,1,1]
[null,"V.startup",{"$f":"Design!G44","v":5.9},null,1,5.9]
[null,"R.en_top",{"$f":"Design!G45","v":100},"kOhm",{"$f":"1000","v":1000},100000,{"$f":"C88&\"kΩ\"","v":"100kΩ"}]
[null,"R.en_bot_calc",{"$f":"(V.en_rising_max*R.en_top)/(V.startup-V.en_rising_max)","v":30386.74033149171},null,1,{"$f":"C89*E89","v":30386.74033149171}]
[null,"R.en_bot",{"$f":"IF(ISNUMBER(R.en_bot_calc/1000),INDEX(STD_VAL!$A$1:$A$769,MATCH(R.en_bot_calc/1000,STD_VAL!$A$1:$A$769)),R.en_bot_calc/1000)","v":30.1},"kOhm",1000,{"$f":"C90*E90","v":30100},{"$f":"C90&\"kΩ\"","v":"30.1kΩ"}]
[null,"V.shutdown",{"$f":"V.en_falling_max*(R.en_top+R.en_bot)/R.en_bot","v":4.3222591362126241},null,1,{"$f":"C91*E91","v":4.3222591362126241}]
[]
["COUT"]
[null,"Name","Number ","Final Unit","multiple ","Value","Arial 8pt"]
["Min 4% of Vload not to trigger UV, 50% load transient ","ΔV.undershoot_desired",{"$f":"V.load*Design!G50/100","v":0.25},null,1,{"$f":"C95*E95","v":0.25}]
["was f.sw/20/1000","f.cross_desired",{"$f":"Design!G51","v":40},"kHZ",1000,{"$f":"C96*E96","v":40000}]
["Assuming Bulk Cap is aluminum, AL-cap doesn't need a derating by bias voltage , this is for 50% transition","C.out_min_calc",{"$f":"1/(2*π*f.cross_desired*ΔV.undershoot_desired)*(I.load_nph/2)","v":2.3873246430472193E-5},null,1,{"$f":"C97*E97","v":2.3873246430472193E-5}]
["Rated value ","C.out_rated",{"$f":"Design!G53","v":45},"uF",9.9999999999999995E-7,{"$f":"C98*E98","v":4.4999999999999996E-5},{"$f":"H98&\"µF\"","v":"45µF"},{"$f":"INT(C.out_rated*1000000)","v":45}]
["Deating at Vload","Derating.cout",{"$f":"Design!G54","v":0.7},null,1,{"$f":"C99*E99","v":0.7}]
["Derated","C.out",{"$f":"C.out_rated*Derating.cout","v":3.1499999999999993E-5},null,1,3.1499999999999993E-5]
[null,"R.esr_cout",{"$f":"IF(Design!G56<>0, Design!G56/1000,0.0001)","v":1E-3},null,1,{"$f":"C101*E101","v":1E-3}]
[null,"DCatVsupplymax",{"$f":"V.load/V.supply_max","v":0.1388888888888889},null,1,{"$f":"C102*E102","v":0.1388888888888889}]
[null,"DCatPeakRipple",{"$f":"IF(PH=1,V.load/V.supply_max,IF(PH=2,V.load/V.supply_max,IF(PH=4,0.37,IF(PH=6,0.25,4444))))","v":0.1388888888888889},null,1,0.1388888888888889]
[null,"NPH_Factor.Iout_temp1",{"$f":"PH / DCatVsupplymax / (1 - DCatVsupplymax) * (DCatVsupplymax - FLOOR(PH *DCatVsupplymax, 1) / PH) * ((1 + FLOOR(PH * DCatVsupplymax, 1)) / PH - DCatVsupplymax)","v":0.99999999999999989},null,1,{"$f":"C104*E104","v":0.99999999999999989}]
[null,"NPH_Factor.Iout_temp2",{"$f":"PH / DCatPeakRipple / (1 - DCatPeakRipple) * (DCatPeakRipple - FLOOR(PH *DCatPeakRipple, 1) / PH) * ((1 + FLOOR(PH * DCatPeakRipple, 1)) / PH - DCatPeakRipple)","v":0.99999999999999989},null,1,0.99999999999999989]
[null,"NPH_Factor.Iout_rms2",{"$f":"MAX(NPH_Factor.Iout_temp1:NPH_Factor.Iout_temp2)","v":0.99999999999999989},null,1,0.99999999999999989]
[null,"ΔV.load_pkpk_nph_calc_simple",{"$f":"(V.supply_max-V.load)/L.out*V.load/V.supply_max/f.sw*SQRT((1/8/f.sw/C.out)^2+(R.esr_cout)^2)*NPH_Factor.Iout_rms2","v":8.0089492121812149E-3},null,1,{"$f":"C107*E107","v":8.0089492121812149E-3}]
[null,"ΔV.overshoot_typical_calc1",{"$f":"(-2*V.load+SQRT((2*V.load)^2+4*(L.out*I.load_1ph^2/(C.out/PH))))/2","v":6.2466931108926538E-2},null,1,{"$f":"C108*E108","v":6.2466931108926538E-2}]
[null,"ΔV.overshoot_typical_calc2",{"$f":"L.out*I.load_1ph^2/(2*V.load*C.out/PH)","v":6.2857142857142861E-2},null,1,6.2857142857142861E-2]
[null,"ΔV.overshoot_typical_calc",{"$f":"MAX(ΔV.overshoot_typical_calc1,ΔV.overshoot_typical_calc2)","v":6.2857142857142861E-2},null,1,{"$f":"C110*E110","v":6.2857142857142861E-2}]
["Max 4% of V.load","ΔV.undershoot_typical_calc1",{"$f":"I.load_nph/(2*π*FCROSSOVER_FOUND*C.out)","v":0.27682616713089564},null,1,{"$f":"C111*E111","v":0.27682616713089564},{"$f":"ΔV.undershoot_typical_calc1/V.load*100","v":5.5365233426179126}]
[]
["Soft-start (Single output)"]
[null,"Name","Number ","Final Unit","multiple ","Value","Arial 8pt"]
[null,"I.ss_max",2.5000000000000001E-5,null,1,{"$f":"C115*E115","v":2.5000000000000001E-5}]
[null,"V.ref",0.8,null,1,0.8]
[null,"t.ss_min",{"$f":"C.out*V.load/(I.pcl_th_min*(1-V.slope_max*V.load/V.supply_min)+t.blank_max*(V.supply_min-V.load)/L.out-(V.supply_min-V.load)/L.out*V.load/V.supply_min/f.sw-I.load_1ph)/PH","v":3.7500000000000159E-3},null,1,3.7500000000000159E-3]
[null,"C.ss_min",{"$f":"IF(IntEA=1,\"N/A\",I.ss_max*t.ss_min/V.ref)","v":"N/A"},null,1,{"$error":"#VALUE!"}]
[null,"C.ss",{"$f":"Design!G63","v":100},"nF",1.0000000000000001E-9,1.0000000000000001E-7,{"$f":"C119&\"nF\"","v":"100nF"}]
[]
["Feedback network"]
[null,"Name","Number ","Final Unit","multiple ","Value","Arial 8pt"]
[null,"R.fb_top1_int",41000,null,1,{"$f":"C123*E123","v":41000}]
[null,"R.fb_top2_int",1563000,null,1,1563000]
["Ideally 6.25E-13 adjusted to 1.25E-13 to match with B0 si","C.fb_top_int",1.25E-13,null,1,1.25E-13]
[null,"C.fb_bot_int",8.0000000000000002E-13,null,1,8.0000000000000002E-13]
["Change to 1ohm","R.fb_top1_ext",{"$f":"Design!G66*1000","v":10},"Ohm",1,{"$f":"C127*E127","v":10}]
[null,"R.fb_top2_ext",{"$f":"Design!G67","v":100},"kOhm",1000,100000]
["Min1fF","C.fb_top_ext",{"$f":"Design!G68","v":10},"pF",{"$f":"0.000000000001","v":9.9999999999999998E-13},{"$f":"C129*E129","v":9.9999999999999994E-12}]
["Min 1fF","C.fb_bot_ext",0,"pF",{"$f":"0.000000000001","v":9.9999999999999998E-13},0]
[null,"R.fb_top_min",{"$f":"4000*V.load/V.ref","v":25000},null,1,25000]
[null,"R.fb_top1",{"$f":"IF(IntFB=1,R.fb_top1_int,R.fb_top1_ext)","v":10},null,1,{"$f":"C132*E132","v":10},{"$f":"C132&\"Ω\"","v":"10Ω"}]
[null,"R.fb_top2",{"$f":"IF(IntFB=1,R.fb_top2_int,R.fb_top2_ext)","v":100000},null,1,100000,{"$f":"C133/1000&\"kΩ\"","v":"100kΩ"}]
[null,"C.fb_top",{"$f":"IF(IntFB=1,C.fb_top_int,MAX(C.fb_top_ext,0.0000000000001))","v":9.9999999999999994E-12},null,1,9.9999999999999994E-12,{"$f":"C134*1000000000000&\"pF\"","v":"10pF"}]
[null,"C.fb_bot",{"$f":"IF(IntFB=1,C.fb_bot_int,MAX(C.fb_bot_ext+0.000000000006,0.0000000000001))","v":6.0000000000000003E-12},null,1,6.0000000000000003E-12]
[null,"R.fb_top",{"$f":"R.fb_top1+R.fb_top2","v":100010},null,1,100010]
[null,"R.fb_bot",{"$f":"V.ref*R.fb_top/(V.load-V.ref)","v":19049.523809523809},null,1,19049.523809523809]
["Min 4k if external FB","R.fb",{"$f":"R.fb_top2*R.fb_bot/(R.fb_top2+R.fb_bot)","v":16001.343978496343},null,1,16001.343978496343]
[null,"R.fb_bot_std",{"$f":"IF(ISNUMBER(R.fb_bot/1000),INDEX(STD_VAL!$A$1:$A$769,MATCH(R.fb_bot/1000,STD_VAL!$A$1:$A$769)),R.fb_bot/1000)","v":18.7},"kOhm",1000,18700,{"$f":"C139&\"kΩ\"","v":"18.7kΩ"}]
[]
["IC parasitic (Feedback)"]
[null,"Name","Number ","Final Unit","multiple ","Value","Arial 8pt"]
[null,"R.fb_buf_int",1000,null,1,{"$f":"C143*E143","v":1000}]
[null,"C.fb_buf_int",3.1999999999999998E-10,null,1,3.1999999999999998E-10]
[null,"A.fb_buf_int",1,null,1,1]
[null,"R.fb_buf_ext",1000,null,1,1000]
[null,"C.fb_buf_ext",{"$f":"0.00000000032+0.00000000000000265","v":3.2000265E-10},null,1,3.2000265E-10]
[null,"A.fb_buf_ext",1,null,1,1]
[null,"R.fb_buf",{"$f":"IF(IntEA=1,R.fb_buf_int,R.fb_buf_ext)","v":1000},null,1,{"$f":"C149*E149","v":1000}]
[null,"C.fb_buf",{"$f":"IF(IntEA=1,C.fb_buf_int,C.fb_buf_ext)","v":3.1999999999999998E-10},null,1,3.1999999999999998E-10]
[null,"A.fb_buf",{"$f":"IF(IntEA=1,A.fb_buf_int,A.fb_buf_ext)","v":1},null,1,1]
[]
["Compensation componeent, Second Feedabck parasitic, COMP filter "]
[null,"Name","Number ","Final Unit","multiple ","Value","Arial 8pt"]
[null,"R.eaout_int1",309000000,null,1,{"$f":"C155*E155","v":309000000}]
[null,"GM.int",1.45E-5,null,1,1.45E-5]
[null,"R.eaout_ext1",473000000,null,1,473000000]
[null,"GM.ext",1E-3,null,1,1E-3]
[null,"R.eaout",{"$f":"IF(IntEA=1,R.eaout_int1,R.eaout_ext1)","v":309000000},null,1,309000000]
[null,"GM",{"$f":"IF(IntEA=1,GM.int,GM.ext)","v":1.45E-5},null,1,1.45E-5]
[null,"R.comp_desired_max",{"$f":"1/(V.ref/V.load*GM*11*I.rated/6*PH/(2*π*f.cross_desired*C.out))","v":620439.79937304056},null,1,{"$f":"C161*E161","v":620439.79937304056}]
[null,"C.comp_desired_min",{"$f":"1/(2*π*f.cross_desired/10*R.comp_desired_max)","v":6.412990283826704E-11},null,1,6.412990283826704E-11]
[null,"C.hf_desired_min",{"$f":"C.out*R.esr_cout/R.comp_desired_max","v":5.0770437408804197E-14},null,1,5.0770437408804197E-14]
[null,"f.ea_zero_desired",{"$f":"1/(2*π*R.comp_desired_max*C.comp_desired_min)","v":4000},null,1,4000]
[null,"f.ea_pole_desired",{"$f":"1/(2*π*R.comp_desired_max*C.hf_desired_min)","v":5052538.9270840641},null,1,5052538.9270840641]
[null,"R.comp_int",960000,null,1,960000]
[null,"C.comp_int",1.7999999999999999E-11,null,1,1.7999999999999999E-11]
[null,"C.hf_int",1.2300000000000001E-13,null,1,1.2300000000000001E-13]
[null,"R.comp_ext",{"$f":"Design!G79","v":620.43979937304061},"kOhm",1000,620439.79937304056]
[null,"C.comp_ext",{"$f":"Design!G80","v":6.4129902838267042E-2},"nF",1.0000000000000001E-9,6.412990283826704E-11]
[null,"C.hf_ext",{"$f":"Design!G81","v":5.0770437408804193E-2},"pF",9.9999999999999998E-13,5.0770437408804191E-14]
[null,"R.comp",{"$f":"IF(IntEA=1,R.comp_int,R.comp_ext)","v":960000},null,1,960000,{"$f":"C172/1000","v":960}]
[null,"C.comp",{"$f":"IF(IntEA=1,C.comp_int,C.comp_ext)","v":1.7999999999999999E-11},null,1,1.7999999999999999E-11,{"$f":"C173*1000000000","v":1.7999999999999999E-2}]
[{"$f":"IntEA","v":1},"C.hf",{"$f":"IF(IntEA=1,C.hf_int,C.hf_ext+0.00000000003)","v":1.2300000000000001E-13},null,1,1.2300000000000001E-13,{"$f":"Design!G81","v":5.0770437408804193E-2}]
[null,"f.ea_zero_estimated",{"$f":"1/(2*π*R.comp*C.comp)","v":9210.3574191636544},null,1,9210.3574191636544]
[null,"f.ea_pole_estimated",{"$f":"1/(2*π*R.comp*(C.comp*C.hf/(C.comp+C.hf)))","v":1357067.5407114057},null,1,1357067.5407114057,{"$f":"0.00000000001","v":9.9999999999999994E-12}]
["Do not show just show graph (actual is greater than this)","f.cross_estimated",{"$f":"V.ref/V.load*GM*R.comp*11*I.rated/6*PH/(2*π*C.out)","v":61891.580841208946},null,1,61891.580841208946]
[null,"COMP.rc_filter_R",21700,null,1,{"$f":"C178*E178","v":21700}]
[null,"COMP.rc_filter_C",{"$f":"0.00000000000226","v":2.2600000000000001E-12},null,1,2.2600000000000001E-12]
[null,"A.comp_buffer_int",0.77,null,1,0.77]
[null,"A.comp_buffer_ext",1,null,1,1]
[null,"A.comp_buffer",{"$f":"IF(IntEA=1,A.comp_buffer_int,A.comp_buffer_ext)","v":0.77},null,1,0.77]
[]
["Input capacitors"]
[null,"Name","Number ","Final Unit","multiple ","Value","Arial 8pt"]
[null,"V.in_ripple_required",{"$f":"Design!G92","v":35},null,1E-3,{"$f":"C186*E186","v":3.5000000000000003E-2}]
[null,"EffectiveDC",{"$f":"1-((1-V.load/V.supply_max)*PH-FLOOR((1-V.load/V.supply_max)*PH,1))","v":0.13888888888888884}]
[]
["Iout/Number_of_Phases*D1_Vinmax*(1-D1_Vinmax)/(Vinripple1*Fsw)","Cinmin at Vinmax",{"$f":"I.load_nph/PH*eDC*(1-eDC)/(V.in_ripple_required*f.sw*PH)","v":1.0251322751322747E-5},null,1000000,{"$f":"C189*E189","v":10.251322751322746}]
[null,"Cinmin at 50%DC",{"$f":"I.load_nph/PH*0.5*(1-0.5)/(V.in_ripple_required*f.sw*PH)","v":2.1428571428571428E-5},null,1000000,{"$f":"C190*E190","v":21.428571428571427}]
[null,"Cinmin_required",{"$f":"MAX(C189,C190,0.00001)","v":2.1428571428571428E-5},null,1,{"$f":"C191*E191","v":2.1428571428571428E-5}]
[null,"I.ripple_rms at VinMax",{"$f":"I.load_nph/PH*SQRT(eDC*(1-eDC))","v":1.0374916331657276}]
[null,"I.ripple_rms at 50%",{"$f":"I.load_nph/PH*SQRT(0.5*(1-0.5))","v":1.5}]
[null,"I.ripple_in",{"$f":"MAX(C193,C192)","v":1.5}]
[null,"I.ripple_rms at VinMax",{"$f":"I.load_nph/PH*SQRT(eDC*(1-eDC))","v":1.0374916331657276}]
[null,"I.ripple_rms at 50%",{"$f":"I.load_nph/PH*SQRT(0.5*(1-0.5))","v":1.5}]
[null,"I.ripple_in",{"$f":"MAX(C196,C195)","v":1.5}]
["-(Iout/Number_of_Phases*0.5*(1-0.5)/(Cin*Fsw)-Vinripple1)/(Iout/Number_of_Phases+Iripple_Vinmax/2)","Max ESR1 at 50%"]
[]
["Converter input impedance at min VIN  -10dB","Max ESR2 for stability",{"$f":"V.supply_min^2/(V.load*I.load_nph)","v":1.6666666666666667}]
[null,"Max ESR",{"$f":"V.in_ripple_required/I.load_nph/PH","v":1.1666666666666667E-2},null,1000,{"$f":"C201*E201","v":11.666666666666668}]
[]
[null,{"$f":"FLOOR(0.9*4,1)","v":3},"Vout (V)","Min Frequency (kHz)"]
["Min operating frequency at VOUT",null,0.8,300]
[null,null,3.3,500]
[null,null,5,700]
[null,null,12,1700,"Min Freq based on VOUT",{"$f":"ROUND(-0.0231*POWER(V.load,4)-0.054*POWER(V.load,3)+10.834*POWER(V.load,2)+37.439*V.load+263.15,-1)","v":700}]
[null,null,16,1900]
[]
[]
[]
[null,null,null,null,null,null,null,null,null,null,null,null,null,null,null,null,null,null,"Global definitions ","for efficiecy plot"]
[null,null,null,null,null,null,null,null,null,null,null,null,null,null,null,null,null,null,"DC_EFF",{"$f":"V.load/V.supply_typ","v":0.41666666666666669},null,null,"estimated theta JA at full power"]
[null,null,null,null,null,null,null,null,null,null,null,null,null,null,null,null,null,null,"IPKPK_EFF",{"$f":"(V.supply_typ-V.load)/L.out*V.load/V.supply_typ/f.sw","v":1.3257575757575757},null,null,{"$f":"AO328/AL328","v":71.780597694419157}]
[null,null,null,null,null,null,null,null,null,null,null,null,null,null,null,null,null,null,"LFM",{"$f":"Design!G88","v":20},null,null,null,null,null,null,null,null,null,null,null,null,null,null,null,null,null,null,null,null,"°"]
[null,null,null,null,null,null,null,null,null,null,null,null,null,null,null,null,null,null,"THETA_JA_EFF",{"$f":"12276/(558+LFM)","v":21.238754325259517},null,"1st 8600_344, 2nd 12143_714, 3rd 11701_509, 4th 12957_617"]
[null,null,null,null,null,null,null,null,null,null,null,null,null,null,null,null,"Use nly for LDO voltage calculation",null,"T_AMB",{"$f":"Design!G87","v":25}]
[null,null,null,null,null,null,null,null,null,null,null,null,null,null,null,null,"R.hs_fullload",{"$f":"R.hs_25*(1+0.006*(AO328-25))*2","v":7.5900569105920843E-2},"R_HSLS",{"$f":"R.hs_25*DC_EFF+R.ls_25*(1-DC_EFF)","v":3.2024999999999998E-2}]
[null,null,null,null,null,null,null,null,null,null,null,null,null,null,null,null,"R.ls_fullload",{"$f":"R.ls_25*(1+0.006*(AO328-25))*2","v":6.2506351028405391E-2},"TR",{"$f":"V.supply_typ*10^-9/6","v":2.0000000000000001E-9}]
[null,null,null,null,null,null,null,null,null,null,null,null,null,null,null,null,"R.dcr_fullload",{"$f":"R.dcr_25*(1+0.005*(AO328-25))","v":7.1571880242794317E-2},"TF",{"$f":"V.supply_typ*10^-9/6","v":2.0000000000000001E-9}]
[null,null,null,null,null,null,null,null,null,null,null,null,null,null,null,null,null,null,"TRF",{"$f":"TR+TF","v":4.0000000000000002E-9},null,null,null,null,null,null,null,null,null,null,null,null,null,null,null,null,null,null,null,null,{"$f":"\"Peak Efficiency = \"&ROUND(MAX(AN229:AN328),1)&\" %\"","v":"Peak Efficiency = 91.9 %"}]
[null,null,null,null,null,null,null,null,null,null,null,null,null,null,null,null,null,null,"PCORE",{"$f":"Design!G32","v":0.3},"This dominates efficiency at light load. ",null,null,null,null,null,null,null,null,null,null,null,null,null,null,null,null,null,null,null,{"$f":"\"Full Load Efficiency = \"&ROUND(AN328,1)&\" %\"","v":"Full Load Efficiency = 91.1 %"}]
[null,null,null,null,null,null,null,null,null,null,null,null,null,null,null,null,null,null,"CIN_ESR",{"$f":"0.5","v":0.5}]
[null,null,null,null,null,null,null,null,null,null,null,null,null,null,null,null,null,null,"TDLH",{"$f":"0.000000002","v":2.0000000000000001E-9},null,null,null,null,null,null,null,null,null,null,null,null,null,null,null,null,null,null,null,null,"Estimated Maximum TJ"]
[null,null,null,null,null,null,null,null,null,null,null,null,null,null,null,null,null,null,"TDHL",{"$f":"0.000000003","v":3E-9},null,null,null,null,null,null,null,null,null,null,null,null,null,null,null,null,null,null,null,null,{"$f":"ROUND(AO328,1)&\" °C\"","v":"35.5 °C"}]
[null,null,null,null,null,null,null,null,null,null,null,null,null,null,null,null,null,null,null,"Total Iout","1PH IOUT","Based on Total IOUT (Limited to Max 2PH)","1PH","1PH","1PH RMS Current","NPH inductor loss (limited to 2PH)",null,null,null,null,"NPH deadtime loss (limited to 2PH)","NPH transition loss (limited to 2PH)","NPH QRR loss  (limited to 2PH)","NPH Coss loss  (limited to 2PH)","NPH switching loss  (naturally limited to 2PH)","One-IC IQ loss","NPH MOSFET conduction loss  (limited to 2PH)",null,"Total loss ( limited to 2PH loss)","Efficiency ( limited to 2PH efficiency)"]
[null,null,null,null,null,null,null,null,null,null,null,null,null,null,null,null,null,null,null,null,null,null,null,null,null,null,"Need to revisit","Need to revisit","Need to revisit","Need to revisit",null,null,null,null,null,null,null,"1PH result is not valid",null,"Chart","Chart","Chart","Chart","Chart"]
[null,null,null,null,null,null,null,null,null,null,null,null,null,null,null,null,null,null,"STEP","IOUT","IOUT_1PH","TJ_ESTIMATED","RDCR_TJ","RHSLS_TJ","ILOAD_RMS_1PH","Inductor","VCIN_RMS","PCIN_NPH","VCOUT_RMS","PCOUT_NPH","PDT_NPH","PTRAN_NPH","PQRR_NPH","POSS_NPH","PSWITCHING_NPH","PIC_2PH","PCONDUCTION_NPH","IC loss","Total","Converter Effciency","TJ_CALC","Single Inductor","Single IC","Total Loss"]
[null,null,null,null,null,null,null,null,null,null,null,null,null,null,null,null,null,null,1,{"$f":"I.load_nph*S229/100","v":0.03},{"$f":"T229/PH","v":0.03},{"$f":"-(T_AMB+THETA_JA_EFF*PH_NEW*(V.supply_typ*U229*TRF/2*f.sw+0.25+U229^2*R_HSLS*0.85))/(THETA_JA_EFF*PH_NEW*U229^2*R_HSLS*0.006-1)","v":30.32561219899436},{"$f":"R.dcr_25*(1+0.005*(V229-25))","v":6.9810708147658093E-2},{"$f":"R_HSLS*(1+0.006*(V229-25))","v":3.3048316384036769E-2},{"$f":"SQRT((T229/PH)^2+(IPKPK_EFF^2)/12)","v":0.38388726097629716},{"$f":"PH_NEW*(PCORE+Y229^2*W229)","v":0.31028796420757138},0,{"$f":"AA229^2/CIN_ESR","v":0},0,0,{"$f":"PH_NEW*IF(AND(FPWM=0,(U229-IPKPK_EFF/2)<0),(U229+IPKPK_EFF/2)*TDHL*0.7*f.sw,(U229-IPKPK_EFF/2)*TDLH*0.7*f.sw+(U229+IPKPK_EFF/2)*TDHL*0.7*f.sw )","v":5.6901515151515131E-4},{"$f":"PH_NEW*IF(AND(FPWM=0,(U229-IPKPK_EFF/2)<0),f.sw*V.supply_typ*(U229+IPKPK_EFF/2)*TF/2,f.sw*V.supply_typ*(U229+IPKPK_EFF/2)*TF/2+f.sw*V.supply_typ*(U229-IPKPK_EFF/2)*TR/2)","v":7.2000000000000015E-4},{"$f":"IF(AND(FPWM=0,(U229-IPKPK_EFF/2)<0),0,PH_NEW*V.supply_typ*(0.000000004*(V229+275)/300*U229/6)*f.sw/2)","v":1.2213024487959774E-4},{"$f":"PH_NEW*(0.000000000125+0.00000000025)/2*V.supply_typ^2*f.sw","v":2.7000000000000003E-2},{"$f":"AE229+AF229+AG229+AH229","v":2.8411145396394753E-2},{"$f":"V.supply_typ*(0.0045+1/R.t_calc*2)","v":5.5575400201005022E-2},{"$f":"PH_NEW*(Y229^2*X229)","v":4.8703115195497639E-3},{"$f":"AI229+AJ229+AK229","v":8.8856857116949545E-2},{"$f":"AL229+Z229+AB229+AD229","v":0.39914482132452089},{"$f":"100*V.load*U229*PH_NEW/(V.load*U229*PH_NEW+AM229)","v":27.315198864701024},{"$f":"T_AMB+THETA_JA_EFF*AL229","v":26.887208958421578},{"$f":"Z229/PH_NEW","v":0.31028796420757138},{"$f":"AL229","v":8.8856857116949545E-2},{"$f":"(Z229+AI229+AJ229+AK229)*PH/PH_NEW","v":0.39914482132452095}]
[null,null,null,null,null,null,null,null,null,null,null,null,null,null,null,null,null,null,2,0.06,0.06,30.342799498314985,6.9816551829427101E-2,3.3051618923601221E-2,0.38738795688545052,0.31047733007755723,0,0,0,0,6.740151515151518E-4,1.440000000000002E-3,2.4427423959865201E-4,2.7000000000000003E-2,{"$f":"AE230+AF230+AG230+AH230","v":2.9358289391113811E-2},{"$f":"V.supply_typ*(0.0045+1/R.t_calc*PH_NEW)","v":5.4787700100502504E-2},4.9600375840138117E-3,{"$f":"AI230+AJ230+AK230","v":8.9106027075630118E-2},{"$f":"AL230+Z230+AB230+AD230","v":0.39958335715318738},42.882666794817588,26.89250101795923,0.31047733007755723,{"$f":"AL230","v":8.9106027075630118E-2},0.39958335715318732]
[null,null,null,null,null,null,null,null,null,null,null,null,null,null,null,null,null,null,3,0.09,0.09,30.361250899829198,6.9822825305941943E-2,3.3055164360402178E-2,0.39315318787958931,0.31079247424847328,0,0,0,0,7.7901515151515153E-4,2.1599999999999987E-3,3.6643350107979511E-4,2.7000000000000003E-2,3.0305448652594949E-2,5.5575400201005022E-2,5.1093178853123915E-3,{"$f":"AI231+AJ231+AK231","v":9.0990166738912373E-2},0.40178264098738564,52.830379294694289,26.932517797382161,0.31079247424847328,9.0990166738912373E-2,0.40178264098738564]
[null,null,null,null,null,null,null,null,null,null,null,null,null,null,null,null,null,null,4,0.12,0.12,30.380966879832815,6.9829528739143165E-2,3.3058952785959869E-2,0.40108531404164333,0.31123343642537304,0,0,0,0,8.8401515151515148E-4,2.8799999999999997E-3,4.886095470077326E-4,2.7000000000000003E-2,3.1252624698522885E-2,5.5575400201005022E-2,5.3181748626397298E-3,9.2146199762167633E-2,0.40337963618754069,59.797904836874189,26.957070498754966,0.31123343642537304,9.2146199762167633E-2,0.40337963618754069]
[null,null,null,null,null,null,null,null,null,null,null,null,null,null,null,null,null,null,5,0.15,0.15,30.401947970405185,6.9836662309937764E-2,3.3062984302513358E-2,0.41105891200639799,0.31180026096354502,0,0,0,0,9.8901515151515133E-4,3.6000000000000008E-3,6.1080389594081041E-4,2.7000000000000003E-2,3.2199819047455967E-2,5.5575400201005022E-2,5.5866335832566163E-3,9.3361852831717607E-2,0.40516211379526262,64.925952041128639,26.982889455643885,0.31180026096354502,9.3361852831717607E-2,0.40516211379526262]
[null,null,null,null,null,null,null,null,null,null,null,null,null,null,null,null,null,null,6,0.18,0.18,30.424194759455435,6.9844226218214844E-2,3.3067259023029358E-2,0.42292957940995768,0.31249299687236898,0,0,0,0,1.094015151515151E-3,4.3200000000000001E-3,7.3301806742269286E-4,2.7000000000000003E-2,3.3147033218937846E-2,5.5575400201005022E-2,5.9147217446699294E-3,9.463715516461281E-2,0.40713015203698177,68.853128251802204,27.009975288582677,0.31249299687236898,9.463715516461281E-2,0.40713015203698183]
[null,null,null,null,null,null,null,null,null,null,null,null,null,null,null,null,null,null,7,0.21,0.21,30.447707890774886,6.9852220682863453E-2,3.3071777071212394E-2,0.4365425857117306,0.31331169781968643,0,0,0,0,1.1990151515151514E-3,5.0399999999999993E-3,8.5525358209416957E-4,2.7000000000000003E-2,3.4094268733609323E-2,5.5575400201005022E-2,6.3024696771024399E-3,9.5972138611716773E-2,0.4092838364314032,71.953102870495428,27.038328674044006,0.31331169781968643,9.5972138611716773E-2,0.40928383643140326]
[null,null,null,null,null,null,null,null,null,null,null,null,null,null,null,null,null,null,8,0.24,0.24,30.472488064095668,6.9860645941792532E-2,3.3076538581515977E-2,0.45174044443671818,0.31425642213668514,0,0,0,0,1.3040151515151513E-3,5.7599999999999995E-3,9.7751196180510618E-4,2.7000000000000003E-2,3.5041527113320259E-2,5.5575400201005022E-2,6.7499103462533025E-3,9.7366837660578576E-2,0.41162325979726372,74.459089163987102,27.067950344500453,0.31425642213668514,9.7366837660578576E-2,0.41162325979726377]
[null,null,null,null,null,null,null,null,null,null,null,null,null,null,null,null,null,null,9,0.27,0.27,30.498536035155478,6.9869502251952861E-2,3.3081543699155128E-2,0.46836890283182087,0.31532723282329872,0,0,0,0,1.4090151515151511E-3,6.4800000000000005E-3,1.0997947297265599E-3,2.7000000000000003E-2,3.5988809881241715E-2,5.5575400201005022E-2,7.2570793563497757E-3,9.8821289438596527E-2,0.41414852226189525,76.524169193481697,27.098841088491714,0.31532723282329872,9.8821289438596527E-2,0.41414852226189525]
[null,null,null,null,null,null,null,null,null,null,null,null,null,null,null,null,null,null,10,0.3,0.3,30.525852615768546,6.9878789889361317E-2,3.3086792580119921E-2,0.48628122433411275,0.31652419755412314,0,0,0,0,1.5140151515151512E-3,7.2000000000000015E-3,1.2221034104630741E-3,2.7000000000000003E-2,3.6936118561978232E-2,5.5575400201005022E-2,7.8240149534906968E-3,0.10033553371647394,0.41685973127059706,78.252987192011162,27.131001750697983,0.31652419755412314,0.10033553371647394,0.41685973127059717]
[null,null,null,null,null,null,null,null,null,null,null,null,null,null,null,null,null,null,11,0.33,0.33,30.554438673902837,6.9888509149126962E-2,3.3092285391190433E-2,0.50534090388556885,0.31784738868485007,0,0,0,0,1.6190151515151515E-3,7.92E-3,1.3444395301651726E-3,2.7000000000000003E-2,3.7883454681680327E-2,5.5575400201005022E-2,8.450758029282416E-3,0.10190961291196776,0.41975700159681784,79.719503242507443,27.164433232019579,0.31784738868485007,0.10190961291196776,0.41975700159681784]
[null,null,null,null,null,null,null,null,null,null,null,null,null,null,null,null,null,null,12,0.36,0.36,30.584295133763419,6.9898660345479563E-2,3.3098022309952638E-2,0.52542309536209353,0.31929688325921918,0,0,0,0,1.7240151515151515E-3,8.6400000000000018E-3,1.4668046166420642E-3,2.7000000000000003E-2,3.8830819768157221E-2,5.5575400201005022E-2,9.1373521247677583E-3,0.10354357209392999,0.42284045535314918,80.977471669869743,27.199136489662777,0.31929688325921918,0.10354357209392999,0.42284045535314918]
[null,null,null,null,null,null,null,null,null,null,null,null,null,null,null,null,null,null,13,0.39,0.39,30.615422975882119,6.9909243811799929E-2,3.3104003524815753E-2,0.54641507038137571,0.32087276301649004,0,0,0,0,1.8290151515151514E-3,9.3600000000000003E-3,1.5892001994745873E-3,2.7000000000000003E-2,3.9778215350989743E-2,5.5575400201005022E-2,9.8838434346489399E-3,0.1052374589866437,0.42611022200313375,82.066900009212958,27.235112537231899,0.32087276301649004,0.1052374589866437,0.42611022200313375]
[null,null,null,null,null,null,null,null,null,null,null,null,null,null,null,null,null,null,14,0.42,0.42,30.647823237213395,6.9920259900652551E-2,3.3110229235030549E-2,0.56821600570547437,0.32257511439943598,0,0,0,0,1.934015151515151E-3,1.008E-2,1.7116278101283952E-3,2.7000000000000003E-2,4.0725642961643549E-2,5.5575400201005022E-2,1.0690280811805002E-2,0.10699132397445357,0.42956643837388953,83.018179247743632,27.272362444827667,0.32257511439943598,0.10699132397445357,0.42956643837388958]
[null,null,null,null,null,null,null,null,null,null,null,null,null,null,null,null,null,null,15,0.45,0.45,30.681497011236509,6.9931708983820423E-2,3.311669965070909E-2,0.59073634486112647,0.32440402856286027,0,0,0,0,2.039015151515151E-3,1.0800000000000001E-2,1.8340889820674191E-3,2.7000000000000003E-2,4.1673104133582578E-2,5.5575400201005022E-2,1.1556715772104939E-2,0.10880522010669254,0.43320924866955279,83.854809352481325,27.310887339151829,0.32440402856286027,0.10880522010669254,0.43320924866955279]
[null,null,null,null,null,null,null,null,null,null,null,null,null,null,null,null,null,null,16,0.48,0.48,30.716445448063979,6.9943591452341761E-2,3.312341499284549E-2,0.61389692061443313,0.32635960138263725,0,0,0,0,2.1440151515151511E-3,1.1519999999999999E-2,1.9565852508676091E-3,2.7000000000000003E-2,4.2620600402382761E-2,5.5575400201005022E-2,1.2483202499517142E-2,0.11067920310290494,0.43703880448554222,84.595247559019796,27.350688403618101,0.32635960138263725,0.11067920310290494,0.43703880448554216]
[null,null,null,null,null,null,null,null,null,null,null,null,null,null,null,null,null,null,17,0.51,0.51,30.752669754556354,6.9955907716549165E-2,3.3130375493337999E-2,0.63762797079479172,0.32844193346527978,0,0,0,0,2.2490151515151512E-3,1.2240000000000001E-2,2.0791181543309833E-3,2.7000000000000003E-2,4.3568133305846135E-2,5.5575400201005022E-2,1.3469797851516425E-2,0.11261333135836757,0.44105526482364732,85.254192056874217,27.391766878469411,0.32844193346527978,0.11261333135836757,0.44105526482364737]
[null,null,null,null,null,null,null,null,null,null,null,null,null,null,null,null,null,null,18,0.54,0.54,30.790171194443303,6.9968658206110729E-2,3.3137581395012272E-2,0.66186813576412917,0.33065113015803455,0,0,0,0,2.3540151515151517E-3,1.2960000000000001E-2,2.2016892325999924E-3,2.7000000000000003E-2,4.4515704384115146E-2,5.5575400201005022E-2,1.4516561364789458E-2,0.11460766594990962,0.44525879610794417,85.843492539980389,27.434124060901542,0.33065113015803455,0.11460766594990962,0.44525879610794422]
[null,null,null,null,null,null,null,null,null,null,null,null,null,null,null,null,null,null,19,0.56999999999999995,0.56999999999999995,30.828951088451092,6.9981843370073377E-2,3.3145032951645871E-2,0.68656349243160586,0.33298730155950823,0,0,0,0,2.4590151515151513E-3,1.3680000000000001E-2,2.3243000282722284E-3,2.7000000000000003E-2,4.5463315179787384E-2,5.5575400201005022E-2,1.5623555261239949E-2,0.11666227064203234,0.44964957220154056,86.372808313049688,27.477761305193059,0.33298730155950823,0.11666227064203234,0.44964957220154056]
[null,null,null,null,null,null,null,null,null,null,null,null,null,null,null,null,null,null,20,0.6,0.6,30.869010814436436,6.9995463676908398E-2,3.3152730427993958E-2,0.71166665591404776,0.33545056253082528,0,0,0,0,2.5640151515151513E-3,1.44E-2,2.4469520865154915E-3,2.7000000000000003E-2,4.6410967238030648E-2,5.5575400201005022E-2,1.6790844454294553E-2,0.11877721189333021,0.45422777442415552,86.850092000667829,27.522680022841733,0.33545056253082528,0.11877721189333021,0.45422777442415552]
[null,null,null,null,null,null,null,null,null,null,null,null,null,null,null,null,null,null,21,0.63,0.63,30.910351807526755,7.0009519614559104E-2,3.3160674099816261E-2,0.73713596380849833,0.33804103270732044,0,0,0,0,2.6690151515151514E-3,1.5120000000000001E-2,2.5696469551832251E-3,2.7000000000000003E-2,4.7358662106698382E-2,5.5575400201005022E-2,1.8018496555510889E-2,0.12095255886321429,0.45899359157053476,87.281950496044146,27.5688816827073,0.33804103270732044,0.12095255886321429,0.45899359157053476]
[null,null,null,null,null,null,null,null,null,null,null,null,null,null,null,null,null,null,22,0.66,0.66,30.952975560266886,7.0024011690490745E-2,3.3168864253905285E-2,0.7629347476291034,0.34075883651076849,0,0,0,0,2.774015151515151E-3,1.584E-2,2.692386184930349E-3,2.7000000000000003E-2,4.8306401336445509E-2,5.5575400201005022E-2,1.9306581881488944E-2,0.12318838341893946,0.46394721992970794,87.67391802219872,27.616367811160728,0.34075883651076849,0.12318838341893946,0.463947219929708]
[null,null,null,null,null,null,null,null,null,null,null,null,null,null,null,null,null,null,23,0.69,0.69,30.996883622772224,7.0038940431742566E-2,3.3177301188115675E-2,0.78903068960585021,0.34360410316215229,0,0,0,0,2.8790151515151511E-3,1.6559999999999998E-2,2.8151713293295042E-3,2.7000000000000003E-2,4.9254186480844654E-2,5.5575400201005022E-2,2.0655173461087157E-2,0.12548476014293683,0.46908886330508914,88.030665298324166,27.665139992239954,0.34360410316215229,0.12548476014293683,0.46908886330508914]
[null,null,null,null,null,null,null,null,null,null,null,null,null,null,null,null,null,null,24,0.72,0.72,31.042077602888433,7.0054306384982071E-2,3.3185985211395014E-2,0.81539525945389435,0.34657696669497351,0,0,0,0,2.9840151515151511E-3,1.728E-2,2.9380039449877289E-3,2.7000000000000003E-2,5.0202019096502883E-2,5.5575400201005022E-2,2.2064347042944826E-2,0.12784176634045274,0.47441873303542625,88.356161599473467,27.715199867812107,0.34657696669497351,0.12784176634045274,0.47441873303542625]
[null,null,null,null,null,null,null,null,null,null,null,null,null,null,null,null,null,null,25,0.75,0.75,31.088559166357626,7.0070110116561599E-2,3.3194916643815617E-2,0.84200322394862814,0.34967756596910743,0,0,0,0,3.0890151515151508E-3,1.8000000000000002E-2,3.0608855916635768E-3,2.7000000000000003E-2,5.1149900743178732E-2,5.5575400201005022E-2,2.3534181103311978E-2,0.13025948204749574,0.4799370480166032,88.653801638924065,27.766549137742313,0.34967756596910743,0.13025948204749574,0.47993704801660314]
[null,null,null,null,null,null,null,null,null,null,null,null,null,null,null,null,null,null,26,0.78,0.78,31.136330036991112,7.0086352212576988E-2,3.320409581660784E-2,0.86883222151338502,0.35290604468520481,0,0,0,0,3.1940151515151517E-3,1.8720000000000001E-2,3.1838178323847078E-3,2.7000000000000003E-2,5.2097832983899861E-2,5.5575400201005022E-2,2.5064756854188762E-2,0.13273799003909365,0.48564403472429846,88.926505870537923,27.819189560069056,0.35290604468520481,0.13273799003909365,0.48564403472429846]
[null,null,null,null,null,null,null,null,null,null,null,null,null,null,null,null,null,null,27,0.81,0.81,31.185391996848786,7.0103033278928584E-2,3.3213523072194495E-2,0.8958623940873307,0.35626255139964397,0,0,0,0,3.2990151515151517E-3,1.9439999999999999E-2,3.306802233565968E-3,2.7000000000000003E-2,5.3045817385081122E-2,5.5575400201005022E-2,2.6656158251775496E-2,0.13527737583786165,0.49153992723750561,89.176800488100156,27.87312295118614,0.35626255139964397,0.13527737583786165,0.49153992723750561]
[null,null,null,null,null,null,null,null,null,null,null,null,null,null,null,null,null,null,28,0.84,0.84,31.235746886425119,7.0120153941384544E-2,3.322319876422658E-2,0.92307606898883665,0.35974723954003629,0,0,0,0,3.4040151515151509E-3,2.0160000000000004E-2,3.4298403651279608E-3,2.7000000000000003E-2,5.3993855516643117E-2,5.5575400201005022E-2,2.8308472005235424E-2,0.13787772772288356,0.49762496726291983,89.406881759808471,27.928351186031346,0.35974723954003629,0.13787772772288356,0.49762496726291983]
[null,null,null,null,null,null,null,null,null,null,null,null,null,null,null,null,null,null,29,0.87,0.87,31.287396604841824,7.0137714845646223E-2,3.3233123257620352E-2,0.95045748413060738,0.36336026742128735,0,0,0,0,3.509015151515151E-3,2.0880000000000003E-2,3.5529338006161661E-3,2.7000000000000003E-2,5.4941948952131323E-2,5.5575400201005022E-2,3.0021787585771894E-2,0.14053913673890825,0.50389940416019563,89.618668163408756,27.984876198281725,0.36336026742128735,0.14053913673890825,0.50389940416019563]
[null,null,null,null,null,null,null,null,null,null,null,null,null,null,null,null,null,null,30,0.9,0.9,31.340343110047243,7.0155716657416059E-2,3.3243296928595574E-2,0.97799255065664159,0.36710179826221817,0,0,0,0,3.6140151515151515E-3,2.1600000000000005E-2,3.6760841173205674E-3,2.7000000000000003E-2,5.589009926883573E-2,5.5575400201005022E-2,3.1796197236021458E-2,0.1432616967058622,0.51036349496808042,89.813842938129341,28.042699980555646,0.36710179826221817,0.1432616967058622,0.51036349496808042]
[null,null,null,null,null,null,null,null,null,null,null,null,null,null,null,null,null,null,31,0.93,0.93,31.39458841902248,7.0174160062467655E-2,3.3253720164715166E-2,1.0056686477860806,0.37097200020274873,0,0,0,0,3.7190151515151515E-3,2.232E-2,3.7992928963958795E-3,2.7000000000000003E-2,5.6838308047911033E-2,5.5575400201005022E-2,3.3631795979765421E-2,0.14604550422868148,0.51701750443143024,89.993889047443389,28.101824584621617,0.37097200020274873,0.14604550422868148,0.51701750443143024]
[null,null,null,null,null,null,null,null,null,null,null,null,null,null,null,null,null,null,32,0.96,0.96,31.450134607994329,7.0193045766718073E-2,3.3264393364926106E-2,1.0334744453250324,0.37497104632164824,0,0,0,0,3.8240151515151512E-3,2.3039999999999998E-2,3.9225617229823274E-3,2.7000000000000003E-2,5.7786576874497481E-2,5.5575400201005022E-2,3.552868163196115E-2,0.14889065870746365,0.52386170502911189,90.160118086195723,28.162252121613882,0.37497104632164824,0.14889065870746365,0.52386170502911189]
[null,null,null,null,null,null,null,null,null,null,null,null,null,null,null,null,null,null,33,{"$f":"I.load_nph*S261/100","v":0.99},{"$f":"T261/PH","v":0.99},{"$f":"-(T_AMB+THETA_JA_EFF*PH_NEW*(V.supply_typ*U261*TRF/2*f.sw+0.25+U261^2*R_HSLS*0.85))/(THETA_JA_EFF*PH_NEW*U261^2*R_HSLS*0.006-1)","v":31.506983812655044},{"$f":"R.dcr_25*(1+0.005*(V261-25))","v":7.0212374496302729E-2},{"$f":"R_HSLS*(1+0.006*(V261-25))","v":3.3275316939601667E-2},{"$f":"SQRT((T261/PH)^2+(IPKPK_EFF^2)/12)","v":1.0613997499245436},{"$f":"PH_NEW*(PCORE+Y261^2*W261)","v":0.37909911465485546},0,{"$f":"AA261^2/CIN_ESR","v":0},0,0,{"$f":"PH_NEW*IF(AND(FPWM=0,(U261-IPKPK_EFF/2)<0),(U261+IPKPK_EFF/2)*TDHL*0.7*f.sw,(U261-IPKPK_EFF/2)*TDLH*0.7*f.sw+(U261+IPKPK_EFF/2)*TDHL*0.7*f.sw )","v":3.9290151515151512E-3},{"$f":"PH_NEW*IF(AND(FPWM=0,(U261-IPKPK_EFF/2)<0),f.sw*V.supply_typ*(U261+IPKPK_EFF/2)*TF/2,f.sw*V.supply_typ*(U261+IPKPK_EFF/2)*TF/2+f.sw*V.supply_typ*(U261-IPKPK_EFF/2)*TR/2)","v":2.3760000000000003E-2},{"$f":"IF(AND(FPWM=0,(U261-IPKPK_EFF/2)<0),0,PH_NEW*V.supply_typ*(0.000000004*(V261+275)/300*U261/6)*f.sw/2)","v":4.0458921863270464E-3},{"$f":"PH_NEW*(0.000000000125+0.00000000025)/2*V.supply_typ^2*f.sw","v":2.7000000000000003E-2},5.8734907337842208E-2,{"$f":"V.supply_typ*(0.0045+1/R.t_calc*2)","v":5.5575400201005022E-2},{"$f":"PH_NEW*(Y261^2*X261)","v":3.7486954809095745E-2},0.15179726234794297,0.53089637700279846,{"$f":"100*V.load*U261*PH_NEW/(V.load*U261*PH_NEW+AM261)","v":90.313694321418339},{"$f":"T_AMB+THETA_JA_EFF*AL261","v":28.223984762254929},{"$f":"Z261/PH_NEW","v":0.37909911465485546},0.15179726234794297,{"$f":"(Z261+AI261+AJ261+AK261)*PH/PH_NEW","v":0.53089637700279846}]
[null,null,null,null,null,null,null,null,null,null,null,null,null,null,null,null,null,null,34,1.02,1.02,31.565138228388967,7.0232146997652262E-2,3.3286491310584934E-2,1.0894353717132024,0.3833563882143719,0,0,0,0,4.0340151515151513E-3,2.4480000000000002E-2,4.1692858799060898E-3,2.7000000000000003E-2,5.9683301031421242E-2,5.5575400201005022E-2,3.9506718939863628E-2,0.15476542017228989,0.53812180838666179,90.455654796492524,28.287024737084828,0.3833563882143719,0.15476542017228989,0.53812180838666179]
[null,null,null,null,null,null,null,null,null,null,null,null,null,null,null,null,null,null,35,1.05,1.05,31.62460011050613,7.0252364037572096E-2,3.3297916911233752E-2,1.117573008415953,0.38774305500773371,0,0,0,0,4.1390151515151522E-3,2.52E-2,4.2927444015470866E-3,2.7000000000000003E-2,6.0631759553062242E-2,5.5575400201005022E-2,4.1588080276170898E-2,0.15779524003023815,0.54553829503797191,90.586926230734235,28.351374336697585,0.38774305500773371,0.15779524003023815,0.54553829503797191]
[null,null,null,null,null,null,null,null,null,null,null,null,null,null,null,null,null,null,36,1.08,1.08,31.685371774482785,7.0273026403324154E-2,3.3309594186466861E-2,1.1458051444900585,0.39225930805806419,0,0,0,0,4.2440151515151514E-3,2.5919999999999999E-2,4.4162693535525531E-3,2.7000000000000003E-2,6.1580284505067709E-2,5.5575400201005022E-2,4.3731147904467943E-2,0.16088683261054068,0.5531461406686049,90.70833929491809,28.417035911984424,0.39225930805806419,0.16088683261054068,0.5531461406686049]
[null,null,null,null,null,null,null,null,null,null,null,null,null,null,null,null,null,null,37,1.1100000000000001,1.1100000000000001,31.747455596208994,7.0294134902711067E-2,3.3321523592811556E-2,1.1741249631703961,0.39690534542471234,0,0,0,0,4.3490151515151515E-3,2.6640000000000007E-2,4.5398623428238938E-3,2.7000000000000003E-2,6.2528877494339052E-2,5.5575400201005022E-2,4.5936033757413397E-2,0.16404031145275746,0.56094565687746978,90.820640726101644,28.484011874384173,0.39690534542471234,0.16404031145275746,0.56094565687746978]
[null,null,null,null,null,null,null,null,null,null,null,null,null,null,null,null,null,null,38,1.1399999999999999,1.1399999999999999,31.810854012243276,7.0315690364162714E-2,3.3333705598452543E-2,1.2025262696256924,0.40168137022448158,0,0,0,0,4.4540151515151507E-3,2.7360000000000002E-2,4.6635249809860967E-3,2.7000000000000003E-2,6.3477540132501259E-2,5.5575400201005022E-2,4.8202852625871206E-2,0.16725579295937748,0.56893716318385912,90.924503653903145,28.552304696140688,0.40168137022448158,0.16725579295937748,0.56893716318385912]
[null,null,null,null,null,null,null,null,null,null,null,null,null,null,null,null,null,null,39,1.17,1.17,31.875569520074382,7.0337693636825294E-2,3.3346140683282295E-2,1.2310034236913736,0.40658759065345196,0,0,0,0,4.5590151515151507E-3,2.8080000000000001E-2,4.7872588845131606E-3,2.7000000000000003E-2,6.4426274036028325E-2,5.5575400201005022E-2,5.0531722171243743E-2,0.17053339640827708,0.5771209870617291,91.020536438888954,28.621916910567492,0.40658759065345196,0.17053339640827708,0.5771209870617291]
[null,null,null,null,null,null,null,null,null,null,null,null,null,null,null,null,null,null,40,1.2,1.2,31.941604678390267,7.0360145590652692E-2,3.3358829338952685E-2,1.2595512808694544,0.41162422000940185,0,0,0,0,4.6640151515151508E-3,2.8799999999999999E-2,4.9110656748542446E-3,2.7000000000000003E-2,6.5375080826369392E-2,5.5575400201005022E-2,5.2922762938143054E-2,0.17387324396551745,0.58549746397491931,91.109290267321427,28.692851112319538,0.41162422000940185,0.17387324396551745,0.58549746397491931]
[null,null,null,null,null,null,null,null,null,null,null,null,null,null,null,null,null,null,41,1.23,1.23,32.0089621073543,7.0383047116500466E-2,3.3371772068928128E-2,1.2881651404769046,0.41679147671483285,0,0,0,0,4.7690151515151508E-3,2.9520000000000001E-2,5.0349469785606104E-3,2.7000000000000003E-2,6.632396213007577E-2,5.5575400201005022E-2,5.5376098367403571E-2,0.17727546069848435,0.59406693741331718,91.191265701743291,28.765109957672308,0.41679147671483285,0.17727546069848435,0.59406693741331718]
[null,null,null,null,null,null,null,null,null,null,null,null,null,null,null,null,null,null,42,1.26,1.26,32.077644488888751,7.040639912622218E-2,3.3384969388539971E-2,1.3168406999861006,0.4220895843406029,0,0,0,0,4.8740151515151509E-3,3.0240000000000003E-2,5.158904427413331E-3,2.7000000000000003E-2,6.7272919578928489E-2,5.5575400201005022E-2,5.7891854809437995E-2,0.18074017458937153,0.60282975892997448,91.266918351128211,28.838696164808177,0.4220895843406029,0.18074017458937153,0.60282975892997448]
[null,null,null,null,null,null,null,null,null,null,null,null,null,null,null,null,null,null,43,1.29,1.29,32.147654566965635,7.0430202552768315E-2,3.3398421825042449E-2,1.3455740147386481,0.4275187716301721,0,0,0,0,4.9790151515151518E-3,3.0960000000000001E-2,5.282939658551809E-3,2.7000000000000003E-2,6.8221954810066959E-2,5.5575400201005022E-2,6.0470161537940138E-2,0.18426751654901211,0.61178628817918423,91.336663795628297,28.913612514110159,0.4275187716301721,0.18426751654901211,0.61178628817918423]
[null,null,null,null,null,null,null,null,null,null,null,null,null,null,null,null,null,null,44,1.32,1.32,32.218995147905012,7.0454458350287713E-2,3.3412129917669946E-2,1.3743614623307376,0.43307927252446765,0,0,0,0,5.084015151515151E-3,3.168E-2,5.4070543146031288E-3,2.7000000000000003E-2,6.9171069466118285E-2,5.5575400201005022E-2,6.3111150763936849E-2,0.18785762043106013,0.62093689295552779,91.400881877789416,28.989861848463139,0.43307927252446765,0.18785762043106013,0.62093689295552779]
[null,null,null,null,null,null,null,null,null,null,null,null,null,null,null,null,null,null,45,1.35,1.35,32.291669100680714,7.0479167494231443E-2,3.3426094217695802E-2,1.4031997110674888,0.43877132618737114,0,0,0,0,5.1890151515151511E-3,3.2400000000000005E-2,5.5312500438122539E-3,2.7000000000000003E-2,7.0120265195327408E-2,5.5575400201005022E-2,6.5814957650192477E-2,0.19151062304652489,0.63028194923389602,91.459920453319242,29.067447073562526,0.43877132618737114,0.19151062304652489,0.63028194923389613]
[null,null,null,null,null,null,null,null,null,null,null,null,null,null,null,null,null,null,46,1.38,1.38,32.365679357233617,7.0504330981459432E-2,3.3440315288492437E-2,1.4320856919681459,0.44459517703183504,0,0,0,0,5.2940151515151511E-3,3.3120000000000004E-2,5.6555285001730982E-3,2.7000000000000003E-2,7.1069543651688258E-2,5.5575400201005022E-2,6.8581720325968196E-2,0.19522666417866147,0.63982184121049657,91.514098679183448,29.146371158230533,0.44459517703183504,0.19522666417866147,0.63982184121049657]
[null,null,null,null,null,null,null,null,null,null,null,null,null,null,null,null,null,null,47,1.41,1.41,32.441028912792589,7.0529949830349492E-2,3.3454793705593094E-2,1.4610165738758352,0.4505510747466337,0,0,0,0,5.3990151515151512E-3,3.3840000000000002E-2,5.7798913435605018E-3,2.7000000000000003E-2,7.2018906495075655E-2,5.5575400201005022E-2,7.1411579902140421E-2,0.1990058865982211,0.64955696134485486,91.563709904272216,29.226637134740074,0.4505510747466337,0.1990058865982211,0.64955696134485486]
[null,null,null,null,null,null,null,null,null,null,null,null,null,null,null,null,null,null,48,1.44,1.44,32.517720826203004,7.0556025080909024E-2,3.3469530056754911E-2,1.4899897412867928,0.45663927432375301,0,0,0,0,5.5040151515151504E-3,3.4559999999999994E-2,5.9043402398630982E-3,2.7000000000000003E-2,7.2968355391378248E-2,5.5575400201005022E-2,7.4304680486680055E-2,0.20284843607906333,0.65948771040281629,91.609024217571871,29.308248099146336,0.45663927432375301,0.20284843607906333,0.6594877104028164]
[null,null,null,null,null,null,null,null,null,null,null,null,null,null,null,null,null,null,49,1.47,1.47,32.595758220263072,7.058255779488945E-2,3.3484524942023551E-2,1.5190027745662229,0.4628600360864269,0,0,0,0,5.6090151515151504E-3,3.5279999999999999E-2,6.0288768611171557E-3,2.7000000000000003E-2,7.3917892012632297E-2,5.5575400201005022E-2,7.7261169200497068E-2,0.20675446141413439,0.66961449750056135,91.650290700266751,29.391207211626149,0.4628600360864269,0.20675446141413439,0.66961449750056135]
[null,null,null,null,null,null,null,null,null,null,null,null,null,null,null,null,null,null,50,1.5,1.5,32.675144282068018,7.0609549055903137E-2,3.3499778973799368E-2,1.5480534322625572,0.46921362571782477,0,0,0,0,5.7140151515151522E-3,3.6000000000000004E-2,6.1535028856413605E-3,2.7000000000000003E-2,7.4867518037156522E-2,5.5575400201005022E-2,8.0281196193653259E-2,0.2107241144318148,0.67993774014963959,91.687739421141345,29.475517696825186,0.46921362571782477,0.2107241144318148,0.67993774014963959]
[null,null,null,null,null,null,null,null,null,null,null,null,null,null,null,null,null,null,51,1.53,1.53,32.755882263362018,7.0636999969543091E-2,3.3515292776905015E-2,1.5771396352700935,0.47570031429039633,0,0,0,0,5.8190151515151506E-3,3.6720000000000003E-2,6.2782199981725869E-3,2.7000000000000003E-2,7.5817235149687745E-2,5.5575400201005022E-2,8.3364914661946288E-2,0.21475755001263905,0.69045786430303535,91.721583208780672,29.561182844213075,0.47570031429039633,0.21475755001263905,0.69045786430303546]
[null,null,null,null,null,null,null,null,null,null,null,null,null,null,null,null,null,null,52,1.56,1.56,32.837975480898251,7.06649116635054E-2,3.3531066988654601E-2,1.6062594526227336,0.4823203782958807,0,0,0,0,5.9240151515151515E-3,3.7440000000000001E-2,6.4030298900026846E-3,2.7000000000000003E-2,7.6767045041517851E-2,5.5575400201005022E-2,8.6512480863869284E-2,0.21885492610639215,0.70117530440227283,91.752019229162642,29.648206008446486,0.4823203782958807,0.21885492610639215,0.70117530440227294]
[null,null,null,null,null,null,null,null,null,null,null,null,null,null,null,null,null,null,53,1.59,1.59,32.921427316806891,7.0693285287714347E-2,3.354710225892444E-2,1.6354110887296454,0.48907409967598514,0,0,0,0,6.0290151515151515E-3,3.8160000000000006E-2,6.5279342591163065E-3,2.7000000000000003E-2,7.7716949410631467E-2,5.5575400201005022E-2,8.9724054137948858E-2,0.22301640374958537,0.71209050342557045,91.779230393125516,29.736590609740329,0.48907409967598514,0.22301640374958537,0.71209050342557045]
[null,null,null,null,null,null,null,null,null,null,null,null,null,null,null,null,null,null,54,1.62,1.62,33.006241218971219,7.0722122014450217E-2,3.356339925022532E-2,1.6645928718878633,0.49596176585374091,0,0,0,0,6.1340151515151516E-3,3.8880000000000005E-2,6.6529348103297791E-3,2.7000000000000003E-2,7.8666949961844951E-2,5.5575400201005022E-2,9.2999796920465852E-2,0.2272421470833158,0.72320391293705666,91.803386614734606,29.826340134247033,0.49596176585374091,0.2272421470833158,0.72320391293705677]
[null,null,null,null,null,null,null,null,null,null,null,null,null,null,null,null,null,null,55,1.65,1.65,33.092420701412053,7.0751423038480102E-2,3.3579958637776325E-2,1.6938032439276658,0.50298366976554265,0,0,0,0,6.2390151515151508E-3,3.9599999999999996E-2,6.7780332554310636E-3,2.7000000000000003E-2,7.9617048406946209E-2,5.5575400201005022E-2,9.6339874763562039E-2,0.23153232337151328,0.73451599313705596,91.824645938655735,29.917458134444111,0.50298366976554265,0.23153232337151328,0.73451599313705596]
[null,null,null,null,null,null,null,null,null,null,null,null,null,null,null,null,null,null,56,1.68,1.68,33.179969344680224,7.0781189577191289E-2,3.3596781109580302E-2,1.7230407508645533,0.51014010989387781,0,0,0,0,6.3440151515151508E-3,4.0320000000000002E-2,6.9032313133208373E-3,2.7000000000000003E-2,8.0567246464835984E-2,5.5575400201005022E-2,9.9744456353737299E-2,0.2358871030195783,0.74602721291345608,91.843155552171055,30.009948229530007,0.51014010989387781,0.2358871030195783,0.74602721291345608]
[null,null,null,null,null,null,null,null,null,null,null,null,null,null,null,null,null,null,57,1.71,1.71,33.268890796257693,7.0811422870727614E-2,3.3613867366500912E-2,1.7523040344471856,0.51743139030075302,0,0,0,0,6.4490151515151518E-3,4.1040000000000007E-2,7.0285307101546745E-3,2.7000000000000003E-2,8.1517545861669843E-2,5.5575400201005022E-2,0.10321371353074046,0.24030665959341532,0.75773804989416838,91.859052695377642,30.103814105828317,0.51743139030075302,0.24030665959341532,0.75773804989416838]
[null,null,null,null,null,null,null,null,null,null,null,null,null,null,null,null,null,null,58,1.74,1.74,33.359188770966909,7.0842124182128749E-2,3.3631218122341287E-2,1.78159182450411,0.52485782066182618,0,0,0,0,6.554015151515151E-3,4.1760000000000005E-2,7.153933179486433E-3,2.7000000000000003E-2,8.24679483310016E-2,5.5575400201005022E-2,0.10674782130685871,0.24479116983886534,0.76964899050069158,91.872465481320901,30.199059517200538,0.52485782066182618,0.24479116983886534,0.76964899050069147]
[null,null,null,null,null,null,null,null,null,null,null,null,null,null,null,null,null,null,59,1.77,1.77,33.450867051388805,7.0873294797472203E-2,3.3648834103924351E-2,1.8109029320037793,0.53241971630124918,0,0,0,0,6.6590151515151519E-3,4.2480000000000004E-2,7.2794404624127755E-3,2.7000000000000003E-2,8.3418455613927939E-2,5.5575400201005022E-2,0.11034695788660907,0.24934081370154204,0.78176053000279122,91.883513636290914,30.295688285467353,0.53241971630124918,0.24934081370154204,0.78176053000279122]
[null,null,null,null,null,null,null,null,null,null,null,null,null,null,null,null,null,null,60,1.8,1.8,33.543929488289407,7.0904936026018411E-2,3.3666716051174807E-2,1.8402362427525125,0.54011739822723059,0,0,0,0,6.7640151515151511E-3,4.3200000000000002E-2,7.4050543077189453E-3,2.7000000000000003E-2,8.4369069459234114E-2,5.5575400201005022E-2,0.11401130468683651,0.25395577434707561,0.79407317257430621,91.892309169203514,30.393704300838582,0.54011739822723059,0.25395577434707561,0.79407317257430632]
[null,null,null,null,null,null,null,null,null,null,null,null,null,null,null,null,null,null,61,1.83,1.83,33.638380001055161,7.0937049200358759E-2,3.368486471720275E-2,1.8695907116638883,0.54795119316832586,0,0,0,0,6.869015151515152E-3,4.3920000000000008E-2,7.5307764720257469E-3,2.7000000000000003E-2,8.5319791623540919E-2,5.5575400201005022E-2,0.11774104635722323,0.25863623818176917,0.80658743135009503,91.898956977865623,30.493111522351903,0.54795119316832586,0.25863623818176917,0.80658743135009503]
[null,null,null,null,null,null,null,null,null,null,null,null,null,null,null,null,null,null,62,1.86,1.86,33.73422257813705,7.0969635676566598E-2,3.3703280868389029E-2,1.8989653575407541,0.55592143361046209,0,0,0,0,6.9740151515151512E-3,4.4640000000000006E-2,7.6566087199378E-3,2.7000000000000003E-2,8.6270623871452956E-2,5.5575400201005022E-2,0.12153637080121281,0.26338239487367077,0.81930382848413286,91.903555398960037,30.593913978320387,0.55592143361046209,0.26338239487367077,0.81930382848413297]
[null,null,null,null,null,null,null,null,null,null,null,null,null,null,null,null,null,null,63,1.89,1.89,33.831461277503699,7.1002696834351259E-2,3.3721965284472334E-2,1.9283592583177762,0.56402845783470579,0,0,0,0,7.0790151515151513E-3,4.5359999999999998E-2,7.7825528241930947E-3,2.7000000000000003E-2,8.7221567975708236E-2,5.5575400201005022E-2,0.12539746919735528,0.26819443737406856,0.83222289520877435,91.906196707751135,30.696115766789042,0.56402845783470579,0.26819443737406856,0.83222289520877435]
[null,null,null,null,null,null,null,null,null,null,null,null,null,null,null,null,null,null,64,1.92,1.92,33.930100227103431,7.1036234077215168E-2,3.3740918758637918E-2,1.9577715467183303,0.57227260995578288,0,0,0,0,7.1840151515151513E-3,4.6080000000000003E-2,7.9086105658138471E-3,2.7000000000000003E-2,8.8172625717329006E-2,5.5575400201005022E-2,0.12932453602107569,0.27307256193940971,0.84534517189519254,91.906967572792865,30.799721056000337,0.57227260995578288,0.27307256193940971,0.84534517189519254]
[null,null,null,null,null,null,null,null,null,null,null,null,null,null,null,null,null,null,65,{"$f":"I.load_nph*S293/100","v":1.95},{"$f":"T293/PH","v":1.95},{"$f":"-(T_AMB+THETA_JA_EFF*PH_NEW*(V.supply_typ*U293*TRF/2*f.sw+0.25+U293^2*R_HSLS*0.85))/(THETA_JA_EFF*PH_NEW*U293^2*R_HSLS*0.006-1)","v":34.030143625335434},{"$f":"R.dcr_25*(1+0.005*(V293-25))","v":7.1070248832614064E-2},{"$f":"R_HSLS*(1+0.006*(V293-25))","v":3.3760142097608199E-2},{"$f":"SQRT((T293/PH)^2+(IPKPK_EFF^2)/12)","v":1.9872014062846985},{"$f":"PH_NEW*(PCORE+Y293^2*W293)","v":0.58065423996135745},0,{"$f":"AA293^2/CIN_ESR","v":0},0,0,{"$f":"PH_NEW*IF(AND(FPWM=0,(U293-IPKPK_EFF/2)<0),(U293+IPKPK_EFF/2)*TDHL*0.7*f.sw,(U293-IPKPK_EFF/2)*TDLH*0.7*f.sw+(U293+IPKPK_EFF/2)*TDHL*0.7*f.sw )","v":7.2890151515151505E-3},{"$f":"PH_NEW*IF(AND(FPWM=0,(U293-IPKPK_EFF/2)<0),f.sw*V.supply_typ*(U293+IPKPK_EFF/2)*TF/2,f.sw*V.supply_typ*(U293+IPKPK_EFF/2)*TF/2+f.sw*V.supply_typ*(U293-IPKPK_EFF/2)*TR/2)","v":4.6800000000000001E-2},{"$f":"IF(AND(FPWM=0,(U293-IPKPK_EFF/2)<0),0,PH_NEW*V.supply_typ*(0.000000004*(V293+275)/300*U293/6)*f.sw/2)","v":8.0347837342587217E-3},{"$f":"PH_NEW*(0.000000000125+0.00000000025)/2*V.supply_typ^2*f.sw","v":2.7000000000000003E-2},8.9123798885773875E-2,{"$f":"V.supply_typ*(0.0045+1/R.t_calc*2)","v":5.5575400201005022E-2},{"$f":"PH_NEW*(Y293^2*X293)","v":0.1333177690668732},0.27801696815365207,0.85867120811500952,{"$f":"100*V.load*U293*PH_NEW/(V.load*U293*PH_NEW+AM293)","v":91.905949470295809},{"$f":"T_AMB+THETA_JA_EFF*AL293","v":30.904734084868913},{"$f":"Z293/PH_NEW","v":0.58065423996135745},0.27801696815365207,{"$f":"(Z293+AI293+AJ293+AK293)*PH/PH_NEW","v":0.85867120811500952}]
[null,null,null,null,null,null,null,null,null,null,null,null,null,null,null,null,null,null,66,1.98,1.98,34.131595741530205,7.1104742552120279E-2,3.3779636121735027E-2,2.0166480677450598,0.58917370375207967,0,0,0,0,7.3940151515151506E-3,4.752E-2,8.1610741275763982E-3,2.7000000000000003E-2,{"$f":"AE294+AF294+AG294+AH294","v":9.0075089279091552E-2},5.5575400201005022E-2,0.1373773694709535,0.28302785895105009,{"$f":"AL294+Z294+AB294+AD294","v":0.87220156270312976},91.903219062266942,31.011159163465557,0.58917370375207967,{"$f":"AL294","v":0.28302785895105009},0.87220156270312976]
[null,null,null,null,null,null,null,null,null,null,null,null,null,null,null,null,null,null,67,2.0099999999999998,2.0099999999999998,34.234460916439239,7.1139716711589349E-2,3.3799401665093799E-2,2.0461108056847466,0.59783136318241159,0,0,0,0,7.4990151515151506E-3,4.8239999999999998E-2,8.2874835525605702E-3,2.7000000000000003E-2,9.1026498704075726E-2,5.5575400201005022E-2,0.14150354173430135,{"$f":"AI295+AJ295+AK295","v":0.28810544063938209},0.88593680382179363,91.898848542063774,31.119000673510477,0.59783136318241159,0.28810544063938209,0.88593680382179374]
[null,null,null,null,null,null,null,null,null,null,null,null,null,null,null,null,null,null,68,2.04,2.04,34.338743562734237,7.1175172811329651E-2,3.3819439575579383E-2,2.0755889354927395,0.60662758610223744,0,0,0,0,7.6040151515151515E-3,4.8960000000000004E-2,8.4140138249063721E-3,2.7000000000000003E-2,9.1978028976421544E-2,5.5575400201005022E-2,0.14569649374619706,0.29324992292362362,0.89987750902586106,91.892905950591569,31.228263068876132,0.60662758610223744,0.29324992292362362,0.89987750902586117]
[null,null,null,null,null,null,null,null,null,null,null,null,null,null,null,null,null,null,69,2.0699999999999998,2.0699999999999998,34.444448165515794,7.1211112376275365E-2,3.3839750715003857E-2,2.1050818105574622,0.61556274639927144,0,0,0,0,7.7090151515151507E-3,4.9679999999999995E-2,8.5406667693682346E-3,2.7000000000000003E-2,9.2929681920883384E-2,5.5575400201005022E-2,0.1499564368081826,0.298461518930071,0.91402426532934244,91.885455466012203,31.33895087609957,0.61556274639927144,0.298461518930071,0.91402426532934244]
[null,null,null,null,null,null,null,null,null,null,null,null,null,null,null,null,null,null,70,2.1,2.1,34.55157928283176,7.1247536956162802E-2,3.3860335959196117E-2,2.1345888196886733,0.62463722404226985,0,0,0,0,7.8140151515151517E-3,5.04E-2,8.667444219919291E-3,2.7000000000000003E-2,9.3881459371434439E-2,5.5575400201005022E-2,0.15428358565848299,0.30374044523092247,0.92837766927319232,91.876557669517112,31.451068694904507,0.62463722404226985,0.30374044523092247,0.92837766927319232]
[null,null,null,null,null,null,null,null,null,null,null,null,null,null,null,null,null,null,71,2.13,2.13,34.660141546205367,7.1284448125709832E-2,3.3881196198103355E-2,2.1641093847446533,0.63385140512505722,0,0,0,0,7.9190151515151509E-3,5.1119999999999999E-2,8.794348019912232E-3,2.7000000000000003E-2,9.4833363171427376E-2,5.5575400201005022E-2,0.15867815849688766,0.30908692186932007,0.9429383269943773,91.866269789439599,31.564621198733171,0.63385140512505722,0.30908692186932007,0.94293832699437719]
[null,null,null,null,null,null,null,null,null,null,null,null,null,null,null,null,null,null,72,2.16,2.16,34.770139661173324,7.1321847484798931E-2,3.3902332335894451E-2,2.1936429584460373,0.64320568191137817,0,0,0,0,8.0240151515151518E-3,5.1840000000000011E-2,8.9213800222417931E-3,2.7000000000000003E-2,9.5785395173756949E-2,5.5575400201005022E-2,0.1631403770100982,0.31450117238486019,0.95770685429623836,91.854645925737671,31.67961313528814,0.64320568191137817,0.31450117238486019,0.95770685429623836]
[null,null,null,null,null,null,null,null,null,null,null,null,null,null,null,null,null,null,73,2.19,2.19,34.881578407833757,7.1359736658663478E-2,3.3923745291065253E-2,2.223189022359521,0.65270045288058265,0,0,0,0,8.129015151515151E-3,5.2560000000000003E-2,9.0485420895087456E-3,2.7000000000000003E-2,9.6737557241023897E-2,5.5575400201005022E-2,0.16767046639754718,0.31998342383957612,0.97268387672015877,91.84173725666426,31.796049327084148,0.65270045288058265,0.31998342383957612,0.97268387672015866]
[null,null,null,null,null,null,null,null,null,null,null,null,null,null,null,null,null,null,74,2.2200000000000002,2.2200000000000002,34.994462641404439,7.1398117298077518E-2,3.3945435996545856E-2,2.2527470850363751,0.66233612277415721,0,0,0,0,8.2340151515151502E-3,5.3280000000000001E-2,9.1758360941855723E-3,2.7000000000000003E-2,9.7689851245700732E-2,5.5575400201005022E-2,0.17226865539769518,0.32553390684440092,0.98787002961855808,91.827592229251223,31.91393467201015,0.66233612277415721,0.32553390684440092,0.98787002961855819]
[null,null,null,null,null,null,null,null,null,null,null,null,null,null,null,null,null,null,75,2.25,2.25,35.10879729279123,7.1436991079549025E-2,3.3967405399809837E-2,2.2823166802921726,0.67211310264310942,0,0,0,0,8.3390151515151511E-3,5.4000000000000006E-2,9.3032639187837374E-3,2.7000000000000003E-2,9.8642279070298905E-2,5.5575400201005022E-2,0.17693517631481043,0.33115285558611435,1.0032659582292238,91.812256735067137,32.033274143901629,0.67211310264310942,0.33115285558611435,1.0032659582292238]
[null,null,null,null,null,null,null,null,null,null,null,null,null,null,null,null,null,null,76,2.2799999999999998,2.2799999999999998,35.224587369166898,7.1476359705516759E-2,3.3989654462985422E-2,2.3118973656154989,0.68203180989622236,0,0,0,0,8.4440151515151503E-3,5.4719999999999991E-2,9.4308274560226737E-3,2.7000000000000003E-2,9.9594842607537815E-2,5.5575400201005022E-2,0.18167026504623879,0.33684050785478159,1.018872317751004,91.795774272558788,32.154072793123355,0.68203180989622236,0.33684050785478159,1.018872317751004]
[null,null,null,null,null,null,null,null,null,null,null,null,null,null,null,null,null,null,77,2.31,2.31,35.341837954560432,7.1516224904550549E-2,3.4012184162968778E-2,2.3414887206945676,0.69209266834918115,0,0,0,0,8.5490151515151512E-3,5.5440000000000003E-2,9.5585286090004613E-3,2.7000000000000003E-2,0.10054754376051561,5.5575400201005022E-2,0.18647416111016829,0.34259710507168895,1.0346897734208702,91.778186097156265,32.276335747162726,0.69209266834918115,0.34259710507168895,1.03468977342087]
[null,null,null,null,null,null,null,null,null,null,null,null,null,null,null,null,null,null,78,2.34,2.34,35.460554210457076,7.1556588431555421E-2,3.4034995491539322E-2,2.3710903460517656,0.70229610827459221,0,0,0,0,8.6540151515151504E-3,5.6160000000000002E-2,9.6863692913662595E-3,2.7000000000000003E-2,0.10150038444288143,5.5575400201005022E-2,0.19134710767389693,0.34842289231778334,1.0507190005923754,91.75953136020361,32.400068211233751,0.70229610827459221,0.34842289231778334,1.0507190005923757]
[null,null,null,null,null,null,null,null,null,null,null,null,null,null,null,null,null,null,79,2.37,2.37,35.580741376409108,7.15974520679791E-2,3.405808945547701E-2,2.4007018617770686,0.71264256645289881,0,0,0,0,8.7590151515151531E-3,5.6880000000000014E-2,9.81435142749453E-3,2.7000000000000003E-2,0.10245336657900969,5.5575400201005022E-2,0.19628935158260763,0.35431811836262234,1.0669606848155211,91.739847237672677,32.525275468891962,0.71264256645289881,0.35431811836262234,1.0669606848155211]
[null,null,null,null,null,null,null,null,null,null,null,null,null,null,null,null,null,null,80,2.4,2.4,35.702404770657573,7.1638817622023579E-2,3.4081467076681853E-2,2.4303229063521341,0.72313248622420989,0,0,0,0,8.8640151515151505E-3,5.7599999999999998E-2,9.9424769526610408E-3,2.7000000000000003E-2,0.10340649210417618,5.5575400201005022E-2,0.20130114338865882,0.36028303569384001,1.0834155219180499,91.719169049526442,32.651962882660172,0.72313248622420989,0.36028303569384001,1.0834155219180499]
[null,null,null,null,null,null,null,null,null,null,null,null,null,null,null,null,null,null,81,2.4300000000000002,2.4300000000000002,35.825549790765045,7.1680686928860121E-2,3.41051293922955E-2,2.4599531355576438,0.73376631754105093,0,0,0,0,8.9690151515151514E-3,5.8320000000000004E-2,1.0070747813220789E-2,2.7000000000000003E-2,0.10435976296473595,5.5575400201005022E-2,0.20638273738139709,0.36631790054713809,1.1000842180881891,91.697530370513235,32.780135894665513,0.73376631754105093,0.36631790054713809,1.1000842180881889]
[null,null,null,null,null,null,null,null,null,null,null,null,null,null,null,null,null,null,82,2.46,2.46,35.95018191425968,7.1723061850848299E-2,3.4129077454824991E-2,2.4895922214571371,0.74454451702205182,0,0,0,0,9.0740151515151506E-3,5.9040000000000002E-2,1.0199165966787719E-2,2.7000000000000003E-2,0.10531318111830287,5.5575400201005022E-2,0.21153439161749799,0.37242297293680587,1.1169674899588578,91.674963133101514,32.909800027287595,0.74454451702205182,0.37242297293680587,1.1169674899588578]
[null,null,null,null,null,null,null,null,null,null,null,null,null,null,null,null,null,null,83,2.4900000000000002,2.4900000000000002,36.076306699290633,7.1765944277758814E-2,3.4153312332268697E-2,2.519239851451204,0.75546754800658045,0,0,0,0,9.1790151515151533E-3,5.9760000000000008E-2,1.0327733382416451E-2,2.7000000000000003E-2,0.10626674853393162,5.5575400201005022E-2,0.21675636795184272,0.37859851668677935,1.1340660646933598,91.651497723196911,33.040960883818173,0.75546754800658045,0.37859851668677935,1.1340660646933598]
[null,null,null,null,null,null,null,null,null,null,null,null,null,null,null,null,null,null,84,2.52,2.52,36.203929785294896,7.1809336127000259E-2,3.4177835108244417E-2,2.548895727396451,0.76653588061033817,0,0,0,0,9.2840151515151507E-3,6.0480000000000006E-2,1.0456452040785909E-2,2.7000000000000003E-2,0.10722046719230108,5.5575400201005022E-2,0.22204893206893694,0.38484479946224304,1.1513806800725812,91.627163069224963,33.173624149132344,0.76653588061033817,0.38484479946224304,1.1513806800725812]
[null,null,null,null,null,null,null,null,null,null,null,null,null,null,null,null,null,null,85,2.5499999999999998,2.5499999999999998,36.333056893675916,7.1853239343849809E-2,3.4202646882119825E-2,2.578559564784161,0.77774999178192838,0,0,0,0,9.3890151515151499E-3,6.1199999999999997E-2,1.0585323934384981E-2,2.7000000000000003E-2,0.10817433908590013,5.5575400201005022E-2,0.2274123535148812,0.39116209280178638,1.1689120845837149,91.601986725109242,33.307795590371505,0.77774999178192838,0.39116209280178638,1.1689120845837149]
[null,null,null,null,null,null,null,null,null,null,null,null,null,null,null,null,null,null,86,2.58,2.58,36.463693828494058,7.1897655901687979E-2,3.4227748769145132E-2,2.6082310919739999,0.7891103653604119,0,0,0,0,9.4940151515151526E-3,6.1920000000000017E-2,1.0714351067700197E-2,2.7000000000000003E-2,0.10912836621921537,5.5575400201005022E-2,0.23284690572989772,0.39755067215011808,1.18666103751053,91.575994947627109,33.443481057638152,0.7891103653604119,0.39755067215011808,1.18666103751053]
[null,null,null,null,null,null,null,null,null,null,null,null,null,null,null,null,null,null,87,2.61,2.61,36.595846477168969,7.1942587802237445E-2,3.4253141900588015E-2,2.6379100494785419,0.80061749213386135,0,0,0,0,9.5990151515151501E-3,6.2640000000000001E-2,1.0843535457405479E-2,2.7000000000000003E-2,0.11008255060892064,5.5575400201005022E-2,0.23835286608142217,0.40401081689134782,1.2046283090252092,91.549212768581938,33.580686484702746,0.80061749213386135,0.40401081689134782,1.2046283090252092]
[null,null,null,null,null,null,null,null,null,null,null,null,null,null,null,null,null,null,88,2.64,2.64,36.729520811194178,7.1988037075806033E-2,3.4278827423870957E-2,2.6675961892947524,0.81227186989893174,0,0,0,0,9.704015151515151E-3,6.336E-2,1.0972879132554035E-2,2.7000000000000003E-2,0.11103689428406918,5.5575400201005022E-2,0.24393051589777001,0.41054281038284424,1.2228146802817759,91.521664062192016,33.719417889722834,0.81227186989893174,0.41054281038284424,1.2228146802817759]
[null,null,null,null,null,null,null,null,null,null,null,null,null,null,null,null,null,null,89,2.67,2.67,36.864722886864037,7.2034005781533766E-2,3.4304806502710922E-2,2.6972892742788792,0.82407400352145643,0,0,0,0,9.8090151515151502E-3,6.4079999999999998E-2,1.110238413477236E-2,2.7000000000000003E-2,0.11199139928628751,5.5575400201005022E-2,0.24958014050238211,0.41714693998967467,1.2412209435111312,91.493371608061935,33.859681375974475,0.82407400352145643,0.41714693998967467,1.2412209435111312]
[null,null,null,null,null,null,null,null,null,null,null,null,null,null,null,null,null,null,90,2.7,2.7,37.001458846013101,7.2080496007644462E-2,3.4331080317261418E-2,2.7269890775615302,0.83602440499808761,0,0,0,0,9.9140151515151511E-3,6.480000000000001E-2,1.1232052518456475E-2,2.7000000000000003E-2,0.11294606766997164,5.5575400201005022E-2,0.25530202924866058,0.42382349711963724,1.2598479021177249,91.464357150069517,34.001483132596306,0.83602440499808761,0.42382349711963724,1.2598479021177247]
[null,null,null,null,null,null,null,null,null,null,null,null,null,null,null,null,null,null,91,2.73,2.73,37.139734916768255,7.2127509871701218E-2,3.435765006425702E-2,2.7566953819999558,0.84812359351899125,0,0,0,0,1.001901515151515E-2,6.5519999999999995E-2,1.1361886350970364E-2,2.7000000000000003E-2,0.11390090150248552,5.5575400201005022E-2,0.26109647555540072,0.43057277725889126,1.2786963707778825,91.434641451474207,34.144829435346281,0.84812359351899125,0.43057277725889126,1.2786963707778827]
[null,null,null,null,null,null,null,null,null,null,null,null,null,null,null,null,null,null,92,2.76,2.76,37.279557414313651,7.2175049520866646E-2,3.4384516957160362E-2,2.7864079796648378,0.86037209553161786,0,0,0,0,1.0124015151515151E-2,6.6239999999999993E-2,1.1491887712846744E-2,2.7000000000000003E-2,0.1148559028643619,5.5575400201005022E-2,0.26696377694283069,0.4373950800081976,1.2977671755398155,91.404244346525942,34.289726647371339,0.86037209553161786,0.4373950800081976,1.2977671755398155]
[null,null,null,null,null,null,null,null,null,null,null,null,null,null,null,null,null,null,93,2.79,2.79,37.4209327416687,7.2223117132167364E-2,3.4411682226311642E-2,2.8161266713590645,0.87277044480555555,0,0,0,0,1.0229015151515152E-2,6.6960000000000006E-2,1.1622058697990077E-2,2.7000000000000003E-2,0.11581107384950523,5.5575400201005022E-2,0.27290423506926342,0.44429070911977364,1.3170611539253292,91.373184788830827,34.43618121999021,0.87277044480555555,0.44429070911977364,1.3170611539253292]
[null,null,null,null,null,null,null,null,null,null,null,null,null,null,null,null,null,null,94,2.82,2.82,37.563867390479338,7.2271714912762977E-2,3.4439147119080603E-2,2.8458512661662212,0.88531918249848918,0,0,0,0,1.033401515151515E-2,6.7680000000000004E-2,1.1752401413882023E-2,2.7000000000000003E-2,0.11676641656539719,5.5575400201005022E-2,0.27891815576837287,0.45125997253477507,1.3365791550332642,91.341480896708532,34.584199693489445,0.88531918249848918,0.45125997253477507,1.3365791550332642]
[null,null,null,null,null,null,null,null,null,null,null,null,null,null,null,null,null,null,95,2.85,2.85,37.708367941822608,7.2320845100219688E-2,3.4466912900021213E-2,2.8755815810266774,0.89801885722327768,0,0,0,0,1.0439015151515152E-2,6.8400000000000016E-2,1.1882917981789259E-2,2.7000000000000003E-2,0.11772193313330442,5.5575400201005022E-2,0.28500584908710253,0.45830318242141199,1.3563220396446898,91.309149995756655,34.733788697932965,0.89801885722327768,0.45830318242141199,1.3563220396446896]
[null,null,null,null,null,null,null,null,null,null,null,null,null,null,null,null,null,null,96,2.88,2.88,37.854441067024943,7.2370509962788487E-2,3.4494980851028839E-2,2.9053174403393314,0.91087002511616477,0,0,0,0,1.0544015151515151E-2,6.9120000000000001E-2,1.2013610536973756E-2,2.7000000000000003E-2,0.11867762568848891,5.5575400201005022E-2,0.29116762932421503,0.46542065521370896,1.3762906803298738,91.276208658820835,34.884954953985279,0.91087002511616477,0.46542065521370896,1.3762906803298738]
[null,null,null,null,null,null,null,null,null,null,null,null,null,null,null,null,null,null,97,{"$f":"I.load_nph*S325/100","v":2.91},{"$f":"T325/PH","v":2.91},{"$f":"-(T_AMB+THETA_JA_EFF*PH_NEW*(V.supply_typ*U325*TRF/2*f.sw+0.25+U325^2*R_HSLS*0.85))/(THETA_JA_EFF*PH_NEW*U325^2*R_HSLS*0.006-1)","v":38.002093528494271},{"$f":"R.dcr_25*(1+0.005*(V325-25))","v":7.2420711799688064E-2},3.452335227150017E-2,2.9350586755872334,{"$f":"PH_NEW*(PCORE+Y325^2*W325)","v":0.92387324990614283},0,{"$f":"AA325^2/CIN_ESR","v":0},0,0,1.0649015151515152E-2,6.9840000000000013E-2,1.2144481228905579E-2,2.7000000000000003E-2,0.11963349638042073,5.5575400201005022E-2,0.29740381506949232,0.47261271165091806,1.3964859615570608,{"$f":"100*V.load*U325*PH_NEW/(V.load*U325*PH_NEW+AM325)","v":91.242672743552177},35.037705273748564,0.92387324990614283,0.47261271165091806,1.3964859615570608]
[null,null,null,null,null,null,null,null,null,null,null,null,null,null,null,null,null,null,98,2.94,2.94,38.15133218056603,7.2471452941392456E-2,3.4552028478495762E-2,2.9648051249854319,0.93702910298548336,0,0,0,0,1.075401515151515E-2,7.0560000000000012E-2,1.227553222147819E-2,2.7000000000000003E-2,0.12058954737299335,5.5575400201005022E-2,0.30371472924359616,0.47987967681759452,1.4169087798030779,91.208557427720407,35.192046561613822,0.93702910298548336,0.47987967681759452,1.4169087798030779]
[null,null,null,null,null,null,null,null,null,null,null,null,null,null,null,null,null,null,99,2.97,2.97,38.302163970363551,7.2522735749923614E-2,3.458101080690535E-2,2.9945566331495361,0.95033816348145539,0,0,0,0,1.0859015151515151E-2,7.128000000000001E-2,1.24067656932264E-2,2.7000000000000003E-2,0.12154578084474155,5.5575400201005022E-2,0.31010069913859906,0.48722188018434565,1.4375600436658011,91.173877242436532,35.347985815126343,0.95033816348145539,0.48722188018434565,1.4375600436658009]
[null,null,null,null,null,null,null,null,null,null,null,null,null,null,null,null,null,null,100,3,3,38.454595938672682,7.2574562619148714E-2,3.4610300609615952E-2,3.0243130507835798,0.96380101832924181,0,0,0,0,1.0964015151515152E-2,7.1999999999999995E-2,1.2538183837546908E-2,2.7000000000000003E-2,0.12250219898906206,5.5575400201005022E-2,0.31656205645919377,0.49463965564926082,1.4584406739785027,91.138646103428513,35.505530125865619,0.96380101832924181,0.49463965564926082,1.4584406739785025]
[]
[]
[]
[]
[]
[]
[]
[]
[]
[]
[]
[]
[]
[]
[]
[]
[null,null,null,null,null,null,null,null,null,null,null,null,null,null,null,null,null,null,null,null,null,null,null,null,null,null,null,null,null,null,null,null,null,null,null,null,null,null,null,null,null,null,null,null,null,null,null,null,null,null,null,null,null,null,null,null,null,null,null,null,"R.fb_top1",{"$f":"R.fb_top1","v":10},"R.fb_buf",{"$f":"R.fb_buf","v":1000},null,null,null,null,null,"R.comp",{"$f":"R.comp","v":960000}]
[null,null,null,null,null,null,null,null,null,null,null,null,null,null,null,null,null,null,null,null,null,null,null,null,null,null,null,null,null,null,null,null,null,null,null,null,null,null,null,null,null,null,null,null,null,null,null,null,null,null,null,null,null,null,"pi",3.1415920000000002,"A_INTCOMP2VOUT",{"$f":"11*I.rated/6*PH*R.load_nph/(1+R.load_nph/Wsh/L.out)","v":6.4111621335217253},null,null,"R.fb_top2",{"$f":"R.fb_top2","v":100000},"C.fb_buf",{"$f":"C.fb_buf","v":3.1999999999999998E-10},null,null,null,null,null,"C.comp",{"$f":"C.comp","v":1.7999999999999999E-11}]
[null,null,null,null,null,null,null,null,null,null,null,null,null,null,null,null,null,null,null,null,null,null,null,null,null,null,null,null,null,null,null,null,null,null,null,null,null,null,null,null,null,null,null,null,null,null,null,null,null,null,null,null,null,null,"π",{"$f":"π","v":3.1415920000000002},"Wesr_zero",{"$f":"1/R.esr_cout/C.out","v":31746031.746031754},null,null,"R.fb_bot",{"$f":"R.fb_bot","v":19049.523809523809},"A.fb_buf",{"$f":"A.fb_buf","v":1},null,null,null,null,null,"C.hf",{"$f":"C.hf","v":1.2300000000000001E-13}]
[null,null,null,null,null,null,null,null,null,null,null,null,null,null,null,null,null,null,null,null,null,null,null,null,null,null,null,null,null,null,null,null,null,null,null,null,null,null,null,null,null,null,null,null,null,null,null,null,null,null,null,null,null,"PM 맞추기위해 x1.5 임의로 넣음","S.slope",{"$f":"V.slope_min*f.sw*1.5","v":480000},"Wload_pole",{"$f":"1/R.load_nph/C.out+1/Wsh/C.out/L.out","v":27234.247234247236},null,null,"C.fb_top",{"$f":"C.fb_top","v":9.9999999999999994E-12},null,null,null,null,null,null,null,"R.eaout",{"$f":"R.eaout","v":309000000}]
[null,null,null,null,null,null,null,null,null,null,null,null,null,null,null,null,null,null,null,null,null,null,null,null,null,null,null,null,null,null,null,null,null,null,null,null,null,null,null,null,null,null,null,null,null,null,null,null,null,null,null,null,null,null,"S.rise",{"$f":"(V.supply_typ-V.load)/L.out*6/11/I.rated","v":578512.3966942149},null,null,null,null,"C.fb_bot",{"$f":"C.fb_bot","v":6.0000000000000003E-12},null,null,null,null,null,null,null,"GM",{"$f":"GM","v":1.45E-5}]
[null,null,null,null,null,null,null,null,null,null,null,null,null,null,null,null,null,null,null,null,null,null,null,null,null,null,null,null,null,null,null,null,null,null,null,null,null,null,null,null,null,null,null,null,null,null,null,null,null,null,null,null,null,null,"S.fall",{"$f":"V.load/L.out*6/11/I.rated","v":413223.1404958677}]
[null,null,null,null,null,null,null,null,null,null,null,null,null,null,null,null,null,null,null,null,null,null,null,null,null,null,null,null,null,null,null,null,null,null,null,null,null,null,null,null,null,null,null,null,null,null,null,null,null,null,null,null,null,null,"mc",{"$f":"1+S.slope/S.rise","v":1.8297142857142856}]
[null,null,null,null,null,null,null,null,null,null,null,null,null,null,null,null,null,null,null,null,null,null,null,null,null,null,null,null,null,null,null,null,null,null,null,null,null,null,null,null,null,null,null,null,null,null,null,null,null,null,null,null,null,null,"kfactor",{"$f":"mc*(1-V.load/V.supply_typ)","v":1.0673333333333332},null,null,null,null,null,null,null,null,null,null,null,null,null,null,null,null,null,null,null,null,null,null,null,null,null,{"$f":"\"Phase Margin = \"&ROUND(CD357,0)&\" °\"","v":"Phase Margin = 78 °"},null,{"$f":"\"Gain Margin = \"&-1*ROUND(CF357,1)&\" dB\"","v":"Gain Margin = 14.7 dB"}]
[null,null,null,null,null,null,null,null,null,null,null,null,null,null,null,null,null,null,null,null,null,null,null,null,null,null,null,null,null,null,null,null,null,null,null,null,null,null,null,null,null,null,null,null,null,null,null,null,null,null,null,null,null,null,"Qfactor",{"$f":"1/π/(kfactor-0.5)","v":0.56106337086891178},null,null,null,null,null,null,null,null,null,null,null,null,null,null,null,null,null,null,null,null,null,null,null,null,{"$f":"\"Crossover Frequency = \"&ROUND(CC357/1000,0)&\" kHz\"","v":"Crossover Frequency = 55 kHz"},null,{"$f":"ROUND(CC357,0)","v":54755},null,{"$f":"\"Load Pole = \"&ROUND(CG357/1000,1)&\" kHz\"","v":"Load Pole = 4.3 kHz"}]
[null,null,null,null,null,null,null,null,null,null,null,null,null,null,null,null,null,null,null,null,null,null,null,null,null,null,null,null,null,null,null,null,null,null,null,null,null,null,null,null,null,null,null,null,null,null,null,null,null,null,null,null,null,null,"Wsh",{"$f":"Qfactor*2*π*f.sw*0.5*1","v":1762632.1974148066}]
[null,null,null,null,null,null,null,null,null,null,null,null,null,null,null,null,null,null,null,null,null,null,null,null,null,null,null,null,null,null,null,null,null,null,null,null,null,null,null,null,null,null,null,null,null,null,null,null,null,null,null,null,null,null,"fsw_sh",{"$f":"f.sw*0.5*1","v":500000},null,null,null,null,null,null,null,null,null,null,null,null,null,null,null,null,null,null,null,null,null,null,null,null,"fCROSS","PM","Find Phase Inversion","GM","fP_LOAD",null,"fZ_ESR","fZ_COMP",null,"fP_COMP"]
[null,null,null,null,null,null,null,null,null,null,null,null,null,null,null,null,null,null,null,null,null,null,null,null,null,null,null,null,null,null,null,null,null,null,null,null,null,null,null,null,null,null,null,null,null,null,null,null,null,null,null,null,null,null,null,null,null,null,null,null,null,null,null,null,null,null,null,null,null,null,null,null,null,null,null,null,null,null,null,"To find ",0,{"$f":"CC357","v":54755.143242447964},-180,{"$f":"CE357","v":339258.9888626195},-45,null,-45,-45,null,-45]
[null,null,null,null,null,null,null,null,null,null,null,null,null,null,null,null,null,null,null,null,null,null,null,null,null,null,null,null,null,null,null,null,null,null,null,null,null,null,null,null,null,null,null,null,null,null,null,null,null,null,null,null,null,null,null,null,null,null,null,null,null,null,null,null,null,null,null,null,null,null,null,null,null,null,null,null,null,null,null,"Found at",{"$f":"SUM(CC361:CC487)","v":54755.143242447964},{"$f":"180+SUM(CD361:CD487)","v":77.659826150791432},{"$f":"SUM(CE361:CE487)","v":339258.9888626195},-14.718904172842516,4348.1181159356947,25.198492060149359,5045866.6340330755,{"$f":"SUM(CJ361:CJ487)","v":8894.9295475901872},{"$f":"SUM(CK361:CK487)","v":16.898767540105702},{"$f":"MAX(CL361:CL487)","v":526101.72369349457},{"$f":"MIN(CM361:CM487)","v":-21.913132617505731}]
[null,null,null,null,null,null,null,null,null,null,null,null,null,null,null,null,null,null,null,null,null,null,null,null,null,null,null,null,null,null,null,null,null,null,null,null,null,null,null,null,null,null,null,null,null,null,null,null,null,null,null,null,null,null,null,null,null,null,null,null,null,null,null,null,null,null,null,null,{"$f":"A.comp_buffer","v":0.77}]
[]
[null,null,null,null,null,null,null,null,null,null,null,null,null,null,null,null,null,null,null,null,null,null,null,null,null,null,null,null,null,null,null,null,null,null,null,null,null,null,null,null,null,null,null,null,null,null,null,null,null,null,null,"Step","Freq",null,"SH_GAIN","SH_PHASE","INTCOMP2VOUT_GAIN","INTCOMP2VOUT_PHASE","ZFB_BOT","ZFB_TOP","VOUT2FB_GAIN","VOUT2FB_PHASE","FB2INTFB_GAIN","FB2INTFB_PHASE","ZCOMP1","ZCOMP2","ZCOMP_TOTAL","ZRC_FILTER","GAIN","INTFB2INTCOMP_GAIN","INTFB2INTCOMP_PHASE",null,"POWER_STAGE_GAIN","POWER_STAGE_PHASE","COMPENSATION_GAIN","COMPENSATION_PHASE","OPENLOOP_GAIN","OPENLOOP_PHASE"]
[null,null,null,null,null,null,null,null,null,null,null,null,null,null,null,null,null,null,null,null,null,null,null,null,null,null,null,null,null,null,null,null,null,null,null,null,null,null,null,null,null,null,null,null,null,null,null,null,null,null,null,1,1,null,{"$f":"20*LOG(IMABS(IMDIV(1,IMSUM(1,IMSUM(COMPLEX(0,2*pi*BA361/Wsh),COMPLEX(-BA361/(fsw_sh),0))))))","v":1.737174143609963E-5},{"$f":"180/pi*IMARGUMENT(IMDIV(1,IMSUM(1,IMSUM(COMPLEX(0,2*pi*BA361/Wsh),COMPLEX(-BA361/(fsw_sh),0)))))","v":-2.0424040847995267E-4},{"$f":"20*LOG(IMABS(IMPRODUCT(A_INTCOMP2VOUT,IMDIV(COMPLEX(1, 2*pi*BA361/Wesr_zero),COMPLEX(1, 2*pi*BA361/Wload_pole)))))","v":16.138734968980508},{"$f":"180/pi*IMARGUMENT(IMPRODUCT(A_INTCOMP2VOUT,IMDIV(COMPLEX(1, 2*pi*BA361/Wesr_zero),COMPLEX(1, 2*pi*BA361/Wload_pole))))","v":-1.3207310418951361E-2},{"$f":"IMDIV(IMPRODUCT(COMPLEX(R.fb_bot,0),IMDIV(COMPLEX(1,0),COMPLEX(0,2*pi*BA361*C.fb_bot))),IMSUM(COMPLEX(R.fb_bot,0),IMDIV(COMPLEX(1,0),COMPLEX(0,2*pi*BA361*C.fb_bot))) )","v":"19049.523809514-0.0136804151284432i"},{"$f":"IMSUM(COMPLEX(R.fb_top1,0),IMDIV(IMPRODUCT(COMPLEX(R.fb_top2,0),IMDIV(COMPLEX(1,0),COMPLEX(0,2*pi*BA361*C.fb_top))),IMSUM(COMPLEX(R.fb_top2,0),IMDIV(COMPLEX(1,0),COMPLEX(0,2*pi*BA361*C.fb_top))) ))","v":"100009.999996052-0.628318399975195i"},{"$f":"20*LOG(IMABS(IMDIV(BG361,IMSUM(BG361,BH361))))","v":-15.917600346721258},{"$f":"180/pi*IMARGUMENT(IMDIV(BG361,IMSUM(BG361,BH361)))","v":2.6780630701903952E-4},{"$f":"20*LOG(IMABS(IMDIV(A.fb_buf,IMSUM(COMPLEX(1,0),COMPLEX(0,2*pi*BA361*R.fb_buf*C.fb_buf)))))","v":-1.7560403165953109E-11},{"$f":"180/pi*IMARGUMENT(IMDIV(A.fb_buf,IMSUM(COMPLEX(1,0),COMPLEX(0,2*pi*BA361*R.fb_buf*C.fb_buf))))","v":-1.151999999998447E-4},{"$f":"IMSUM(COMPLEX(R.comp,0),IMDIV(COMPLEX(1,0),COMPLEX(0,2*pi*BA361*C.comp)))","v":"960000-8841943122.39711i"},{"$f":"IMDIV(COMPLEX(1,0),COMPLEX(0,2*pi*BA361*C.hf))","v":"-1293942895960.55i"},{"$f":"IMDIV(COMPLEX(1,0),IMSUM(IMDIV(COMPLEX(1,0),BM361),IMSUM(IMDIV(COMPLEX(1,0),BN361),IMDIV(COMPLEX(1,0),COMPLEX(R.eaout,0)))))","v":"308616748.811011-10858908.8265906i"},{"$f":"IMDIV(IMDIV(COMPLEX(1,0),COMPLEX(0,2*pi*BA361*0.00000000000226)),IMSUM(COMPLEX(21700,0),IMDIV(COMPLEX(1,0),COMPLEX(0,2*pi*BA361*0.00000000000226))) )","v":"0.999999999999905-3.08139909727971E-07i"},{"$f":"GM*A.comp_buffer","v":1.1165000000000001E-5},{"$f":"20*LOG(IMABS(IMPRODUCT(BQ361,IMPRODUCT(BO361,BP361)) ))","v":70.750937781710093},{"$f":"180/pi*IMARGUMENT(IMPRODUCT(BQ361,IMPRODUCT(BO361,BP361)) )","v":-2.01518116134327},null,{"$f":"BC361+BE361","v":16.138752340721943},{"$f":"BD361+BF361","v":-1.3411550827431314E-2},{"$f":"BI361+BK361+BR361","v":54.83333743497127},{"$f":"BJ361+BL361+BS361","v":-2.0150285550362508},{"$f":"BU361+BW361","v":70.972089775693206},{"$f":"BV361+BX361","v":-2.0284401058636821},{"$f":"BZ361+360","v":357.97155989413631},null,{"$f":"IF(AND(BY362<$CC$356,BY361>=$CC$356),(($CC$356-BY361)/(BY362-BY361)*(BA362-BA361)+BA361),0)","v":0},{"$f":"IF(AND(BA362>$CD$356,BA361<=$CD$356),(($CD$356-BA361)/(BA362-BA361)*(BZ362-BZ361)+BZ361),0)","v":0},{"$f":"IF(AND(BZ362<$CE$356,BZ361>=$CE$356),(($CE$356-BZ361)/(BZ362-BZ361)*(BA362-BA361)+BA361),0)","v":0},{"$f":"IF(AND(BA362>$CF$356,BA361<=$CF$356),(($CF$356-BA361)/(BA362-BA361)*(BY362-BY361)+BY361),0)","v":0},{"$f":"IF(AND(BF362<$CG$356,BF361>=$CG$356),(($CG$356-BF361)/(BF362-BF361)*(BA362-BA361)+BA361),0)","v":0},{"$f":"IF(AND(BF362<$CG$356,BF361>=$CG$356),(($CG$356-BF361)/(BF362-BF361)*(BY362-BY361)+BY361),0)","v":0},{"$f":"IF(AND(BF362>$CI$356,BF361<=$CI$356),(($CI$356-BF361)/(BF362-BF361)*(BA362-BA361)+BA361),0)","v":0},{"$f":"IF(AND(BX362>$CJ$356,BX361<=$CJ$356),(($CJ$356-BX361)/(BX362-BX361)*(BA362-BA361)+BA361),0)","v":0},{"$f":"IF(AND(BX362>$CJ$356,BX361<=$CJ$356),(($CJ$356-BX361)/(BX362-BX361)*(BY362-BY361)+BY361),0)","v":0},{"$f":"IF(AND(BX362<$CL$356,BX361>=$CL$356),(($CL$356-BX361)/(BX362-BX361)*(BA362-BA361)+BA361),0)","v":0},{"$f":"IF(AND(BX362<$CL$356,BX361>=$CL$356),(($CL$356-BX361)/(BX362-BX361)*(BY362-BY361)+BY361),0)","v":0}]
[null,null,null,null,null,null,null,null,null,null,null,null,null,null,null,null,null,null,null,null,null,null,null,null,null,null,null,null,null,null,null,null,null,null,null,null,null,null,null,null,null,null,null,null,null,null,null,null,null,null,null,2,1.5,null,2.6057583838915976E-5,-3.063609190798374E-4,16.138734680030467,-1.9810965188687128E-2,"19049.5238095017-0.0205206226926516i","100009.999991117-0.942477599916286i",{"$f":"20*LOG(IMABS(IMDIV(BG362,IMSUM(BG362,BH362))))","v":-15.917600346521013},4.017094605198282E-4,-3.9503674667445238E-11,-1.7279999999947625E-4,"960000-5894628748.26474i","-862628597307.035i","308139023.746688-16263072.2027943i","0.999999999999786-4.62209864591901E-07i",1.1165000000000001E-5,{"$f":"20*LOG(IMABS(IMPRODUCT(BQ362,IMPRODUCT(BO362,BP362)) ))","v":70.744189288770414},-3.0212012309695422,null,{"$f":"BC362+BE362","v":16.138760737614305},{"$f":"BD362+BF362","v":-2.0117326107766967E-2},{"$f":"BI362+BK362+BR362","v":54.826588942209895},{"$f":"BJ362+BL362+BS362","v":-3.0209723215090216},{"$f":"BU362+BW362","v":70.9653496798242},{"$f":"BV362+BX362","v":-3.0410896476167886},{"$f":"BZ362+360","v":356.95891035238321},null,0,0,0,0,0,{"$f":"IF(AND(BF363<$CG$356,BF362>=$CG$356),(($CG$356-BF362)/(BF363-BF362)*(BY363-BY362)+BY362),0)","v":0},0,0,{"$f":"IF(AND(BX363>$CJ$356,BX362<=$CJ$356),(($CJ$356-BX362)/(BX363-BX362)*(BY363-BY362)+BY362),0)","v":0},0,{"$f":"IF(AND(BX363<$CL$356,BX362>=$CL$356),(($CL$356-BX362)/(BX363-BX362)*(BY363-BY362)+BY362),0)","v":0}]
[null,null,null,null,null,null,null,null,null,null,null,null,null,null,null,null,null,null,null,null,null,null,null,null,null,null,null,null,null,null,null,null,null,null,null,null,null,null,null,null,null,null,null,null,null,null,null,null,null,null,null,3,2,null,3.4743407278184813E-5,-4.0848163391961557E-4,16.138734275500429,-2.6414619430734958E-2,"19049.5238094845-0.027360830256844i","100009.999984209-1.25663679980156i",-15.917600346240752,5.3561261401012614E-4,-7.0224254769627354E-11,-2.3039999999875833E-4,"960000-4420971561.19855i","-646971447980.276i","307472695.586204-21637061.8804455i","0.99999999999962-6.16279819455767E-07i",1.1165000000000001E-5,70.73475898165546,-4.0253432341885773,null,16.138769018907706,-2.6823101064654575E-2,54.817158635344484,-4.0250380215745656,70.955927654252193,-4.0518611226392203,355.9481388773608,null,0,0,0,0,0,0,0,0,0,0,0]
[null,null,null,null,null,null,null,null,null,null,null,null,null,null,null,null,null,null,null,null,null,null,null,null,null,null,null,null,null,null,null,null,null,null,null,null,null,null,null,null,null,null,null,null,null,null,null,null,null,null,null,4,2.5,null,4.3429211842672033E-5,-5.1060255299924836E-4,16.138733755390437,-3.3018272969199298E-2,"19049.5238094624-0.0342010378210155i","100009.999975326-1.57079599961242i",-15.917600345880151,6.6951576748646748E-4,-1.0972889376485854E-10,-2.8799999999757448E-4,"960000-3536777248.95884i","-517577158384.221i","306620223.593997-26971110.0956102i","0.999999999999407-7.70349774319544E-07i",1.1165000000000001E-5,70.722664312813023,-5.0269919951765027,null,16.138777184602279,-3.3528875522198548E-2,54.805063966823141,-5.0266104794090136,70.943841151425417,-5.0601393549312119,354.93986064506879,null,0,0,0,0,0,0,0,0,0,0,0]
[null,null,null,null,null,null,null,null,null,null,null,null,null,null,null,null,null,null,null,null,null,null,null,null,null,null,null,null,null,null,null,null,null,null,null,null,null,null,null,null,null,null,null,null,null,null,null,null,null,null,null,5,3,null,5.2114997532425568E-5,-6.1272367631870028E-4,16.138733119700539,-3.9621925628184188E-2,"19049.5238094354-0.0410412453851603i","100009.999964469-1.88495519933026i",-15.917600345439539,8.0341892094533591E-4,-1.5800794837859295E-10,-3.4559999999580842E-4,"960000-2947314374.13237i","-431314298653.518i","305584730.695405-32255692.9466739i","0.999999999999145-9.2441972918321E-07i",1.1165000000000001E-5,70.70792753649863,-6.0255415059252604,null,16.138785234698073,-4.0234649304502886E-2,54.790327190901081,-6.0250836870043107,70.929112425599158,-6.0653183363088132,353.93468166369121,null,0,0,0,0,0,0,0,0,0,0,0]
[null,null,null,null,null,null,null,null,null,null,null,null,null,null,null,null,null,null,null,null,null,null,null,null,null,null,null,null,null,null,null,null,null,null,null,null,null,null,null,null,null,null,null,null,null,null,null,null,null,null,null,6,3.5,null,6.08007642568472E-5,-7.1484500387793636E-4,16.138732368430773,-4.6225577231794164E-2,"19049.5238094034-0.0478814529492732i","100009.999951639-2.19911439893648i",-15.917600344918911,9.3732207438323599E-4,-2.1507299054057581E-10,-4.0319999999334456E-4,"960000-2526269463.54203i","-369697970274.444i","304369975.158251-37481585.4538686i","0.999999999998837-1.07848968404674E-06i",1.1165000000000001E-5,70.690575573596973,-7.0203970595347114,null,16.138793169195029,-4.6940422235672102E-2,54.77297522846299,-7.0198629374603216,70.911768397658022,-7.066803359695994,352.933196640304,null,0,0,0,0,0,0,0,0,0,0,0]
[null,null,null,null,null,null,null,null,null,null,null,null,null,null,null,null,null,null,null,null,null,null,null,null,null,null,null,null,null,null,null,null,null,null,null,null,null,null,null,null,null,null,null,null,null,null,null,null,null,null,null,7,4,null,6.9486512108559855E-5,-8.1696653567691659E-4,16.138731501581209,-5.2829227604133798E-2,"19049.5238093666-0.0547216605133494i","100009.999936835-2.51327359841248i",-15.917600344318165,1.0712252277966768E-3,-2.8090376937418201E-10,-4.6079999999006462E-4,"960000-2210485780.59928i","-323485723990.138i","302980316.973613-42639912.8720707i","0.999999999998481-1.23255963891013E-06i",1.1165000000000001E-5,70.670639849954497,-8.010977281717949,null,16.138800988093315,-5.3646194139810713E-2,54.753039505355432,-8.0103668564901422,70.89184049344874,-8.0640130506299528,351.93598694937003,null,0,0,0,0,0,0,0,0,0,0,0]
[null,null,null,null,null,null,null,null,null,null,null,null,null,null,null,null,null,null,null,null,null,null,null,null,null,null,null,null,null,null,null,null,null,null,null,null,null,null,null,null,null,null,null,null,null,null,null,null,null,null,null,8,4.5,null,7.8172240998894123E-5,-9.1908827171561765E-4,16.138730519151903,-5.9432876569308395E-2,"19049.5238093249-0.0615618680773834i","100009.999920056-2.82743279773965i",-15.917600343637188,1.2051283811821926E-3,-3.5552825037614205E-10,-5.1839999998585455E-4,"960000-1964876249.42158i","-287542865769.012i","301420679.48865-47722197.6898818i","0.999999999998077-1.38662959377333E-06i",1.1165000000000001E-5,70.648156110232009,-8.9967160440111922,null,16.138808691392903,-6.0351964841024015E-2,54.730555766239291,-8.9960293156299951,70.869364457632201,-9.0563812804710189,350.94361871952896,null,0,0,0,0,0,0,0,0,0,0,0]
[null,null,null,null,null,null,null,null,null,null,null,null,null,null,null,null,null,null,null,null,null,null,null,null,null,null,null,null,null,null,null,null,null,null,null,null,null,null,null,null,null,null,null,null,null,null,null,null,null,null,null,9,5,null,8.6857951014686813E-5,-1.0212102119939838E-3,16.138729421142948,-6.6036523951421733E-2,"19049.5238092781-0.0684020756413689i","100009.999901304-3.14159199689937i",-15.917600342876256,1.3390315345362554E-3,-4.3892039670508443E-10,-5.7599999998059648E-4,"960000-1768388624.47942i","-258788579192.11i","299696506.908621-52720401.8373908i","0.999999999997626-1.54069954863634E-06i",1.1165000000000001E-5,70.623164209545834,-9.9770642441001804,null,16.138816279093962,-6.7057734163415719E-2,54.705563866230662,-9.976301212565625,70.844380145324621,-10.043358946729041,349.95664105327097,null,0,0,0,0,0,0,0,0,0,0,0]
[null,null,null,null,null,null,null,null,null,null,null,null,null,null,null,null,null,null,null,null,null,null,null,null,null,null,null,null,null,null,null,null,null,null,null,null,null,null,null,null,null,null,null,null,null,null,null,null,null,null,null,10,5.5,null,9.5543642157914479E-5,-1.1233323565119887E-3,16.138728207554419,-7.2640169574580291E-2,"19049.5238092266-0.0752422832053025i","100009.999880578-3.45575119587306i",-15.917600342035144,1.4729346878553675E-3,-5.3108792298099443E-10,-6.3359999997417323E-4,"960000-1607626022.25402i","-235262344720.1i","297813718.333937-57626963.7215963i","0.999999999997128-1.69476950349913E-06i",1.1165000000000001E-5,70.595707885381174,-10.95149144078756,null,16.138823751196576,-7.3763501931092282E-2,54.678107542814942,-10.950652106099678,70.816931294011511,-11.02441560803077,348.97558439196922,null,0,0,0,0,0,0,0,0,0,0,0]
[null,null,null,null,null,null,null,null,null,null,null,null,null,null,null,null,null,null,null,null,null,null,null,null,null,null,null,null,null,null,null,null,null,null,null,null,null,null,null,null,null,null,null,null,null,null,null,null,null,null,null,11,6,null,1.0422931433605074E-4,-1.2254547052696005E-3,16.138726878386422,-7.9243813262889179E-2,"19049.5238091701-0.0820824907691776i","100009.999857878-3.76991039464212i",-15.917600341113914,1.6068378411360827E-3,-6.3204047247881757E-10,-6.9119999996646736E-4,"960000-1473657187.06618i","-215657149326.759i","295778659.030488-62434829.8093353i","0.999999999996582-1.84883945836169E-06i",1.1165000000000001E-5,70.565834512424658,-11.919487333368155,null,16.138831107700756,-8.0469267968158786E-2,54.648234170678705,-11.918571695526985,70.787065278379458,-11.999040963495144,348.00095903650487,null,0,0,0,0,0,0,0,0,0,0,0]
[null,null,null,null,null,null,null,null,null,null,null,null,null,null,null,null,null,null,null,null,null,null,null,null,null,null,null,null,null,null,null,null,null,null,null,null,null,null,null,null,null,null,null,null,null,null,null,null,null,null,null,12,6.5,null,1.1291496764557532E-4,-1.3275772582667772E-3,16.138725433639067,-8.5847454840454779E-2,"19049.5238091087-0.0889226983329891i","100009.999833204-4.08406959318792i",-15.917600340112614,1.7407409943748498E-3,-7.4176936625166073E-10,-7.4879999995736699E-4,"960000-1360298941.90725i","-199068137840.085i","293598049.647601-67137480.5798223i","0.999999999995988-2.00290941322397E-06i",1.1165000000000001E-5,70.53359484307785,-12.88056307750063,null,16.138838348606711,-8.7175032098721558E-2,54.615994502223465,-12.879571136506213,70.754832850830184,-12.966746168604935,347.03325383139509,null,0,0,0,0,0,0,0,0,0,0,0]
[null,null,null,null,null,null,null,null,null,null,null,null,null,null,null,null,null,null,null,null,null,null,null,null,null,null,null,null,null,null,null,null,null,null,null,null,null,null,null,null,null,null,null,null,null,null,null,null,null,null,null,13,7,null,1.2160060199010468E-4,-1.4297000155034957E-3,16.138723873312465,-9.2451094131381459E-2,"19049.5238090424-0.0957629058967316i","100009.999806556-4.39822879149188i",-15.917600339031139,1.8746441475682343E-3,-8.6028135459212292E-10,-8.0639999994675654E-4,"960000-1263134731.77102i","-184848985137.222i","291278934.098148-71728950.7698074i","0.999999999995347-2.15697936808597E-06i",1.1165000000000001E-5,70.499042736476213,-13.834252432014489,null,16.138845473914454,-9.3880794146884952E-2,54.581442396584791,-13.833184187866868,70.720287870499249,-13.927064982013754,346.07293501798625,null,0,0,0,0,0,0,0,0,0,0,0]
[null,null,null,null,null,null,null,null,null,null,null,null,null,null,null,null,null,null,null,null,null,null,null,null,null,null,null,null,null,null,null,null,null,null,null,null,null,null,null,null,null,null,null,null,null,null,null,null,null,null,null,14,7.5,null,1.3028621746418977E-4,-1.5318229769796944E-3,16.138722197406736,-9.9054730959778126E-2,"19049.5238089712-0.1026031134604i","100009.999777934-4.71238798953538i",-15.917600337869597,2.0085473007126929E-3,-9.8756872288083021E-10,-8.6399999993451286E-4,"960000-1178925749.65295i","-172525719461.407i","288828626.80056-76203843.9313142i","0.999999999994659-2.31104932294766E-06i",1.1165000000000001E-5,70.462234878852442,-14.780112733416152,null,16.138852483624198,-0.10058655393675782,54.544634539995272,-14.778968186115373,70.683487023619477,-14.87955474005213,345.12044525994787,null,0,0,0,0,0,0,0,0,0,0,0]
[null,null,null,null,null,null,null,null,null,null,null,null,null,null,null,null,null,null,null,null,null,null,null,null,null,null,null,null,null,null,null,null,null,null,null,null,null,null,null,null,null,null,null,null,null,null,null,null,null,null,null,15,8,null,1.3897181406594984E-4,-1.6339461426953463E-3,16.138720405922001,-0.1056583651497514,"19049.523808895-0.109443321023989i","100009.999747338-5.02654718729984i",-15.917600336627988,2.1424504538047596E-3,-1.1236353284280352E-9,-9.2159999992051916E-4,"960000-1105242890.29964i","-161742861995.069i","286254659.954024-80557341.4126706i","0.999999999993923-2.46511927780902E-06i",1.1165000000000001E-5,70.423230498050415,-15.717725697108909,null,16.138859377736068,-0.10729231129244675,54.505630160298793,-15.716504846655024,70.644489538034861,-15.823797157947471,344.17620284205253,null,0,0,0,0,0,0,0,0,0,0,0]
[null,null,null,null,null,null,null,null,null,null,null,null,null,null,null,null,null,null,null,null,null,null,null,null,null,null,null,null,null,null,null,null,null,null,null,null,null,null,null,null,null,null,null,null,null,null,null,null,null,null,null,16,8.5,null,1.4765739170864486E-4,-1.7360695126504373E-3,16.138718498858445,-0.11226199652540712,"19049.523808814-0.116283528587494i","100009.999714769-5.34070638476662i",-15.917600335306259,2.2763536068408953E-3,-1.2684744209418838E-9,-9.7919999990466432E-4,"960000-1040228602.63495i","-152228575995.359i","283564731.47775-84785205.9561965i","0.99999999999314-2.61918923267003E-06i",1.1165000000000001E-5,70.382091074918861,-16.646698046486787,null,16.138866156250153,-0.11399806603805757,54.464490738344125,-16.645400892879849,70.60335689459427,-16.759398958917906,343.24060104108207,null,0,0,0,0,0,0,0,0,0,0,0]
[null,null,null,null,null,null,null,null,null,null,null,null,null,null,null,null,null,null,null,null,null,null,null,null,null,null,null,null,null,null,null,null,null,null,null,null,null,null,null,null,null,null,null,null,null,null,null,null,null,null,null,17,9,null,1.5634295048103954E-4,-1.8381930868448968E-3,16.138716476216167,-0.11886562491085365,"19049.523808728-0.123123736150909i","100009.999680225-5.65486558191716i",-15.917600333904407,2.4102567598176944E-3,-1.4220985366798819E-9,-1.0367999998868332E-3,"960000-982438124.71079i","-143771432884.506i","280766654.194673-88883780.178928i","0.999999999992309-2.77325918753067E-06i",1.1165000000000001E-5,70.338880054200928,-17.566661973045758,null,16.13887281916665,-0.12070381799769854,54.421279718874423,-17.565288516285825,70.560152538041081,-17.685992334283522,342.31400766571647,null,0,0,0,0,0,0,0,0,0,0,0]
[null,null,null,null,null,null,null,null,null,null,null,null,null,null,null,null,null,null,null,null,null,null,null,null,null,null,null,null,null,null,null,null,null,null,null,null,null,null,null,null,null,null,null,null,null,null,null,null,null,null,null,18,9.5,null,1.6502849029060809E-4,-1.9403168652787186E-3,16.138714337995367,-0.12546925013020108,"19049.5238086371-0.129963943714228i","100009.999643707-5.96902477873282i",-15.917600332422435,2.5441599127316063E-3,-1.5844922464030279E-9,-1.0943999998669065E-3,"960000-930730854.989169i","-136204515364.269i","277868306.781481-92849980.2650909i","0.999999999991431-2.92732914239091E-06i",1.1165000000000001E-5,70.293662557385147,-18.477275432474269,null,16.138879366485657,-0.12740956699547978,54.37606222337822,-18.475825672561403,70.514941589863881,-18.603235239556881,341.39676476044315,null,0,0,0,0,0,0,0,0,0,0,0]
[null,null,null,null,null,null,null,null,null,null,null,null,null,null,null,null,null,null,null,null,null,null,null,null,null,null,null,null,null,null,null,null,null,null,null,null,null,null,null,null,null,null,null,null,null,null,null,null,null,null,null,19,10,null,1.7371401123190093E-4,-2.0424408479518519E-3,16.138712084196204,-0.13207287200755616,"19049.5238085413-0.136804151277447i","100009.999605216-6.28318397519499i",-15.917600330860395,2.6780630655791155E-3,-1.755674836661149E-9,-1.151999999844765E-3,"960000-884194312.239711i","-129394289596.055i","274877586.942443-96681285.2499585i","0.999999999990505-3.08139909725074E-06i",1.1165000000000001E-5,70.246505099808786,-19.378222283283769,null,16.138885798207436,-0.13411531285550801,54.328904767192718,-19.376696220218033,70.467790565400151,-19.510811533073539,340.48918846692646,null,0,0,0,0,0,0,0,0,0,0,0]
[null,null,null,null,null,null,null,null,null,null,null,null,null,null,null,null,null,null,null,null,null,null,null,null,null,null,null,null,null,null,null,null,null,null,null,null,null,null,null,null,null,null,null,null,null,null,null,null,null,null,null,20,{"$f":"BA362*10","v":15},null,2.6056818051839063E-4,-3.0636919078374162E-3,16.138683189438776,-0.19810886827592372,"19049.5238073133-0.205206226902942i","100009.999111736-9.42477591628313i",-15.917600310833928,4.0170945896351364E-3,-3.9502633202674249E-9,-1.727999999476077E-3,"960000-589462874.826474i","-86262859730.7035i","241561955.675503-127384442.864613i","0.999999999978636-4.62209864582125E-06i",1.1165000000000001E-5,69.683338633396062,-27.80458959167245,null,16.138943757619295,-0.20117256018376115,53.765738318611866,-27.802300497082289,69.904682076231154,-28.003473057266049,331.99652694273396,null,0,0,0,0,0,0,0,0,0,0,0]
[null,null,null,null,null,null,null,null,null,null,null,null,null,null,null,null,null,null,null,null,null,null,null,null,null,null,null,null,null,null,null,null,null,null,null,null,null,null,null,null,null,null,null,null,null,null,null,null,null,null,null,21,{"$f":"BA363*10","v":20},null,3.474204586425517E-4,-4.0849633916144991E-3,16.138642737101335,-0.26414433686966282,"19049.523805594-0.27360830251256i","100009.998420864-12.56636780156i",-15.917600282796958,5.356126103210992E-3,-7.0226916341541001E-9,-2.303999998758118E-3,"960000-442097156.119855i","-64697144798.0276i","206553435.38228-145134310.344613i","0.99999999996202-6.16279819432594E-06i",1.1165000000000001E-5,69.00049718161489,-35.09407006328334,null,16.138990157559977,-0.26822930026127734,53.082896891795244,-35.09101793717889,69.221887049355217,-35.359247237440165,324.64075276255983,null,0,0,0,0,0,0,0,0,0,0,0]
[null,null,null,null,null,null,null,null,null,null,null,null,null,null,null,null,null,null,null,null,null,null,null,null,null,null,null,null,null,null,null,null,null,null,null,null,null,null,null,null,null,null,null,null,null,null,null,null,null,null,null,22,25,null,4.3427084555985927E-4,-5.1062552992467711E-3,16.138590727506859,-0.33017910191033828,"19049.5238033834-0.342010378101014i","100009.9975326-15.7079596124218i",-15.917600246749435,6.6951576028131503E-3,-1.0972964600890057E-8,-2.8799999975744495E-3,"960000-353677724.895884i","-51757715838.4221i","174152391.112906-152829058.859306i","0.999999999940656-7.70349774274286E-06i",1.1165000000000001E-5,68.255766943289558,-41.269322528624478,null,16.139024998352419,-0.33528535720958508,52.33816668556716,-41.26550737101924,68.477191683919585,-41.600792728228825,318.39920727177116,null,0,0,0,0,0,0,0,0,0,28.603788649160069,67.925864551480529]
[null,null,null,null,null,null,null,null,null,null,null,null,null,null,null,null,null,null,null,null,null,null,null,null,null,null,null,null,null,null,null,null,null,null,null,null,null,null,null,null,null,null,null,null,null,null,null,null,null,null,null,23,30,null,5.2111934112936305E-4,-6.127567630697898E-3,16.138527161070542,-0.3962129875307468,"19049.5238006817-0.410412453663008i","100009.996446944-18.8495513302649i",-15.917600202691355,8.0341890849482765E-3,-1.5801061006468708E-8,-3.4559999958086438E-3,"960000-294731437.413237i","-43131429865.3518i","146179422.633962-153776772.850759i","0.999999999914545-9.24419729105003E-06i",1.1165000000000001E-5,67.490816504857165,-46.451428020148526,null,16.139048280411671,-0.40234055516144468,51.573216286364747,-46.446849831059389,67.712264566776412,-46.849190386220833,313.15080961377919,null,0,0,0,0,0,0,0,0,0,0,0]
[null,null,null,null,null,null,null,null,null,null,null,null,null,null,null,null,null,null,null,null,null,null,null,null,null,null,null,null,null,null,null,null,null,null,null,null,null,null,null,null,null,null,null,null,null,null,null,null,null,null,null,24,35,null,6.079659451291205E-4,-7.1489003859315173E-3,16.138452038299867,-0.46224581787772712,"19049.5237974886-0.478814529193252i","100009.995163896-21.9911429364854i",-15.917600150622723,9.3732205461229678E-3,-2.1507006889195538E-8,-4.0319999933442824E-3,"960000-252626946.354203i","-36969797027.4444i","122902201.198885-150652349.807142i","0.999999999883686-0.0000107848968392256i",1.1165000000000001E-5,66.732216807832273,-50.793059625803338,null,16.139060004244996,-0.46939471826365864,50.814616635702542,-50.787718405250558,66.953676639947531,-51.257113123514216,308.74288687648578,null,0,0,0,0,0,0,0,0,0,0,0]
[null,null,null,null,null,null,null,null,null,null,null,null,null,null,null,null,null,null,null,null,null,null,null,null,null,null,null,null,null,null,null,null,null,null,null,null,null,null,null,null,null,null,null,null,null,null,null,null,null,null,null,25,40,null,6.9481065732948362E-4,-8.1702535649113093E-3,16.13836535979453,-0.52827741711496479,"19049.5237938044-0.547216604686455i","100009.993683456-25.1327344124797i",-15.917600090543431,1.0712251982843939E-2,-2.809077910694131E-8,-4.6079999900649326E-3,"960000-221048578.059928i","-32348572399.0138i","103868432.866772-145303219.663009i","0.99999999984808-0.0000123255963872475i",1.1165000000000001E-5,65.995309681708903,-54.442047644589259,null,16.139060170451859,-0.53644767067987609,50.077709563074691,-54.435943392596478,66.216769733526547,-54.972391063276355,305.02760893672365,null,0,0,0,0,0,0,0,0,0,0,0]
[null,null,null,null,null,null,null,null,null,null,null,null,null,null,null,null,null,null,null,null,null,null,null,null,null,null,null,null,null,null,null,null,null,null,null,null,null,null,null,null,null,null,null,null,null,null,null,null,null,null,null,26,45,null,7.8165347777080078E-4,-9.1916271676006078E-3,16.13826712624644,-0.59430760942580352,"19049.5237896291-0.615618680137328i","100009.992005624-28.2743257396441i",-15.917600022453582,1.2051283391617564E-2,-3.5552393090941688E-8,-5.1839999858541742E-3,"960000-196487624.942158i","-28754286576.9012i","88399561.1327442-138898195.629006i","0.999999999807726-0.0000138662959350939i",1.1165000000000001E-5,65.288019731227934,-57.526736845266967,null,16.139048779724209,-0.6034992365934041,49.37041967322196,-57.519869561861206,65.509468452946166,-58.123368798454614,301.87663120154537,null,0,0,0,0,0,0,0,0,0,0,0]
[null,null,null,null,null,null,null,null,null,null,null,null,null,null,null,null,null,null,null,null,null,null,null,null,null,null,null,null,null,null,null,null,null,null,null,null,null,null,null,null,null,null,null,null,null,null,null,null,null,null,null,27,50,null,8.6849440622343383E-4,-1.0213021193962892E-2,16.138157338439722,-0.66033621901603679,"19049.5237849623-0.68402075554057i","100009.990130401-31.4159168993746i",-15.917599946353345,1.3390314768950544E-2,-4.3891846914804057E-8,-5.7599999805955796E-3,"960000-176838862.447942i","-25878857919.2111i","75821940.9147012-132135782.460053i","0.999999999762625-0.0000154069954827427i",1.1165000000000001E-5,64.613707345124567,-60.152899047504,null,16.139025832845945,-0.67054924020999973,48.696107354879373,-60.145268732715643,64.835133187725319,-60.815817972925643,299.18418202707437,null,0,0,0,0,0,0,0,0,0,0,0]
[null,null,null,null,null,null,null,null,null,null,null,null,null,null,null,null,null,null,null,null,null,null,null,null,null,null,null,null,null,null,null,null,null,null,null,null,null,null,null,null,null,null,null,null,null,null,null,null,null,null,null,28,55,null,9.5533344255610466E-4,-1.1234435643961656E-2,16.138035997250693,-0.72636307011673962,"19049.5237798044-0.7524228308909i","100009.988057785-34.5575078730676i",-15.91759986224239,1.472934611134947E-2,-5.3109128044799768E-8,-6.3359999741727287E-3,"960000-160762602.225402i","-23526234472.01i","65552105.8330961-125414026.954356i","0.999999999712776-0.0000169476950301722i",1.1165000000000001E-5,63.973063909363937,-62.405563478117813,null,16.138991330693248,-0.73759750576070127,48.05546399401242,-62.397170131980637,64.194455324705672,-63.134767637741341,296.86523236225867,null,0,0,0,0,0,0,0,0,0,0,0]
[null,null,null,null,null,null,null,null,null,null,null,null,null,null,null,null,null,null,null,null,null,null,null,null,null,null,null,null,null,null,null,null,null,null,null,null,null,null,null,null,null,null,null,null,null,null,null,null,null,null,null,29,60,null,1.0421705865391899E-3,-1.2255870517560233E-2,16.137903103647766,-0.79238798698704493,"19049.5237741553-0.820824906183022i","100009.985787778-37.6990986421195i",-15.917599770120939,1.6068377415320832E-2,-6.3204259627582779E-8,-6.9119999664691298E-3,"960000-147365718.706618i","-21565714932.6759i","57114384.0096402-118947390.10176i","0.999999999658179-0.0000184883945773604i",1.1165000000000001E-5,63.365295580660458,-64.352379757711446,null,16.138945274234306,-0.80464385750460521,47.44769574733526,-64.3432233802626,63.586641021569562,-65.147867237767201,294.85213276223283,null,0,0,0,0,0,0,0,0,0,0,0]
[null,null,null,null,null,null,null,null,null,null,null,null,null,null,null,null,null,null,null,null,null,null,null,null,null,null,null,null,null,null,null,null,null,null,null,null,null,null,null,null,null,null,null,null,null,null,null,null,null,null,null,30,65,null,1.1290058381224172E-3,-1.3277325814721875E-2,16.137758658691546,-0.85841079391695507,"19049.5237680149-0.889226981411642i","100009.983320378-40.8406891879263i",-15.917599669988885,1.7407408677371398E-2,-7.4177215629372084E-8,-7.4879999573684575E-3,"960000-136029894.190725i","-19906813784.0085i","50131923.0362847-112841269.247888i","0.999999999598835-0.0000200290941242851i",1.1165000000000001E-5,62.788836747694901,-66.047047859630695,null,16.138887664529669,-0.87168811973167692,46.871237003528805,-66.037128450910686,63.010124668058474,-66.908816570642358,293.09118342935767,null,0,0,0,0,0,0,0,0,0,0,0]
[null,null,null,null,null,null,null,null,null,null,null,null,null,null,null,null,null,null,null,null,null,null,null,null,null,null,null,null,null,null,null,null,null,null,null,null,null,null,null,null,null,null,null,null,null,null,null,null,null,null,null,31,70,null,1.2158391971706668E-3,-1.4298801535409744E-2,16.137602663534729,-0.92443131523013111,"19049.5237613833-0.95762905657147i","100009.980655587-43.9822794918846i",-15.917599561846279,1.8746439894007854E-2,-8.6028014375716637E-8,-8.063999946754245E-3,"960000-126313473.177102i","-18484898513.7222i","44309912.2805703-107137740.445117i","0.999999999534744-0.0000215697936709246i",1.1165000000000001E-5,62.241769437145805,-67.532293468235977,null,16.138818502731901,-0.93873011676554086,46.324169789271508,-67.521611028288717,62.462988292003409,-68.460341145054258,291.53965885494574,null,0,0,0,0,0,0,0,0,0,0,0]
[null,null,null,null,null,null,null,null,null,null,null,null,null,null,null,null,null,null,null,null,null,null,null,null,null,null,null,null,null,null,null,null,null,null,null,null,null,null,null,null,null,null,null,null,null,null,null,null,null,null,null,32,75,null,1.3026706633694871E-3,-1.5320297679587312E-2,16.137435119422037,-0.99044937528674515,"19049.5237542605-1.02603113165722i","100009.977793404-47.1238695353904i",-15.917599445693176,2.0085471061736318E-2,-9.8756652012899647E-8,-8.6399999345100689E-3,"960000-117892574.965295i","-17252571946.1407i","39418629.1382685-101843070.37273i","0.999999999465905-0.0000231104932172568i",1.1165000000000001E-5,61.722064077604919,-68.842277898849758,null,16.138737790085408,-1.0057696729663324,45.804464533155091,-68.830832427722527,61.943202323240499,-69.836602100688864,290.16339789931112,null,0,0,0,0,0,0,0,0,0,0,0]
[null,null,null,null,null,null,null,null,null,null,null,null,null,null,null,null,null,null,null,null,null,null,null,null,null,null,null,null,null,null,null,null,null,null,null,null,null,null,null,null,null,null,null,null,null,null,null,null,null,null,null,33,80,null,{"$f":"20*LOG(IMABS(IMDIV(1,IMSUM(1,IMSUM(COMPLEX(0,2*pi*BA393/Wsh),COMPLEX(-BA393/(fsw_sh),0))))))","v":1.3895002367573246E-3},{"$f":"180/pi*IMARGUMENT(IMDIV(1,IMSUM(1,IMSUM(COMPLEX(0,2*pi*BA393/Wsh),COMPLEX(-BA393/(fsw_sh),0)))))","v":-1.6341814247217427E-2},{"$f":"20*LOG(IMABS(IMPRODUCT(A_INTCOMP2VOUT,IMDIV(COMPLEX(1, 2*pi*BA393/Wesr_zero),COMPLEX(1, 2*pi*BA393/Wload_pole)))))","v":16.137256027690306},{"$f":"180/pi*IMARGUMENT(IMPRODUCT(A_INTCOMP2VOUT,IMDIV(COMPLEX(1, 2*pi*BA393/Wesr_zero),COMPLEX(1, 2*pi*BA393/Wload_pole))))","v":-1.0564647984862072},{"$f":"IMDIV(IMPRODUCT(COMPLEX(R.fb_bot,0),IMDIV(COMPLEX(1,0),COMPLEX(0,2*pi*BA393*C.fb_bot))),IMSUM(COMPLEX(R.fb_bot,0),IMDIV(COMPLEX(1,0),COMPLEX(0,2*pi*BA393*C.fb_bot))) )","v":"19049.5237466464-1.09443320666359i"},{"$f":"IMSUM(COMPLEX(R.fb_top1,0),IMDIV(IMPRODUCT(COMPLEX(R.fb_top2,0),IMDIV(COMPLEX(1,0),COMPLEX(0,2*pi*BA393*C.fb_top))),IMSUM(COMPLEX(R.fb_top2,0),IMDIV(COMPLEX(1,0),COMPLEX(0,2*pi*BA393*C.fb_top))) ))","v":"100009.97473383-50.2654592998402i"},-15.917599321529465,{"$f":"180/pi*IMARGUMENT(IMDIV(BG393,IMSUM(BG393,BH393)))","v":2.1424502177064004E-2},{"$f":"20*LOG(IMABS(IMDIV(A.fb_buf,IMSUM(COMPLEX(1,0),COMPLEX(0,2*pi*BA393*R.fb_buf*C.fb_buf)))))","v":-1.1236311697285059E-7},{"$f":"180/pi*IMARGUMENT(IMDIV(A.fb_buf,IMSUM(COMPLEX(1,0),COMPLEX(0,2*pi*BA393*R.fb_buf*C.fb_buf))))","v":-9.2159999205194947E-3},{"$f":"IMSUM(COMPLEX(R.comp,0),IMDIV(COMPLEX(1,0),COMPLEX(0,2*pi*BA393*C.comp)))","v":"960000-110524289.029964i"},{"$f":"IMDIV(COMPLEX(1,0),COMPLEX(0,2*pi*BA393*C.hf))","v":"-16174286199.5069i"},{"$f":"IMDIV(COMPLEX(1,0),IMSUM(IMDIV(COMPLEX(1,0),BM393),IMSUM(IMDIV(COMPLEX(1,0),BN393),IMDIV(COMPLEX(1,0),COMPLEX(R.eaout,0)))))","v":"35278887.6299299-96944060.4471245i"},{"$f":"IMDIV(IMDIV(COMPLEX(1,0),COMPLEX(0,2*pi*BA393*0.00000000000226)),IMSUM(COMPLEX(21700,0),IMDIV(COMPLEX(1,0),COMPLEX(0,2*pi*BA393*0.00000000000226))) )","v":"0.999999999392319-0.0000246511927632599i"},{"$f":"GM*A.comp_buffer","v":1.1165000000000001E-5},61.227713465259498,{"$f":"180/pi*IMARGUMENT(IMPRODUCT(BQ393,IMPRODUCT(BO393,BP393)) )","v":-70.004487751638194},null,16.138645527927064,-1.0728066127334246,45.310114031366915,-69.992279249381653,61.448759559293975,-71.065085862115083,288.9349141378849,null,{"$f":"IF(AND(BY394<$CC$356,BY393>=$CC$356),(($CC$356-BY393)/(BY394-BY393)*(BA394-BA393)+BA393),0)","v":0},{"$f":"IF(AND(BA394>$CD$356,BA393<=$CD$356),(($CD$356-BA393)/(BA394-BA393)*(BZ394-BZ393)+BZ393),0)","v":0},{"$f":"IF(AND(BZ394<$CE$356,BZ393>=$CE$356),(($CE$356-BZ393)/(BZ394-BZ393)*(BA394-BA393)+BA393),0)","v":0},{"$f":"IF(AND(BA394>$CF$356,BA393<=$CF$356),(($CF$356-BA393)/(BA394-BA393)*(BY394-BY393)+BY393),0)","v":0},{"$f":"IF(AND(BF394<$CG$356,BF393>=$CG$356),(($CG$356-BF393)/(BF394-BF393)*(BA394-BA393)+BA393),0)","v":0},0,{"$f":"IF(AND(BF394>$CI$356,BF393<=$CI$356),(($CI$356-BF393)/(BF394-BF393)*(BA394-BA393)+BA393),0)","v":0},{"$f":"IF(AND(BX394>$CJ$356,BX393<=$CJ$356),(($CJ$356-BX393)/(BX394-BX393)*(BA394-BA393)+BA393),0)","v":0},0,{"$f":"IF(AND(BX394<$CL$356,BX393>=$CL$356),(($CL$356-BX393)/(BX394-BX393)*(BA394-BA393)+BA393),0)","v":0},0]
[null,null,null,null,null,null,null,null,null,null,null,null,null,null,null,null,null,null,null,null,null,null,null,null,null,null,null,null,null,null,null,null,null,null,null,null,null,null,null,null,null,null,null,null,null,null,null,null,null,null,null,34,85,null,1.4763279171065163E-3,-1.7363351238263346E-2,16.137065389768299,-1.1224774092700003,"19049.5237385411-1.16283528158529i","100009.971476863-53.40704876663i",-15.917599189355156,2.2763533236497099E-2,-1.2684742468893457E-7,-9.7919999046660582E-3,"960000-104022860.263495i","-15222857599.5359i","31750378.6286343-92417658.5344256i","0.999999999313985-0.000026191892308912i",1.1165000000000001E-5,60.756803576126373,-71.041194533717999,null,16.138541717685406,-1.1398407605082637,44.83920425992379,-71.028223000386163,60.977745977609196,-72.168063760894427,287.83193623910557,null,0,0,0,0,0,0,0,0,0,0,0]
[null,null,null,null,null,null,null,null,null,null,null,null,null,null,null,null,null,null,null,null,null,null,null,null,null,null,null,null,null,null,null,null,null,null,null,null,null,null,null,null,null,null,null,null,null,null,null,null,null,null,null,35,90,null,1.5631537042838949E-3,-1.8384908652687961E-2,16.136863207176813,-1.1884870321244725,"19049.5237299446-1.23123735641704i","100009.968022505-56.5486379171566i",-15.917599049170352,2.4102564236542261E-2,-1.4220957323688813E-7,-1.0367999886833392E-2,"960000-98243812.471079i","-14377143288.4506i","28722628.5162969-88236542.4293437i","0.999999999230903-0.0000277325918541909i",1.1165000000000001E-5,60.307547433053173,-71.970575752021105,null,16.138426360881095,-1.2068719407771604,44.389948241673245,-71.956841187671401,60.528374602554337,-73.163713128448563,286.83628687155147,null,0,0,0,0,0,0,0,0,0,0,0]
[null,null,null,null,null,null,null,null,null,null,null,null,null,null,null,null,null,null,null,null,null,null,null,null,null,null,null,null,null,null,null,null,null,null,null,null,null,null,null,null,null,null,null,null,null,null,null,null,null,null,null,36,95,null,1.6499775981466563E-3,-1.9406486490454327E-2,16.136649481528512,-1.2544934915836323,"19049.5237208569-1.29963943115354i","100009.964370756-59.6902267328158i",-15.917598900975001,2.5441595173706161E-2,-1.5844955587107669E-7,-1.094399986690507E-2,"960000-93073085.4989169i","-13620451536.4269i","26108096.8564646-84372302.1705846i","0.999999999143074-0.000029273291399075i",1.1165000000000001E-5,59.878297679152652,-72.807575716582804,null,16.138299459126657,-1.2738999780740867,43.960698619728092,-72.793078121275997,60.098998078854748,-74.066978099350081,285.93302190064992,null,0,0,0,0,0,0,0,0,0,0,0]
[null,null,null,null,null,null,null,null,null,null,null,null,null,null,null,null,null,null,null,null,null,null,null,null,null,null,null,null,null,null,null,null,null,null,null,null,null,null,null,null,null,null,null,null,null,null,null,null,null,null,null,37,100,null,1.7367995985597157E-3,-2.042808475152532E-2,16.136424214527956,-1.3204966122319204,"19049.5237112779-1.3680415057895i","100009.960521614-62.8318151950039i",-15.917598744768995,2.6780626044495482E-2,-1.7556737163209659E-7,-1.151999984476461E-2,"960000-88419431.2239711i","-12939428959.6055i","23836940.4859009-80797195.5042359i","0.999999999050498-0.000030813990943542i",1.1165000000000001E-5,59.467547174566278,-73.564568349938867,null,16.138161014126517,-1.3409246969834456,43.549948254229911,-73.549307723739133,59.688109268356428,-74.890232420722583,285.10976757927745,null,0,0,0,0,0,0,0,0,0,0,0]
[null,null,null,null,null,null,null,null,null,null,null,null,null,null,null,null,null,null,null,null,null,null,null,null,null,null,null,null,null,null,null,null,null,null,null,null,null,null,null,null,null,null,null,null,null,null,null,null,null,null,null,38,150,null,2.6049154286682842E-3,-3.0645190635797362E-2,16.133537210751328,-1.9803056343445584,"19049.5235884705-2.05206224545513i","100009.911173676-94.2476762831798i",-15.917596742129396,4.0170930333234205E-2,-3.9502658200151164E-7,-1.7279999476080561E-2,"960000-58946287.4826474i","-8626285973.07035i","11556879.0792297-56184448.5399083i","0.99999999786362-0.0000462209863604544i",1.1165000000000001E-5,56.129468416182661,-78.379310453190342,null,16.136142126179998,-2.0109508249803558,40.211871279026681,-78.356419522333184,56.348013405206679,-80.367370347313539,279.63262965268643,null,0,0,0,0,0,0,0,0,0,0,0]
[null,null,null,null,null,null,null,null,null,null,null,null,null,null,null,null,null,null,null,null,null,null,null,null,null,null,null,null,null,null,null,null,null,null,null,null,null,null,null,null,null,null,null,null,null,null,null,null,null,null,null,39,200,null,3.4728417482524825E-3,-4.0864338809355132E-2,16.129498626939387,-2.6395882999272589,"19049.5234165402-2.73608296924581i","100009.842086645-125.663481560266i",-15.917593938435688,5.3561224141772057E-2,-7.0226945574709712E-7,-2.3039998758116999E-2,"960000-44209715.6119855i","-6469714479.80276i","7005166.49415969-42783230.4339043i","0.999999996201992-0.0000616279817115365i",1.1165000000000001E-5,53.697545064813525,-80.704664467658759,null,16.132971468687639,-2.6804526387366141,37.779950424108378,-80.674143242275107,53.912921892796021,-83.354595881011718,276.64540411898827,null,0,0,0,0,0,0,0,0,0,0,0]
[null,null,null,null,null,null,null,null,null,null,null,null,null,null,null,null,null,null,null,null,null,null,null,null,null,null,null,null,null,null,null,null,null,null,null,null,null,null,null,null,null,null,null,null,null,null,null,null,null,null,null,40,250,null,4.3405784091269817E-3,-5.108552923423898E-2,16.124311674308252,-3.2981704605818636,"19049.5231954869-3.42010367186993i","100009.753260601-157.07921242274i",-15.917590333689663,6.6951503976732024E-2,-1.0972959790404115E-6,-2.8799997574447397E-2,"960000-35367772.4895884i","-5175771583.84221i","4850875.10979392-34470802.5922573i","0.999999994065612-0.0000770349769748447i",1.1165000000000001E-5,51.79136652528797,-81.994130177197434,null,16.12865225271738,-3.3492559898161027,35.873775094302331,-81.955978670795147,52.002427347019712,-85.305234660611248,274.69476533938877,null,0,0,0,0,0,0,0,0,0,0,0]
[null,null,null,null,null,null,null,null,null,null,null,null,null,null,null,null,null,null,null,null,null,null,null,null,null,null,null,null,null,null,null,null,null,null,null,null,null,null,null,null,null,null,null,null,null,null,null,null,null,null,null,41,300,null,5.2081252627242643E-3,-6.1308761871956191E-2,16.117980466972512,-3.955879078770582,"19049.5229253108-4.1041243480358i","100009.644695652-188.494850267221i",-15.91758592789359,8.0341766344746546E-2,-1.5801061175706946E-6,-3.4559995808645369E-2,"960000-29473143.7413237i","-4313142986.53518i","3667710.07534327-28837477.0513523i","0.999999991454482-0.0000924419721284354i",1.1165000000000001E-5,50.226009774924464,-82.757035057940485,null,16.123188592235234,-4.0171878406425385,34.308422266924758,-82.711253287404389,50.431610859159989,-86.728441128046924,273.27155887195306,null,0,0,0,0,0,0,0,0,0,0,0]
[null,null,null,null,null,null,null,null,null,null,null,null,null,null,null,null,null,null,null,null,null,null,null,null,null,null,null,null,null,null,null,null,null,null,null,null,null,null,null,null,null,null,null,null,null,null,null,null,null,null,null,42,350,null,6.0754821608541539E-3,-7.1534036683474952E-2,16.110510011112687,-4.6125424972594846,"19049.5226060116-4.78814499245179i","100009.516391924-219.910376490517i",-15.917580721050278,9.3732007752477281E-2,-2.1506998502963282E-6,-4.0319993344284641E-2,"960000-25262694.6354203i","-3696979702.74444i","2949839.8062461-24776015.8512811i","0.9999999883686-0.000107848967150366i",1.1165000000000001E-5,48.898934426348937,-83.216505786506261,null,16.11658549327354,-4.6840765339429593,32.98135155459881,-83.163093772098065,49.09793704787235,-87.847170306041022,272.15282969395901,null,0,0,0,0,0,0,0,0,0,0,0]
[null,null,null,null,null,null,null,null,null,null,null,null,null,null,null,null,null,null,null,null,null,null,null,null,null,null,null,null,null,null,null,null,null,null,null,null,null,null,null,null,null,null,null,null,null,null,null,null,null,null,null,43,400,null,6.9426489548402538E-3,-8.1761353629232938E-2,16.101906191858216,-5.2679907031370359,"19049.5222375895-5.47216559982627i","100009.368349571-251.325772489652i",-15.917574713162946,0.10712222470660447,-2.8090771491939544E-6,-4.6079990064938917E-2,"960000-22104857.8059928i","-3234857239.90138i","2482105.19516947-21712210.4756599i","0.999999984807968-0.000123255962018692i",1.1165000000000001E-5,47.747644250747889,-83.485428975620749,null,16.108848840813057,-5.3497520567662686,31.830066728507795,-83.424386740979088,47.938915569320855,-88.774138797745351,271.22586120225463,null,0,0,0,0,0,0,0,0,0,0,0]
[null,null,null,null,null,null,null,null,null,null,null,null,null,null,null,null,null,null,null,null,null,null,null,null,null,null,null,null,null,null,null,null,null,null,null,null,null,null,null,null,null,null,null,null,null,null,null,null,null,null,null,44,450,null,7.8096254963892116E-3,-9.1990712669125438E-2,16.092175757957431,-5.9220555854113925,"19049.5218200446-6.15618616486762i","100009.200568767-282.741019661911i",-15.917567904235471,0.12051241371384036,-3.5552379580432547E-6,-5.1839985854182036E-2,"960000-19648762.4942158i","-2875428657.69012i","2160600.9179785-19320051.2450547i","0.999999980772584-0.00013866295671147i",1.1165000000000001E-5,46.731317746282919,-83.626970730307903,null,16.09998538345382,-6.014046298080518,30.81374628680949,-83.55829830244825,46.91373167026331,-89.572344600528766,270.42765539947123,null,0,0,0,0,0,0,0,0,0,0,0]
[null,null,null,null,null,null,null,null,null,null,null,null,null,null,null,null,null,null,null,null,null,null,null,null,null,null,null,null,null,null,null,null,null,null,null,null,null,null,null,null,null,null,null,null,null,null,null,null,null,null,null,45,500,null,8.6764116368178868E-3,-0.10222211376251546,16.081326304317834,-6.5745711852359197,"19049.5213533766-6.84020668228408i","100009.013049711-314.156099404869i",-15.917560294272095,0.13390257128093216,-4.3891822416076611E-6,-5.7599980595588213E-2,"960000-17683886.2447942i","-2587885791.9211i","1930216.72760713-17401167.26575i","0.99999997626245-0.000154069951206756i",1.1165000000000001E-5,45.821852708334525,-83.679211988325349,null,16.09000271595465,-6.6767932989984349,29.904288024880188,-83.602909397640005,45.994290740834842,-90.279702696638438,269.72029730336158,null,0,0,0,0,0,0,0,0,0,0,0]
[null,null,null,null,null,null,null,null,null,null,null,null,null,null,null,null,null,null,null,null,null,null,null,null,null,null,null,null,null,null,null,null,null,null,null,null,null,null,null,null,null,null,null,null,null,null,null,null,null,null,null,46,550,null,9.5430072275602042E-3,-0.11245555686822822,16.06936625251042,-7.2253739378666895,"19049.5208375858-7.52422714678418i","100008.805792626-345.570993116433i",-15.917551883277657,0.14729269391466165,-5.3109099422395944E-6,-6.3359974172731065E-2,"960000-16076260.2225402i","-2352623447.201i","1759535.6692419-15828101.9369434i","0.999999971277564-0.000169476945482609i",1.1165000000000001E-5,44.999091200105468,-83.66646917213302,null,16.07890925973798,-7.3378294947349181,29.081534005917867,-83.582536452391096,45.160443265655843,-90.920365947126015,269.07963405287398,null,0,0,0,0,0,0,0,0,0,0,0]
[null,null,null,null,null,null,null,null,null,null,null,null,null,null,null,null,null,null,null,null,null,null,null,null,null,null,null,null,null,null,null,null,null,null,null,null,null,null,null,null,null,null,null,null,null,null,null,null,null,null,null,47,600,null,1.0409412120170923E-2,-0.12269104194454677,16.056304829341581,-7.8743029055109472,"19049.5202726721-8.20824755307618i","100008.578797756-376.98568219488i",-15.917542671257349,0.1606827781218578,-6.3204210194179064E-6,-6.9119966469184932E-2,"960000-14736571.8706618i","-2156571493.26759i","1629591.62540669-14515296.2284878i","0.999999965817928-0.000184883939517084i",1.1165000000000001E-5,44.248088525057142,-83.604995979211964,null,16.066714241461753,-7.9969939474554943,28.330539533378776,-83.513433167559285,44.397253774840529,-91.510427115014778,268.48957288498525,null,0,0,0,0,0,0,0,0,0,0,0]
[null,null,null,null,null,null,null,null,null,null,null,null,null,null,null,null,null,null,null,null,null,null,null,null,null,null,null,null,null,null,null,null,null,null,null,null,null,null,null,null,null,null,null,null,null,null,null,null,null,null,null,48,650,null,1.1275626165724599E-2,-0.13292856894922367,16.04215204360538,-8.5212000002942698,"19049.5196586355-8.89226789586844i","100008.332065371-408.400148038885i",-15.917532658217139,0.17407282040938929,-7.41771539574549E-6,-7.4879957368524486E-2,"960000-13602989.4190725i","-1990681378.40085i","1528388.51369024-13403213.1401425i","0.99999995988354-0.000200290933288237i",1.1165000000000001E-5,43.557460952102915,-83.506069413983894,null,16.053427669771104,-8.6541285692434933,27.639920876170379,-83.406876550943025,43.693348545941483,-92.061005120186522,267.93899487981349,null,0,0,0,0,0,0,0,0,0,0,0]
[null,null,null,null,null,null,null,null,null,null,null,null,null,null,null,null,null,null,null,null,null,null,null,null,null,null,null,null,null,null,null,null,null,null,null,null,null,null,null,null,null,null,null,null,null,null,null,null,null,null,null,49,700,null,1.214164921576529E-2,-0.1431681378394678,16.026918661136097,-9.1659101966368421,"19049.518995476-9.57628816986933i","100008.065595762-439.81437204757i",-15.917521844163234,0.1874628172841791,-8.6027930186662811E-6,-8.063994675432451E-2,"960000-12631347.3177102i","-1848489851.37222i","1448039.50239138-12449159.9144435i","0.999999953474402-0.000215697926774125i",1.1165000000000001E-5,42.918339062061435,-83.377759898822006,null,16.039060310351861,-9.3090783344763093,27.000808615105182,-83.270937028292153,43.039868925457043,-92.580015362768464,267.41998463723155,null,0,0,0,0,0,0,0,0,0,0,0]
[null,null,null,null,null,null,null,null,null,null,null,null,null,null,null,null,null,null,null,null,null,null,null,null,null,null,null,null,null,null,null,null,null,null,null,null,null,null,null,null,null,null,null,null,null,null,null,null,null,null,null,50,750,null,1.3007481121433944E-2,-0.15340974857194956,16.01061617828886,-9.8082817324048435,"19049.5182831936-10.2603083697873i","100007.779389246-471.228335620529i",-15.917510229102614,0.20085276525320406,-9.8756537997125529E-6,-8.6399934510159371E-2,"960000-11789257.4965295i","-1725257194.61407i","1383187.39957463-11621732.9639864i","0.999999946590513-0.000231104919952804i",1.1165000000000001E-5,42.323678861584867,-83.225996373707815,null,16.023623659410294,-9.9616914809767927,26.406158756828454,-83.111543542964768,42.429782416238751,-93.073235023941564,266.92676497605845,null,0,0,0,0,0,0,0,0,0,0,0]
[null,null,null,null,null,null,null,null,null,null,null,null,null,null,null,null,null,null,null,null,null,null,null,null,null,null,null,null,null,null,null,null,null,null,null,null,null,null,null,null,null,null,null,null,null,null,null,null,null,null,null,51,800,null,1.387312173399809E-2,-0.16365340110280252,15.993256793980706,-10.448166298275043,"19049.5175217884-10.9443284903305i","100007.473446161-502.642020157875i",-15.917497813042393,0.21424266082350543,-1.1236297678150591E-5,-9.2159920519603464E-2,"960000-11052428.9029964i","-1617428619.95069i","1330090.34085494-10897322.3880446i","0.999999939231873-0.000246511912802332i",1.1165000000000001E-5,41.767793460923706,-83.055233456393793,null,16.007129915714703,-10.611819699377845,25.850284411583633,-82.933150716089898,41.857414327298336,-93.544970415467745,266.45502958453227,null,0,0,0,0,0,0,0,0,0,0,0]
[null,null,null,null,null,null,null,null,null,null,null,null,null,null,null,null,null,null,null,null,null,null,null,null,null,null,null,null,null,null,null,null,null,null,null,null,null,null,null,null,null,null,null,null,null,null,null,null,null,null,null,52,850,null,1.4738570904499426E-2,-0.17389909538762113,15.974853380430318,-11.085419214828768,"19049.5167112603-11.6283485262076i","100007.14776687-534.055407060265i",-15.917484595990562,0.22763250050217237,-1.2684724558299314E-5,-9.7919904666233015E-2,"960000-10402286.0263495i","-1522285759.95359i","1286070.89560892-10257838.0751189i","0.999999931398482-0.000261918905300764i",1.1165000000000001E-5,41.246025751148252,-82.868883889534246,null,15.989591951334818,-11.25931831021639,25.328528470433135,-82.739171293698305,41.318120421767951,-93.998489603914692,266.00151039608534,null,0,0,0,0,0,0,0,0,0,0,0]
[null,null,null,null,null,null,null,null,null,null,null,null,null,null,null,null,null,null,null,null,null,null,null,null,null,null,null,null,null,null,null,null,null,null,null,null,null,null,null,null,null,null,null,null,null,null,null,null,null,null,null,53,900,null,1.5603828484269848E-2,-0.18414683138145477,15.95541945273701,-11.719899596969658,"19049.5158516094-12.3123684721267i","100006.802351757-565.468477728953i",-15.917470577955307,0.24102228079638138,-1.4220934357746691E-5,-0.10367988683362288,"960000-9824381.2471079i","-1437714328.84506i","1249172.46116492-9689187.24549557i","0.999999923090341-0.000277325897426158i",1.1165000000000001E-5,40.754514073968139,-82.669607244379961,null,15.97102328122128,-11.904046428351112,24.837029275078475,-82.532264850417207,40.808052556299756,-94.436311278768315,265.5636887212317,null,0,0,0,0,0,0,0,0,0,0,0]
[null,null,null,null,null,null,null,null,null,null,null,null,null,null,null,null,null,null,null,null,null,null,null,null,null,null,null,null,null,null,null,null,null,null,null,null,null,null,null,null,null,null,null,null,null,null,null,null,null,null,null,54,950,null,1.6468894324338394E-2,-0.19439660903881628,15.934969137443105,-12.351470505336085,"19049.5149428356-12.9963883227964i","100006.437201234-596.881213565807i",-15.917455758945795,0.25441199821335747,-1.5844926984205853E-5,-0.10943986690534867,"960000-9307308.54989169i","-1362045153.64269i","1217938.39401208-9180229.10921964i","0.999999914307448-0.000292732889156569i",1.1165000000000001E-5,40.290020908408046,-82.459507681509336,null,15.951438031767443,-12.545867114374902,24.372549304535266,-82.314535550201327,40.323987336302707,-94.860402664576227,265.13959733542379,null,0,0,0,0,0,0,0,0,0,0,0]
[null,null,null,null,null,null,null,null,null,null,null,null,null,null,null,null,null,null,null,null,null,null,null,null,null,null,null,null,null,null,null,null,null,null,null,null,null,null,null,null,null,null,null,null,null,null,null,null,null,null,null,55,1000,null,1.7333768275673879E-2,-0.20464842831368038,15.913517140224213,-12.979999084460061,"19049.513984939-13.6804080729249i","100006.05231573-628.293595973361i",-15.917440138970957,0.26780164926042938,-1.7556702340336703E-5,-0.11519984476498668,"960000-8841943.12239711i","-1293942895.96055i","1191266.22687691-8722040.99921874i","0.999999905049805-0.000308139880470055i",1.1165000000000001E-5,39.849805289330355,-82.240272514338969,null,15.930850908499886,-13.184647512773742,23.932347593657056,-82.087670709843522,39.863198502156941,-95.272318222617258,264.72768177738271,null,0,0,0,0,0,0,0,0,0,0,0]
[null,null,null,null,null,null,null,null,null,null,null,null,null,null,null,null,null,null,null,null,null,null,null,null,null,null,null,null,null,null,null,null,null,null,null,null,null,null,null,null,null,null,null,null,null,null,null,null,null,null,null,56,1500,null,2.5971921115969625E-2,-0.30727889951103476,15.647486583878914,-19.071857795364409,"19049.5017042223-20.5205988802927i","100001.118148678-942.393890540826i",-15.917239888559546,0.40169374105735611,-3.9502480459864997E-5,-0.17279947608341781,"960000-5894628.74826474i","-862628597.307035i","1054032.51301117-5817864.21598682i","0.999999786362087-0.000462209765846449i",1.1165000000000001E-5,36.392705066597479,-79.757510699578845,null,15.673458504994883,-19.379136694875445,20.475425675557474,-79.528616434604899,36.148884180552358,-98.907753129480341,261.09224687051966,null,0,0,0,0,0,0,0,0,0,0,0]
[null,null,null,null,null,null,null,null,null,null,null,null,null,null,null,null,null,null,null,null,null,null,null,null,null,null,null,null,null,null,null,null,null,null,null,null,null,null,null,null,null,null,null,null,null,null,null,null,null,null,null,57,2000,null,3.4590720949853306E-2,-0.41011347779564766,15.300462864853188,-24.74676882435832,"19049.4845112455-27.3607738127849i","99994.2111328058-1256.43839128453i",-15.916959555671493,0.53557535463105566,-7.0226383521371618E-5,-0.23039875812892907,"960000-4420971.56119855i","-646971447.980276i","1005971.13050856-4364685.93254463i","0.999999620199328-0.000616279585392511i",1.1165000000000001E-5,33.981014998230037,-77.056465252806731,null,15.335053585803042,-25.156882302153967,18.063985216175023,-76.75128865630461,33.399038801978065,-101.90817095845858,258.09182904154142,null,0,0,0,0,0,0,0,0,0,0,0]
[null,null,null,null,null,null,null,null,null,null,null,null,null,null,null,null,null,null,null,null,null,null,null,null,null,null,null,null,null,null,null,null,null,null,null,null,null,null,null,null,null,null,null,null,null,null,null,null,null,null,null,58,2500,null,4.3190018167152955E-2,-0.51315210815133905,14.891522072564612,-29.946814548102779,"19049.4624060352-34.2009275788406i","99985.3320858252-1570.40851739086i",-15.916599157990717,0.66944299920129624,-1.0972822522625585E-4,-0.28799757448380164,"960000-3536777.24895884i","-517577158.384221i","983719.76353297-3492625.16270814i","0.999999406561577-0.000770349317164844i",1.1165000000000001E-5,32.151755042493299,-74.313946647820188,null,14.934712090731765,-30.459966656254117,16.235046156277356,-73.93250122310269,31.169758247009121,-104.39246787935681,255.60753212064319,null,0,0,0,0,0,0,0,0,0,0,0]
[null,null,null,null,null,null,null,null,null,null,null,null,null,null,null,null,null,null,null,null,null,null,null,null,null,null,null,null,null,null,null,null,null,null,null,null,null,null,null,null,null,null,null,null,null,null,null,null,null,null,null,59,3000,null,5.1769662759271688E-2,-0.6163947300639917,14.438939041421044,-34.654133294658351,"19049.4353886257-41.0410548869522i","99974.4820586638-1884.28570271785i",-15.916158718247379,0.80329318566778385,-1.5800776605766429E-4,-0.3455958087359659,"960000-2947314.37413237i","-431314298.653517i","971630.475236237-2911270.93659621i","0.999999145448895-0.000924418939220098i",1.1165000000000001E-5,30.697478962854095,-71.596657963495673,null,14.490708704180316,-35.270528024722346,14.781162236840659,-71.138960586563854,29.271870941020975,-106.40948861128621,253.59051138871379,null,0,0,0,0,0,0,0,0,0,0,0]
[null,null,null,null,null,null,null,null,null,null,null,null,null,null,null,null,null,null,null,null,null,null,null,null,null,null,null,null,null,null,null,null,null,null,null,null,null,null,null,null,null,null,null,null,null,null,null,null,null,null,null,60,3500,null,6.0329504323855886E-2,-0.71984127748089433,13.958568584571271,-38.880542521639732,"19049.4034590585-47.8811504456814i","99961.6623351552-2198.05139945177i",-15.915638264213962,0.93712242702924886,-2.1506471326275403E-4,-0.40319334448040933,"960000-2526269.46354203i","-369697970.274444i","964339.746065941-2496078.1540528i","0.999998836861354-0.00107848842961497i",1.1165000000000001E-5,29.506516435191482,-68.938168341735647,null,14.018898088895128,-39.600383799120628,13.590663106264257,-68.404239259186809,27.609561195159387,-108.00462305830743,251.99537694169257,null,0,0,0,0,0,0,0,0,0,0,0]
[null,null,null,null,null,null,null,null,null,null,null,null,null,null,null,null,null,null,null,null,null,null,null,null,null,null,null,null,null,null,null,null,null,null,null,null,null,null,null,null,null,null,null,null,null,null,null,null,null,null,null,61,4000,null,6.8869392069130494E-2,-0.82349167877019547,13.46320579143935,-42.656575904596991,"19049.3666173834-54.7212089636717i","99946.8744316596-2511.68708175605i",-15.915037828699036,1.0709272388019178,-2.8089872089284029E-4,-0.46079006532059208,"960000-2210485.78059928i","-323485723.990138i","959606.761850248-2184752.14544297i","0.999998480799045-0.00123255776640622i",1.1165000000000001E-5,28.511332719788719,-66.358154428805193,null,13.53207518350848,-43.480067583367187,12.596013992368789,-65.748017255323873,26.128089175877271,-109.22808483869106,250.77191516130893,null,0,0,0,0,4348.1181159356947,25.198492060149359,0,0,0,0,0]
[null,null,null,null,null,null,null,null,null,null,null,null,null,null,null,null,null,null,null,null,null,null,null,null,null,null,null,null,null,null,null,null,null,null,null,null,null,null,null,null,null,null,null,null,null,null,null,null,null,null,null,62,4500,null,7.7389174819006187E-2,-0.927345856680305,12.962620030081631,-46.022422133403843,"19049.3248636573-61.5612251496616i","99930.120096615-2825.17424941109i",-15.914357449541441,1.2047041394371134,-3.5550938979920794E-4,-0.51838585486985445,"960000-1964876.24942158i","-287542865.769012i","956360.903966436-1942677.39286241i","0.999998077262067-0.00138662692765068i",1.1165000000000001E-5,27.667618066587014,-63.868893245644344,null,13.040009204900636,-46.949767990084148,11.752905107655774,-63.182574961077087,24.792914312556412,-110.13234295116123,249.86765704883877,null,0,0,0,0,0,0,0,0,0,0,0]
[null,null,null,null,null,null,null,null,null,null,null,null,null,null,null,null,null,null,null,null,null,null,null,null,null,null,null,null,null,null,null,null,null,null,null,null,null,null,null,null,null,null,null,null,null,null,null,null,null,null,null,63,5000,null,8.588870101706042E-2,-1.0314037282995918,12.463940456786579,-49.021515936889877,"19049.2781979445-68.4011937124983i","99911.4013100213-3138.49443144352i",-15.913597169602799,1.3384496507381554,-4.3889626762894703E-4,-0.57598059675283209,"960000-1768388.62447942i","-258788579.192111i","954038.247710771-1749081.71415781i","0.999997626250536-0.00154069589140527i",1.1165000000000001E-5,26.944495847958599,-61.477988285100217,null,12.549829157803639,-50.052919665189471,11.030459782088171,-60.715519231114897,23.580288939891808,-110.76843889630436,249.23156110369564,null,0,0,0,0,0,0,0,0,0,0,0]
[null,null,null,null,null,null,null,null,null,null,null,null,null,null,null,null,null,null,null,null,null,null,null,null,null,null,null,null,null,null,null,null,null,null,null,null,null,null,null,null,null,null,null,null,null,null,null,null,null,null,null,64,5500,null,9.4367818731816849E-2,-1.1356652050159459,11.972160653223318,-51.69653630161433,"19049.2266203176-75.2411093611539i","99890.7202828559-3451.62918974343i",-15.912757036758148,1.4721602982761797,-5.3105884884106476E-4,-0.63357417460685483,"960000-1607626.02225402i","-235262344.7201i","952318.837957386-1590745.19102943i","0.99999712776458-0.001694764635727i",1.1165000000000001E-5,26.31943934079581,-59.189757317662007,null,12.066528471955134,-52.832201506630277,10.406151245188822,-58.351171193992684,22.472679717143954,-111.18337270062295,248.81662729937705,null,0,0,0,0,0,0,0,0,0,0,0]
[null,null,null,null,null,null,null,null,null,null,null,null,null,null,null,null,null,null,null,null,null,null,null,null,null,null,null,null,null,null,null,null,null,null,null,null,null,null,null,null,null,null,null,null,null,null,null,null,null,null,null,65,6000,null,{"$f":"20*LOG(IMABS(IMDIV(1,IMSUM(1,IMSUM(COMPLEX(0,2*pi*BA425/Wsh),COMPLEX(-BA425/(fsw_sh),0))))))","v":0.10282637566121558},{"$f":"180/pi*IMARGUMENT(IMDIV(1,IMSUM(1,IMSUM(COMPLEX(0,2*pi*BA425/Wsh),COMPLEX(-BA425/(fsw_sh),0)))))","v":-1.240130192476552},{"$f":"20*LOG(IMABS(IMPRODUCT(A_INTCOMP2VOUT,IMDIV(COMPLEX(1, 2*pi*BA425/Wesr_zero),COMPLEX(1, 2*pi*BA425/Wload_pole)))))","v":11.490630891515003},{"$f":"180/pi*IMARGUMENT(IMPRODUCT(A_INTCOMP2VOUT,IMDIV(COMPLEX(1, 2*pi*BA425/Wesr_zero),COMPLEX(1, 2*pi*BA425/Wload_pole))))","v":-54.087210770884454},{"$f":"IMDIV(IMPRODUCT(COMPLEX(R.fb_bot,0),IMDIV(COMPLEX(1,0),COMPLEX(0,2*pi*BA425*C.fb_bot))),IMSUM(COMPLEX(R.fb_bot,0),IMDIV(COMPLEX(1,0),COMPLEX(0,2*pi*BA425*C.fb_bot))) )","v":"19049.1701308562-82.0809668047346i"},{"$f":"IMSUM(COMPLEX(R.fb_top1,0),IMDIV(IMPRODUCT(COMPLEX(R.fb_top2,0),IMDIV(COMPLEX(1,0),COMPLEX(0,2*pi*BA425*C.fb_top))),IMSUM(COMPLEX(R.fb_top2,0),IMDIV(COMPLEX(1,0),COMPLEX(0,2*pi*BA425*C.fb_top))) ))","v":"99868.0794564213-3764.56012266789i"},-15.911837103887787,{"$f":"180/pi*IMARGUMENT(IMDIV(BG425,IMSUM(BG425,BH425)))","v":1.6058326118048052},{"$f":"20*LOG(IMABS(IMDIV(A.fb_buf,IMSUM(COMPLEX(1,0),COMPLEX(0,2*pi*BA425*R.fb_buf*C.fb_buf)))))","v":-6.3199657471683544E-4},{"$f":"180/pi*IMARGUMENT(IMDIV(A.fb_buf,IMSUM(COMPLEX(1,0),COMPLEX(0,2*pi*BA425*R.fb_buf*C.fb_buf))))","v":-0.69116647208337201},{"$f":"IMSUM(COMPLEX(R.comp,0),IMDIV(COMPLEX(1,0),COMPLEX(0,2*pi*BA425*C.comp)))","v":"960000-1473657.18706618i"},{"$f":"IMDIV(COMPLEX(1,0),COMPLEX(0,2*pi*BA425*C.hf))","v":"-215657149.326759i"},{"$f":"IMDIV(COMPLEX(1,0),IMSUM(IMDIV(COMPLEX(1,0),BM425),IMSUM(IMDIV(COMPLEX(1,0),BN425),IMDIV(COMPLEX(1,0),COMPLEX(R.eaout,0)))))","v":"951010.177817135-1458853.9426242i"},{"$f":"IMDIV(IMDIV(COMPLEX(1,0),COMPLEX(0,2*pi*BA425*0.00000000000226)),IMSUM(COMPLEX(21700,0),IMDIV(COMPLEX(1,0),COMPLEX(0,2*pi*BA425*0.00000000000226))) )","v":"0.999996581804341-0.001848833138673i"},{"$f":"GM*A.comp_buffer","v":1.1165000000000001E-5},25.775418678420081,{"$f":"180/pi*IMARGUMENT(IMPRODUCT(BQ425,IMPRODUCT(BO425,BP425)) )","v":-57.006073161009027},null,11.59345726717622,-55.327340963361003,9.8629495779575773,-56.091407021287594,21.456406845133799,-111.4187479846486,248.5812520153514,null,{"$f":"IF(AND(BY426<$CC$356,BY425>=$CC$356),(($CC$356-BY425)/(BY426-BY425)*(BA426-BA425)+BA425),0)","v":0},{"$f":"IF(AND(BA426>$CD$356,BA425<=$CD$356),(($CD$356-BA425)/(BA426-BA425)*(BZ426-BZ425)+BZ425),0)","v":0},{"$f":"IF(AND(BZ426<$CE$356,BZ425>=$CE$356),(($CE$356-BZ425)/(BZ426-BZ425)*(BA426-BA425)+BA425),0)","v":0},{"$f":"IF(AND(BA426>$CF$356,BA425<=$CF$356),(($CF$356-BA425)/(BA426-BA425)*(BY426-BY425)+BY425),0)","v":0},{"$f":"IF(AND(BF426<$CG$356,BF425>=$CG$356),(($CG$356-BF425)/(BF426-BF425)*(BA426-BA425)+BA425),0)","v":0},0,{"$f":"IF(AND(BF426>$CI$356,BF425<=$CI$356),(($CI$356-BF425)/(BF426-BF425)*(BA426-BA425)+BA425),0)","v":0},{"$f":"IF(AND(BX426>$CJ$356,BX425<=$CJ$356),(($CJ$356-BX425)/(BX426-BX425)*(BA426-BA425)+BA425),0)","v":0},0,{"$f":"IF(AND(BX426<$CL$356,BX425>=$CL$356),(($CL$356-BX425)/(BX426-BX425)*(BA426-BA425)+BA425),0)","v":0},0]
[null,null,null,null,null,null,null,null,null,null,null,null,null,null,null,null,null,null,null,null,null,null,null,null,null,null,null,null,null,null,null,null,null,null,null,null,null,null,null,null,null,null,null,null,null,null,null,null,null,null,null,66,6500,null,0.11126421913807862,-1.3447985905477067,11.021480191605104,-56.22932285563801,"19049.1087296476-88.9207607524977i","99843.481501626-4077.26886862953i",{"$f":"20*LOG(IMABS(IMDIV(BG426,IMSUM(BG426,BH426))))","v":-15.910837428865758},1.7394631256737307,-7.4170883337306977E-4,-0.74875737284935451,"960000-1360298.94190725i","-199068137.840085i","949990.820378404-1347305.74163353i","0.999995988369976-0.00200290137830046i",1.1165000000000001E-5,{"$f":"20*LOG(IMABS(IMPRODUCT(BQ426,IMPRODUCT(BO426,BP426)) ))","v":25.299196751619},-54.926948363566318,null,{"$f":"BC426+BE426","v":11.132744410743182},{"$f":"BD426+BF426","v":-57.574121446185714},{"$f":"BI426+BK426+BR426","v":9.3876176139198684},{"$f":"BJ426+BL426+BS426","v":-53.936242610741942},{"$f":"BU426+BW426","v":20.520362024663051},{"$f":"BV426+BX426","v":-111.51036405692766},{"$f":"BZ426+360","v":248.48963594307236},null,0,0,0,0,0,{"$f":"IF(AND(BF427<$CG$356,BF426>=$CG$356),(($CG$356-BF426)/(BF427-BF426)*(BY427-BY426)+BY426),0)","v":0},0,0,{"$f":"IF(AND(BX427>$CJ$356,BX426<=$CJ$356),(($CJ$356-BX426)/(BX427-BX426)*(BY427-BY426)+BY426),0)","v":0},0,{"$f":"IF(AND(BX427<$CL$356,BX426>=$CL$356),(($CL$356-BX426)/(BX427-BX426)*(BY427-BY426)+BY426),0)","v":0}]
[null,null,null,null,null,null,null,null,null,null,null,null,null,null,null,null,null,null,null,null,null,null,null,null,null,null,null,null,null,null,null,null,null,null,null,null,null,null,null,null,null,null,null,null,null,null,null,null,null,null,null,67,7000,null,0.11968119613436844,-1.4496702932748395,10.565953213267832,-58.15445026214541,"19049.042416787-95.760485913864i","99816.9293181983-4389.73710966864i",-15.909758074548911,1.8730483792407409,-8.6019495978119701E-4,-0.80634676058870847,"960000-1263134.73177102i","-184848985.137222i","949181.074242957-1251741.685173i","0.999995347461652-0.00215696933266678i",1.1165000000000001E-5,24.880257387264912,-52.950980010493026,null,10.685634409402201,-59.604120555420252,8.9696391177562198,-51.884278391840994,19.655273527158421,-111.48839894726125,248.51160105273874,null,0,0,0,0,0,0,0,0,0,0,0]
[null,null,null,null,null,null,null,null,null,null,null,null,null,null,null,null,null,null,null,null,null,null,null,null,null,null,null,null,null,null,null,null,null,null,null,null,null,null,null,null,null,null,null,null,null,null,null,null,null,null,null,68,7500,null,0.12807715326690616,-1.5547451888424346,10.12466764705529,-59.890108406538893,"19048.9711923769-102.600136998433i","99788.426033833-4701.94657500721i",-15.908599108764683,2.0065849172823964,-9.8745423575647665E-4,-0.86393451900367824,"960000-1178925.74965295i","-172525719.461407i","948526.889929012-1168965.14751531i","0.999994659079552-0.00231103697982941i",1.1165000000000001E-5,24.510100698645804,-51.075704458603866,null,10.252744800322196,-61.444853595381325,8.6005141356453638,-49.933054060325148,18.85325893596756,-111.37790765570648,248.62209234429352,null,0,0,0,0,0,0,0,0,0,0,0]
[null,null,null,null,null,null,null,null,null,null,null,null,null,null,null,null,null,null,null,null,null,null,null,null,null,null,null,null,null,null,null,null,null,null,null,null,null,null,null,null,null,null,null,null,null,null,null,null,null,null,null,69,8000,null,0.13645193680237472,-1.6600231595342856,9.6978053646654701,-61.460092865353928,"19048.8950565275-109.439708715992i","99757.9750032731-5013.87904458372i",-15.90736060429723,2.140069290403174,-1.1234858900022089E-3,-0.92152053181624027,"960000-1105242.89029964i","-161742861.995069i","947990.560499925-1096578.60141433i","0.999993923223873-0.00246510429784602i",1.1165000000000001E-5,24.181761583925685,-49.297885419148528,null,9.8342573014678454,-63.120116024888212,8.273277493738453,-48.079336660561594,18.107534795206298,-111.19945268544981,248.80054731455019,null,0,0,0,0,0,0,0,0,0,0,0]
[null,null,null,null,null,null,null,null,null,null,null,null,null,null,null,null,null,null,null,null,null,null,null,null,null,null,null,null,null,null,null,null,null,null,null,null,null,null,null,null,null,null,null,null,null,null,null,null,null,null,null,70,8500,null,0.1448053926620517,-1.7655040816938237,9.285251671916976,-62.884898370855765,"19048.8140093565-116.279195776536i","99725.5798073254-5325.51635256693i",-15.906042638873599,2.2734980554427424,-1.2682890981047879E-3,-0.97910468276955465,"960000-1040228.60263495i","-152228575.995359i","947545.131556643-1032748.60777359i","0.999993139894825-0.00261917126477439i",1.1165000000000001E-5,23.889469352629579,-47.613748173464046,null,9.430057064579028,-64.650402452549585,7.9821584246578752,-46.319354800790862,17.412215489236903,-110.96975725334045,249.03024274665955,null,0,0,0,0,0,0,0,8894.9295475901872,16.898767540105702,0,0]
[null,null,null,null,null,null,null,null,null,null,null,null,null,null,null,null,null,null,null,null,null,null,null,null,null,null,null,null,null,null,null,null,null,null,null,null,null,null,null,null,null,null,null,null,null,null,null,null,null,null,null,71,9000,null,0.15313736642809458,-1.8711878256843706,8.886695365762133,-64.182146401529565,"19048.7280509894-123.118592890278i","99691.244251811-5636.84039084765i",-15.904645295148118,2.4068677758814601,-1.4218629825673622E-3,-1.0366868556293298,"960000-982438.12471079i","-143771432.884506i","947170.921163685-976049.135449561i","0.999992309092629-0.00277323785867247i",1.1165000000000001E-5,23.628399859079764,-46.019168425355183,null,9.0398327321902272,-66.053334227213938,7.7223327009490781,-44.648987505103051,16.762165433139305,-110.70232173231699,249.29767826768301,null,0,0,0,0,0,0,0,0,0,0,0]
[null,null,null,null,null,null,null,null,null,null,null,null,null,null,null,null,null,null,null,null,null,null,null,null,null,null,null,null,null,null,null,null,null,null,null,null,null,null,null,null,null,null,null,null,null,null,null,null,null,null,null,72,9500,null,0.16144770334789324,-1.977074255849893,8.5016998590236312,-65.366986741139712,"19048.6371815592-129.957894767661i","99654.9723664519-5947.83311250667i",-15.903168660686513,2.5401750222439752,-1.5842066127962648E-3,-1.0942669341852329,"960000-930730.854989169i","-136204515.364269i","946853.286302333-925354.355293949i","0.999991430817524-0.00292730405759841i",1.1165000000000001E-5,23.39449028597712,-44.509822523606132,null,8.6631475623715239,-67.344060996989612,7.4897374186778123,-43.063914435547389,16.152884981049336,-110.407975432537,249.592024567463,null,0,0,0,0,0,0,0,0,0,0,0]
[null,null,null,null,null,null,null,null,null,null,null,null,null,null,null,null,null,null,null,null,null,null,null,null,null,null,null,null,null,null,null,null,null,null,null,null,null,null,null,null,null,null,null,null,null,null,null,null,null,null,null,73,10000,null,0.16973624834031226,-2.0831632304755683,8.1297532612245256,-66.452457822032486,"19048.5414012064-136.797096119375i","99616.7684036929-6258.47653525789i",-15.901612827948295,2.6734163725007809,-1.7553190051790997E-3,-1.1518448022523242,"960000-884194.312239711i","-129394289.596055i","946581.150507833-879763.593826671i","0.999990505069758-0.00308136983961052i",1.1165000000000001E-5,23.184297647740181,-43.081304933811495,null,8.2994895095648378,-68.535621052508048,7.2809295007867068,-41.559733363563041,15.580419010351545,-110.09535441607109,249.90464558392893,null,0,0,0,0,0,0,0,0,0,0,0]
[null,null,null,null,null,null,null,null,null,null,null,null,null,null,null,null,null,null,null,null,null,null,null,null,null,null,null,null,null,null,null,null,null,null,null,null,null,null,null,null,null,null,null,null,null,null,null,null,null,null,null,74,15000,null,0.25138880070909603,-3.1551573348565238,5.0073693971702804,-73.712504614294033,"19047.3135332931-205.182417279316i","99129.5566351816-9341.79618505903i",-15.881722396723873,4.0014588587179345,-3.9484705539835473E-3,-1.7274763663019259,"960000-589462.874826474i","-86262859.7307035i","945143.561727599-592290.718791492i","0.999978636660509-0.00462199990245747i",1.1165000000000001E-5,21.905650892997173,-32.338865257681029,null,5.2587581978793763,-76.867661949150559,6.0199800257193168,-30.064882765265018,11.278738223598694,-106.93254471441557,253.06745528558443,null,0,0,0,0,0,0,0,0,0,0,0]
[null,null,null,null,null,null,null,null,null,null,null,null,null,null,null,null,null,null,null,null,null,null,null,null,null,null,null,null,null,null,null,null,null,null,null,null,null,null,null,null,null,null,null,null,null,null,null,null,null,null,null,75,20000,null,0.33068935460640281,-4.2472035273747748,2.6575771117214559,-77.544995452351174,"19045.5947841288-273.551869978887i","98455.4129966396-12371.0128762776i",-15.854049368423551,5.3192178299780863,-7.0170232720752953E-3,-2.3027593203915679,"960000-442097.156119855i","-64697144.7980276i","944573.550878238-450285.752210738i","0.999962021360845-0.00616256413987119i",1.1165000000000001E-5,21.351057400174717,-25.840613625106432,null,2.9882664663278589,-81.792198979725953,5.4899910084790911,-22.824155115519915,8.4782574748069504,-104.61635409524587,255.38364590475413,null,0,0,0,0,0,0,0,0,0,0,0]
[null,null,null,null,null,null,null,null,null,null,null,null,null,null,null,null,null,null,null,null,null,null,null,null,null,null,null,null,null,null,null,null,null,null,null,null,null,null,null,null,null,null,null,null,null,null,null,null,null,null,null,76,25000,null,0.40747835427541929,-5.3590541639947666,0.79012743728226287,-79.880434948055338,"19043.3854195044-341.900171094631i","97602.0145608815-15329.7146104174i",-15.818763274543841,6.6234540693707533,-1.0959122209750897E-2,-2.8775781174755442,"960000-353677.724895884i","-51757715.8384221i","944236.391487542-366467.882990616i","0.999940659644007-0.00770304061490151i",1.1165000000000001E-5,21.067886999241598,-21.653120148789622,null,1.1976057915576821,-85.239489112050109,5.2381646024880055,-17.907244196894414,6.4357703940456874,-103.14673330894452,256.85326669105547,null,0,0,0,0,0,0,0,0,0,0,0]
[null,null,null,null,null,null,null,null,null,null,null,null,null,null,null,null,null,null,null,null,null,null,null,null,null,null,null,null,null,null,null,null,null,null,null,null,null,null,null,null,null,null,null,null,null,null,null,null,null,null,null,77,30000,null,0.48159438443602715,-6.4903929188698628,-0.75455096792027354,-81.438492806794443,"19040.6857809748-410.222042952937i","96578.8544214767-18202.7964299805i",-15.776076489662348,7.9110830627801692,-1.5772388839729808E-2,-3.4518177704787574,"960000-294731.437413237i","-43131429.8653518i","943975.476404037-311742.869328139i","0.999914552118394-0.00924340739476426i",1.1165000000000001E-5,20.905574132619105,-18.805173177115122,null,-0.2729565834842464,-87.928885725664301,5.1137252541170266,-14.345907884813711,4.8407686706327802,-102.27479361047801,257.72520638952199,null,0,0,0,0,0,0,0,0,0,0,0]
[null,null,null,null,null,null,null,null,null,null,null,null,null,null,null,null,null,null,null,null,null,null,null,null,null,null,null,null,null,null,null,null,null,null,null,null,null,null,null,null,null,null,null,null,null,null,null,null,null,null,null,78,35000,null,0.55287494546459637,-7.6408315455436382,-2.0698066606205541,-82.543450801570131,"19037.4962857271-478.512214686985i","95396.9860161616-20976.6894520739i",-15.726240341539226,9.1792053941860523,-2.1453925825840089E-2,-4.0253639891185085,"960000-252626.946354203i","-36969797.0274444i","943737.161490872-273641.507496256i","0.999883699527513-0.0107836425518818i",1.1165000000000001E-5,20.804279946758495,-16.78770043494276,null,-1.5169317151559576,-90.184282347113765,5.0565856793934287,-11.633859029875216,3.5396539642374711,-101.81814137698898,258.18185862301101,null,0,0,0,0,0,0,0,0,0,0,0]
[null,null,null,null,null,null,null,null,null,null,null,null,null,null,null,null,null,null,null,null,null,null,null,null,null,null,null,null,null,null,null,null,null,null,null,null,null,null,null,null,null,null,null,null,null,null,null,null,null,null,null,79,40000,null,0.62115730911570122,-8.8099070325421689,-3.2141793339201286,-83.361893188870468,"19033.8174264196-546.765423589999i","94068.7382362051-23639.5343658365i",-15.669540671287567,10.425132257001698,-2.8000322810573616E-2,-4.5981033146385952,"960000-221048.578059928i","-32348572.3990138i","943499.056206316-245929.034152409i","0.999848102749932-0.0123237241649231i",1.1165000000000001E-5,20.736819830480279,-15.315608319442525,null,-2.5930220248044273,-92.171800221412639,5.0392788363821381,-9.4885793770794216,2.4462568115777108,-101.66037959849206,258.33962040150794,null,0,0,0,0,0,0,0,0,0,0,0]
[null,null,null,null,null,null,null,null,null,null,null,null,null,null,null,null,null,null,null,null,null,null,null,null,null,null,null,null,null,null,null,null,null,null,null,null,null,null,null,null,null,null,null,null,null,null,null,null,null,null,null,80,45000,null,0.68627945097567034,-9.9970792371277533,-4.2265659478416371,-83.987890736443532,"19029.6497709914-614.976416464082i","92607.414312705-26181.2966422932i",-15.606292999651941,11.64640567240914,-3.5407663196936022E-2,-5.1699232520640095,"960000-196487.624942158i","-28754286.5769012i","943250.481970952-225141.560977756i","0.999807762799213-0.0138636303198436i",1.1165000000000001E-5,20.689512875434318,-14.219008409641338,null,-3.5402864968659666,-93.984969973571282,5.0478122125854394,-7.7425259892962082,1.5075257157194728,-101.72749596286749,258.27250403713253,null,0,0,0,0,0,0,0,0,0,0,0]
[null,null,null,null,null,null,null,null,null,null,null,null,null,null,null,null,null,null,null,null,null,null,null,null,null,null,null,null,null,null,null,null,null,null,null,null,null,null,null,null,null,null,null,null,null,null,null,null,null,null,null,81,50000,null,0.74808105377596579,-11.201729081461254,-5.1340430152724803,-84.478490495249744,"19024.9939624434-683.139950963927i","91026.9871665936-28593.8238746673i",-15.536837458562228,12.840813238018168,-4.3671531896911836E-2,-5.7407123995982854,"960000-176838.862447942i","-25878857.919211i","942985.833128035-209200.641265914i","0.999762680823843-0.0154033391109241i",1.1165000000000001E-5,20.654900569592243,-13.391127373836417,null,-4.3859619614965144,-95.680219576710996,5.0743915791331027,-6.2910265354165347,0.68842961763658828,-101.97124611212753,258.02875388787248,null,54755.143242447964,-102.34017384920857,0,0,0,0,0,0,0,0,0]
[null,null,null,null,null,null,null,null,null,null,null,null,null,null,null,null,null,null,null,null,null,null,null,null,null,null,null,null,null,null,null,null,null,null,null,null,null,null,null,null,null,null,null,null,null,null,null,null,null,null,null,82,55000,null,0.80640457351795469,-12.423157393592049,-5.9561816798011229,-84.870262922609754,"19019.8507185913-751.250796934711i","89341.8028309441-30870.8484831198i",-15.46153364204052,14.006397449875539,-5.2787024014203487E-2,-6.3103605748011686,"960000-160762.602225402i","-23526234.47201i","942701.948488575-196783.525437557i","0.999712858107148-0.0169428286418081i",1.1165000000000001E-5,20.628648441921822,-12.76178761696988,null,-5.1497771062831683,-97.293420316201804,5.114327775867098,-5.065750741895509,-3.5449330416070346E-2,-102.35917105809732,257.64082894190267,null,0,0,0,0,0,0,0,0,0,0,0]
[null,null,null,null,null,null,null,null,null,null,null,null,null,null,null,null,null,null,null,null,null,null,null,null,null,null,null,null,null,null,null,null,null,null,null,null,null,null,null,null,null,null,null,null,null,null,null,null,null,null,null,83,60000,null,0.86109635811311369,-13.66058447130272,-6.7075713730629527,-85.187717636887001,"19014.2208317884-819.303737743337i","87566.3018795051-33007.9413041086i",-15.380755518464559,15.141459835469716,-6.2748754426021736E-2,-6.8787589372021039,"960000-147365.718706618i","-21565714.9326759i","942396.945786277-187008.288143581i","0.999658296067207-0.0184820770265398i",1.1165000000000001E-5,20.608103012240552,-12.283095681770405,null,-5.8464750149498386,-98.848302108189728,5.1645987393499713,-4.0203947835027929,-0.6818762755998673,-102.86869689169252,257.13130310830746,null,0,0,0,0,0,0,0,0,0,0,0]
[null,null,null,null,null,null,null,null,null,null,null,null,null,null,null,null,null,null,null,null,null,null,null,null,null,null,null,null,null,null,null,null,null,null,null,null,null,null,null,null,null,null,null,null,null,null,null,null,null,null,null,84,65000,null,0.91200780601435316,-14.913150439642928,-7.3993705226932329,-85.447889785310252,"19008.1051686218-887.293571602495i","85714.7667324462-35002.4232387074i",-15.294886528712128,16.244560296043332,-7.3550868225104787E-2,-7.4458001070235529,"960000-136029.894190725i","-19906813.7840085i","942069.657415314-179264.281092217i","0.99959899625675-0.020021062390599i",1.1165000000000001E-5,20.591568318425967,-11.921308275559202,null,-6.4873627166788799,-100.36104022495319,5.2231309214887336,-3.1225480865394228,-1.2642317951901463,-103.48358831149261,256.51641168850739,null,0,0,0,0,0,0,0,0,0,0,0]
[null,null,null,null,null,null,null,null,null,null,null,null,null,null,null,null,null,null,null,null,null,null,null,null,null,null,null,null,null,null,null,null,null,null,null,null,null,null,null,null,null,null,null,null,null,null,null,null,null,null,null,85,{"$f":"BA427*10","v":70000},null,0.95899655017586916,-16.17991646288182,-8.0403000107153542,-85.662984041394722,"19001.5046695792-955.215112886692i","83801.1004704235-36853.243127271i",-15.204314973639299,17.314512178151915,-8.5187051979968148E-2,-8.0113782797100708,"960000-126313.473177102i","-18484898.5137222i","941719.337397391-173115.248871457i","0.999534960363042-0.0215597628719374i",1.1165000000000001E-5,20.577920377939446,-11.651996034680812,null,-7.0813034605394849,-101.84290050427654,5.2884183523201784,-2.3488621362389672,-1.7928851082193065,-104.19176264051551,255.80823735948451,null,0,0,0,0,0,0,0,0,0,0,0]
[null,null,null,null,null,null,null,null,null,null,null,null,null,null,null,null,null,null,null,null,null,null,null,null,null,null,null,null,null,null,null,null,null,null,null,null,null,null,null,null,null,null,null,null,null,null,null,null,null,null,null,86,75000,null,1.0019276507350545,-17.459866858588196,-8.6373026118313927,-85.841971623758141,"18994.4203486886-1023.06319343963i","81838.6405626614-38560.8303843798i",-15.109429771413847,18.35037367558871,-9.765054576900857E-2,-8.5753893359796614,"960000-117892.574965295i","-17252571.9461407i","941345.500193221-168241.198421356i","0.999466190207771-0.0230981566220108i",1.1165000000000001E-5,20.56639091997258,-11.457053183932311,null,-7.6353749610963382,-103.30183848234634,5.3593106027897246,-1.682068844323263,-2.2760643583066136,-104.98390732666961,255.01609267333038,null,0,0,0,0,0,0,0,0,0,0,0]
[null,null,null,null,null,null,null,null,null,null,null,null,null,null,null,null,null,null,null,null,null,null,null,null,null,null,null,null,null,null,null,null,null,null,null,null,null,null,null,null,null,null,null,null,null,null,null,null,null,null,null,87,80000,null,1.0406747781495864,-18.751912145746836,-9.1959942368044842,-85.991593612449265,"18986.8532931302-1090.83266387223i","79840.0088590708-40126.9307506537i",-15.010616642075579,19.351436205239963,-0.11093415594124469,-9.1377309471386585,"960000-110524.289029964i","-16174286.1995069i","940947.827671039-164402.067456718i","0.999392687746913-0.0246362218068126i",1.1165000000000001E-5,20.556440654028812,-11.322784416258829,null,-8.1553194586548976,-104.74350575819611,5.4348898560119885,-1.1090791581575239,-2.7204296026429091,-105.85258491635363,254.14741508364637,null,0,0,0,0,0,0,0,0,0,0,0]
[null,null,null,null,null,null,null,null,null,null,null,null,null,null,null,null,null,null,null,null,null,null,null,null,null,null,null,null,null,null,null,null,null,null,null,null,null,null,null,null,null,null,null,null,null,null,null,null,null,null,null,88,85000,null,1.0751213672451891,-20.054893040529009,-9.7209809487668579,-86.117012820241797,"18978.8046628203-1158.51839485059i","77816.9974213063-41554.4329092753i",-14.908254754633237,20.317210408276445,-0.12503026855447191,-9.6983026754238555,"960000-104022.860263495i","-15222857.5995359i","940526.113174807-161414.215811842i","0.999314455070595-0.0261739366079038i",1.1165000000000001E-5,20.547682160120363,-11.238643869027122,null,-8.6458595815216697,-106.17190586077081,5.5143971369326543,-0.6197361361745326,-3.1314624445890153,-106.79164199694534,253.20835800305466,null,0,0,0,0,0,0,0,0,0,0,0]
[null,null,null,null,null,null,null,null,null,null,null,null,null,null,null,null,null,null,null,null,null,null,null,null,null,null,null,null,null,null,null,null,null,null,null,null,null,null,null,null,null,null,null,null,null,null,null,null,null,null,null,89,90000,null,1.1051617218284064,-21.367585392992765,-10.216086856997237,-86.222249811583183,"18970.2756899693-1226.11527837332i","75780.4883379985-42847.1927997749i",-14.802713852060734,21.247410407016975,-0.13993086343990743,-10.25700606916328,"960000-98243.812471079i","-14377143.2884506i","940080.22669391-159134.753020189i","0.999231494402948-0.0277112792234429i",1.1165000000000001E-5,20.539831411338028,-11.196381802213979,null,-9.1109251351688307,-107.58983520457595,5.5971866958373866,-0.2059774643602843,-3.5137384393314441,-107.79581266893624,252.20418733106376,null,0,0,0,0,0,0,0,0,0,0,0]
[null,null,null,null,null,null,null,null,null,null,null,null,null,null,null,null,null,null,null,null,null,null,null,null,null,null,null,null,null,null,null,null,null,null,null,null,null,null,null,null,null,null,null,null,null,null,null,null,null,null,null,90,95000,null,1.1307020492634323,-22.688706036193267,-10.6845212888137,-86.310482038761549,"18961.267678612-1293.61822903742i","73740.404608453-44009.8613621892i",-14.694351852381821,22.141936904308537,-0.15562752884044845,-10.813744752569102,"960000-93073.0854989169i","-13620451.5364269i","939610.092498576-157450.815097357i","0.999143808101944-0.0292482278692132i",1.1165000000000001E-5,20.532676409769699,-11.189453572225421,null,-9.5538192395502683,-108.99918807495482,5.6826970285474303,0.13873857951401369,-3.871122211002838,-108.8604494954408,251.1395505045592,null,0,0,0,0,0,0,0,0,0,0,0]
[null,null,null,null,null,null,null,null,null,null,null,null,null,null,null,null,null,null,null,null,null,null,null,null,null,null,null,null,null,null,null,null,null,null,null,null,null,null,null,null,null,null,null,null,null,null,null,null,null,null,null,91,100000,null,1.1516614047646365,-24.016919496661913,-11.12900363533827,-86.384253706816253,"18951.7820041117-1361.02218529221i","71705.6884761569-45047.7202702373i",-14.583512909984083,23.000859652939358,-0.17211147656914741,-11.368424510004861,"960000-88419.4312239711i","-12939428.9596055i","939115.674386721-156272.058307346i","0.999051398659236-0.0307847607796489i",1.1165000000000001E-5,20.526056372950361,-11.212601703247874,null,-9.9773422305736332,-110.40117320347817,5.7704319863971296,0.41983343968662368,-4.2069102441765036,-109.98133976379154,250.01866023620846,null,0,0,0,0,0,0,0,0,0,0,0]
[null,null,null,null,null,null,null,null,null,null,null,null,null,null,null,null,null,null,null,null,null,null,null,null,null,null,null,null,null,null,null,null,null,null,null,null,null,null,null,null,null,null,null,null,null,null,null,null,null,null,null,92,150000,null,1.1019258231489157,-37.374612764809356,-14.644176792522606,-86.644334406807914,"18831.0062457132-2028.52301168023i","52968.6957101873-49912.3844320677i",-13.402809915295828,29.734173291561262,-0.37808125395274883,-16.782938087752154,"960000-58946.2874826474i","-8626285.97307035i","932842.791659988-160982.130861256i","0.997868174798587-0.0461224513954321i",1.1165000000000001E-5,20.471523964872368,-12.43757147992677,null,-13.54225096937369,-124.01894717161727,6.6906327956237917,0.51366372388233827,-6.8516181737498982,-123.50528344773494,236.49471655226506,null,0,0,0,0,0,0,0,0,0,0,0]
[null,null,null,null,null,null,null,null,null,null,null,null,null,null,null,null,null,null,null,null,null,null,null,null,null,null,null,null,null,null,null,null,null,null,null,null,null,null,null,null,null,null,null,null,null,null,null,null,null,null,null,93,200000,null,0.61344225101937144,-49.916210873715976,-17.138392492975928,-86.491663250238801,"18664.4834354485-2680.77967835985i","38782.6735516292-48723.1684193641i",-12.230721412183161,33.648821851433453,-0.65095309481955144,-21.906236645349484,"960000-44209.7156119855i","-6469714.47980276i","924214.058207786-179432.182847694i","0.996216362128817-0.0613948039791861i",1.1165000000000001E-5,20.416849653333099,-14.513612732842819,null,-16.524950241956557,-136.40787412395477,7.5351751463303867,-2.77102752675885,-8.9897750956261699,-139.17890165071361,220.82109834928639,null,0,0,0,0,0,0,0,0,0,0,0]
[null,null,null,null,null,null,null,null,null,null,null,null,null,null,null,null,null,null,null,null,null,null,null,null,null,null,null,null,null,null,null,null,null,null,null,null,null,null,null,null,null,null,null,null,null,null,null,null,null,null,null,94,250000,null,-0.18773263373741317,-60.70482587670687,-19.072038578801319,-86.174041840740898,"18454.6615628527-3313.30370458735i","28850.0524533976-45301.8390335871i",-11.168778884599202,35.60441301314637,-0.97833822533466497,-26.686610871056637,"960000-35367.7724895884i","-5175771.58384221i","913355.477365307-202657.58923735i","0.994100621451828-0.0765805189386789i",1.1165000000000001E-5,20.35298936541508,-16.915339794871802,null,-19.25977121253873,-146.87886771744778,8.2058722554812125,-7.9975376527820679,-11.053898957057518,-154.87640537022983,205.12359462977017,null,0,0,0,0,0,0,0,0,0,0,0]
[null,null,null,null,null,null,null,null,null,null,null,null,null,null,null,null,null,null,null,null,null,null,null,null,null,null,null,null,null,null,null,null,null,null,null,null,null,null,null,null,null,null,null,null,null,null,null,null,null,null,null,95,300000,null,-1.1514831774587031,-69.492094136139855,-20.650600228246091,-85.774243629555983,"18204.5323101185-3922.07535020685i","21973.2698723097-41399.7797548135i",-10.244043141438951,36.284787322810075,-1.3476117721412053,-31.097784032425064,"960000-29473.1437413237i","-4313142.98653517i","900426.854116522-227538.463424823i","0.991526888770507-0.0916587017995886i",1.1165000000000001E-5,20.278023393647693,-19.463313756895211,null,-21.802083405704796,-155.26633776569582,8.6863684800675376,-14.2763104665102,-13.115714925637258,-169.54264823220603,190.45735176779397,null,0,0,339258.9888626195,-14.718904172842516,0,0,0,0,0,0,0]
[null,null,null,null,null,null,null,null,null,null,null,null,null,null,null,null,null,null,null,null,null,null,null,null,null,null,null,null,null,null,null,null,null,null,null,null,null,null,null,null,null,null,null,null,null,null,null,null,null,null,null,96,350000,null,-2.1658359296360601,-76.479595862938424,-21.983789433217019,-85.327823478481946,"17917.5288191405-4503.61553236007i","17144.7182174404-37681.2055719155i",-9.4524844862880268,36.158921302901348,-1.7470424484591007,-35.134694854019919,"960000-25262.6946354203i","-3696979.70274444i","885612.306309309-252647.157352173i","0.988502333966561-0.106608956984031i",1.1165000000000001E-5,20.191625682905752,-22.077872434396383,null,-24.149625362853079,-161.80741934142037,8.9920987481586234,-21.053645985514954,-15.157526614694456,-182.86106532693532,177.13893467306468,null,0,0,0,0,0,0,0,0,0,0,0]
[null,null,null,null,null,null,null,null,null,null,null,null,null,null,null,null,null,null,null,null,null,null,null,null,null,null,null,null,null,null,null,null,null,null,null,null,null,null,null,null,null,null,null,null,null,null,null,null,null,null,null,97,400000,null,{"$f":"20*LOG(IMABS(IMDIV(1,IMSUM(1,IMSUM(COMPLEX(0,2*pi*BA457/Wsh),COMPLEX(-BA457/(fsw_sh),0))))))","v":-3.1661770216090939},{"$f":"180/pi*IMARGUMENT(IMDIV(1,IMSUM(1,IMSUM(COMPLEX(0,2*pi*BA457/Wsh),COMPLEX(-BA457/(fsw_sh),0)))))","v":-82.015468350159793},{"$f":"20*LOG(IMABS(IMPRODUCT(A_INTCOMP2VOUT,IMDIV(COMPLEX(1, 2*pi*BA457/Wesr_zero),COMPLEX(1, 2*pi*BA457/Wload_pole)))))","v":-23.137127746752668},{"$f":"180/pi*IMARGUMENT(IMPRODUCT(A_INTCOMP2VOUT,IMDIV(COMPLEX(1, 2*pi*BA457/Wesr_zero),COMPLEX(1, 2*pi*BA457/Wload_pole))))","v":-84.85261749700058},{"$f":"IMDIV(IMPRODUCT(COMPLEX(R.fb_bot,0),IMDIV(COMPLEX(1,0),COMPLEX(0,2*pi*BA457*C.fb_bot))),IMSUM(COMPLEX(R.fb_bot,0),IMDIV(COMPLEX(1,0),COMPLEX(0,2*pi*BA457*C.fb_bot))) )","v":"17597.4149903187-5055.03328403023i"},{"$f":"IMSUM(COMPLEX(R.fb_top1,0),IMDIV(IMPRODUCT(COMPLEX(R.fb_top2,0),IMDIV(COMPLEX(1,0),COMPLEX(0,2*pi*BA457*C.fb_top))),IMSUM(COMPLEX(R.fb_top2,0),IMDIV(COMPLEX(1,0),COMPLEX(0,2*pi*BA457*C.fb_top))) ))","v":"13677.6547594377-34350.5558808091i"},-8.7794721033534113,{"$f":"180/pi*IMARGUMENT(IMDIV(BG457,IMSUM(BG457,BH457)))","v":35.534757906670293},{"$f":"20*LOG(IMABS(IMDIV(A.fb_buf,IMSUM(COMPLEX(1,0),COMPLEX(0,2*pi*BA457*R.fb_buf*C.fb_buf)))))","v":-2.1664458333088223},{"$f":"180/pi*IMARGUMENT(IMDIV(A.fb_buf,IMSUM(COMPLEX(1,0),COMPLEX(0,2*pi*BA457*R.fb_buf*C.fb_buf))))","v":-38.80790355612956},{"$f":"IMSUM(COMPLEX(R.comp,0),IMDIV(COMPLEX(1,0),COMPLEX(0,2*pi*BA457*C.comp)))","v":"960000-22104.8578059928i"},{"$f":"IMDIV(COMPLEX(1,0),COMPLEX(0,2*pi*BA457*C.hf))","v":"-3234857.23990138i"},{"$f":"IMDIV(COMPLEX(1,0),IMSUM(IMDIV(COMPLEX(1,0),BM457),IMSUM(IMDIV(COMPLEX(1,0),BN457),IMDIV(COMPLEX(1,0),COMPLEX(R.eaout,0)))))","v":"869113.37042527-277211.633643069i"},{"$f":"IMDIV(IMDIV(COMPLEX(1,0),COMPLEX(0,2*pi*BA457*0.00000000000226)),IMSUM(COMPLEX(21700,0),IMDIV(COMPLEX(1,0),COMPLEX(0,2*pi*BA457*0.00000000000226))) )","v":"0.985035311402789-0.121411476773819i"},{"$f":"GM*A.comp_buffer","v":1.1165000000000001E-5},20.093992307040139,{"$f":"180/pi*IMARGUMENT(IMPRODUCT(BQ457,IMPRODUCT(BO457,BP457)) )","v":-24.717168679610459},null,-26.303304768361762,-166.86808584716039,9.1480743703779055,-27.990314329069726,-17.155230397983857,-194.85840017623011,165.14159982376989,null,{"$f":"IF(AND(BY458<$CC$356,BY457>=$CC$356),(($CC$356-BY457)/(BY458-BY457)*(BA458-BA457)+BA457),0)","v":0},{"$f":"IF(AND(BA458>$CD$356,BA457<=$CD$356),(($CD$356-BA457)/(BA458-BA457)*(BZ458-BZ457)+BZ457),0)","v":0},{"$f":"IF(AND(BZ458<$CE$356,BZ457>=$CE$356),(($CE$356-BZ457)/(BZ458-BZ457)*(BA458-BA457)+BA457),0)","v":0},{"$f":"IF(AND(BA458>$CF$356,BA457<=$CF$356),(($CF$356-BA457)/(BA458-BA457)*(BY458-BY457)+BY457),0)","v":0},{"$f":"IF(AND(BF458<$CG$356,BF457>=$CG$356),(($CG$356-BF457)/(BF458-BF457)*(BA458-BA457)+BA457),0)","v":0},0,{"$f":"IF(AND(BF458>$CI$356,BF457<=$CI$356),(($CI$356-BF457)/(BF458-BF457)*(BA458-BA457)+BA457),0)","v":0},{"$f":"IF(AND(BX458>$CJ$356,BX457<=$CJ$356),(($CJ$356-BX457)/(BX458-BX457)*(BA458-BA457)+BA457),0)","v":0},0,{"$f":"IF(AND(BX458<$CL$356,BX457>=$CL$356),(($CL$356-BX457)/(BX458-BX457)*(BA458-BA457)+BA457),0)","v":0},0]
[null,null,null,null,null,null,null,null,null,null,null,null,null,null,null,null,null,null,null,null,null,null,null,null,null,null,null,null,null,null,null,null,null,null,null,null,null,null,null,null,null,null,null,null,null,null,null,null,null,null,null,98,450000,null,-4.1214572273779897,-86.432793975375176,-24.152891889955526,-84.358583516098847,"17248.1725022308-5574.04862602661i","11128.0583676029-31435.562900875i",-8.2081644025827281,34.612541073049918,-2.5974294836846301,-42.138126251988076,"960000-19648.7624942158i","-2875428.65769012i","851142.54580334-300770.174719221i","0.981135303077806-0.136047124674607i",1.1165000000000001E-5,19.98554049529303,-27.356463963419028,null,-28.274349117333514,-170.79137749147401,9.1799466090256718,-34.882049142357189,-19.094402508307844,-205.67342663383118,154.32657336616882,null,0,0,0,0,0,0,0,0,0,0,0]
[null,null,null,null,null,null,null,null,null,null,null,null,null,null,null,null,null,null,null,null,null,null,null,null,null,null,null,null,null,null,null,null,null,null,null,null,null,null,null,null,null,null,null,null,null,null,null,null,null,null,null,99,500000,null,-5.0197616674125731,-90.000018723972232,-25.059955259597103,-83.851738827507745,"16873.8912084769-6058.99231058104i","9209.97031086148-28902.5531288399i",-7.7226581188193952,33.522441084955439,-3.0333584536726681,-45.151710565770642,"960000-17683.8862447942i","-2587885.7919211i","831917.20624381-323032.617534328i","0.976812855043953-0.150497512487197i",1.1165000000000001E-5,19.866798727548755,-29.979835831443648,null,-30.079716927009677,-173.85175755147998,9.1107821550566914,-41.609105312258848,-20.968934771952988,-215.46086286373884,144.53913713626116,null,0,0,0,0,0,0,0,0,0,526101.72369349457,-21.913132617505731]
[null,null,null,null,null,null,null,null,null,null,null,null,null,null,null,null,null,null,null,null,null,null,null,null,null,null,null,null,null,null,null,null,null,null,null,null,null,null,null,null,null,null,null,null,null,null,null,null,null,null,null,100,550000,null,-5.8588992505548543,-92.919903809383996,-25.878916439234288,-83.335950460779159,"16478.6676504844-6508.7851571558i","7736.65185366888-26701.3864152984i",-7.3089984217724666,32.349055781709282,-3.4691659567887752,-47.877297715110245,"960000-16076.2602225402i","-2352623.447201i","811654.054399685-343816.034336286i","0.972079507867829-0.164745070491557i",1.1165000000000001E-5,19.738356612385182,-32.576401235973208,null,-31.737815689789144,-176.25585427016316,8.9601922338239408,-48.104643169374171,-22.777623455965205,-224.36049743953731,135.63950256046269,null,0,0,0,0,0,0,0,0,0,0,0]
[null,null,null,null,null,null,null,null,null,null,null,null,null,null,null,null,null,null,null,null,null,null,null,null,null,null,null,null,null,null,null,null,null,null,null,null,null,null,null,null,null,null,null,null,null,null,null,null,null,null,null,101,600000,null,-6.6411972033729167,-95.342245303089456,-26.624987762833989,-82.813830419723772,"16066.5152712164-6922.900565145i","6583.66057800507-24782.1113790914i",-6.9553411320510072,31.147128840186074,-3.9011018522913234,-50.343582452109693,"960000-14736.5718706618i","-2156571.49326759i","790564.287781852-363010.991790793i","0.966947721966524-0.178773110255077i",1.1165000000000001E-5,19.600837101581391,-35.13841781489257,null,-33.266184966206907,-178.15607572281323,8.7443941172390609,-54.334871426816193,-24.521790848967846,-232.49094714962942,127.50905285037058,null,0,0,0,0,0,0,0,0,0,0,0]
[null,null,null,null,null,null,null,null,null,null,null,null,null,null,null,null,null,null,null,null,null,null,null,null,null,null,null,null,null,null,null,null,null,null,null,null,null,null,null,null,null,null,null,null,null,null,null,null,null,null,null,102,650000,null,-7.3708306509200492,-97.377415537218184,-27.309724121381386,-82.287217741894779,"15641.2886745224-7301.31423903991i","5666.22872891477-23100.4318024074i",-6.6517968357425943,29.951692013444539,-4.3264762536441124,-52.577945088108315,"960000-13602.9894190725i","-1990681.37840085i","768849.58844103-380561.670469276i","0.961430798690782-0.192565879686893i",1.1165000000000001E-5,19.454878515762868,-37.660248153236992,null,-34.680554772301434,-179.66463327911296,8.4766054263761603,-60.286501227900771,-26.203949345925274,-239.95113450701373,120.04886549298627,null,0,0,0,0,0,0,0,0,0,0,0]
[null,null,null,null,null,null,null,null,null,null,null,null,null,null,null,null,null,null,null,null,null,null,null,null,null,null,null,null,null,null,null,null,null,null,null,null,null,null,null,null,null,null,null,null,null,null,null,null,null,null,null,103,700000,null,-8.0525145665867637,-99.107269840988494,-27.94210945810876,-81.757453941985432,"15206.6230791763-7644.4452340955i","4925.35353794902-21618.8494927892i",-6.3901747764520733,28.784685014420379,-4.7434278237108805,-54.605711592833934,"960000-12631.3473177102i","-1848489.85137222i","746698.984243446-396452.814921021i","0.955542798048694-0.206108610072376i",1.1165000000000001E-5,19.30112166512307,-40.13775274742823,null,-35.994624024695526,-180.86472378297393,8.1675190649601159,-65.958779325841789,-27.827104959735408,-246.82350310881571,113.17649689118429,null,0,0,0,0,0,0,0,0,0,0,0]
[null,null,null,null,null,null,null,null,null,null,null,null,null,null,null,null,null,null,null,null,null,null,null,null,null,null,null,null,null,null,null,null,null,null,null,null,null,null,null,null,null,null,null,null,null,null,null,null,null,null,null,104,750000,null,-8.6908934187392664,-100.5931681541032,-28.529267606847309,-81.225548250316024,"14765.8890641328-7953.09219371361i","4319.11883451344-20306.2398863351i",-6.1637152256287493,27.659326807168338,-5.150728262339026,-56.44983366292999,"960000-11789.2574965295i","-1725257.19461407i","724286.571873212-410700.342102131i","0.949298453970497-0.219387554933549i",1.1165000000000001E-5,19.140200103883487,-42.567909908785573,null,-37.220161025586577,-181.81871640441921,7.8257566159157115,-71.358416764547229,-29.394404409670866,-253.17713316896644,106.82286683103356,null,0,0,0,0,0,0,0,0,0,0,0]
[null,null,null,null,null,null,null,null,null,null,null,null,null,null,null,null,null,null,null,null,null,null,null,null,null,null,null,null,null,null,null,null,null,null,null,null,null,null,null,null,null,null,null,null,null,null,null,null,null,null,null,105,800000,null,-9.2902795221935808,-101.88168104200427,-29.076943296994024,-80.692280858052612,"14322.1618534742-8228.36819026099i","3817.17760857323-19136.9579482765i",-5.9668444546032617,26.583030541302964,-5.5476243114341095,-58.13083152612149,"960000-11052.4289029964i","-1617428.61995069i","701770.045763512-423344.101488589i","0.942713088007162-0.232390020670345i",1.1165000000000001E-5,18.97273261298626,-44.948562562323474,null,-38.367222819187603,-182.57396190005687,7.4582638469488884,-76.496363547141996,-30.908958972238715,-259.07032544719885,100.92967455280115,null,0,0,0,0,0,0,0,0,0,0,0]
[null,null,null,null,null,null,null,null,null,null,null,null,null,null,null,null,null,null,null,null,null,null,null,null,null,null,null,null,null,null,null,null,null,null,null,null,null,null,null,null,null,null,null,null,null,null,null,null,null,null,null,106,850000,null,-9.8545621496077516,-103.00861048149669,-29.589837103995521,-80.158269695471986,"13878.2037715305-8471.63698791855i","3397.17302999683-18089.8966792114i",-5.7949630709518836,25.559361984012718,-5.9337137011457397,-59.666889502796316,"960000-10402.2860263495i","-1522285.75995359i","679289.944849376-434442.041487109i","0.935802522333697-0.245104389041869i",1.1165000000000001E-5,18.799317432884429,-47.278239668351191,null,-39.444399253603272,-183.16688017696868,7.0706406607868058,-81.385767187134789,-32.373758592816465,-264.55264736410345,95.44735263589655,null,0,0,0,0,0,0,0,0,0,0,0]
[null,null,null,null,null,null,null,null,null,null,null,null,null,null,null,null,null,null,null,null,null,null,null,null,null,null,null,null,null,null,null,null,null,null,null,null,null,null,null,null,null,null,null,null,null,null,null,null,null,null,null,107,900000,null,-10.387197696580984,-104.00182844326504,-30.07184452764314,-79.624014925683028,"13436.4581069083-8684.45289955086i","3042.37010014241-17147.6453657639i",-5.644268587039428,24.589362176577435,-6.3088496655408646,-61.074031658321871,"960000-9824.3812471079i","-1437714.32884506i","656969.509929712-444065.397164263i","0.928582992893676-0.257520131644692i",1.1165000000000001E-5,18.620527947307654,-49.556023753715145,null,-40.45904222422412,-183.62584336894807,6.6674096947273611,-86.040693235459571,-33.791632529496759,-269.66653660440761,90.333463395592389,null,0,0,0,0,0,0,0,0,0,0,0]
[null,null,null,null,null,null,null,null,null,null,null,null,null,null,null,null,null,null,null,null,null,null,null,null,null,null,null,null,null,null,null,null,null,null,null,null,null,null,null,null,null,null,null,null,null,null,null,null,null,null,null,108,950000,null,-10.891235981271674,-104.88329584119978,-30.526230350184118,-79.089929365221181,"12999.0524339495-8868.50577387201i","2740.05810158706-16295.7845138142i",-5.5116091558159077,23.672443366739376,-6.6730684876822446,-62.366331820964682,"960000-9307.30854989169i","-1362045.15364269i","634915.036797078-452294.687447802i","0.921071063475866-0.2696278166349i",1.1165000000000001E-5,18.436909596257966,-51.781448416007656,null,-41.417466331455792,-183.97322520642098,6.2522319527598142,-90.475336870232951,-35.165234378695978,-274.44856207665396,85.551437923346043,null,0,0,0,0,0,0,0,0,0,0,0]
[null,null,null,null,null,null,null,null,null,null,null,null,null,null,null,null,null,null,null,null,null,null,null,null,null,null,null,null,null,null,null,null,null,null,null,null,null,null,null,null,null,null,null,null,null,null,null,null,null,null,null,109,1000000,null,-11.36936042265194,-105.67051317808087,-30.955758221342368,-78.5563597586481,"12567.8094145911-9025.5720702527i","2480.45330571766-15522.3126832323i",-5.3943641469628298,22.806996324091536,-7.0265351014652673,-63.556130595709391,"960000-8841.94312239711i","-1293942.89596055i","613216.611752319-459216.392758729i","0.913283541458634-0.281419108021132i",1.1165000000000001E-5,18.248977832406162,-53.954416354949174,null,-42.325118643994308,-184.22687293672897,5.8280785839780656,-94.703550626567022,-36.497040060016246,-278.93042356329602,81.069576436703983,null,0,0,0,0,0,0,0,0,0,0,0]
[null,null,null,null,null,null,null,null,null,null,null,null,null,null,null,null,null,null,null,null,null,null,null,null,null,null,null,null,null,null,null,null,null,null,null,null,null,null,null,null,null,null,null,null,null,null,null,null,null,null,null,110,1500000,null,-15.130883264179079,-110.50794331180462,-34.277574528473693,-73.299326794988602,"8817.53545416543-9498.46935511088i","1123.25843014602-10492.2113342379i",-4.7238738441131014,16.431054252189377,-10.041417550747472,-71.655894535897332,"960000-5894.62874826474i","-862628.597307035i","426394.148741881-475682.623420223i","0.823968954369897-0.380846578827322i",1.1165000000000001E-5,16.223799230139285,-72.934328831196851,null,-49.408457792652769,-183.80727010679323,1.4585078352787129,-128.15916911490481,-47.949949957374059,-311.96643922169801,48.03356077830199,null,0,0,0,0,0,0,0,0,0,0,0]
[null,null,null,null,null,null,null,null,null,null,null,null,null,null,null,null,null,null,null,null,null,null,null,null,null,null,null,null,null,null,null,null,null,null,null,null,null,null,null,null,null,null,null,null,null,null,null,null,null,null,null,111,2000000,null,-17.768986468788871,-112.82126121766039,-36.511004195473625,-68.280171093829992,"6219.32343802653-8932.81399588224i","639.272743397855-7907.67286590701i",-4.4573119805027348,12.6874181699755,-12.347792268763724,-76.034994877752709,"960000-4420.97156119855i","-646971.447980276i","298904.360797409-443533.188063445i","0.724742287799273-0.446644046277065i",1.1165000000000001E-5,14.123665505288187,-87.668025774711978,null,-54.279990664262499,-181.10143231149038,-2.6814387439782728,-151.01560248248919,-56.961429408240775,-332.11703479397954,27.882965206020458,null,0,0,0,0,0,0,0,0,0,0,0]
[null,null,null,null,null,null,null,null,null,null,null,null,null,null,null,null,null,null,null,null,null,null,null,null,null,null,null,null,null,null,null,null,null,null,null,null,null,null,null,null,null,null,null,null,null,null,null,null,null,null,null,112,2500000,null,-19.796280033773588,-114.17298442018955,-38.130273385077672,-63.574435307590868,"4510.50189243482-8098.04210109957i","413.648974846604-6340.50195093147i",-4.3272250564875518,10.285692925881207,-14.193968624490758,-78.748288377034839,"960000-3536.77724895884i","-517577.158384221i","215905.473627509-400018.659660285i","0.627573532047838-0.483451128782258i",1.1165000000000001E-5,12.085756629973535,-99.25142581068117,null,-57.926553418851256,-177.74741972778043,-6.4354370510047758,-167.7140212618348,-64.361990469856039,-345.4614409896152,14.538559010384802,null,0,0,0,0,0,0,0,0,0,0,0]
[null,null,null,null,null,null,null,null,null,null,null,null,null,null,null,null,null,null,null,null,null,null,null,null,null,null,null,null,null,null,null,null,null,null,null,null,null,null,null,null,null,null,null,null,null,null,null,null,null,null,null,113,3000000,null,-21.441418474924816,-115.05859577050033,-39.353447322490503,-59.217046392975924,"3376.58459836419-7274.68247770992i","290.657943700093-5290.27650398799i",-4.2546370160594007,8.6280830962536168,-15.726775723558649,-80.586772122365119,"960000-2947.31437413237i","-431314.298653518i","161197.701024251-358172.104933141i","0.539213830936173-0.498459903566284i",1.1165000000000001E-5,10.157654629408555,-108.52048627318389,null,-60.794865797415319,-174.27564216347625,-9.8237581102094964,-180.47917529929538,-70.618623907624823,-354.7548174627716,5.245182537228402,null,0,0,0,0,0,0,0,0,0,0,0]
[null,null,null,null,null,null,null,null,null,null,null,null,null,null,null,null,null,null,null,null,null,null,null,null,null,null,null,null,null,null,null,null,null,null,null,null,null,null,null,null,null,null,null,null,null,null,null,null,null,null,null,114,3500000,null,-22.825276021897732,-115.68345859906991,-40.301706936078794,-55.21789531032762,"2603.17364895642-6543.14185689864i","216.351322676136-4537.90165156137i",-4.2101871370500668,7.4192884124231675,-17.034780110019618,-81.912283414815974,"960000-2526.26946354203i","-369697.970274444i","124049.942551984-321452.236132666i","0.462290929227027-0.498575998200313i",1.1165000000000001E-5,8.3515645276416546,-116.06081014213436,null,-63.126982957976523,-170.90135390939753,-12.89340271942803,-190.55380514452716,-76.020385677404548,-361.45515905392472,-1.4551590539247172,null,0,0,0,0,0,0,0,0,0,0,0]
[null,null,null,null,null,null,null,null,null,null,null,null,null,null,null,null,null,null,null,null,null,null,null,null,null,null,null,null,null,null,null,null,null,null,null,null,null,null,null,null,null,null,null,null,null,null,null,null,null,null,null,115,4000000,null,-24.019323688224134,-116.14785150381901,-41.050525331594798,-51.569927400711563,"2059.00056818206-5914.68486122744i","168.064176936366-3972.58522999898i",-4.1810565677124494,6.5000815987971992,-18.174424837875307,-82.912247227102782,"960000-2210.48578059928i","-323485.723990138i","97993.3188051066-290137.948154641i","0.396950898920575-0.489265656639338i",1.1165000000000001E-5,6.6657706674128967,-122.28466266701216,null,-65.069849019818932,-167.71777890453058,-15.68971073817486,-198.69682829531774,-80.759559757993799,-366.41460719984832,-6.4146071998483194,null,0,0,0,0,0,0,0,0,0,0,0]
[null,null,null,null,null,null,null,null,null,null,null,null,null,null,null,null,null,null,null,null,null,null,null,null,null,null,null,null,null,null,null,null,null,null,null,null,null,null,null,null,null,null,null,null,null,null,null,null,null,null,null,116,4500000,null,-25.069278624799367,-116.50651198500104,-41.650418173381816,-48.255241609008678,"1664.62647738043-5379.53161582181i","134.931658657941-3532.35869447868i",-4.1609552120432012,5.7779088972370181,-19.183575743810479,-83.693040200428868,"960000-1964.87624942158i","-287542.865769012i","79150.9546249129-263600.115083999i","0.342144508984616-0.474427701506027i",1.1165000000000001E-5,5.0930906040238799,-127.48851127092969,null,-66.719696798181189,-164.76175359400972,-18.2514403518298,-205.40364257412153,-84.971137150010989,-370.16539616813122,-10.165396168131224,null,0,0,0,0,0,0,0,0,0,0,0]
[null,null,null,null,null,null,null,null,null,null,null,null,null,null,null,null,null,null,null,null,null,null,null,null,null,null,null,null,null,null,null,null,null,null,null,null,null,null,null,null,null,null,null,null,null,null,null,null,null,null,null,117,5000000,null,-26.006135272307958,-116.79183835177578,-42.136815618169976,-45.249789964997383,"1371.11200394093-4923.32028586863i","111.218669803914-3179.87763306617i",-4.1465117120107244,5.1955827530928138,-20.088755932303627,-84.319386548590501,"960000-1768.38862447942i","-258788.579192111i","65149.9899621198-241051.800397494i","0.296405628328862-0.456672017780633i",1.1165000000000001E-5,3.6244378331816556,-131.89000978549007,null,-68.142950890477934,-162.04162831677317,-20.610829811132696,-211.01381358098774,-88.753780701610623,-373.05544189776094,-13.055441897760943,null,0,0,0,0,0,0,5045866.6340330755,0,0,0,0]
[null,null,null,null,null,null,null,null,null,null,null,null,null,null,null,null,null,null,null,null,null,null,null,null,null,null,null,null,null,null,null,null,null,null,null,null,null,null,null,null,null,null,null,null,null,null,null,null,null,null,null,118,5500000,null,-26.85186801692965,-117.02422535334775,-42.535361668930449,-42.526786955693773,"1147.48448766221-4532.36278549666i","93.6664908155535-2891.30576035638i",-4.1357901311662131,4.7159686690143374,-20.909218483229942,-84.832873694358213,"960000-1607.62602225402i","-235262.3447201i","54495.5928973085-221774.918121589i","0.258248210913376-0.437671192190458i",1.1165000000000001E-5,2.2504143264168661,-135.65179746691857,null,-69.387229685860092,-159.55101230904151,-22.79459428797929,-215.76870249226243,-92.181823973839386,-375.31971480130392,-15.319714801303917,null,0,0,0,0,0,0,0,0,0,0,0]
[null,null,null,null,null,null,null,null,null,null,null,null,null,null,null,null,null,null,null,null,null,null,null,null,null,null,null,null,null,null,null,null,null,null,null,null,null,null,null,null,null,null,null,null,null,null,null,null,null,null,null,119,6000000,null,-27.622618925903353,-117.21714980727309,-42.865034940638282,-40.059007118882207,"973.572626412924-4195.02696871582i","80.3124891146084-2650.71783963049i",-4.1276156193002276,4.3139486785017098,-21.65935968958135,-85.261419870313674,"960000-1473.65718706618i","-215657.149326759i","46217.5126077312-205171.732001527i","0.226336140974785-0.418459188288927i",1.1165000000000001E-5,0.96203010532781186,-138.89726457031094,null,-70.487653866541635,-157.27615692615529,-24.824945203553767,-219.84473576212289,-95.312599070095402,-377.12089268827822,-17.120892688278218,null,0,0,0,0,0,0,0,0,0,0,0]
[null,null,null,null,null,null,null,null,null,null,null,null,null,null,null,null,null,null,null,null,null,null,null,null,null,null,null,null,null,null,null,null,null,null,null,null,null,null,null,null,null,null,null,null,null,null,null,null,null,null,null,120,6500000,null,-28.330592589315657,-117.37987350860601,-43.140118192939987,-37.820212525791476,"835.87243172175-3901.83150170476i","69.917465497271-2447.07099346453i",-4.1212421714036953,3.9719450262056637,-22.350215286275926,-85.624453318345346,"960000-1360.29894190725i","-199068.137840085i","39667.8479481883-190760.918338012i","0.199535237830443-0.399651006122081i",1.1165000000000001E-5,-0.24899372795597816,-141.72129621238034,null,-71.470710782255651,-155.20008603439749,-26.720451185635596,-223.37380450452002,-98.191161967891247,-378.57389053891751,-18.57389053891751,null,0,0,0,0,0,0,0,0,0,0,0]
[null,null,null,null,null,null,null,null,null,null,null,null,null,null,null,null,null,null,null,null,null,null,null,null,null,null,null,null,null,null,null,null,null,null,null,null,null,null,null,null,null,null,null,null,null,null,null,null,null,null,null,121,7000000,null,-28.985239710878371,-117.51897110252693,-43.371505288880854,-35.785951763363727,"725.109697344321-3645.16259869083i","61.6677935505759-2272.46777626597i",-4.1161778548696448,3.6772984062263734,-22.990425222404923,-85.935906374520485,"960000-1263.13473177102i","-184848.985137222i","34402.5086257132-178159.041242699i","0.176910992716954-0.381593361279852i",1.1165000000000001E-5,-1.390128034886877,-144.19776141935697,null,-72.356744999759229,-153.30492286589066,-28.496731112161445,-226.45636938765108,-100.85347611192067,-379.76129225354174,-19.76129225354174,null,0,0,0,0,0,0,0,0,0,0,0]
[null,null,null,null,null,null,null,null,null,null,null,null,null,null,null,null,null,null,null,null,null,null,null,null,null,null,null,null,null,null,null,null,null,null,null,null,null,null,null,null,null,null,null,null,null,null,null,null,null,null,null,122,7500000,null,-29.59402727826739,-117.63923846190664,-43.567600132810675,-33.933934088179484,"634.765326785787-3418.92529692834i","55.0113865388034-2121.11117788818i",-4.1120877360244981,3.4206654271254218,-23.586877155262354,-86.2060277629609,"960000-1178.92574965295i","-172525.719461407i","30109.8136865623-167060.882517971i","0.157705101276445-0.364464267532266i",1.1165000000000001E-5,-2.4680402216513424,-146.38482746269435,null,-73.161627411078058,-151.57317255008613,-30.167005112938195,-229.1701897985298,-103.32863252401626,-380.74336234861596,-20.74336234861596,null,0,0,0,0,0,0,0,0,0,0,0]
[null,null,null,null,null,null,null,null,null,null,null,null,null,null,null,null,null,null,null,null,null,null,null,null,null,null,null,null,null,null,null,null,null,null,null,null,null,null,null,null,null,null,null,null,null,null,null,null,null,null,null,123,8000000,null,-30.16295720555793,-117.74425599809602,-43.734951140070571,-32.244133343452106,"560.159494347437-3218.22823391921i","49.5629453670662-1988.6501225858i",-4.108737433911914,3.1950025529458315,-24.145148417573694,-86.442523021461014,"960000-1105.24289029964i","-161742.861995069i","26566.2959111751-157222.518656843i","0.141306544681009-0.348337487375854i",1.1165000000000001E-5,-3.4886462843698056,-148.32878725205555,null,-73.897908345628508,-149.98838934154813,-31.742532135855413,-231.57630772057072,-105.64044048148392,-381.56469706211885,-21.564697062118853,null,0,0,0,0,0,0,0,0,0,0,0]
[null,null,null,null,null,null,null,null,null,null,null,null,null,null,null,null,null,null,null,null,null,null,null,null,null,null,null,null,null,null,null,null,null,null,null,null,null,null,null,null,null,null,null,null,null,null,null,null,null,null,null,124,8500000,null,-30.69692594017587,-117.83675069582864,-43.878707711179942,-30.698730878601896,"497.868344920496-3039.12520335989i","45.0469604812917-1871.75526142982i",-4.1059589864041728,2.9949011616207426,-24.669817422087498,-86.651296415910835,"960000-1040.22860263495i","-152228.575995359i","23608.627194903-148447.788982704i","0.127223998962761-0.333223728222773i",1.1165000000000001E-5,-4.4571819994539865,-150.06685181255926,null,-74.575633651355815,-148.53548157443055,-33.232958407945659,-233.72324706684935,-107.80859205930147,-382.2587286412799,-22.258728641279902,null,0,0,0,0,0,0,0,0,0,0,0]
[null,null,null,null,null,null,null,null,null,null,null,null,null,null,null,null,null,null,null,null,null,null,null,null,null,null,null,null,null,null,null,null,null,null,null,null,null,null,null,null,null,null,null,null,null,null,null,null,null,null,null,125,9000000,null,-31.199980152326038,-117.91883604503064,-44.002953572162937,-29.281970607344334,"445.343598772851-2878.41146594341i","41.2622069597513-1767.83578716778i",-4.1036294975968657,2.8161401932672443,-25.164688043791944,-86.836947705399737,"960000-982.43812471079i","-143771.432884506i","21115.3482220679-140577.791535464i","0.115062001164588-0.319096751867813i",1.1165000000000001E-5,-5.3782786053629019,-151.62921192205857,null,-75.202933724488972,-147.20080665237498,-34.646596146751712,-235.65001943419105,-109.84952987124069,-382.85082608656603,-22.85082608656603,null,0,0,0,0,0,0,0,0,0,0,0]
[null,null,null,null,null,null,null,null,null,null,null,null,null,null,null,null,null,null,null,null,null,null,null,null,null,null,null,null,null,null,null,null,null,null,null,null,null,null,null,null,null,null,null,null,null,null,null,null,null,null,null,126,9500000,null,-31.675502562551372,-117.99217534984992,-44.110953176953565,-27.979972967385962,"400.658984476906-2733.46579317364i","38.0589462971088-1674.84546309311i",-4.101657379456868,2.6553777816606532,-25.632954528581489,-87.003113245531438,"960000-930.730854989169i","-136204.515364269i","18994.7104285233-133482.820234822i","0.104501333187256-0.30590979806038i",1.1165000000000001E-5,-6.2560356976027158,-153.04057708767269,null,-75.78645573950493,-145.97214831723588,-35.990647605641072,-237.38831255154349,-111.777103345146,-383.36046086877934,-23.360460868779342,null,0,0,0,0,0,0,0,0,0,0,0]
[null,null,null,null,null,null,null,null,null,null,null,null,null,null,null,null,null,null,null,null,null,null,null,null,null,null,null,null,null,null,null,null,null,null,null,null,null,null,null,null,null,null,null,null,null,null,null,null,null,null,null,127,10000000,null,-32.126349620314606,-118.05809551592151,-44.205335755982269,-26.780536345778291,"362.337767996278-2602.12860566465i","35.3238918308187-1591.14671969131i",-4.0999732526360182,2.5099340631090423,-26.077324841905725,-87.152705465876124,"960000-884.194312239711i","-129394.289596055i","17176.4179918571-127056.19001249i","0.0952832831380414-0.293605822647435i",1.1165000000000001E-5,-7.094088044165602,-154.32133642545116,null,-76.331685376296875,-144.83863186169981,-37.271386138707342,-238.96410782821823,-113.60307151500422,-383.80273968991804,-23.802739689918042]

{"sheet":"STD_VAL","index":3,"n_rows":769,"n_cols":4,"rows_kept":769,"cut":false,"hidden":true,"merged":[]}
[1]
[1.02,null,"Device Rating","Value"]
[1.05,null,"TPSM64404",2]
[1.0699999999999998,null,"TPSM64406",3]
[1.1000000000000001]
[1.1300000000000001]
[1.1499999999999999,null,"Number of Phase","Value"]
[1.1800000000000002,null,"1-Phase",1]
[1.21,null,"2-Phase (1 device)",2]
[1.24,null,"4-Phase (2 devices)",4]
[1.27,null,"6-Phase (3 devices)",6]
[1.3]
[1.33,null,"Switching Mode","Value"]
[1.3699999999999999,null,"FPWM",1]
[1.4,null,"AUTO",0]
[1.4300000000000002]
[1.47,null,"Feedback","Value"]
[1.5,null,"Internal",1]
[1.54,null,"External",0]
[1.58]
[1.6199999999999999,null,"Spread Spectrum","Value"]
[1.65,null,"Enable",1]
[1.69,null,"Disable",0]
[1.7399999999999998]
[1.78,null,"External clock synchronization","Value"]
[1.8199999999999998,null,"Yes",1]
[1.8699999999999999,null,"No",0]
[1.9100000000000001]
[1.9600000000000002]
[2]
[2.0499999999999998]
[2.1]
[2.15]
[2.21]
[2.2600000000000002]
[2.3199999999999998]
[2.37]
[2.4300000000000002]
[2.4899999999999998]
[2.5499999999999998]
[2.6100000000000003]
[2.67]
[2.7399999999999998]
[2.8]
[2.87]
[2.94]
[3.0100000000000002]
[3.09]
[3.16]
[3.2399999999999998]
[3.3200000000000003]
[3.4]
[3.4799999999999995]
[3.5700000000000003]
[3.65]
[3.7399999999999998]
[3.8299999999999996]
[3.9200000000000004]
[4.0200000000000005]
[4.12]
[4.2200000000000006]
[4.32]
[4.42]
[4.5299999999999994]
[4.6399999999999997]
[4.75]
[4.87]
[4.99]
[5.1100000000000003]
[5.2299999999999995]
[5.36]
[5.49]
[5.62]
[5.76]
[5.9]
[6.04]
[6.1899999999999995]
[6.34]
[6.49]
[6.65]
[6.81]
[6.9799999999999995]
[7.15]
[7.32]
[7.5]
[7.68]
[7.87]
[8.0599999999999987]
[8.25]
[8.4499999999999993]
[8.66]
[8.870000000000001]
[9.09]
[9.3099999999999987]
[9.5299999999999994]
[9.76]
[{"$f":"A1*10","v":10}]
[{"$f":"A2*10","v":10.199999999999999}]
[10.5]
[10.7]
[11]
[11.3]
[11.5]
[11.8]
[12.1]
[12.4]
[12.7]
[13]
[13.3]
[13.7]
[14]
[14.3]
[14.7]
[15]
[15.4]
[15.8]
[16.2]
[16.5]
[16.899999999999999]
[17.399999999999999]
[17.8]
[18.2]
[18.7]
[19.100000000000001]
[19.600000000000001]
[20]
[20.5]
[21]
[21.5]
[22.1]
[22.6]
[23.2]
[23.700000000000003]
[24.3]
[24.9]
[25.5]
[26.1]
[26.7]
[27.4]
[28]
[28.700000000000003]
[29.4]
[30.1]
[30.9]
[31.6]
[32.4]
[33.200000000000003]
[34]
[34.799999999999997]
[35.700000000000003]
[36.5]
[37.4]
[38.299999999999997]
[39.200000000000003]
[40.200000000000003]
[41.2]
[42.2]
[43.2]
[44.2]
[45.3]
[46.4]
[{"$f":"A66*10","v":47.5}]
[48.7]
[49.900000000000006]
[51.1]
[52.3]
[53.6]
[54.900000000000006]
[56.2]
[57.599999999999994]
[59]
[60.4]
[61.899999999999991]
[63.4]
[64.900000000000006]
[66.5]
[68.099999999999994]
[69.8]
[71.5]
[73.2]
[75]
[76.8]
[78.7]
[80.599999999999994]
[82.5]
[84.5]
[86.6]
[88.700000000000017]
[90.9]
[93.1]
[95.3]
[97.6]
[100]
[102]
[105]
[107]
[110]
[113]
[115]
[118]
[121]
[124]
[127]
[130]
[133]
[137]
[140]
[143]
[147]
[150]
[154]
[158]
[162]
[165]
[169]
[174]
[178]
[182]
[187]
[191]
[196]
[200]
[205]
[210]
[215]
[{"$f":"A130*10","v":221}]
[226]
[232]
[237.00000000000003]
[243]
[249]
[255]
[261]
[267]
[274]
[280]
[287]
[294]
[301]
[309]
[316]
[324]
[332]
[340]
[348]
[357]
[365]
[374]
[383]
[392]
[402]
[412]
[422]
[432]
[442]
[453]
[464]
[475]
[487]
[499.00000000000006]
[511]
[523]
[536]
[549]
[562]
[576]
[590]
[604]
[618.99999999999989]
[634]
[649]
[665]
[681]
[698]
[715]
[732]
[750]
[768]
[787]
[806]
[825]
[845]
[866]
[887.00000000000023]
[909]
[931]
[953]
[976]
[1000]
[{"$f":"A194*10","v":1020}]
[1050]
[1070]
[1100]
[1130]
[1150]
[1180]
[1210]
[1240]
[1270]
[1300]
[1330]
[1370]
[1400]
[1430]
[1470]
[1500]
[1540]
[1580]
[1620]
[1650]
[1690]
[1740]
[1780]
[1820]
[1870]
[1910]
[1960]
[2000]
[2050]
[2100]
[2150]
[2210]
[2260]
[2320]
[2370.0000000000005]
[2430]
[2490]
[2550]
[2610]
[2670]
[2740]
[2800]
[2870]
[2940]
[3010]
[3090]
[3160]
[3240]
[3320]
[3400]
[3480]
[3570]
[3650]
[3740]
[3830]
[3920]
[4020]
[4120]
[4220]
[4320]
[4420]
[4530]
[4640]
[{"$f":"A258*10","v":4750}]
[4870]
[4990.0000000000009]
[5110]
[5230]
[5360]
[5490]
[5620]
[5760]
[5900]
[6040]
[6189.9999999999991]
[6340]
[6490]
[6650]
[6810]
[6980]
[7150]
[7320]
[7500]
[7680]
[7870]
[8060]
[8250]
[8450]
[8660]
[8870.0000000000018]
[9090]
[9310]
[9530]
[9760]
[10000]
[10200]
[10500]
[10700]
[11000]
[11300]
[11500]
[11800]
[12100]
[12400]
[12700]
[13000]
[13300]
[13700]
[14000]
[14300]
[14700]
[15000]
[15400]
[15800]
[16200]
[16500]
[16900]
[17400]
[17800]
[18200]
[18700]
[19100]
[19600]
[20000]
[20500]
[21000]
[21500]
[{"$f":"A322*10","v":22100}]
[22600]
[23200]
[23700.000000000004]
[24300]
[24900]
[25500]
[26100]
[26700]
[27400]
[28000]
[28700]
[29400]
[30100]
[30900]
[31600]
[32400]
[33200]
[34000]
[34800]
[35700]
[36500]
[37400]
[38300]
[39200]
[40200]
[41200]
[42200]
[43200]
[44200]
[45300]
[46400]
[47500]
[48700]
[49900.000000000007]
[51100]
[52300]
[53600]
[54900]
[56200]
[57600]
[59000]
[60400]
[61899.999999999993]
[63400]
[64900]
[66500]
[68100]
[69800]
[71500]
[73200]
[75000]
[76800]
[78700]
[80600]
[82500]
[84500]
[86600]
[88700.000000000015]
[90900]
[93100]
[95300]
[97600]
[100000]
[{"$f":"A386*10","v":102000}]
[105000]
[107000]
[110000]
[113000]
[115000]
[118000]
[121000]
[124000]
[127000]
[130000]
[133000]
[137000]
[140000]
[143000]
[147000]
[150000]
[154000]
[158000]
[162000]
[165000]
[169000]
[174000]
[178000]
[182000]
[187000]
[191000]
[196000]
[200000]
[205000]
[210000]
[215000]
[221000]
[226000]
[232000]
[237000.00000000003]
[243000]
[249000]
[255000]
[261000]
[267000]
[274000]
[280000]
[287000]
[294000]
[301000]
[309000]
[316000]
[324000]
[332000]
[340000]
[348000]
[357000]
[365000]
[374000]
[383000]
[392000]
[402000]
[412000]
[422000]
[432000]
[442000]
[453000]
[464000]
[{"$f":"A450*10","v":475000}]
[487000]
[499000.00000000006]
[511000]
[523000]
[536000]
[549000]
[562000]
[576000]
[590000]
[604000]
[618999.99999999988]
[634000]
[649000]
[665000]
[681000]
[698000]
[715000]
[732000]
[750000]
[768000]
[787000]
[806000]
[825000]
[845000]
[866000]
[887000.00000000012]
[909000]
[931000]
[953000]
[976000]
[1000000]
[1020000]
[1050000]
[1070000]
[1100000]
[1130000]
[1150000]
[1180000]
[1210000]
[1240000]
[1270000]
[1300000]
[1330000]
[1370000]
[1400000]
[1430000]
[1470000]
[1500000]
[1540000]
[1580000]
[1620000]
[1650000]
[1690000]
[1740000]
[1780000]
[1820000]
[1870000]
[1910000]
[1960000]
[2000000]
[2050000]
[2100000]
[2150000]
[{"$f":"A514*10","v":2210000}]
[2260000]
[2320000]
[2370000.0000000005]
[2430000]
[2490000]
[2550000]
[2610000]
[2670000]
[2740000]
[2800000]
[2870000]
[2940000]
[3010000]
[3090000]
[3160000]
[3240000]
[3320000]
[3400000]
[3480000]
[3570000]
[3650000]
[3740000]
[3830000]
[3920000]
[4020000]
[4120000]
[4220000]
[4320000]
[4420000]
[4530000]
[4640000]
[4750000]
[4870000]
[4990000.0000000009]
[5110000]
[5230000]
[5360000]
[5490000]
[5620000]
[5760000]
[5900000]
[6040000]
[6189999.9999999991]
[6340000]
[6490000]
[6650000]
[6810000]
[6980000]
[7150000]
[7320000]
[7500000]
[7680000]
[7870000]
[8060000]
[8250000]
[8450000]
[8660000]
[8870000.0000000019]
[9090000]
[9310000]
[9530000]
[9760000]
[10000000]
[{"$f":"A578*10","v":10200000}]
[10500000]
[10700000]
[11000000]
[11300000]
[11500000]
[11800000]
[12100000]
[12400000]
[12700000]
[13000000]
[13300000]
[13700000]
[14000000]
[14300000]
[14700000]
[15000000]
[15400000]
[15800000]
[16200000]
[16500000]
[16900000]
[17400000]
[17800000]
[18200000]
[18700000]
[19100000]
[19600000]
[20000000]
[20500000]
[21000000]
[21500000]
[22100000]
[22600000]
[23200000]
[23700000.000000004]
[24300000]
[24900000]
[25500000]
[26100000]
[26700000]
[27400000]
[28000000]
[28700000]
[29400000]
[30100000]
[30900000]
[31600000]
[32400000]
[33200000]
[34000000]
[34800000]
[35700000]
[36500000]
[37400000]
[38300000]
[39200000]
[40200000]
[41200000]
[42200000]
[43200000]
[44200000]
[45300000]
[46400000]
[{"$f":"A642*10","v":47500000}]
[48700000]
[49900000.000000007]
[51100000]
[52300000]
[53600000]
[54900000]
[56200000]
[57600000]
[59000000]
[60400000]
[61899999.999999993]
[63400000]
[64900000]
[66500000]
[68100000]
[69800000]
[71500000]
[73200000]
[75000000]
[76800000]
[78700000]
[80600000]
[82500000]
[84500000]
[86600000]
[88700000.000000015]
[90900000]
[93100000]
[95300000]
[97600000]
[100000000]

{"sheet":"SCH","index":4,"n_rows":1,"n_cols":4,"rows_kept":1,"cut":false,"hidden":true,"merged":[]}
[null,{"$f":"IF(PH=1,IF(AND(IntFB=1,V.load=5),\"SCH_1PH_5V\",IF(AND(IntFB=1,V.load=3.3),\"SCH_1PH_3P3V\",IF(IntFB=0,\"SCH_1PH_ADJ\",444))),IF(PH=2,IF(AND(IntFB=1,V.load=5),\"SCH_2PH_5V\",IF(AND(IntFB=1,V.load=3.3),\"SCH_2PH_3P3V\",IF(IntFB=0,\"SCH_2PH_ADJ\",444))),IF(PH=4,IF(AND(IntFB=1,V.load=5),\"SCH_4PH_5V\",IF(AND(IntFB=1,V.load=3.3),\"SCH_4PH_3P3V\",IF(IntFB=0,\"SCH_4PH_ADJ\",444))),IF(PH=6,IF(AND(IntFB=1,V.load=5),\"SCH_6PH_5V\",IF(AND(IntFB=1,V.load=3.3),\"SCH_6PH_3P3V\",IF(IntFB=0,\"SCH_6PH_ADJ\",444))),444)) ) )","v":"SCH_1PH_ADJ"},{"$f":"IF(PH=4,\"SCH_4PH_SLAVE\",IF(PH=6,\"SCH_6PH_SLAVE\",\"SCH_BLANK\"))","v":"SCH_BLANK"},{"$f":"IF(PH=6,\"SCH_6PH_SLAVE2\",\"SCH_BLANK\")","v":"SCH_BLANK"}]