{"text_format":"1","workbook":"xlsx","n_sheets":9,"sheets":["InputSheet","DeviceCalculator","6A_SchematicChecklist","6A_LayoutChecklist","Std. R and C Values","Extra","partData","revisionNotes","Disclaimer"],"not_rendered":{"charts":0,"images":5,"macros":1,"external_links":2,"defined_names":168,"comments":1,"pivot_tables":0},"unopened":[],"bounds":{"document_bytes":16777216,"sheet_cells":100000,"rows_first":2000,"rows_last":500,"rows_between":2000,"halvings":0,"cell_chars":16384,"cell_head_chars":4096},"cells_cut":0,"cells_raw":0,"read":"whole","date_system":"1900"}

{"sheet":"InputSheet","index":0,"n_rows":61,"n_cols":8,"rows_kept":61,"cut":false,"hidden":false,"merged":[]}
["Parameter","Units","Type","Default",null,null,"end"]
["Rail Name",null,"Req",null,"TPS548C26EVM"]
["Part Number",null,"Req",null,"TPS548C26"]
["Vin_min","V","Opt","Vin_nom*0.8",4.5]
["Vin_nom","V","Req",null,12,null,null,"Directions:"]
["Vin_max","V","Opt","Vin_nom*1.1",18,null,null,"Check/Calculate Selected Column"]
["Vout","V","Req",null,3.3,null,null,"Select any cell in the column of the design you would like to check."]
["Iout","A","Opt","Io_max_IC",35,null,null,"Click on the Check/Calculate to send the input values to the DeviceCalculator worksheet."]
["dVo_ripple_perc",null,"Opt",0.01,0.01,null,null,"The calculated results on the DeviceCalculator worksheet are then pulled back to check the design."]
["dVo_trans_perc",null,"Opt",0.04,2.5000000000000001E-2]
["Io_step","A","Opt","Iout*0.5",{"$f":"E8/4","v":8.75},null,null,"Insert New Design"]
["Slewrate_Io_step","A/µs","Opt",10,10,null,null,"Click on Insert New Design to add another column to check another design."]
["fsw_input",null,"Req",null,600,null,null,"To delete a design that is no longer needed, right click on the column letter then select delete."]
["LL_mode_input",null,"Req",null,"DCM"]
["fsw_select","kHz","Calc",null,600,null,null,"Pull Values from DeviceCalculator Sheet"]
["LL_mode_select",null,"Calc",null,"DCM",null,null,"The DeviceCalculator worksheet has more details to aid in the design."]
["Lout","µH","Opt","L_rec",0.4,null,null,"Updates to the design can be mode in the DeviceCalculator sheet."]
["DCR","mΩ","Opt","Rdson_LS",0.8,null,null,"After making updates, click on Pull Values to use the values on the DeviceCalculator sheet and check them."]
["Tol_L",null,"Opt",0.2,0.2]
["I_lim_sel","kΩ","Req",null,39,null,null,"Check/Calculate All Columns"]
{"$rows_left_out":42}
{"sheet":"DeviceCalculator","index":1,"n_rows":169,"n_cols":10,"rows_kept":169,"cut":false,"hidden":false,"merged":[[145,1,145,7],[160,1,160,7],[124,1,124,7],[140,1,140,7],[45,1,45,7],[75,1,75,7],[74,1,74,7],[59,1,59,7],[113,1,113,7],[114,1,114,7],[156,1,156,7],[0,1,0,7],[31,1,31,7],[25,1,25,7],[7,1,7,7],[44,1,44,7],[1,1,6,1],[1,2,6,2],[1,3,6,3],[1,4,6,4],[1,5,6,5],[1,6,6,6],[1,7,6,7]]}
[null,"Design Calculations",null,null,null,null,null,null,null,"Key"]
[null,"Parameter","Input","Recommended","Selected Value","Calculated with Selected Value","Units","Description",null,"User Entered Value"]
[null,null,null,null,null,null,null,null,null,"Fixed IC Parameter/I2"]
[null,null,null,null,null,null,null,null,null,"Calculated Parameter"]
[null,null,null,null,null,null,null,null,null,"Recommended Component Value"]
[null,null,null,null,null,null,null,null,null,"Design Caution"]
[null,null,null,null,null,null,null,null,null,"Design Warning"]
[null,"Choose Device"]
[null,"Part Number","TPS548C26",null,null,null,null,"Select IC part number"]
[null,"Vin_min_bias",{"$f":"VLOOKUP($C$9,partData!$A$3:$ZZ$5,7,FALSE)","v":2.7},null,null,null,"V","IC rated minimum input voltage with external bias"]
[null,"Vin_min_IC",{"$f":"VLOOKUP($C$9,partData!$A$3:$ZZ$5,2,FALSE)","v":4},null,null,null,"V","IC rated minimum input voltage with internal bias"]
[null,"Vin_max_IC",{"$f":"VLOOKUP($C$9,partData!$A$3:$ZZ$5,3,FALSE)","v":18},null,null,null,"V","IC rated maximum input voltage"]
[null,"Vcc",{"$f":"VLOOKUP($C$9,partData!$A$3:$ZZ$5,6,FALSE)","v":4.5},null,null,null,"V","Internal VCC regulator output voltage"]
[null,"Vref",{"$f":"VLOOKUP($C$9,partData!$A$3:$ZZ$5,5,FALSE)","v":0.8},null,null,null,"V","Internal voltage reference"]
[null,"ton_min",{"$f":"VLOOKUP($C$9,partData!$A$3:$ZZ$5,10,FALSE)","v":50},null,null,null,"ns","Typical minimum on-time"]
[null,"toff_min_max",{"$f":"VLOOKUP($C$9,partData!$A$3:$ZZ$5,11,FALSE)","v":180},null,null,null,"ns","Worst case minimum off-time"]
[null,"Io_max_IC",{"$f":"VLOOKUP($C$9,partData!$A$3:$ZZ$5,4,FALSE)","v":35},null,null,null,"A","IC rated maximum output current"]
[null,"Ioc_valley_max",{"$f":"VLOOKUP($C$9,partData!$A$3:$ZZ$5,16,FALSE)","v":39},null,null,null,"A","Maximum valley current limit setting"]
[null,"Ioc_neg_max",{"$f":"VLOOKUP($C$9,partData!$A$3:$ZZ$5,17,FALSE)","v":-20},null,null,null,"A","Maximum negative current limit setting"]
[null,"OCF_response",{"$f":"VLOOKUP($C$9,partData!$A$3:$L$5,12,FALSE)","v":"Hiccup"},null,null,null,null,"Over current fault response"]
{"$rows_left_out":150}
{"sheet":"6A_SchematicChecklist","index":2,"n_rows":26,"n_cols":8,"rows_kept":26,"cut":false,"hidden":true,"merged":[[1,0,1,7],[6,0,6,7],[15,0,15,7]]}
["Pin","Name","Purpose","Connection For Functional Use","Reasoning","Recommended Component Values from Design Calculations","Status","Comments"]
["Control"]
[6,"FB divider","Output feedback input","Ensure that the feedback divider network gives the appropriate Vout based on the Vref chosen. The FB pin must be connected to the AGND pin.",null,{"$f":"CONCATENATE(\"Rfb_t = \",ROUND(DeviceCalculator!D128,3),\" kΩ\",\"\nRfb_b = \",ROUND(Rfb_b,3),\" kΩ\")","v":"Rfb_t = 28.81 kΩ\nRfb_b = 5.36 kΩ"},"Open"]
[6,"FB Cff","Output feedback input","Add a capacitor in parallel with the top feedback resistor","Improves transient response and may be required for sufficient phase margin or minimizing output ripple",{"$f":"CONCATENATE(\"Cff = \",ROUND(DeviceCalculator!D134,0),\" pF\")","v":"Cff = 155587256 pF"},"Open"]
[6,"FB Cff, FB divider","Output feedback input","The RC time constant between RfbTop and Cff should be less than 1.5*Tsw, where Tsw is the switching period. If a larger Cff is required, RfbTop and RfbBottom should be reduced accordingly while still maintaining the desired voltage divider ratio. For example, if Cff is doubled, RfbTop and RfbBottom should both be halved.\n\nTypically in general, Cff is not needed for Vout < 2.5 V. It is typically needed for Vout > 2.5V","Larger Cff helps improve transient response, but can put a low frequency zero which can cause instability"]
[]
["Configuration"]
[12,"MODE","fsw and DCM/CCM selection","Connect a resistor from MODE pin to AGND pin. 10% or better tolerance resistor is required. Use Table 1 to select the desired mode.",null,{"$f":"CONCATENATE(R_mode,\" kΩ\")","v":"Float kΩ"},"Open"]
[12,"MODE fsw setting","fsw selection","Selected fsw should be below the maximum limits calculated in the calculator tab","When exceeding fsw_max_ton, the fsw will decrease but the output will still be regulated. \nWhen exceeding fsw_max_toff, the output will become unregulated and UVP may trip.",{"$f":"CONCATENATE(\"fsw_max_ton = \",ROUND(DeviceCalculator!D35,0),\" kHz\",\"\nfsw_max_toff = \",ROUND(DeviceCalculator!D36,0),\" kHz\")","v":"fsw_max_ton = 7727 kHz\nfsw_max_toff = 2305 kHz"},"Open"]
[4,"TRIP","OCL detection threshold setting pin","Connect the resistor from the TRIP pin to the AGND pin. Use WEBENCH or calculator to calculate the RTRIP resistor value. Recommend 1% or better resistors for RTRIP.",null,{"$f":"CONCATENATE(\"Valley ILIM = \",ROUND(I_lim_target,2),\" A\n\",\"RTRIP = \",ROUND(Rtrip,2),\" kΩ\")","v":"Valley ILIM = 15.85 A\nRTRIP = 26 kΩ"},"Open"]
[8,"SS/REFIN","Soft-start time","Connecting a capacitor from this pin to AGND pin programs soft-start time. Minimum soft-start time (1.5 ms) is fixed internally. \nA minimum 1-nF capacitor is required. ",null,{"$f":"CONCATENATE(\"CSSREFIN = \",ROUND(DeviceCalculator!D143,0),\" nF\")","v":{"$error":"#VALUE!"}},"Open"]
[9,"PGOOD","Open drain power good flag","Connect a 1k-100k resistor to pull-up this pin. Recommend pulling up to VCC but not required.","PGOOD pin is an open-drain output so a pull-up is required when used",null,"Open"]
[5,"EN","Enable pin","Floating this pin is not recommended. To start switching, this pin must be pulled high.\nThe recommended max voltage rating on the EN pin is 6V. Do not connect EN pin directly to VIN unless the max VIN for your application is below 6V. \nWhen using VIN or VDD to drive the EN pin, use a resistor divider and ensure that the voltage stays below 6V.",null,{"$f":"CONCATENATE(\"Ren_t = \",ROUND(DeviceCalculator!D151,3),\" kΩ\",\"\nRen_b = \",ROUND(Ren_b,3),\" kΩ\")","v":"Ren_t = 0 kΩ\nRen_b = 0 kΩ"},"Open"]
[7,"AGND","Ground reference for control circuits","AGND must be connected to PGND",null,null,"Open"]
[]
["Power Stage"]
["3 (VIN), \n1, 14 (PGND)","VIN-PGND cap","Conversion power input","A minimum of 10-µF input capacitance is required","The input capacitor Cin should be able to give minimum ripple voltage desired for the application. Use WEBENCH or calculator to calculate the input capacitance. ",{"$f":"CONCATENATE(\"Cin > \",ROUND(DeviceCalculator!D119,1),\" µF\")","v":"Cin > 16.2 µF"},"Open"]
["3 (VIN),\n1, 14 (PGND)","VIN-PGND hf cap","Conversion power input","Include a 10nF-100nF 0402 input capacitor","Minimizes high frequency voltage overshoots and undershoots from switching","Cin_hf >= 10 nF","Open"]
[10,"BOOT cap","Supply input for high-side FET gate driver","Connect at least 100-nF capacitor from the BOOT pin to the SW pin. The BOOT capacitor should be at least 10-V rated, X5R, and 0402 size.","10-V rating, X5R or better dielectric, and 0402 size or larger ensure stable capacitance across all operating conditions",{"$f":"CONCATENATE(\"Cboot >= \",ROUND(DeviceCalculator!D164,2),\" µF\")","v":"Cboot >= 0.1 µF"},"Open"]
[10,"BOOT resistor","Supply input for high-side FET gate driver","Include a 0-Ω resistor in series with the BOOT capacitor with an 0402 or larger package size. Optional but highly recommended in case of layout related issues.","If the SW pin overshoot is too high, populating a 4.7-Ω resistor in series with the BOOT capacitor minimizes high frequency voltage overshoots on rising edge of SW pin","Rboot = 0 Ω","Open"]
{"$rows_left_out":7}
{"sheet":"6A_LayoutChecklist","index":3,"n_rows":17,"n_cols":7,"rows_kept":17,"cut":false,"hidden":true,"merged":[[10,0,10,6],[1,0,1,6]]}
["Pin","Name","Purpose","Placement or Routing?","Remarks","Status","Comments"]
["Power Stage"]
["3 (VIN), \n1, 14 (PGND)","VIN-PGND caps","Conversion power input","Placement","A 0402 sized 0.01-μF to 0.1-μF bypass capacitor must be placed as close as possible to the VIN and PGND pins to bypass high frequency noise and help reduce switch node ringing. It must be placed on the same side of the PCB as the IC.\nLarger VIN bypass capacitors should also be placed as close as possible to VIN and PGND pins behind this capacitor to minimize the input AC-current loop.","Open"]
[13,"VCC cap","Internal 3-V LDO output","Placement","Place the VCC bypass capacitor as close as possible to the IC on the same side of the PCB. If multiple capacitors are used, provide PGND vias for each capacitor and ensure the return path is as short as possible.","Open"]
["1, 14","PGND",null,"Routing","Include a large PGND pour connected to the PGND pins of the IC and include as many vias as possible for best thermal performance.","Open"]
["N/A","Cout and Lout","Output filter inductor and capacitors","Placement and Routing","Highly recommended to place output and inductor on the same side of the PCB as the IC to minimize PCB parasitic impedance. If components must be placed on the other side of the PCB due to space constraints, ensure multiple vias are used to minimize the added PCB parasitic impedance.","Open"]
[10,"BOOT cap and resistor","Supply input for high-side FET gate driver","Placement","Place the BOOT resistor (if used) as close as possible to the pin, followed by the BOOT capacitor. ","Open"]
["2, 11","SW","Switching node","Routing","The PCB trace which connects the SW pins and high-voltage side of the inductor, should be as short and wide as possible to minimize PCB resistance and radiated noise.","Open"]
["2, 11","SW snubber","Switching node","Placement and Routing","If used, keep the snubber path short for low inductance and the best possible performance. Also, to minimize inductance, avoid using vias for the RC snubber routing anduse very wide traces. To be most effective, the RC snubber should be connected between a large SW and PGND copper pour on the same side of the PCB as the IC.","Open"]
[]
["Control and Configuration"]
[7,"AGND","Ground reference for control circuits","Routing","Create a quite AGND island for the return of noise sensitive pins. Connect AGND to PGND at a single point. For example, use vias to connect to an internal ground plane.","Open"]
["4, 6, 8","TRIP, FB, SS/REFIN","Current limit, Output feedback input, and soft-start timing","Placement","Place the components connected to TRIP, FB and SS/REFIN as close as possible to the IC to minimize the length of trace connected to them. These components must also be returned to quite area of AGND.","Open"]
[6,"FB","Output feedback input","Routing","Connect the FB divider to the output voltage near the desired point of regulation. Avoid routing near noisy signals or power planes.","Open"]
[12,"MODE","Light load mode and fsw selection","Routing","The MODE pin resistor must be returned to the quiet AGND to ensure accurate pin detection.","Open"]
[9,"PGOOD","Open drain power good","Placement and Routing","Keep the PGOOD pull-up resistor and traces away from fast switching voltage and current paths.","Open"]
[8,"EN","Enable pin","Placement and Routing","All components and routing for the EN pin should be placed away from any high voltage switch node (itself and others), such as SW and BOOT to avoid noise coupling."]

{"sheet":"Std. R and C Values","index":4,"n_rows":99,"n_cols":17,"rows_kept":99,"cut":false,"hidden":false,"merged":[[2,4,2,5],[2,6,2,7],[9,4,9,5],[22,4,22,5],[47,4,47,5]]}
["Hide Sheet"]
[null,null,null,null,"Std. Resistors",null,null,null,null,"Capacitors"]
[null,"Enter resistor value",100,null,"E6",null,"E96",null,null,"Cap value",8.2000000000000006E-8,"pF"]
[null,null,null,null,100,150,100,102,null,null,{"$f":"IF(K3*10^12<10000,IF((10^(LOG(K3*10^12)-INT(LOG(K3*10^12))))-VLOOKUP((10^(LOG(K3*10^12)-INT(LOG(K3*10^12)))),c_s1:C_f1,1)<VLOOKUP((10^(LOG(K3*10^12)-INT(LOG(K3*10^12)))),c_s1:C_f1,2)-(10^(LOG(K3*10^12)-INT(LOG(K3*10^12)))),VLOOKUP((10^(LOG(K3*10^12)-INT(LOG(K3*10^12)))),c_s1:C_f1,1),VLOOKUP((10^(LOG(K3*10^12)-INT(LOG(K3*10^12)))),c_s1:C_f1,2))*10^INT(LOG(K3*10^12)),IF((10^(LOG(K3*10^12)-INT(LOG(K3*10^12))))-VLOOKUP((10^(LOG(K3*10^12)-INT(LOG(K3*10^12)))),C_s2:C_f2,1)<VLOOKUP((10^(LOG(K3*10^12)-INT(LOG(K3*10^12)))),C_s2:C_f2,2)-(10^(LOG(K3*10^12)-INT(LOG(K3*10^12)))),VLOOKUP((10^(LOG(K3*10^12)-INT(LOG(K3*10^12)))),C_s2:C_f2,1),VLOOKUP((10^(LOG(K3*10^12)-INT(LOG(K3*10^12)))),C_s2:C_f2,2))*10^INT(LOG(K3*10^12)))*10^-12","v":6.8E-8},"pF"]
[null,"Closest E6 Value",{"$f":"(IF((10^(LOG(C3)-INT(LOG(C3)))*100)-VLOOKUP((10^(LOG(C3)-INT(LOG(C3)))*100),E6_s:E6_f,1)<VLOOKUP((10^(LOG(C3)-INT(LOG(C3)))*100),E6_s:E6_f,2)-(10^(LOG(C3)-INT(LOG(C3)))*100),VLOOKUP((10^(LOG(C3)-INT(LOG(C3)))*100),E6_s:E6_f,1),VLOOKUP((10^(LOG(C3)-INT(LOG(C3)))*100),E6_s:E6_f,2)))*10^INT(LOG(C3))/100","v":100},null,150,220,102,105]
[null,"Closest E12 Value",{"$f":"(IF((10^(LOG(C3)-INT(LOG(C3)))*100)-VLOOKUP((10^(LOG(C3)-INT(LOG(C3)))*100),E12_s:E12_f,1)<VLOOKUP((10^(LOG(C3)-INT(LOG(C3)))*100),E12_s:E12_f,2)-(10^(LOG(C3)-INT(LOG(C3)))*100),VLOOKUP((10^(LOG(C3)-INT(LOG(C3)))*100),E12_s:E12_f,1),VLOOKUP((10^(LOG(C3)-INT(LOG(C3)))*100),E12_s:E12_f,2)))*10^INT(LOG(C3))/100","v":100},null,220,330,105,107,null,"C values up to 10nF"]
[null,"Closest E24 Value",{"$f":"(IF((10^(LOG(C3)-INT(LOG(C3)))*100)-VLOOKUP((10^(LOG(C3)-INT(LOG(C3)))*100),E24_s:E24_f,1)<VLOOKUP((10^(LOG(C3)-INT(LOG(C3)))*100),E24_s:E24_f,2)-(10^(LOG(C3)-INT(LOG(C3)))*100),VLOOKUP((10^(LOG(C3)-INT(LOG(C3)))*100),E24_s:E24_f,1),VLOOKUP((10^(LOG(C3)-INT(LOG(C3)))*100),E24_s:E24_f,2)))*10^INT(LOG(C3))/100","v":100},null,330,470,107,110,null,1,1.2,{"$f":"IF((10^(LOG(K3)-INT(LOG(K3))))-VLOOKUP((10^(LOG(K3)-INT(LOG(K3)))),c_s1:C_f1,1)<VLOOKUP((10^(LOG(K3)-INT(LOG(K3)))),c_s1:C_f1,2)-(10^(LOG(K3)-INT(LOG(K3)))),VLOOKUP((10^(LOG(K3)-INT(LOG(K3)))),c_s1:C_f1,1),VLOOKUP((10^(LOG(K3)-INT(LOG(K3)))),c_s1:C_f1,2))","v":8.1999999999999993}]
[null,"Closest E48 Value",{"$f":"(IF((10^(LOG(C3)-INT(LOG(C3)))*100)-VLOOKUP((10^(LOG(C3)-INT(LOG(C3)))*100),E48_s:E48_f,1)<VLOOKUP((10^(LOG(C3)-INT(LOG(C3)))*100),E48_s:E48_f,2)-(10^(LOG(C3)-INT(LOG(C3)))*100),VLOOKUP((10^(LOG(C3)-INT(LOG(C3)))*100),E48_s:E48_f,1),VLOOKUP((10^(LOG(C3)-INT(LOG(C3)))*100),E48_s:E48_f,2)))*10^INT(LOG(C3))/100","v":100},null,470,680,110,113,null,1.2,1.5]
[null,"Closest E96 Value",{"$f":"(IF((10^(LOG(C3)-INT(LOG(C3)))*100)-VLOOKUP((10^(LOG(C3)-INT(LOG(C3)))*100),E96_s:E96_f,1)<VLOOKUP((10^(LOG(C3)-INT(LOG(C3)))*100),E96_s:E96_f,2)-(10^(LOG(C3)-INT(LOG(C3)))*100),VLOOKUP((10^(LOG(C3)-INT(LOG(C3)))*100),E96_s:E96_f,1),VLOOKUP((10^(LOG(C3)-INT(LOG(C3)))*100),E96_s:E96_f,2)))*10^INT(LOG(C3))/100","v":100},null,680,1000,113,115,null,1.5,1.8,null,null,null,null,"Notes:","If I use the value in column K it rounds up"]
[null,null,null,null,"E12",null,115,118,null,1.8,2.2000000000000002,null,null,null,null,null,"If I use the value in column J it rounds down"]
[null,null,null,null,100,120,118,121,null,2.2000000000000002,2.7]
[null,null,null,null,120,150,121,124,null,2.7,3.3]
[null,null,null,null,150,180,124,127,null,3.3,3.9]
[null,null,null,null,180,220,127,130,null,3.9,4.7]
[null,null,null,null,220,270,130,133,null,4.7,5.6]
[null,null,null,null,270,330,133,137,null,5.6,6.8]
[null,null,null,null,330,390,137,140,null,6.8,8.1999999999999993]
[null,null,null,null,390,470,140,143,null,8.1999999999999993,10]
[null,null,null,null,470,560,143,147,null,"C values greater than 10nF"]
[null,null,null,null,560,680,147,150,null,1,1.5,{"$f":"IF((10^(LOG(K3)-INT(LOG(K3))))-VLOOKUP((10^(LOG(K3)-INT(LOG(K3)))),C_s2:C_f2,1)<VLOOKUP((10^(LOG(K3)-INT(LOG(K3)))),C_s2:C_f2,2)-(10^(LOG(K3)-INT(LOG(K3)))),VLOOKUP((10^(LOG(K3)-INT(LOG(K3)))),C_s2:C_f2,1),VLOOKUP((10^(LOG(K3)-INT(LOG(K3)))),C_s2:C_f2,2))","v":6.8}]
{"$rows_left_out":80}
{"sheet":"Extra","index":5,"n_rows":6,"n_cols":2,"rows_kept":6,"cut":false,"hidden":false,"merged":[]}
[]
[]
[null,"Validation Options"]
[null,"Open"]
[null,"Complete"]
[null,"Not Applicable"]

{"sheet":"partData","index":6,"n_rows":578,"n_cols":29,"rows_kept":578,"cut":false,"hidden":false,"merged":[[27,5,27,10],[15,5,15,9]]}
[1,2,3,4,5,6,7,8,9,10,11,12,13,14,15,16,17,18,19,20,21,22,{"$f":"V1+1","v":23},{"$f":"W1+1","v":24},{"$f":"X1+1","v":25},26,27,28]
["Part #","VIN_min","VIN_max","Io,rated","Vref","VCC LDO Voltage","VIN_min_bias","R_HS","R_LS","tonmin","toffmin","OC Fault","OV Fault","EN_rise","EN_fall","OC max","Ioc_neg_max",null,null,null,"Ilim_min","ILIM_Tol","Rboot_rec"]
["TPS544C26",4,18,35,0.8,4.5,2.7,4,1,50,180,"Hiccup","Latch Off",1.2,1,40,-20,null,null,null,0]
["TPS548C26",4,18,35,0.8,4.5,2.7,4,1,50,180,"Hiccup","Latch Off",{"$f":"N3","v":1.2},1,39,-20,null,null,null,0]
[]
[null,null,null,null,null,null,null,null,null,null,null,null,null,null,null,null,null,null,null,null,null,null,null,null,null,null,null,null,0]
[null,"Selected device",{"$f":"DeviceCalculator!C9","v":"TPS548C26"},null,null,null,null,null,null,null,null,null,null,null,null,null,null,null,null,null,null,null,null,null,null,null,null,null,{"$f":"AC98/10","v":1E-3}]
[null,null,null,null,null,null,null,null,null,null,null,null,null,null,null,null,null,null,null,null,null,null,null,null,null,null,null,null,{"$f":"AC99/10","v":1.0200000000000001E-3}]
[null,"Configuration options",null,null,null,null,null,null,null,null,null,null,null,null,null,null,null,null,null,null,null,null,null,null,null,null,null,null,{"$f":"AC100/10","v":1.0500000000000002E-3}]
[null,"Pinstrap",null,null,null,null,null,null,null,null,null,null,null,null,null,null,null,null,null,null,null,null,"Extra step to round down",null,null,null,null,null,{"$f":"AC101/10","v":1.0700000000000002E-3}]
[null,"I2C",null,null,null,null,null,null,null,null,null,null,null,null,null,null,null,null,null,"rfb",{"$f":"DeviceCalculator!D128","v":28.81},{"$f":"INDEX(NSV,MATCH(MIN(ABS(NSV-U11)),ABS(NSV-U11),0))","v":28.7},null,null,null,null,null,null,{"$f":"AC107/10","v":1.24E-3}]
[null,null,null,null,null,null,null,null,null,null,null,null,null,null,null,null,null,null,null,"ren",{"$f":"DeviceCalculator!D151","v":0},{"$f":"INDEX(NSV,MATCH(MIN(ABS(NSV-U12)),ABS(NSV-U12),0))","v":0},null,null,null,null,null,null,1.2699999999999999E-3]
[null,null,null,null,null,null,null,null,null,null,null,null,null,null,null,null,null,null,null,"rtrip",{"$f":"I_lim_rec","v":19},{"$f":"INDEX(NSV,MATCH(MIN(ABS(NSV-U13)),ABS(NSV-U13),0))","v":19.100000000000001},{"$f":"INDEX(NSV,MATCH(MIN(ABS(NSV-U13/1.024)),ABS(NSV-U13/1.024),0))","v":18.7},{"$f":"IF(V13<=U13,V13,W13)","v":18.7},null,null,null,null,1.3000000000000002E-3]
[null,null,null,null,null,null,null,null,null,null,null,null,null,null,null,null,null,null,null,null,null,null,null,null,null,null,null,null,1.33E-3]
[null,"Frequency and LL mode",{"$f":"IF(OR(C7=A5,C7=A4),B10,B11)","v":"Pinstrap"},null,null,null,null,null,null,null,null,null,null,null,null,null,null,null,null,null,null,null,null,null,null,null,null,null,1.3700000000000001E-3]
[null,null,null,null,null,"Pinstrap table",null,null,null,null,null,null,null,null,null,null,null,null,null,null,null,null,null,null,null,null,null,null,1.3999999999999998E-3]
[null,"fsw options","LL options",null,null,"FSW(kHz)","Mode","RMODE(kΩ)",{"$f":"F17","v":"FSW(kHz)"},{"$f":"G17","v":"Mode"},null,null,null,null,null,null,null,null,null,null,null,null,null,null,null,null,null,null,1.4299999999999998E-3]
[null,600,"FCCM",null,{"$f":"CONCATENATE(F18&G18)","v":"600FCCM"},{"$f":"B18","v":600},{"$f":"C$18","v":"FCCM"},0,600,"FCCM",null,null,null,null,null,null,null,null,null,null,null,null,null,null,null,null,null,null,1.47E-3]
[null,800,"DCM",null,"1000FCCM",{"$f":"B20","v":1000},{"$f":"C$18","v":"FCCM"},1.5,1000,"FCCM",null,null,null,null,null,null,null,null,null,null,null,null,null,null,null,null,null,null,1.5E-3]
[null,1000,null,null,"1000FCCM",{"$f":"B20","v":1000},{"$f":"C$18","v":"FCCM"},2.4900000000000002,1000,"FCCM",null,null,null,null,null,null,null,null,null,null,null,null,null,null,null,null,null,null,1.5400000000000001E-3]
{"$rows_left_out":559}
{"sheet":"revisionNotes","index":7,"n_rows":2,"n_cols":2,"rows_kept":2,"cut":false,"hidden":false,"merged":[]}
["Date","Change"]
["2022-02-02","Remove 4C27 support, clean up drop downs and units"]

{"sheet":"Disclaimer","index":8,"n_rows":6,"n_cols":2,"rows_kept":6,"cut":false,"hidden":false,"merged":[]}
[]
[null,"Important notice and disclaimer"]
[null,"TI PROVIDES TECHNICAL AND RELIABILITY DATA (INCLUDING DATASHEETS), DESIGN RESOURCES (INCLUDING REFERENCE DESIGNS), APPLICATION OR OTHER DESIGN ADVICE, WEB TOOLS, SAFETY INFORMATION, AND OTHER RESOURCES “AS IS” AND WITH ALL FAULTS, AND DISCLAIMS ALL WARRANTIES, EXPRESS AND IMPLIED, INCLUDING WITHOUT LIMITATION ANY IMPLIED WARRANTIES OF MERCHANTABILITY, FITNESS FOR A PARTICULAR PURPOSE OR NON-INFRINGEMENT OF THIRD PARTY INTELLECTUAL PROPERTY RIGHTS."]
[null,"These resources are intended for skilled developers designing with TI products. You are solely responsible for (1) selecting the appropriate TI products for your application, (2) designing, validating and testing your application, and (3) ensuring your application meets applicable standards, and any other safety, security, or other requirements."]
[null,"These resources are subject to change without notice. TI grants you permission to use these resources only for development of an application that uses the TI products described in the resource. Other reproduction and display of these resources is prohibited. No license is granted to any other TI intellectual property right or to any third party intellectual property right. TI disclaims responsibility for, and you will fully indemnify TI and its representatives against, any claims, damages, costs, losses, and liabilities arising out of your use of these resources."]
[null,"TI’s products are provided subject to TI’s Terms of Sale or other applicable terms available either on ti.com or provided in conjunction with such TI products. TI’s provision of these resources does not expand or otherwise alter TI’s applicable warranties or warranty disclaimers for TI products."]