{"text_format":"1","workbook":"xlsx","n_sheets":4,"sheets":["User Interface","Custom","REF","Copyright and Disclaimer"],"not_rendered":{"charts":0,"images":0,"macros":1,"external_links":0,"defined_names":1,"comments":0,"pivot_tables":0},"unopened":[],"bounds":{"document_bytes":16777216,"sheet_cells":100000,"rows_first":2000,"rows_last":500,"rows_between":2000,"halvings":0,"cell_chars":16384,"cell_head_chars":4096},"cells_cut":0,"cells_raw":0,"read":"whole","date_system":"1900"}

{"sheet":"User Interface","index":0,"n_rows":47,"n_cols":17,"rows_kept":47,"cut":false,"hidden":false,"merged":[[0,0,0,1]]}
["USER INPUTS"]
[]
["Select mode:",null,"Extended",{"$f":"IF(EXACT(\"Standard\",C3),\"Configured for 100 or 200 series RC-timed TPUL devices.\",IF(EXACT(\"Extended\",C3),\"Configured for 300 or 400 series RC-timed TPUL devices.\",\"\"))","v":"Configured for 300 or 400 series RC-timed TPUL devices."}]
[]
["Input Supply and RC values, get K factor and pulse width"]
[null,null,"Component Tolerance"]
["Supply Voltage:",null,0,3.3,"V",{"$f":"IF(OR(D7<1.5,D7>5.5),\"Please input a voltage between 1.5V and 5.5V\",\"\")","v":""}]
["Timing Resistor:",null,0,1000000,"Ω",{"$f":"IF(OR(D8<1000,D8>1000000),\"Please input a resistance between 1kohm and 1Mohm\",\"\")","v":""}]
["Timing Capacitor:",null,0,1.0000000000000001E-5,"F",{"$f":"IF(OR(D9<0.0000000001,D9>0.000001),\"Please input a capacitance between 100pF and 1uF\",\"\")","v":"Please input a capacitance between 100pF and 1uF"}]
[null,null,null,null,null,null,null,null,null,null,null,"K Factor","tw (s)","Tolerance error range(1)",null,"tw(min) (s)","tw(max) (s)"]
[null,"K Factor","tw (s)","Tolerance error range(1)",null,"tw(min) (s)","tw(max) (s)",null,null,null,null,null,{"$f":"C12*1024","v":9257804.1036800016},null,null,{"$f":"F12*1024","v":8609757.816422401},9905850.3909376021]
[null,{"$f":"Kcalc(D7,D8,D9)","v":0.88289300000000004},{"$f":"B12*D8*D9*IF(EXACT(C3,\"Standard\"),1,1024)","v":9040.8243200000015},{"$f":"IFERROR(tol3min(D7,D8,D9,C7,C8,C9),\"Out of range\")","v":-7.0000000000000007E-2},{"$f":"IFERROR(tol3max(D7,D8,D9,C7,C8,C9),\"\")","v":7.0000000000000007E-2},{"$f":"D12*C12+C12","v":8407.966617600001},{"$f":"C12*E12+C12","v":9673.6820224000021}]
[]
[]
[]
["Input Supply & Pulse width, get suggested RC combinations"]
[]
["SUPPLY VOLTAGE:",null,null,2.5,"V",{"$f":"IF(IFERROR(MATCH(D18,REF!I2:I7,0),-1)<0,\"Please input one of these values: 1.5, 1.8, 2.5, 3.3, 5, 5.5.\",\"\")","v":""}]
["DESIRED PULSE WIDTH:",null,null,1E-3,"s"]
[]
[null,"VCC","Cext (F)","Rext (Ω)","tw (s)","tw Error(2)",null,null,null,null,null,null,null,"K Factor","Rext","tw"]
[null,{"$f":"$D$18","v":2.5},9.9999999999999994E-12,{"$f":"IF(EXACT(P22,\"\"),\"\",($D$19/IF(EXACT($C$3,\"Standard\"),1,1024))/(Kcalc(B22,O22,C22)*C22))","v":62029.306336674061},{"$f":"IF(EXACT(P22,\"\"),\"\",Kcalc(B22,D22,C22)*IF(EXACT($C$3,\"Standard\"),1,1024)*D22*C22)","v":9.7500440835778619E-4},{"$f":"IF(EXACT(P22,\"\"),\"\",(E22-$D$19)/$D$19)","v":-2.4995591642213832E-2},null,null,null,null,null,null,null,{"$f":"Kcalc(B22,10000,C22)*IF(EXACT($C$3,\"Standard\"),1,1024)","v":2160.64},{"$f":"IF(OR($D$19/(C22*N22)<1200,$D$19/(C22*N22)>950000),\"-\",$D$19/(C22*N22))","v":46282.58293838863},{"$f":"IF(EXACT(O22,\"-\"),\"\",Kcalc(B22,O22,C22)*O22*C22*IF(EXACT($C$3,\"Standard\"),1,1024))","v":7.4614058534174888E-4}]
[null,2.5,5.0000000000000002E-11,{"$f":"IF(EXACT(P23,\"\"),\"\",($D$19/IF(EXACT($C$3,\"Standard\"),1,1024))/(Kcalc(B23,O23,C23)*C23))","v":14823.302175578623},{"$f":"IF(EXACT(P23,\"\"),\"\",Kcalc(B23,D23,C23)*IF(EXACT($C$3,\"Standard\"),1,1024)*D23*C23)","v":9.9700660279811691E-4},{"$f":"IF(EXACT(P23,\"\"),\"\",(E23-$D$19)/$D$19)","v":-2.9933972018831093E-3},null,null,null,null,null,null,null,{"$f":"Kcalc(B23,10000,C23)*IF(EXACT($C$3,\"Standard\"),1,1024)","v":1388.5440000000001},{"$f":"IF(OR($D$19/(C23*N23)<1200,$D$19/(C23*N23)>950000),\"-\",$D$19/(C23*N23))","v":14403.576696165192},{"$f":"IF(EXACT(O23,\"-\"),\"\",Kcalc(B23,O23,C23)*O23*C23*IF(EXACT($C$3,\"Standard\"),1,1024))","v":9.7168475185610613E-4}]
[null,2.5,1E-10,7654.0616884551473,1.0005794245001244E-3,5.7942450012440569E-4,null,null,null,null,null,null,null,1280,7812.5,1.0206999E-3]
[null,2.5,1.0000000000000001E-9,"","","",null,null,null,null,null,null,null,1044.48,"-",""]
[null,2.5,1E-8,"","","",null,null,null,null,null,null,null,961.53599999999994,"-",""]
[null,2.5,9.9999999999999995E-8,"","","",null,null,null,null,null,null,null,927.01184000000001,"-",""]
[null,2.5,9.9999999999999995E-7,"","","",null,null,null,null,null,null,null,919.21305600000005,"-",""]
[]
[]
[]
["Input RC, get pulse width for all supply values"]
[]
["Timing Resistor:",null,10000,"Ω",{"$f":"IF(OR(C34<1000,C34>1000000),\"Please input a resistance between 1kohm and 1Mohm\",\"\")","v":""}]
["Timing Capacitor:",null,9.9999999999999995E-7,"F",{"$f":"IF(OR(C35<0.0000000001,C35>0.000001),\"Please input a capacitance between 100pF and 1uF\",\"\")","v":""}]
[]
[null,"VCC","Cext (F)","Rext (Ω)","K Factor","tw (s)"]
[null,1.5,{"$f":"$C$35","v":9.9999999999999995E-7},{"$f":"$C$34","v":10000},{"$f":"Kcalc(B38,D38,C38)","v":0.91205199999999997},{"$f":"E38*D38*C38*IF(EXACT($C$3,\"Standard\"),1,1024)","v":9.33941248}]
[null,1.8,9.9999999999999995E-7,10000,0.89496799999999999,{"$f":"E39*D39*C39*IF(EXACT($C$3,\"Standard\"),1,1024)","v":9.1644723199999998}]
[null,2.5,9.9999999999999995E-7,10000,0.89766900000000005,9.1921305600000007]
[null,3.3,9.9999999999999995E-7,10000,0.89270799999999995,9.1413299199999987]
[null,5,9.9999999999999995E-7,10000,0.88104400000000005,9.0218905599999992]
[null,5.5,9.9999999999999995E-7,10000,0.87299599999999999,8.9394790399999984]
[]
[]
["(1) \"Tolerance error range\" calculates the expected typical (TA = 25°C) pulse width at each possible corner case from the provided tolerances, then selects the worst-case values to display. Value includes the expected worst-case internal error for the TPUL device across process and temperature variations."]
["(2) \"tw Error\" indicates the difference in expected typical (TA = 25°C) pulse width from the requested output pulse width."]

{"sheet":"Custom","index":1,"n_rows":33,"n_cols":9,"rows_kept":33,"cut":false,"hidden":false,"merged":[]}
["If you want to make a custom use of the interpolation function:"]
["Function is Kcalc( VCC, Rext, Cext )"]
["Arguments:"]
[null,"VCC value in V"]
[null,"Rext value in ohms"]
[null,"Cext value in F"]
[]
["Example use:"]
["K Factor (K):",null,"Kcalc(3.6, 10E3, 10E-9)",null,null,{"$f":"Kcalc(3.6, 10000, 0.00000001)","v":0.93029411764705883}]
["Pulse width (tw):",null,"K * R * C",null,null,{"$f":"F9*10000*0.00000001","v":9.3029411764705876E-5}]
[]
[]
[null,null,"C"]
[null,"R",1.0000000000000001E-5,9.9999999999999995E-7,9.9999999999999995E-8,1E-8,1.0000000000000001E-9,1E-10,9.9999999999999994E-12]
[1,{"$f":"A15*1000","v":1000},{"$f":"Kcalc(3.3,$B15,C$14)*$B15*C$14","v":9.5128300000000016E-3},9.5128299999999992E-4,9.9499999999999993E-5,1.03E-5,1.1400000000000001E-6,1.68E-7,5.8099999999999997E-8]
[1.5,1500,1.41142005E-2,1.4114200499999998E-3,1.4430199499999998E-4,1.48999995E-5,1.6300005000000002E-6,2.2699994999999999E-7,6.5200004999999993E-8]
[2.2000000000000002,2200,2.0358346800000003E-2,2.0358346800000001E-3,2.0723617199999998E-4,2.1251999999999999E-5,2.3416799999999998E-6,3.1121200000000005E-7,7.9529999999999998E-8]
[3.3,3300,3.0122820420000002E-2,3.0122820419999996E-3,3.0612397860000002E-4,3.1466286719999996E-5,3.4194289800000003E-6,4.3855435800000005E-7,9.6240572999999994E-8]
[4.7,4700,4.2497336079999996E-2,4.2497336079999996E-3,4.3171041599999999E-4,4.4280266039999996E-5,4.8341069799999995E-6,6.0423209400000003E-7,1.1693599059999998E-7]
[6.8,6800,6.1196794480000004E-2,6.1196794479999993E-3,6.2079227759999996E-4,6.3919999999999998E-5,6.9059603200000005E-6,8.4929742399999993E-7,1.4685009359999998E-7]
[1,{"$f":"A21*10000","v":10000},8.9270800000000011E-2,8.9270799999999987E-3,9.0655699999999989E-4,9.3400000000000007E-5,1.01E-5,1.22E-6,1.9399999999999999E-7]
[1.5,15000,0.13403599500000002,1.34035995E-2,1.3541999999999998E-3,1.3974799500000002E-4,1.5100005E-5,1.8000000000000001E-6,2.6399999999999998E-7]
[2.2000000000000002,22000,0.19623837200000002,1.9623837200000001E-2,1.9866884400000003E-3,2.04741064E-4,2.19648E-5,2.6158E-6,3.6269200000000003E-7]
[3.3,33000,0.29375354580000002,2.9375354579999999E-2,2.9731528859999997E-3,3.0663756419999999E-4,3.3056568600000007E-5,3.8896004399999999E-6,5.1787995599999998E-7]
[4.7,47000,{"$f":"Kcalc(3.3,$B25,C$14)*$B25*C$14","v":0.41709166760000005},4.1709166759999999E-2,4.230421213999999E-3,4.3621514979999998E-4,4.6761867919999997E-5,5.5171739599999999E-6,7.1577869800000001E-7]
[6.8,68000,0.60517746480000012,6.0517746480000002E-2,6.122845664E-3,6.2912801679999993E-4,6.7899865920000005E-5,7.9522613600000005E-6,1.003739976E-6]
[1,{"$f":"A27*100000","v":100000},0.88815700000000009,8.8815699999999997E-2,8.9956099999999994E-3,9.2510400000000016E-4,1.00054E-4,1.17E-5,1.46E-6]
[1.5,150000,1.3280200500000001,0.132802005,1.3463899499999999E-2,1.39062E-3,1.5025695000000003E-4,1.7399999999999999E-5,2.1499994999999996E-6]
[2.2000000000000002,220000.00000000003,1.9510497600000003,0.19510497600000001,1.9751441600000003E-2,2.0377742000000001E-3,2.1970071200000008E-4,2.5550800000000003E-5,3.1169599999999997E-6]
[3.3,330000,2.9260214279999999,0.29260214279999996,2.9618863559999997E-2,3.0543158580000002E-3,3.2976469020000004E-4,3.8053705800000005E-5,4.6375995599999995E-6]
[4.7,470000,4.1667944940000003,0.41667944939999996,4.2147581819999995E-2,4.3564063119999998E-3,4.6950680080000006E-4,5.4482399999999999E-5,6.5900260399999992E-6]
[6.8,680000,6.038219936,0.60382199359999988,6.0970825039999989E-2,6.2845821679999997E-3,6.8023133599999996E-4,7.9196825600000005E-5,9.4983297599999997E-6]
[1,1000000,8.8289300000000015,0.88289299999999993,8.9945399999999995E-2,9.2774399999999996E-3,1.00136E-3,1.16618E-4,1.3899999999999999E-5]

{"sheet":"REF","index":2,"n_rows":2959,"n_cols":12,"rows_kept":2959,"cut":false,"hidden":false,"merged":[]}
["KEY","VCC","Rext","Cext","K Factor",null,"R Vals","C Vals","VCC Vals","Error",null,"Mode"]
[{"$f":"B2&C2&D2","v":"1.510000.00000000001"},1.5,1000,9.9999999999999994E-12,17.7,null,1000,9.9999999999999994E-12,1.5,0.1,null,"Standard"]
["1.510000.00000000005",1.5,1000,5.0000000000000002E-11,3.96,null,1500,5.0000000000000002E-11,1.8,0.09,null,"Extended"]
["1.510000.0000000001",1.5,1000,1E-10,2.5499999999999998,null,2000,1E-10,2.5,0.08]
["1.510000.000000001",1.5,1000,1.0000000000000001E-9,1.4,null,2500,1.0000000000000001E-9,3.3,7.0000000000000007E-2]
["1.510000.00000001",1.5,1000,1E-8,1.2,null,3000,1E-8,5,0.05]
["1.510000.0000001",1.5,1000,9.9999999999999995E-8,1.1419699999999999,null,3500,9.9999999999999995E-8,5.5,0.05]
["1.510000.000001",1.5,1000,9.9999999999999995E-7,0.92529600000000001,null,4000,9.9999999999999995E-7]
["1.515000.00000000001",1.5,1500,9.9999999999999994E-12,11.533329999999999,null,4500]
["1.515000.00000000005",1.5,1500,5.0000000000000002E-11,3,null,5000]
["1.515000.0000000001",1.5,1500,1E-10,2.226667,null,5500]
["1.515000.000000001",1.5,1500,1.0000000000000001E-9,1.266667,null,6000]
["1.515000.00000001",1.5,1500,1E-8,1.1000000000000001,null,6500]
["1.515000.0000001",1.5,1500,9.9999999999999995E-8,1.0400400000000001,null,7000]
["1.515000.000001",1.5,1500,9.9999999999999995E-7,1.0127470000000001,null,7500]
["1.520000.00000000001",1.5,2000,9.9999999999999994E-12,8.65,null,8000]
["1.520000.00000000005",1.5,2000,5.0000000000000002E-11,2.75,null,8500]
["1.520000.0000000001",1.5,2000,1E-10,1.9750000000000001,null,9000]
["1.520000.000000001",1.5,2000,1.0000000000000001E-9,1.2050000000000001,null,9500]
["1.520000.00000001",1.5,2000,1E-8,1.05,null,10000]
["1.520000.0000001",1.5,2000,9.9999999999999995E-8,0.99879499999999999,null,10500]
["1.520000.000001",1.5,2000,9.9999999999999995E-7,0.97741,null,15000]
["1.525000.00000000001",1.5,2500,9.9999999999999994E-12,7,null,20000]
["1.525000.00000000005",1.5,2500,5.0000000000000002E-11,2.464,null,25000]
["1.525000.0000000001",1.5,2500,1E-10,1.8320000000000001,null,30000]
["1.525000.000000001",1.5,2500,1.0000000000000001E-9,1.1719999999999999,null,35000]
["1.525000.00000001",1.5,2500,1E-8,1.024,null,40000]
["1.525000.0000001",1.5,2500,9.9999999999999995E-8,0.96997199999999995,null,45000]
["1.525000.000001",1.5,2500,9.9999999999999995E-7,0.95755599999999996,null,50000]
["1.530000.00000000001",1.5,3000,9.9999999999999994E-12,5.9666670000000002,null,55000]
["1.530000.00000000005",1.5,3000,5.0000000000000002E-11,2.266667,null,60000]
["1.530000.0000000001",1.5,3000,1E-10,1.73,null,65000]
["1.530000.000000001",1.5,3000,1.0000000000000001E-9,1.1466670000000001,null,70000]
["1.530000.00000001",1.5,3000,1E-8,1.006667,null,75000]
["1.530000.0000001",1.5,3000,9.9999999999999995E-8,0.95613000000000004,null,80000]
["1.530000.000001",1.5,3000,9.9999999999999995E-7,0.94597330000000002,null,85000]
["1.535000.00000000001",1.5,3500,9.9999999999999994E-12,5.3142860000000001,null,90000]
["1.535000.00000000005",1.5,3500,5.0000000000000002E-11,2.1257139999999999,null,95000]
["1.535000.0000000001",1.5,3500,1E-10,1.657143,null,100000]
["1.535000.000000001",1.5,3500,1.0000000000000001E-9,1.1257140000000001,null,105000]
["1.535000.00000001",1.5,3500,1E-8,0.99428570000000005,null,150000]
["1.535000.0000001",1.5,3500,9.9999999999999995E-8,0.94749139999999998,null,200000]
["1.535000.000001",1.5,3500,9.9999999999999995E-7,0.93780289999999999,null,250000]
["1.540000.00000000001",1.5,4000,9.9999999999999994E-12,4.8250000000000002,null,300000]
["1.540000.00000000005",1.5,4000,5.0000000000000002E-11,2,null,350000]
["1.540000.0000000001",1.5,4000,1E-10,1.5974999999999999,null,400000]
["1.540000.000000001",1.5,4000,1.0000000000000001E-9,1.1174999999999999,null,450000]
["1.540000.00000001",1.5,4000,1E-8,0.98250000000000004,null,500000]
["1.540000.0000001",1.5,4000,9.9999999999999995E-8,0.934195,null,550000]
["1.540000.000001",1.5,4000,9.9999999999999995E-7,0.932195,null,600000]
["1.545000.00000000001",1.5,4500,9.9999999999999994E-12,4.4222219999999997,null,650000]
["1.545000.00000000005",1.5,4500,5.0000000000000002E-11,1.92,null,700000]
["1.545000.0000000001",1.5,4500,1E-10,1.5533330000000001,null,750000]
["1.545000.000000001",1.5,4500,1.0000000000000001E-9,1.104444,null,800000]
["1.545000.00000001",1.5,4500,1E-8,0.97777780000000003,null,850000]
["1.545000.0000001",1.5,4500,9.9999999999999995E-8,0.9322222,null,900000]
["1.545000.000001",1.5,4500,9.9999999999999995E-7,0.9276356,null,950000]
["1.550000.00000000001",1.5,5000,9.9999999999999994E-12,4.22,null,1000000]
["1.550000.00000000005",1.5,5000,5.0000000000000002E-11,1.86,null,1050000]
["1.550000.0000000001",1.5,5000,1E-10,1.514,null,1500000]
["1.550000.000000001",1.5,5000,1.0000000000000001E-9,1.0940000000000001,null,2000000]
["1.550000.00000001",1.5,5000,1E-8,0.97199999999999998,null,2500000]
["1.550000.0000001",1.5,5000,9.9999999999999995E-8,0.92459599999999997,null,3000000]
["1.550000.000001",1.5,5000,9.9999999999999995E-7,0.92394200000000004,null,3500000]
["1.555000.00000000001",1.5,5500,9.9999999999999994E-12,4.0727270000000004,null,4000000]
[{"$f":"B66&C66&D66","v":"1.555000.00000000005"},1.5,5500,5.0000000000000002E-11,1.792727,null,4500000]
["1.555000.0000000001",1.5,5500,1E-10,1.485455,null,5000000]
["1.555000.000000001",1.5,5500,1.0000000000000001E-9,1.0909089999999999,null,5500000]
["1.555000.00000001",1.5,5500,1E-8,0.96545449999999999,null,6000000]
["1.555000.0000001",1.5,5500,9.9999999999999995E-8,0.9186436,null,6500000]
["1.555000.000001",1.5,5500,9.9999999999999995E-7,0.92044550000000003,null,7000000]
["1.560000.00000000001",1.5,6000,9.9999999999999994E-12,3.9,null,7500000]
["1.560000.00000000005",1.5,6000,5.0000000000000002E-11,1.766667,null,8000000]
["1.560000.0000000001",1.5,6000,1E-10,1.4683330000000001,null,8500000]
["1.560000.000000001",1.5,6000,1.0000000000000001E-9,1.085,null,9000000]
["1.560000.00000001",1.5,6000,1E-8,0.96166669999999999,null,9500000]
["1.560000.0000001",1.5,6000,9.9999999999999995E-8,0.91847330000000005,null,10000000]
["1.560000.000001",1.5,6000,9.9999999999999995E-7,0.91781000000000001,null,10500000]
["1.565000.00000000001",1.5,6500,9.9999999999999994E-12,3.7538459999999998]
["1.565000.00000000005",1.5,6500,5.0000000000000002E-11,1.723077]
["1.565000.0000000001",1.5,6500,1E-10,1.450769]
["1.565000.000000001",1.5,6500,1.0000000000000001E-9,1.075385]
["1.565000.00000001",1.5,6500,1E-8,0.96]
["1.565000.0000001",1.5,6500,9.9999999999999995E-8,0.91479379999999999]
["1.565000.000001",1.5,6500,9.9999999999999995E-7,0.91476460000000004]
["1.570000.00000000001",1.5,7000,9.9999999999999994E-12,3.6142859999999999]
["1.570000.00000000005",1.5,7000,5.0000000000000002E-11,1.6771430000000001]
["1.570000.0000000001",1.5,7000,1E-10,1.428571]
["1.570000.000000001",1.5,7000,1.0000000000000001E-9,1.071429]
["1.570000.00000001",1.5,7000,1E-8,0.95428570000000001]
["1.570000.0000001",1.5,7000,9.9999999999999995E-8,0.91237429999999997]
["1.570000.000001",1.5,7000,9.9999999999999995E-7,0.91467430000000005]
["1.575000.00000000001",1.5,7500,9.9999999999999994E-12,3.48]
["1.575000.00000000005",1.5,7500,5.0000000000000002E-11,1.6613329999999999]
["1.575000.0000000001",1.5,7500,1E-10,1.4]
["1.575000.000000001",1.5,7500,1.0000000000000001E-9,1.0680000000000001]
["1.575000.00000001",1.5,7500,1E-8,0.95333330000000005]
["1.575000.0000001",1.5,7500,9.9999999999999995E-8,0.91171999999999997]
["1.575000.000001",1.5,7500,9.9999999999999995E-7,0.91123469999999995]
["1.580000.00000000001",1.5,8000,9.9999999999999994E-12,3.3624999999999998]
["1.580000.00000000005",1.5,8000,5.0000000000000002E-11,1.6325000000000001]
["1.580000.0000000001",1.5,8000,1E-10,1.4]
["1.580000.000000001",1.5,8000,1.0000000000000001E-9,1.07]
["1.580000.00000001",1.5,8000,1E-8,0.94874999999999998]
["1.580000.0000001",1.5,8000,9.9999999999999995E-8,0.90903500000000004]
["1.580000.000001",1.5,8000,9.9999999999999995E-7,0.91091880000000003]
["1.585000.00000000001",1.5,8500,9.9999999999999994E-12,3.2588240000000002]
["1.585000.00000000005",1.5,8500,5.0000000000000002E-11,1.6094120000000001]
["1.585000.0000000001",1.5,8500,1E-10,1.3882350000000001]
["1.585000.000000001",1.5,8500,1.0000000000000001E-9,1.0647059999999999]
["1.585000.00000001",1.5,8500,1E-8,0.94705879999999998]
["1.585000.0000001",1.5,8500,9.9999999999999995E-8,0.90686120000000003]
["1.585000.000001",1.5,8500,9.9999999999999995E-7,0.91068939999999998]
["1.590000.00000000001",1.5,9000,9.9999999999999994E-12,3.177778]
["1.590000.00000000005",1.5,9000,5.0000000000000002E-11,1.588889]
["1.590000.0000000001",1.5,9000,1E-10,1.3666670000000001]
["1.590000.000000001",1.5,9000,1.0000000000000001E-9,1.0644439999999999]
["1.590000.00000001",1.5,9000,1E-8,0.9477778]
["1.590000.0000001",1.5,9000,9.9999999999999995E-8,0.90431329999999999]
["1.590000.000001",1.5,9000,9.9999999999999995E-7,0.91037219999999996]
["1.595000.00000000001",1.5,9500,9.9999999999999994E-12,3.0842109999999998]
["1.595000.00000000005",1.5,9500,5.0000000000000002E-11,1.5747370000000001]
["1.595000.0000000001",1.5,9500,1E-10,1.3578950000000001]
["1.595000.000000001",1.5,9500,1.0000000000000001E-9,1.063158]
["1.595000.00000001",1.5,9500,1E-8,0.94631580000000004]
["1.595000.0000001",1.5,9500,9.9999999999999995E-8,0.90407680000000001]
["1.595000.000001",1.5,9500,9.9999999999999995E-7,0.90790210000000005]
["1.5100000.00000000001",1.5,10000,9.9999999999999994E-12,3]
["1.5100000.00000000005",1.5,10000,5.0000000000000002E-11,1.552]
[{"$f":"B130&C130&D130","v":"1.5100000.0000000001"},1.5,10000,1E-10,1.36]
["1.5100000.000000001",1.5,10000,1.0000000000000001E-9,1.06]
["1.810000.00000001",1.8,1000,1E-8,1.1299999999999999]
["2.510000.00000001",2.5,1000,1E-8,1.06]
["1.5100000.0000001",1.5,10000,9.9999999999999995E-8,0.90509499999999998]
["1.5100000.000001",1.5,10000,9.9999999999999995E-7,0.91205199999999997]
["1.5105000.00000000001",1.5,10500,9.9999999999999994E-12,2.9428570000000001]
["1.5105000.00000000005",1.5,10500,5.0000000000000002E-11,1.5371429999999999]
["1.5105000.0000000001",1.5,10500,1E-10,1.3523810000000001]
["1.5105000.000000001",1.5,10500,1.0000000000000001E-9,1.0571429999999999]
["1.5105000.00000001",1.5,10500,1E-8,0.94476190000000004]
["1.5105000.0000001",1.5,10500,9.9999999999999995E-8,0.90245520000000001]
["1.5105000.000001",1.5,10500,9.9999999999999995E-7,0.90593999999999997]
["1.5150000.00000000001",1.5,15000,9.9999999999999994E-12,2.5066670000000002]
["1.5150000.00000000005",1.5,15000,5.0000000000000002E-11,1.44]
["1.5150000.0000000001",1.5,15000,1E-10,1.3]
["1.5150000.000000001",1.5,15000,1.0000000000000001E-9,1.04]
["1.5150000.00000001",1.5,15000,1E-8,0.93484]
["1.5150000.0000001",1.5,15000,9.9999999999999995E-8,0.89549999999999996]
["1.5150000.000001",1.5,15000,9.9999999999999995E-7,0.90132000000000001]
["1.5200000.00000000001",1.5,20000,9.9999999999999994E-12,2.25]
["1.5200000.00000000005",1.5,20000,5.0000000000000002E-11,1.39]
["1.5200000.0000000001",1.5,20000,1E-10,1.2749999999999999]
["1.5200000.000000001",1.5,20000,1.0000000000000001E-9,1.04]
["1.5200000.00000001",1.5,20000,1E-8,0.92967999999999995]
["1.5200000.0000001",1.5,20000,9.9999999999999995E-8,0.88971999999999996]
["1.5200000.000001",1.5,20000,9.9999999999999995E-7,0.896895]
["1.5250000.00000000001",1.5,25000,9.9999999999999994E-12,2.0920000000000001]
["1.5250000.00000000005",1.5,25000,5.0000000000000002E-11,1.3440000000000001]
["1.5250000.0000000001",1.5,25000,1E-10,1.256]
["1.5250000.000000001",1.5,25000,1.0000000000000001E-9,1.036]
["1.5250000.00000001",1.5,25000,1E-8,0.92752400000000002]
["1.5250000.0000001",1.5,25000,9.9999999999999995E-8,0.88836000000000004]
["1.5250000.000001",1.5,25000,9.9999999999999995E-7,0.89302800000000004]
["1.5300000.00000000001",1.5,30000,9.9999999999999994E-12,1.993333]
["1.5300000.00000000005",1.5,30000,5.0000000000000002E-11,1.326667]
["1.5300000.0000000001",1.5,30000,1E-10,1.236667]
["1.5300000.000000001",1.5,30000,1.0000000000000001E-9,1.03]
["1.5300000.00000001",1.5,30000,1E-8,0.9227533]
["1.5300000.0000001",1.5,30000,9.9999999999999995E-8,0.88653329999999997]
["1.5300000.000001",1.5,30000,9.9999999999999995E-7,0.89488670000000003]
["1.5350000.00000000001",1.5,35000,9.9999999999999994E-12,1.9142859999999999]
["1.5350000.00000000005",1.5,35000,5.0000000000000002E-11,1.3028569999999999]
["1.5350000.0000000001",1.5,35000,1E-10,1.2314290000000001]
["1.5350000.000000001",1.5,35000,1.0000000000000001E-9,1.0314289999999999]
["1.5350000.00000001",1.5,35000,1E-8,0.91854290000000005]
["1.5350000.0000001",1.5,35000,9.9999999999999995E-8,0.88686290000000001]
["1.5350000.000001",1.5,35000,9.9999999999999995E-7,0.89372289999999999]
["1.5400000.00000000001",1.5,40000,9.9999999999999994E-12,1.86]
["1.5400000.00000000005",1.5,40000,5.0000000000000002E-11,1.2949999999999999]
["1.5400000.0000000001",1.5,40000,1E-10,1.2250000000000001]
["1.5400000.000000001",1.5,40000,1.0000000000000001E-9,1.03]
["1.5400000.00000001",1.5,40000,1E-8,0.91869749999999994]
["1.5400000.0000001",1.5,40000,9.9999999999999995E-8,0.88500500000000004]
["1.5400000.000001",1.5,40000,9.9999999999999995E-7,0.89396249999999999]
["1.5450000.00000000001",1.5,45000,9.9999999999999994E-12,1.802222]
["1.5450000.00000000005",1.5,45000,5.0000000000000002E-11,1.2844439999999999]
["1.5450000.0000000001",1.5,45000,1E-10,1.213333]
["1.5450000.000000001",1.5,45000,1.0000000000000001E-9,1.0244439999999999]
["1.5450000.00000001",1.5,45000,1E-8,0.92153560000000001]
["1.5450000.0000001",1.5,45000,9.9999999999999995E-8,0.88602219999999998]
["1.5450000.000001",1.5,45000,9.9999999999999995E-7,0.89183559999999995]
["1.5500000.00000000001",1.5,50000,9.9999999999999994E-12,1.774]
["1.5500000.00000000005",1.5,50000,5.0000000000000002E-11,1.272]
[{"$f":"B194&C194&D194","v":"1.5500000.0000000001"},1.5,50000,1E-10,1.214]
["1.5500000.000000001",1.5,50000,1.0000000000000001E-9,1.024]
["1.5500000.00000001",1.5,50000,1E-8,0.92679199999999995]
["1.5500000.0000001",1.5,50000,9.9999999999999995E-8,0.88598399999999999]
["1.5500000.000001",1.5,50000,9.9999999999999995E-7,0.89178400000000002]
["1.5550000.00000000001",1.5,55000,9.9999999999999994E-12,1.745455]
["1.5550000.00000000005",1.5,55000,5.0000000000000002E-11,1.269091]
{"$rows_left_out":2760}
{"sheet":"Copyright and Disclaimer","index":3,"n_rows":9,"n_cols":3,"rows_kept":9,"cut":false,"hidden":false,"merged":[[7,1,7,8],[3,1,3,8]]}
["File","TPUL_KFactor_Calculator.xlsm"]
["Revision",0.1,"Pre-release"]
["Revision Date","2025-02-01"]
["Source organization","Texas Instruments Incorporated\nASC-INT-LOGIC\n12500 TI Blvd\nDallas, TX 75243"]
["Revision History"]
["Rev 0.1: 02/01/2025","Initial release"]
[null,"Values are based on simulated operation"]
["Disclaimer","This calculator is designed as an aid for customers of Texas Instruments.\nTI and its licensors and suppliers make no warranties, either expressed\nor implied, with respect to this calculator, including the warranties of\nmerchantability or fitness for a particular purpose. The calculator is\nprovided solely on an \"as is\" basis. The entire risk as to its quality\nand performance is with the customer."]
["Copyright","(C) Copyright 2025 Texas Instruments Incorporated. All rights reserved."]