{"text_format":"1","workbook":"xlsx","n_sheets":12,"sheets":["Design Regulator","BOM & Schematic","EVM","Variable Management","Stability Calculations","Bode Plot Management","Efficiency Calculations","Efficiency Plot Management","Schematic Management","Standard Value Calculator","Snubber","Parallel Output Caps"],"not_rendered":{"charts":7,"images":27,"macros":1,"external_links":0,"defined_names":260,"comments":1,"pivot_tables":0},"unopened":[],"bounds":{"document_bytes":16777216,"sheet_cells":100000,"rows_first":2000,"rows_last":500,"rows_between":2000,"halvings":0,"cell_chars":16384,"cell_head_chars":4096},"cells_cut":0,"cells_raw":0,"read":"whole","date_system":"1900"}

{"sheet":"Design Regulator","index":0,"n_rows":103,"n_cols":17,"rows_kept":103,"cut":false,"hidden":false,"merged":[[70,5,70,7],[2,14,2,15],[0,0,0,16],[81,5,81,6],[80,7,80,8],[36,11,37,16]]}
["                        LM25141-Q1 Synchronous Buck Controller Design Tool"]
[null,null,null,null,null,null,null,null,null,null,null,null,null,null,"http://www.ti.com/product/lm5175"]
["About",null,"xx",null,null,"= Input Box",null,null,null,null,null,null,null,null,"TERMS OF USE",null,"                "]
[]
["Step 1: Operating Specifications"]
[null,null,null,"Input Voltage – Min, VIN(min) ",8,"V"]
[null,null,null,"Input Voltage – Nom, VIN(nom)",13.5,"V"]
[null,null,null,"Input Voltage – Max, VIN(max)",18,"V"]
[null,null,null,"Output Voltage, VOUT ",5,"V"]
[null,null,null,"Full Load Output Current, IOUT ",12,"A"]
[null,null,null,{"$f":"IF(OSC=1, \"* Tie OSC to VDDA\", \"* Tie OSC to AGND\")","v":"* Tie OSC to VDDA"}]
[null,null,null,"Switching Frequency, FSW",2100,"kHz"]
[null,null,null,"Frequency Set Resistor, RT ",{"$f":"'Variable Management'!C367","v":52.3},"kΩ"]
[null,null,null,"Ambient Temperature, TA",25,"°C"]
[]
["Step 2: Current Sense Resistor"]
[null,null,null,"Required IOCP Setpoint at VIN(nom)",18,"A"]
[null,null,null,"Recommended Sense Resistance",{"$f":"Rs_ideal*1000","v":3.8698702342065263},"mΩ"]
[null,null,null,"Sense Resistance, RS",4,"mΩ"]
[null,null,null,"Min Inductor Sat Current, ILO(SAT)",{"$f":"'Variable Management'!B95","v":18.75},"A"]
[null,null,null,"Max power loss in shunt",{"$f":"'Variable Management'!B105","v":1.2868066655183203},"W"]
[null,null,null,"VIN(min)",{"$f":"'Variable Management'!B97","v":17.929791381580646},"A"]
[null,null,"IOUT(typ) at OCP Inception:","VIN(nom)",{"$f":"'Variable Management'!B98","v":17.369505187264267},"A"]
[null,null,null,"VIN(max)",{"$f":"'Variable Management'!B99","v":17.165087424395935},"A"]
[]
["Step 3: Buck Inductance"]
[null,null,null,"Recommended Inductance",{"$f":"Lopt*1000000","v":0.3968253968253968},"µH"]
[null,null,null,"Inductance, LO ",0.55000000000000004,"µH"]
[null,null,null,"Inductor DCR ",2.9,"mΩ"]
[null,null,null,"DIL as a % at VIN(nom)",{"$f":"'Variable Management'!B68*100","v":23.008246878928894},"%"]
[]
[]
[]
["Step 4: Output Capacitors"]
[null,null,null,"Output Voltage Ripple Spec",100,"mVPK-PK"]
[null,null,null,"Minimum Output Capacitance",{"$f":"'Variable Management'!B121","v":2.2000000000000002},"µF"]
[null,null,null,"Output Capacitance (derated), COUT ",85,"µF",null,null,null,null,null,{"$f":"CHOOSE(SCH_MODE, \"\", \"** For Single-Output Operation in 2-Phase Mode, tie MODE to VDDA and use FB1 to set VOUT **\", \"** For Single-Output Operation in 3-Phase Mode, tie both MODE pins to VDDA. Use FB1 of master IC to set VOUT. Connect FB2 of master IC to AGND. Connect FB2 of slave IC to VDDA to configure it as a slave **\", \"** For Single-Output Operation in 4-Phase Mode, tie both MODE pins to VDDA. Use FB1 of master IC to set VOUT. Connect FB2 of master IC to AGND. Connect FB2 of slave IC to VDDA to configure it as a slave **\")","v":""}]
[null,null,null,"Maximum Permitted ESR",{"$f":"'Variable Management'!B125","v":36.212126939621946},"mΩ"]
[null,null,null,"Output Capacitor ESR",1,"mΩ",null,null,null,null,null,{"$f":"CHOOSE(SCH_MODE,  \"\", \"** Tie VCCX to GND if not used **\", \"** Slave controller (CNTRL2) not shown **\",\"** Slave controller (CNTRL2) not shown **\")","v":""}]
[null,null,null,"Resulting Output Voltage Ripple (max) ",{"$f":"'Variable Management'!B127*1000","v":3.3706609093319355},"mVPK-PK",null,null,null,null,null,{"$f":"IF(OR(SCH_MODE=3, SCH_MODE=4),\"** Tie VCCX to GND if not used **\", \"\")","v":""}]
[null,null,null,"Output Capacitor RMS Current (max) ",{"$f":"'Variable Management'!B114","v":0.91504970216703008},"ARMS"]
[]
["Step 5: Input Capacitors"]
[null,null,null,"Input Voltage Ripple Spec",100,"mVPk-PK"]
[null,null,null,"Minimum Input Capacitance",{"$f":"'Variable Management'!B146","v":14.285714285714285},"µF"]
[null,null,null,"Input Capacitance (derated), CIN ",30,"µF"]
[null,null,null,"Maximum Permitted ESR",{"$f":"'Variable Management'!B152","v":3.8558181430639955},"mΩ",null,null,null,null,null,null,null,null,null,null," "]
[null,null,null,"Input Capacitor ESR",1,"mΩ"]
[null,null,null,"Resulting Input Voltage Ripple (max)",{"$f":"'Variable Management'!B158*1000","v":61.203960194651685},"mVPK-PK"]
[null,null,null,"Input Capacitor RMS Current (max)",{"$f":"'Variable Management'!B138","v":5.8304747696248453},"ARMS"]
[]
["Step 6: Soft-start, Hiccup, Dither, Diode Emulation Mode"]
[null,null,null,"Soft-Start Time, tSS ",3,"ms"]
[null,null,null,"Soft-Start Capacitance, CSS ",{"$f":"IF(Tss>0.5/1000,Css_u*1000000000,\"N/A\")","v":56},"nF"]
[null,null,null,"Hiccup Fault Time, tRES ",20,"ms"]
[null,null,null,"RES Capacitance, CRES ",{"$f":"IF(Tres>1/1000,Cres_u*1000000000,\"N/A\")","v":330},"nF"]
[null,null,null,"Modulating Frequency",8,{"$f":"IF(DITHER=1, \"kHz\", \"\")","v":"kHz"}]
[null,null,null,{"$f":"IF(DITHER=1, \"DITH Capacitance, Cd\", \"* Tie DITH to VDDA\")","v":"DITH Capacitance, Cd"},{"$f":"IF(DITHER=1,IF(E57>0,'Standard Value Calculator'!O22*1000000000,\"N/A\"),\"\")","v":10},{"$f":"IF(DITHER=1, \"nF\", \"\")","v":"nF"}]
[null,null,null,{"$f":"IF(DEMB=1, \"* Tie DEMB to VDDA\", \"* Tie DEMB to AGND\")","v":"* Tie DEMB to VDDA"}]
[]
[]
["Step 7: Compensation Design"]
[null,null,null,"Load Pole Frequency",{"$f":"Fp_dominant","v":5530.3344622701316},"Hz"]
[null,null,null,"ESR Zero Frequency",{"$f":"Fesr/1000","v":1872.4110973383101},"kHz"]
[null,null,null,"Desired Crossover Frequency",60,{"$f":"\"     kHz \"","v":"     kHz "}]
[null,null,null,"Error Amp Pole Frequency",{"$f":"Fp1_u","v":0.52906122062329253},"Hz"]
[null,null,null,{"$f":"CHOOSE(VOUT_setting, \"Upper Feedback Resistor\", \"* Tie FB to AGND for Fixed 5V Output\", \"* Tie FB to VDDA for Fixed 3.3V Output\")","v":"* Tie FB to AGND for Fixed 5V Output"},49.9,"kΩ"]
[null,null,null,{"$f":"CHOOSE(VOUT_setting, \"Lower Feedback Resistor\", \"\", \"\")","v":""},{"$f":"IF(Vout=Vref,\"OPEN\",Rfb2_u/1000)","v":15.8},{"$f":"IF(Vout=Vref,\"\",\"kΩ\")","v":"kΩ"}]
[]
["Compensation Components"]
[null,"Calculated /","Std Values",{"$f":"C71","v":"Std Values"},null,"Actual P/Z Frequencies"]
["RC1",{"$f":"Rcea1/1000","v":5.3407075050000019},{"$f":"'Standard Value Calculator'!O30","v":5.36},{"$f":"C72","v":5.36},"kΩ",{"$f":"Fp1_u","v":0.52906122062329253},"Hz   (FPEA)"]
["CC1",{"$f":"Cc1ea*1000000000","v":4.9667246997005101},{"$f":"'Standard Value Calculator'!O31","v":4.7},{"$f":"C73","v":4.7},"nF",{"$f":"Fz1_u/1000","v":6.3176779641853109},"kHz (FZCOMP)"]
["CC2",{"$f":"IF(Cc2ea<0, \"N/A\", Cc2ea*1000000000000)","v":"N/A"},{"$f":"'Standard Value Calculator'!O32","v":0},{"$f":"C74","v":0},"pF",{"$f":"Fp2_u/1000","v":932.83582089552249},"kHz (FPCOMP)"]
[null,null,null,null,null,null,null,null,null,null,null,null,null,"** Specify Inductor Core Loss **",0.25,"W"]
[]
["Efficiency / Power Loss Analyzer"]
[]
["Step 8: Efficiency"]
[null,null,null,null,null,"Power MOSFETs","(Q1, Q2) "]
[null,null,null,null,"IAUC60N04S6L039, L032"]
[null,null,null,null,"High-side","  Low-side"]
[null,null,null,"On-State Resistance, RDS(on) ",4.5,3.65,"mΩ"]
[null,null,null,"Total Gate Charge, QG ",8,9,"nC"]
[null,null,null,"Gate-Drain Charge, QGD ",3.1,3.9,"nC"]
[null,null,null,"Gate-Source Charge, QGS ",2.9,3.8,"nC"]
[null,null,null,"Output Charge, QOSS ",null,12,"nC"]
[null,null,null,"Output Capacitance, COSS ",259,330,"pF"]
[null,null,null,"Gate Resistance, RG ",0,0,"Ω"]
[null,null,null,"Transconductance, gFS ",71,71,"S"]
[null,null,null,"Gate-Source Threshold Voltage, VTH ",3.2,3.2,"V"]
[null,null,null,"Body Diode Forward Voltage, VBD ",0.8,0.8,"V"]
[null,null,null,"Body Diode Rev Recovery Charge, QRR ",null,13,"nC"]
[null,null,null,"Thermal Resistance, θJA ",50,50,"°C/W"]
[]
["External Schottky Diode (if applicable)"]
[null,null,null,"Schottky Fwd Voltage, VFWDsch ",null,0,"V"]
[null,null,null,"Schottky Rev Recovery Charge, QRRsch ",null,0,"nC"]
[]
["Step 9: IC Power Loss"]
[null,null,null,"IC Power Dissipation",{"$f":"'Variable Management'!B308","v":0.17850000000000002},"W"]
[null,null,null,"IC Junction Temperature (estimate)",{"$f":"'Variable Management'!B310","v":31.086850000000002},"°C"]
[null,null,null,null,{"$f":"CHOOSE(Ext_VCC, \"* Tie VCCX to VOUT\", \"* Tie VCCX to PGND\")","v":"* Tie VCCX to VOUT"}]

{"sheet":"BOM & Schematic","index":1,"n_rows":70,"n_cols":10,"rows_kept":70,"cut":false,"hidden":false,"merged":[[64,0,65,0],[64,9,65,9],[64,3,65,6],[64,2,65,2],[64,1,65,1],[64,7,65,7],[64,8,65,8],[41,3,41,6],[46,3,46,5],[60,3,60,6],[58,3,58,6],[59,3,59,6],[54,3,54,6],[57,3,57,6],[56,3,56,6],[53,3,53,6],[42,3,42,5],[43,3,43,5],[48,3,48,5],[49,3,49,5],[51,3,51,5],[44,3,44,5],[45,3,45,5],[50,3,50,5],[47,3,47,5],[62,3,62,6],[63,3,63,6],[61,3,61,6],[52,3,52,5],[55,3,55,6]]}
[]
[]
[]
[]
[]
[]
[]
[]
[]
[]
[]
[]
[]
[]
[]
[]
[]
[]
[]
[]
[]
[]
[]
[]
[]
[]
[]
[]
[]
[]
[]
[]
[]
[]
[]
["   ** Tie DEMB to VDDA for FPWM, AGND for DEM **"]
["   ** Tie VCCX to GND if not used **",null,null,null,null,null,null,null,{"$f":"IF(OR(SCH_MODE=3, SCH_MODE=4),\"** Tie VCCX to GND if not used **\", \"\")","v":""}]
["   ** Tie DITH to VDDA to disable spread spectrum **"]
["   ** Tie OSC to VDDA for 2.2MHz, AGND for 440kHz **"]
[{"$f":"\"VIN = \"&VIN_min&\"V to \"&VIN_max&\"V, VOUT = \"& Vout &\"V, IOUT = \" &Iout & \"A, Fsw = \" & Fsw/1000 &\"kHz, Current Limit = \"&ROUNDUP(Ilimit_DC,0)&\"A\"","v":"VIN = 8V to 18V, VOUT = 5V, IOUT = 12A, Fsw = 2100kHz, Current Limit = 18A"}]
["High Efficiency Synchronous Buck Regulator BOM"]
["Count","Ref Des","Value","Description",null,null,null,"Size","Part Number","MFR"]
[1,"CBOOT",0.1,{"$f":"C43","v":0.1},null,null,null,"0603","Std","Std"]
[1,"CC1",{"$f":"'Design Regulator'!D73","v":4.7},4.7,null,null,null,"0603","Std","Std"]
[1,"CC2",{"$f":"'Design Regulator'!D74","v":0},0,null,null,null,"0603","Std","Std"]
[1,"CRES",{"$f":"Cres_u*1000000000","v":330},{"$f":"C46","v":330},null,null,null,"0603","Std","Std"]
[1,"CDITH",{"$f":"Cdither*1000000000","v":10},{"$f":"C47","v":10},null,null,null,"0603","Std","Std"]
[{"$f":"ROUNDUP('Design Regulator'!E46/10,0)","v":3},"CIN",10,{"$f":"C48","v":10},null,null,null,1210,"Std","Std"]
[{"$f":"ROUNDUP('Design Regulator'!E37/47,0)","v":2},"COUT",47,{"$f":"C49","v":47},null,null,null,1210,"Std","Std"]
[1,"CSS",{"$f":"'Design Regulator'!E54","v":56},{"$f":"C50","v":56},null,null,null,"0603","Std","Std"]
[2,"CVCC, CVCCX",2.2000000000000002,2.2000000000000002,null,null,null,"0603","Std","Std"]
[1,"CVDDA",0.47,0.47,null,null,null,"0603","Std","Std"]
[1,"DBOOT","See description","Schottky Diode, 60V, 200mA",null,null,null,"-","-","Various"]
[1,"LO",{"$f":"'Design Regulator'!E28","v":0.55000000000000004},{"$f":"\"Inductor, \"&Lf*1000000&\"µH, \"&Rdcr*1000&\"mΩ, >\"&ROUNDUP(Ilimit_DC*1.1,0)&\"A\"","v":"Inductor, 0.55µH, 2.9mΩ, >20A"},null,null,null,"-","-","Various"]
[2,"Q1, Q2","See description",{"$f":"'Design Regulator'!E83","v":4.5},null,null,null,"Std",{"$f":"'Design Regulator'!E81","v":"IAUC60N04S6L039, L032"},"-"]
[1,"RC1",{"$f":"'Design Regulator'!D72","v":5.36},{"$f":"C56","v":5.36},null,null,null,"0603","Std","Std"]
[1,"RS",{"$f":"Rs*1000","v":4},4,null,null,null,"0508","Std","Std"]
[1,"RT",{"$f":"'Design Regulator'!E13","v":52.3},52.3,null,null,null,"0603","Std","Std"]
[1,"RFB1",{"$f":"'Design Regulator'!E67","v":49.9},49.9,null,null,null,"0603","Std","Std"]
[1,"RFB2",{"$f":"'Design Regulator'!E68","v":15.8},15.8,null,null,null,"0603","Std","Std"]
[1,"RPGOOD",100,100,null,null,null,"0603","Std","Std"]
[1,"RCS",100,100,null,null,null,"0603","Std","Std"]
[1,"RDEMB",100,100,null,null,null,"0603","Std","Std"]
[1,"RVIN",2.2000000000000002,2.2000000000000002,null,null,null,"0603","Std","Std"]
[1,"U1","LM25141-Q1","IC, LM25141-Q1, Synchronous Buck PWM Controller, 3.8V–42V Input",null,null,null,"VQFN-24","LM25141QRGEQ1","TI"]
[]
[]
["NOTES:"]
["** Inductor saturation current should be higher than the peak inductor current at the OCP setpoint for all input voltages and operating temperatures **"]
["** Effective input and output capacitances should be appropriately derated for applied voltage and temperature, particularly with ceramics **"]

{"sheet":"EVM","index":2,"n_rows":6,"n_cols":2,"rows_kept":6,"cut":false,"hidden":true,"merged":[[0,0,0,16]]}
[" LM5143-Q1 Quickstart Design Tool"]
[]
[]
[]
[]
[null,"LM5143-Q1EVM-2100 PCB Layout"]

{"sheet":"Variable Management","index":3,"n_rows":374,"n_cols":27,"rows_kept":374,"cut":false,"hidden":true,"merged":[[4,4,4,7],[0,0,0,8]]}
["EXCEL Variables Names/Calculations"]
[null,"Input from user ="]
[null,"Output ="]
[null,"Constant"]
["Variable Name","Value","STD Units",null,"Notes",null,null,null,"Iteration"]
["Step 1: Operational Specs"]
["VIN_min",{"$f":"'Design Regulator'!E6","v":8},"V","Minimum input voltage",null,null,null,null,1]
["VIN_nom",{"$f":"'Design Regulator'!E7","v":13.5},"V","Nominal input voltage",null,null,null,null,null,null,{"$f":"CHOOSE(SCH_MODE, \"Efficiency vs. IOUT (Ch1)\", \"Efficiency vs. IOUT - 2 Ph\", \"Efficiency vs. IOUT - 3 Ph\", \"Efficiency vs. IOUT - 4 Ph\")","v":"Efficiency vs. IOUT (Ch1)"},1,null,"DITHER Enabled",1,null,null,null,null,"Dual  Outputs",1,null,"FPWM",1,null,{"$f":"CHOOSE(SCH_MODE, \"Bode Plot (Ch1)\", \"Bode Plot - 2 Ph\", \"Bode Plot - 3 Ph\", \"Bode Plot - 4 Ph\")","v":"Bode Plot (Ch1)"},1]
["VIN_max",{"$f":"'Design Regulator'!E8","v":18},"V","Maximum input voltage",null,null,null,null,null,null,{"$f":"IF(MODE=1, \"Efficiency vs. IOUT (Ch2)\", \"N/A - Do Not Use\")","v":"Efficiency vs. IOUT (Ch2)"},2,null,"DITHER Disabled",2,null,null,null,null,"Single Output – 2  Phases",2,null,"DEM",2,null,{"$f":"IF(MODE=1, \"Bode Plot (Ch2)\", \"N/A - Do Not Use\")","v":"Bode Plot (Ch2)"},2]
[null,null,null,null,null,null,null,null,null,null,"PLOT_TYPE",1,null,"DITHER Yes/No",1,"1 = Yes, 2 = No",null,null,null,"Single Output – 3  Phases",3,null,"FPWM/DEM",1,null,"BODE_PLOT_TYPE",1]
["Vout",{"$f":"'Design Regulator'!E9","v":5},"V","Output voltage - channel 1",null,null,null,null,null,null,null,null,null,null,null,null,null,null,null,"Single Output – 4  Phases",4]
["Iout",{"$f":"'Design Regulator'!E10","v":12},"A","Output current - channel 1",null,null,null,null,1,null,null,null,null,null,null,null,null,null,null,"Single/Dual Yes/No",1]
[null,null,null,null,null,null,null,null,1,null,"Adjustable",1,null,"3.3V",1,null,null,null,null,"MODE (Single/Dual), DUAL = 1, SINGLE = 2",{"$f":"IF(U12=1, 1, 2)","v":1},null,"VCCX Connected",1]
["Rout",{"$f":"Vout/Iout","v":0.41666666666666669},"W","Load resistance - Channel 1",null,null,null,null,null,null,"5V",2,null,"5V",2,null,null,null,null,"SINGLE OUTPUT (1 = YES)",{"$f":"IF(U12=1, 2, 1)","v":2},null,"No External VCC",2]
[null,null,null,null,null,null,null,null,null,null,"3.3V",3,null,"Adjustable",3,null,null,null,null,"Number of Phases",{"$f":"SCH_MODE","v":1},null,"Ext_VCC",1]
["Pout",{"$f":"Vout*Iout","v":60},"W","Output power",null,null,null,null,null,null,"Output Voltage Setting",{"$f":"IF(Vout=3.3, 3, IF(Vout=5, 2, 1))","v":2},null,"Ch2 Output Setting",{"$f":"IF(Vout2=3.3, 1, IF(Vout2=5, 2, 3))","v":3}]
[]
["Efficiency",0.9,null,"Estimate of efficiency"]
["Pin",{"$f":"Pout/Efficiency","v":66.666666666666671},"W","Calculate input power assuming finite efficiency",null,null,null,null,null,null,null,null,null,null,null,null,null,null,null,null,null,null,"2.2 MHz Fsw Setting",1]
[null,null,null,null,null,null,null,null,null,null,null,null,null,null,null,null,null,null,null,null,null,null,"440 kHz Fsw Setting",2]
["Iin_Vinmin",{"$f":"Pin/VIN_min","v":8.3333333333333339},"A",null,null,null,null,null,null,null,null,{"$f":"Vout","v":5},null,null,null,null,null,null,null,null,null,null,"OSC",1]
["Iin_Vinnom",{"$f":"Pin/VIN_nom","v":4.9382716049382722},"A","Input currents at min, nom, max Vin",null,null,null,{"$f":"AND(OSC=1, OR(Fsw/1000>2530, Fsw/1000<1800))","v":false}]
["Iin_Vinmax",{"$f":"Pin/VIN_max","v":3.7037037037037042},"A",null,null,null,null,{"$f":"AND(OSC=2, OR(Fsw/1000>500, Fsw/1000<300))","v":false}]
[null,null,null,null,null,null,null,{"$f":"OR(H22,H23)","v":false}]
["OSC setting",{"$f":"CHOOSE(OSC, 2200, 440)","v":2200},"kHz"]
["Fsw",{"$f":"'Design Regulator'!E12*1000","v":2100000},"Hz","Nominal switching frequency - determines RT resistor (SYNCIN must be 80-120% of this)",null,null,null,null,null,null,null,null,null,"Min CS Gain - 11.4",1]
["RT resistor to AGND - 2.2MHz setting",{"$f":"(1/(Fsw/1000000)-0.0216)/0.0086","v":52.859357696566995},"kΩ",null,null,null,null,null,null,null,"Adjustable",1,null,"Nom CS Gain - 12",2]
["RT resistor to AGND - 440kHz setting",{"$f":"(1/(Fsw/1000)-0.0000138)/0.000045","v":10.275343915343914},"kΩ",null,null,null,null,null,1,null,"5V",2,null,"Max CS Gain - 12.6",3]
["Tsw",{"$f":"1/Fsw","v":4.7619047619047617E-7},"sec","Switching period",null,null,null,null,null,null,"3.3V",3,null,"CS Gain",2]
["Vref",1.2,"V","Reference voltage",null,null,null,null,null,null,"Adjustable_NoRT",4,null,null,{"$f":"CHOOSE(O29, 11.4, 12, 12.6)","v":12}]
["Rt",{"$f":"CHOOSE(OSC, 'Standard Value Calculator'!O12/1000, 'Standard Value Calculator'!O13/1000)","v":52.3},"kΩ","Frequency set resistor",null,{"$f":"IF(OR((Fsw=440000),(Fsw=2200000)),\"N/A\",Rfadj/1000)","v":5.2299999999999999E-2},null,null,null,null,"5V_NoRT",5]
[null,null,null,null,null,null,null,null,null,null,"3.3V_NoRT",6,null,"Min EA gm - 1.01mS",1010]
["Step 2: Buck Inductor","Channel 1",null,null,null,null,null,null,null,null,"Schematic setting",{"$f":"IF(No_RT, IF(Vout=3.3, 6, IF(Vout=5, 5, 4)),IF(Vout=3.3, 3, IF(Vout=5, 2, 1)))","v":2},null,"Nom EA gm - 1.2mS",1200]
["Don1",{"$f":"Vout/VIN_nom","v":0.37037037037037035},null,null,null,"Ideal Duty Cycle at VIN(nom)",null,null,null,null,null,null,null,"Max EA gm - 1.4mS",1400]
["Doff1",{"$f":"1-34:34","v":0.62962962962962965},null,null,null,"Ideal 1- Duty Cycle at VIN(nom)",null,null,null,null,null,null,null,"EA Transconductance",2]
[null,null,null,null,null,null,null,null,null,null,null,null,null,null,{"$f":"CHOOSE(O35, 0.000101, 0.0012, 0.0014)","v":1.1999999999999999E-3}]
["D_Vinmin",{"$f":"Vout/VIN_min","v":0.625}]
["D_Vinnom",{"$f":"Vout/VIN_nom","v":0.37037037037037035}]
["D_Vinmax",{"$f":"Vout/VIN_max","v":0.27777777777777779}]
[]
["L_Vinnom",{"$f":"(VIN_nom-Vout)*D1_Vinnom/(Fsw*(Iout/Number_of_Phases)*0.35)","v":3.5693289661543628E-7},"H",null,null,"Calculated inductance for 35% ripple at VIN(nom)"]
["L_slopecomp",{"$f":"1000*Vout*Rs/24/Fsw","v":3.9682539682539683E-7},"H",null,null,"Calculated inductance based on one times inductor downslope"]
[]
["Lopt",{"$f":"B42","v":3.9682539682539683E-7},"H",null,null,"min of calculated inductances at VIN(min) and VIN(nom)"]
[]
["Lo",{"$f":"'Design Regulator'!E28/1000000","v":5.5000000000000003E-7},"H",null,null,"Chosen inductance"]
["Rdcr",{"$f":"'Design Regulator'!E29/1000","v":2.8999999999999998E-3},"W",null,null,"Chosen inductor DCR"]
[]
["Don2",{"$f":"(Vout+Iout*(Rdcr+Rs))/(Vin+Iout*Rs)","v":0.37516976675524061}]
["Doff2",{"$f":"1-_Don2","v":0.62483023324475939}]
[]
["D_Vinmin_2",{"$f":"CHOOSE(MODE, (Vout+Iout*(Rdcr+Rs))/(VIN_min+Iout*Rs), (Vout+Iout/Number_of_Phases*(Rdcr+Rs))/(VIN_min+Iout/Number_of_Phases*Rs))","v":0.63156063618290259},null,null,null,"Duty cycles adjusted for DCR/shunt voltage drops"]
["D_Vinnom_2",{"$f":"CHOOSE(MODE, (Vout+Iout*(Rdcr+Rs))/(VIN_nom+Iout*Rs), (Vout+Iout/Number_of_Phases*(Rdcr+Rs))/(VIN_nom+Iout/Number_of_Phases*Rs))","v":0.37516976675524061},null,null,null,"need to include RDS(on) later"]
["D_Vinmax_2",{"$f":"CHOOSE(MODE, (Vout+Iout*(Rdcr+Rs))/(VIN_max+Iout*Rs), (Vout+Iout/Number_of_Phases*(Rdcr+Rs))/(VIN_max+Iout/Number_of_Phases*Rs))","v":0.2816267730496454}]
[]
["Iripple_Vinmin",{"$f":"(VIN_min-Vout)*D1_Vinmin_2/(Fsw*Lf)","v":1.640417236838708},"A"]
["Iripple_Vinnom",{"$f":"(VIN_nom-Vout)*D1_Vinnom_2/(Fsw*Lf)","v":2.7609896254714674},"A"]
["Iripple_Vinmax",{"$f":"(VIN_max-Vout)*D1_Vinmax_2/(Fsw*Lf)","v":3.1698251512081299},"A"]
[]
["Ishunt_rms_Vinmin",{"$f":"SQRT((Iout/Number_of_Phases)^2+(Iripple_Vinmin^2)/12)","v":12.009340006535599},"A"]
["Ishunt_rms_Vinnom",{"$f":"SQRT((Iout/Number_of_Phases)^2+(Iripple_Vinnom^2)/12)","v":12.02643984350024},"A"]
["Ishunt_rms_Vinmax",{"$f":"SQRT((Iout/Number_of_Phases)^2+(Iripple_Vinmax^2)/12)","v":12.034837595806433},"A"]
["Max shunt power loss at full load",{"$f":"B61^2*Rs","v":0.57854102123732043},"W",null,null,"Note this is power loss at full load - not loss near OCP!"]
[]
["Max inductor ripple current",{"$f":"MAX(B56:B58)","v":3.1698251512081299},"A",null,null,"Ripple current at Vin(max)"]
[]
[null,{"$f":"B56/(Iout/Number_of_Phases)","v":0.13670143640322566}]
["% ripple current",{"$f":"B57/(Iout/Number_of_Phases)","v":0.23008246878928895}]
[null,{"$f":"B58/(Iout/Number_of_Phases)","v":0.26415209593401084}]
[]
["Inductor copper temerature",100,"°C"]
["DCR at hot",{"$f":"Rdcr*(1+0.0039*(B71-25))","v":3.7482499999999998E-3},"W"]
[]
[]
["Step 3: Sense Resistors, Slope Comp, Current Limit"]
[]
["Ilimit_DC",{"$f":"'Design Regulator'!E17","v":18},"A",null,null,"Chosen OCP level - based on output current"]
[]
["Ilimit_inductor_Vinmin",{"$f":"CHOOSE(MODE, Ilimit_DC+Iripple_Vinmin/2, Ilimit_DC/Number_of_Phases+Iripple_Vinmin/2)","v":18.820208618419354},"A",null,null,"Peak inductor current at current limit inception"]
["Ilimit_inductor_Vinnom",{"$f":"CHOOSE(MODE, Ilimit_DC+Iripple_Vinnom/2, Ilimit_DC/Number_of_Phases+Iripple_Vinnom/2)","v":19.380494812735733},"A"]
["Ilimit_inductor_Vinmax",{"$f":"CHOOSE(MODE, Ilimit_DC+Iripple_Vinmax/2, Ilimit_DC/Number_of_Phases+Iripple_Vinmax/2)","v":19.584912575604065},"A"]
[]
[]
["CS threshold_min",6.8000000000000005E-2,"V"]
["CS threshold",7.4999999999999997E-2,"V"]
["CS threshold_max",8.2000000000000003E-2,"V"]
[]
["Shunt required to get OCP at VIN(min)",{"$f":"Buck_CS_threshold/B79","v":3.9850780360955957E-3},"W"]
["Shunt required to get OCP at VIN(nom)",{"$f":"Buck_CS_threshold/B80","v":3.8698702342065262E-3},"W"]
["Shunt required to get OCP at VIN(max)",{"$f":"Buck_CS_threshold/B81","v":3.8294784166370854E-3},"W"]
[]
["Rs_ideal",{"$f":"B89","v":3.8698702342065262E-3},"W",null,null,"Ideal Rs for the required OCP -- based on 73mV CL threshold"]
["Rs",{"$f":"'Design Regulator'!E19/1000","v":4.0000000000000001E-3},"W",null,null,"Selected (starndard value) current limit sense resistor"]
[]
["Current limit - peak",{"$f":"Buck_CS_threshold/Rs","v":18.75},"A",null,null,"Peak inductor current limit = min sat current"]
[]
["Iout_OCP_Vinmin",{"$f":"Number_of_Phases*(Buck_CS_threshold/Rs-Iripple_Vinmin/2)","v":17.929791381580646},"A",null,null,"Current limit setpoints (i.e. IOUT) after standard components are selected"]
["Iout_OCP_Vinnom",{"$f":"Number_of_Phases*(Buck_CS_threshold/Rs-Iripple_Vinnom/2)","v":17.369505187264267},"A"]
["Iout_OCP_Vinmax",{"$f":"Number_of_Phases*(Buck_CS_threshold/Rs-Iripple_Vinmax/2)","v":17.165087424395935},"A"]
[]
["Irms_OCP_Vinmin",{"$f":"SQRT((Iout_OCP_Vinmin/Number_of_Phases)^2+(Iripple_Vinmin^2)/12)","v":17.936043777254227},"A"]
["Irms_OCP_Vinnom",{"$f":"SQRT((Iout_OCP_Vinnom/Number_of_Phases)^2+(Iripple_Vinnom^2)/12)","v":17.387782082822707},"A"]
["Irms_OCP_Vinmax",{"$f":"SQRT((Iout_OCP_Vinmax/Number_of_Phases)^2+(Iripple_Vinmax^2)/12)","v":17.189460208063295},"A"]
[]
["Pshunt_Vinmin",{"$f":"B101^2*Rs","v":1.2868066655183203},"W",null,null,"Max power dissipations in shunt"]
["Pshunt_Vinnom",{"$f":"B102^2*Rs","v":1.2093398630389214},"W"]
["Pshunt_Vinmax",{"$f":"B103^2*Rs","v":1.1819101689783655},"W"]
[]
[]
["Step 4: Output Capacitor"]
["Icoutrms_VINmin",{"$f":"Iripple_Vinmin/SQRT(12)","v":0.47354766663606512},"A",null,null,"Output Cap RMS current"]
["Icoutrms_VINnom",{"$f":"Iripple_Vinnom/SQRT(12)","v":0.79702905174785788},"A"]
["Icoutrms_VINmax",{"$f":"Iripple_Vinmax/SQRT(12)","v":0.91504970216703008},"A"]
["Max Cout rms current",{"$f":"MAX(B111:B113)","v":0.91504970216703008},"A"]
[]
["Vripple1",{"$f":"'Design Regulator'!E35/1000","v":0.1},"V",null,null,"Output voltage ripple spec(pk-pk)"]
[]
["Output Ripple Spec (pk-pk)",{"$f":"Vo1_ripple*1000","v":100},"mV",null,null,"Vout ripple spec at Vin(nom)"]
[]
["Coutmin",{"$f":"Iripple_Vinnom/(Fsw*8*Vo1_ripple)","v":1.6434462056377781E-6},"F",null,null,"Minimum output capacitnace",null,{"$f":"Vo2_ripple","v":0},1]
["Reported Coutmin",{"$f":"IF(Cout_min*1000000<2, 2.2,Cout_min*1000000)","v":2.2000000000000002},"uF"]
["Cout",{"$f":"'Design Regulator'!E37/1000000","v":8.5000000000000006E-5},"F",null,null,"Chosen output capacitance",null,null,1]
["Resrmax",{"$f":"SQRT((Vo1_ripple/Iripple_Vinnom)^2-(1/(Fsw*Cout*8))^2)","v":3.6212126939621947E-2},"W",null,null,"Max ESR before ripple exceeds Vripple1",null,null,1]
[]
["Reported Cout ESR max",{"$f":"IF(OR(CoutEsrMax>0.3, CoutEsrMax<0, (ISERROR(CoutEsrMax))), \"N/A\", CoutEsrMax*1000)","v":36.212126939621946},"mΩ"]
["CoutEsr",{"$f":"'Design Regulator'!E39/1000","v":1E-3},"W",null,null,"Chosen ESR",null,null,1,null,{"$f":"ISERROR(CoutEsrMax)","v":false},{"$f":"ISERROR(B125)","v":false}]
["Vripple",{"$f":"Iripple_Vinnom*SQRT(Cout_ESR^2+(1/(8*Fsw*Cout))^2)","v":3.3706609093319354E-3},"Vp-p",null,null,null,null,null,null,null,null,{"$f":"OR(CoutEsrMax>0.3,CoutEsrMax<0)","v":false}]
[null,null,null,null,null,null,null,null,null,null,{"$f":"OR(TRUE, FALSE, TRUE)","v":true}]
["Step 5: Input Capacitor"]
[null,null,null,null,null,null,null,null,null,null,"Two channels operating at full load"]
["Icinrms_VINmin",{"$f":"SQRT(D1_Vinmin_2*(Iout^2*(1-D1_Vinmin_2)+Iripple_Vinmin^2/12))","v":5.8007969179197731},"A",null,null,"Calculate input cap rms current with one output unloaded",null,null,null,null,{"$f":"SQRT(Iout^2*D1_Vinmin*(1-D1_Vinmin)+Iout2^2*D2_Vinmin*(1-D2_Vinmin)-2*Iout*Iout2*D1_Vinmin*D2_Vinmin)","v":{"$error":"#NAME?"}},"A",{"$f":"SQRT(Iout^2*D1_Vinmin*(1-D1_Vinmin)+Iout2^2*D2_Vinmin*(1-D2_Vinmin)-2*Iout*Iout2*(0.5-D2_Vinmin*(1-D1_Vinmin)))","v":{"$error":"#NAME?"}},"A"]
["Icinrms_VINnom",{"$f":"SQRT(D1_Vinnom_2*(Iout^2*(1-D1_Vinnom_2)+Iripple_Vinnom^2/12))","v":5.8304747696248453},"A",null,null,null,null,null,null,null,{"$f":"SQRT(Iout^2*D1_Vinnom*(1-D1_Vinnom)+Iout2^2*D2_Vinnom*(1-D2_Vinnom)-2*Iout*Iout2*D1_Vinnom*D2_Vinnom)","v":{"$error":"#NAME?"}},"A"]
["Icinrms_VINmax",{"$f":"SQRT(D1_Vinmax_2*(Iout^2*(1-D1_Vinmax_2)+Iripple_Vinmax^2/12))","v":5.4193082447210248},"A",null,null,null,null,null,null,null,{"$f":"SQRT(Iout^2*D1_Vinmax*(1-D1_Vinmax)+Iout2^2*D2_Vinmax*(1-D2_Vinmax)-2*Iout*Iout2*D1_Vinmax*D2_Vinmax)","v":{"$error":"#NAME?"}},"A"]
["Max Cin rms current",{"$f":"MAX(B131:B133)","v":5.8304747696248453},"A",null,null,null,null,null,null,null,{"$f":"MAX(K131:K133)","v":{"$error":"#NAME?"}},"A"]
[null,null,null,null,null,{"$f":"Number_of_Phases*D1_Vinnom","v":0.37037037037037035},"N*D"]
["Icinrms - multiphase",{"$f":"Iout*SQRT((D1_Vinnom-F136/Number_of_Phases)*((F136+1)/Number_of_Phases-D1_Vinnom))","v":5.7948465824023545},"A",null,null,{"$f":"FLOOR(Number_of_Phases*D1_Vinnom,1)","v":0},"floor(N*D)"]
["Icinrms - multiphase - max",{"$f":"Iout/2/Number_of_Phases","v":6},"A"]
["Final result",{"$f":"CHOOSE(MODE, B134, B137)","v":5.8304747696248453},"A","…report this"]
[]
["Vinripple1",{"$f":"'Design Regulator'!E44/1000","v":0.1},"Vp-p",null,null,"Input voltage ripple spec (pk-pk)"]
[]
["Cinmin_Vinmin",{"$f":"Iout/Number_of_Phases*D1_Vinmin*(1-D1_Vinmin)/(Vinripple1*Fsw)","v":1.3392857142857142E-5},"F"]
["Cinmin_Vinmax",{"$f":"Iout/Number_of_Phases*D1_Vinmax*(1-D1_Vinmax)/(Vinripple1*Fsw)","v":1.146384479717813E-5},"F",null,null,"Calculate cap at Vinmax and 50% duty cycle (Vin = 2*Vout)"]
["Cinmin_50%D",{"$f":"Iout*0.5*(1-0.5)/(Vinripple1*Fsw)","v":1.4285714285714285E-5},"F",null,null,"Buck 50% typically worst case"]
["Cinmin",{"$f":"IF(VIN_min>2*Vout, B142,B144)","v":1.4285714285714285E-5},"F"]
["Reported Cinmin",{"$f":"IF(Cinmin*1000000<10, 10,Cinmin*1000000)","v":14.285714285714285},"uF",null,null,"…report this"]
["Cin",{"$f":"'Design Regulator'!E46/1000000","v":3.0000000000000001E-5},"F",null,null,"Input capacitance"]
["CinEsrMax_Vinmin",{"$f":"-(Iout/Number_of_Phases*D1_Vinmin*(1-D1_Vinmin)/(Cin*Fsw)-Vinripple1)/(Iout/Number_of_Phases+Iripple_Vinmin/2)","v":4.3179595983803909E-3},"W"]
["CinEsrMax_Vinmax",{"$f":"-(Iout/Number_of_Phases*D1_Vinmax*(1-D1_Vinmax)/(Cin*Fsw)-Vinripple1)/(Iout/Number_of_Phases+Iripple_Vinmax/2)","v":4.5482209521439491E-3},"W"]
["CinEsrMax_50%D",{"$f":"-(Iout/Number_of_Phases*0.5*(1-0.5)/(Cin*Fsw)-Vinripple1)/(Iout/Number_of_Phases+Iripple_Vinmax/2)","v":3.8558181430639956E-3},"W",null,null,"Calculate ESR at Vinmax and 50% duty cycle (Vin = 2*Vout)"]
["CinEsrMax",{"$f":"IF(VIN_min>2*Vout, B148,B150)","v":3.8558181430639956E-3},"W"]
["Reported Cin ESR max",{"$f":"IF(OR(CinEsrMax>0.3, CinEsrMax<0), \"N/A\",CinEsrMax*1000)","v":3.8558181430639955},"mΩ",null,null,"…report this"]
["RCinEsr",{"$f":"'Design Regulator'!E48/1000","v":1E-3},"W",null,null,"Input capacitance series resistance (ESR)"]
[]
["Vinripple2_Vinmin",{"$f":"Iout/Number_of_Phases*D1_Vinmin_2*(1-D1_Vinmin_2)/(Cin*Fsw)+(Iout/Number_of_Phases +Iripple_Vinmin/2)*RCinEsr","v":5.7142456048352677E-2},"Vp-p"]
["Vinripple2_Vinmax",{"$f":"Iout/Number_of_Phases*D1_Vinmax_2*(1-D1_Vinmax_2)/(Cin*Fsw)+(Iout/Number_of_Phases +Iripple_Vinmax/2)*RCinEsr","v":5.2120747575849571E-2},"Vp-p"]
["Vinripple2_50%D",{"$f":"Iout/Number_of_Phases*0.5*(1-0.5)/(Cin*Fsw)+(Iout/Number_of_Phases +Iripple_Vinmax/2)*RCinEsr","v":6.1203960194651685E-2},"Vp-p",null,null,"Calculate ripple at Vinmax and 50% duty cycle (Vin = 2*Vout)"]
["Vinripple2",{"$f":"IF(VIN_min>2*Vout, B155,B157)","v":6.1203960194651685E-2},"Vp-p",null,null,"…report highest of these"]
[]
[null,{"$f":"Iout*D1_Vinmin_2*(1-D1_Vinmin_2)/(Cin*Fsw)","v":4.432224742993332E-2},"Vp-p"]
[]
["Step 6a: Soft Start"]
["Tss",{"$f":"'Design Regulator'!E53/1000","v":3.0000000000000001E-3},"s","Soft-start time"]
["Iss",{"$f":"Cout*Vout/Tss","v":0.14166666666666666},"A","Load cap current during soft start"]
["Css",{"$f":"0.000022*Tss/1.2","v":5.4999999999999996E-8},"F"]
["Css_u",{"$f":"'Standard Value Calculator'!B4","v":5.5999999999999999E-8},"F"]
[]
["Step 6b: Other Components - Dither, Hiccup, DEMB, MODE"]
["Tres",{"$f":"'Design Regulator'!E55/1000","v":0.02},"s","Hiccup time"]
["Cres",{"$f":"0.00002*Tres/1.2","v":3.3333333333333335E-7},"F"]
["Cres_u",{"$f":"'Standard Value Calculator'!G4","v":3.3000000000000002E-7},"F"]
[]
["RPG1/2",100,"kΩ"]
["RFB1/2",null,"W",null,"Tie to VDDA or AGND for 3.3V/5V output, respectively. "]
["R_MODE",null,"W",null,"Tie to VDDA or AGND for Single/Dual operation, respectively. "]
["R_DEMB",null,"W",null,"Tie to VDDA or AGND for FPWM/DEM, respectively. "]
[]
["Dither Modulation Frequency",{"$f":"'Design Regulator'!E57*1000","v":8000},"Hz"]
["Cdither_calculated",{"$f":"10*10^-6/Fdither/0.12","v":1.0416666666666666E-8},"F"]
["Cdither_stdvalue",{"$f":"'Standard Value Calculator'!O22","v":1E-8},"F"]
[]
[]
["Step 7: Compensation"]
["Pi",3.1415926500000002,null,"p"]
["CS Amp Gain",{"$f":"O30","v":12}]
["Ri",{"$f":"Rs*CSAmp_gain","v":4.8000000000000001E-2},"W",null,null,"Current Sense effective resistance = shunt resistor Rs * CS amp gain"]
["gm",{"$f":"O36","v":1.1999999999999999E-3},"S",null,null,"Error Amp Transconductance"]
[]
["Se_ext",{"$f":"B193/Ri*1000","v":12727272.727272728},"A/s",null,null,"Slope Comp Slope - referred to inductor current"]
["Sn",{"$f":"(Vin-Vout)/Lf","v":15454545.454545453},"A/s",null,null,"On-time Slope"]
["Sf",{"$f":"Vout/Lf","v":9090909.0909090899},"A/s",null,null,"Off-time Slope"]
[]
["Se_int",{"$f":"Fsw/220*64/1000","v":610.90909090909099},"mV/μs",null,null,"Slope Comp Slope - referred to IC"]
["Sn_int",{"$f":"Sn*Ri/1000","v":741.81818181818176},"mV/μs",null,null,"etc"]
["Sf_int",{"$f":"Sf*Ri/1000","v":436.36363636363637},"mV/μs",null,null,"etc"]
[]
["mc_buck",{"$f":"1+Se_ext/Sn","v":1.8235294117647061},null,null,null,"mc = 1 + Se/Sn for peak current-mode buck"]
["k_buck",{"$f":"mc_buck*(1-D1_Vinnom_2)","v":1.1393963076816203},null,null,null,"mc*(1-d)"]
[]
["mc",{"$f":"1+Se_ext/Sn","v":1.8235294117647061}]
["k",{"$f":"mc_buck*(1-D1_Vinnom_2)","v":1.1393963076816203}]
["Q",{"$f":"1/Pi/(k-0.5)","v":0.49782878431323591},null,null,null,"1/(Pi*(k-0.5))",null,"Q = 2/Pi = 0.636 gives ideal one-cycle damping"]
[]
["Error Amp (EA)"]
["GBW",6,"MHz",null,null,"EA gain-bandwidth product"]
["Cbw",{"$f":"gm/(2*Pi*GBW*1000000)","v":3.1830988654751269E-11},"F",null,null,"EA effective bandwidth limiting capacitance = gm/(2*Pi*GBW)"]
["RoEA",64000000,"W",null,null,"EA output resistance"]
["AEA",{"$f":"gm*RoEA","v":76800},"V/V",null,null,"EA DC gain = gm*RoEA"]
["Afb",{"$f":"Vref/Vout","v":0.24},"V/V",null,null,"Feedback gain from Vout to FB"]
["Acs",{"$f":"1/Ri","v":20.833333333333332},null,null,null,"Acs = 1/Ri"]
["Am_buck",{"$f":"(Ro/Number_of_Phases)/Ri/((1+Ro/Number_of_Phases*(k-0.5)/(Fsw*Lf)))","v":7.0535633593250973}]
["Am",{"$f":"(Ro*Number_of_Phases)/Ri/((1+Ro*Number_of_Phases*(k-0.5)/(Fsw*Lf)))","v":7.0535633593250973},null,null,null,"Buck modulator gain"]
[]
["Scaling factor to calculate Rcomp - buck",{"$f":"2*Pi*Ri/gm","v":251.32741200000004},null,null,null,"2*Pi*Ri/gm -- scaling factor to calculate Rcomp given desired buck crossover frequency"]
["DC Gain is Adc = AEA*Afb*Am"]
[]
["Ro",{"$f":"Rout","v":0.41666666666666669},"W",null,null,"Output Resistance"]
[]
["Fp_load_buck",{"$f":"1/(2*Pi*Ro*Cout)+(k-0.5)/(2*Pi*Fsw*Lf*Cout/Number_of_Phases)","v":5530.3344622701316},"Hz",null,null,"Buck dominant pole frequency -- note slope comp influence"]
["Fp_dominant",{"$f":"Fload_u","v":5530.3344622701316},"Hz"]
[null,{"$f":"Cbw","v":3.1830988654751269E-11}]
["Fp_EA",{"$f":"1/(2*Pi*(RoEA+Rcea1_u)*Cc1ea_u)","v":0.52906122062329253},"Hz",null,null,"Error Amp LF pole -- related to amplifier ouptut resistance and comp cap"]
["Fp_HF",{"$f":"1/(2*Pi*Rcea1_u*(Cc2ea_u+Cbw))","v":932835.82089552248},"Hz",null,null,"Error Amp HF pole cancels zero related to Output Cap ESR"]
["Fesr",{"$f":"1/(2*Pi*Cout*Cout_ESR)","v":1872411.0973383102},"Hz",null,null,"Cout ESR zero frequency"]
["F_mod",{"$f":"Fsw/2","v":1050000},"Hz",null,null,"Zero-order sample-and-hold effects of current-mode control modeled as pole at Fsw/2"]
[]
["Desired Crossover Frequency",{"$f":"'Design Regulator'!E65*1000","v":60000},"Hz"]
["Rcea1",{"$f":"Fcross*Cout/Number_of_Phases*2*Pi*Ri/(gm*Afb)","v":5340.7075050000021},"W",null,null,"This component will largely determine the crossover frequency",null,null,null,null,{"$f":"Fcross/Fp_dominant/(gm*Afb*Am)","v":5340.7075050000012}]
["Cc1ea, Cc3ea",{"$f":"10/(Rcea1*Fcross*2*Pi)","v":4.96672469970051E-9},"F",null,null,"This along with Rcea1 will set a zero at Fcrossover/5 to optimize phase margin"]
["Cc2ea, Cc4ea",{"$f":"MAX(1/(Rcea1*2*Pi*Fesr)-Cbw, 1/(Rcea1*2*Pi*(Fsw/2))-Cbw)","v":-3.4497046564626401E-12},"F",null,null,"This along with Rcea1 places a pole at the output cap ESR zero"]
[]
["Chosen Compensation Components from the standard value sheet"]
["Rcea1_u",{"$f":"'Design Regulator'!D72*1000","v":5360},"W",null,null,{"$f":"1/(Rcea1*2*Pi*(Fsw/2))-Cbw","v":-3.4497046564626401E-12}]
["Cc1ea_u",{"$f":"'Design Regulator'!D73*0.000000001","v":4.7000000000000007E-9},"F"]
["Cc2ea_u",{"$f":"'Design Regulator'!D74*0.000000000001","v":0},"F"]
[]
["Resulting Pole/Zero Locations",null,null,null,null,{"$f":"Cout","v":8.5000000000000006E-5},{"$f":"Cout_ESR","v":1E-3}]
["Fz1",{"$f":"1/(2*Pi*Rcea1_u*Cc1ea_u)","v":6317.6779641853109},"Hz",null,null,"This zero is set at or close to the dominant load pole"]
["Fp2",{"$f":"1/(2*Pi*Rcea1_u*(Cc1ea_u*(Cc2ea_u+Cbw)/(Cc1ea_u+Cc2ea_u+Cbw)))","v":939153.49885970773},"Hz",null,null,"This pole cancels the zero from the Output Cap ESR"]
[]
["Rfb1",{"$f":"'Design Regulator'!E67*1000","v":49900},"W",null,null,"Upper Feedback Resistance - chosen by user"]
["Rfb2",{"$f":"IF(Vout=Vref,100000000,Vref*B241/((Vout-Vref)))","v":15757.894736842107},"W",null,null,"Lower Feedback Resistance"]
["Rfb2_u",{"$f":"IF(Vout=Vref,\"N/A\",'Standard Value Calculator'!O11)","v":15800},"W",null,null,"Std Value Lower Feedback Resistance"]
[]
[]
["Other Input Variables"]
["Rfets",0,"W","Series resistance due to FETs"]
["Diode loss eq res",{"$f":"0.00000002*Fsw*0.6*4/Iripple1","v":{"$error":"#NAME?"}}]
["Fet loss eq res",{"$f":"_Don2*RdsonTop+Doff2*RdsonBot","v":{"$error":"#NAME?"}}]
["cap loss eq res",{"$f":"B251*Vin^2*Fsw/2/(((Iripple1/SQRT(3))^2))","v":{"$error":"#NAME?"}}]
["Sw cap",5.0000000000000001E-9]
[]
["Step 8: Efficiency"]
["VAR",0]
["Design"]
["Ta",{"$f":"'Design Regulator'!E14","v":25},"°C","Ambient Temperature"]
["Components"]
["LTc",{"$f":"4000/1000000","v":4.0000000000000001E-3},"%/°C","Inductor DCR Temp Co"]
["θCA",20,"°C/W","Inductor Core to Ambient Thermal Resistance"]
["RCinEsr",{"$f":"RCinEsr","v":1E-3},"W","Input Capacitor ESR"]
[]
["Controller Characteristics"]
["VCC",5,"V","with 170mA current limit"]
["Top Driver"]
["RdsonDRT",1,"W","Drain-Source Resistance of Pullup High-side FET Driver"]
["RdsonDRT2",0.5,"W","Drain-Source Resistance of Pulldown High-side FET Driver"]
["Bottom Driver"]
["RdsonDRB",1,"W","Drain-Source Resistance of Pullup Low-side FET Driver"]
["RdsonDRB2",0.5,"W","Drain-Source Resistance of Pulldown Low-side FET Driver"]
["Deadtime"]
["Deadtime",1.4E-8,"s","Total Deadtime",null,null,"14ns for LM513-Q1"]
["IQ"]
["IQ ",3.4999999999999997E-5,"A","Quiescent Current of LM5143-Q1 Controller (One channel disabled)"]
[]
["High- & low-side MOSFETs - Ch1","Q1: high-side",null,"Q2: low-side"]
["Rdson",{"$f":"'Design Regulator'!E83/1000","v":4.4999999999999997E-3},"W",{"$f":"'Design Regulator'!F83/1000","v":3.65E-3},"W","Drain-Source Resistances of Channel 1 FETs"]
["RdsonTopTc",{"$f":"4000/1000000","v":4.0000000000000001E-3},"%/°C",4.0000000000000001E-3,"%/°C","Drain-Source Resistance Temp Co"]
["Qg",{"$f":"'Design Regulator'!E84/1000000000","v":8.0000000000000005E-9},"C",{"$f":"'Design Regulator'!F84/1000000000","v":8.9999999999999995E-9},"C","Gate Charge at VCC = 5V"]
["Qgd",{"$f":"'Design Regulator'!E85/1000000000","v":3.1E-9},"C",{"$f":"'Design Regulator'!F85/1000000000","v":3.9000000000000002E-9},"C","Gate to Drain Charge"]
["Qgs",{"$f":"'Design Regulator'!E86/1000000000","v":2.8999999999999999E-9},"C",{"$f":"'Design Regulator'!F86/1000000000","v":3.8000000000000001E-9},"C","Gate to Source Charge"]
["Qoss",{"$f":"'Design Regulator'!E87/1000000000","v":0},"C",{"$f":"'Design Regulator'!F87/1000000000","v":1.2E-8},"C","Output Charge"]
["Coss",{"$f":"'Design Regulator'!E88/1000000000000","v":2.5899999999999998E-10},"F",{"$f":"'Design Regulator'!F88/1000000000000","v":3.3E-10},"F","Output Capacitance"]
["Rgate",{"$f":"'Design Regulator'!E89","v":0},"W",{"$f":"'Design Regulator'!F89","v":0},"W","Gate Resistance"]
["Gfs",{"$f":"'Design Regulator'!E90","v":71},"S",{"$f":"'Design Regulator'!F90","v":71},"S","Transconductance"]
["Vth",{"$f":"'Design Regulator'!E91","v":3.2},"V",{"$f":"'Design Regulator'!F91","v":3.2},"V","Threshold Voltage"]
["Vsp",{"$f":"Vth_Q1+(Iout/Number_of_Phases)/Gfs_Q1","v":3.3690140845070422},"V",{"$f":"Vth_Q2+(Iout/Number_of_Phases)/Gfs_Q2","v":3.3690140845070422},"V","Switch Point Voltage of FETs"]
[]
["Vsd - Buck",{"$f":"'Design Regulator'!E92","v":0.8},"V",{"$f":"'Design Regulator'!F92","v":0.8},"V","Diode Forward Voltage of MOSFET Body diode"]
["QrrTop",null,"C",{"$f":"'Design Regulator'!F93/1000000000","v":1.3000000000000001E-8},"C","Reverse Recovery Charge of Body Diode"]
["TrrTop",4.0000000000000001E-8,"s",4.0000000000000001E-8,"s","Reverse Recovery Time of Body Diode"]
["θJA-MOSFET",{"$f":"'Design Regulator'!E94","v":50},"°C/W",{"$f":"'Design Regulator'!F94","v":50},"°C/W","Junction-to-Ambient Resistance"]
[]
[]
[]
["Anti-parallel Schottky Diode (optional)"]
["VfdSky",{"$f":"'Design Regulator'!F97","v":0},"V",{"$f":"'Design Regulator'!#REF!","v":{"$error":"#REF!"}},"V","Diode Forward Voltage"]
["QrrSky",{"$f":"'Design Regulator'!F98/1000000000","v":0},"C",{"$f":"'Design Regulator'!#REF!/1000000000","v":{"$error":"#REF!"}},"C","Diode Reverse Recovery Charge"]
["Ireverse",0,"A",0,"A","Reverse Leakage Current"]
[]
["Controller"]
["θJACtrl",34.1,"°C/W",null,null,"Junction-to-ambient thermal resistance of controller"]
["Outputs"]
["Top FET"]
["Tr",{"$f":"(Qgd_Q1+Qgs_Q1/2)*(RdsonDRT+Rgate1)/(VCC-Vsp_Q1)","v":2.7897236614853198E-9},"s"]
["Tf",{"$f":"(Qgd_Q1+Qgs_Q1/2)*(RdsonDRT2+Rgate1)/(Vsp_Q1)","v":6.7527173913043484E-10},"s"]
[]
["IC Power Disipation","Value","Units"]
["Power Dis",{"$f":"CHOOSE(Ext_VCC, (Qg_Q1+Qg_Q2)*Fsw*VCC, (Qg_Q1+Qg_Q2)*Fsw*Vin)","v":0.17850000000000002},"W"]
["Temp rise",{"$f":"B308*ThetaJaCtrl","v":6.086850000000001},"°C"]
["Junction temperature",{"$f":"B309 + Ta","v":31.086850000000002},"°C"]
[]
["Current (switching)",{"$f":"(Qg_Q1+Qg_Q2)*Fsw+Iq","v":3.5735000000000003E-2},"A"]
["Qrr Current",{"$f":"Qrr_Q2*Fsw","v":2.7300000000000001E-2},"A"]
["Diode Current",{"$f":"C314/Vin","v":{"$error":"#NAME?"}},{"$f":"Deadtime*Fsw*(Ipp/2)*(Vsd_Q1+Vsd_Q2)","v":{"$error":"#NAME?"}}]
["Total Application Switching IQ",{"$f":"SUM(B312:B314)","v":{"$error":"#NAME?"}},"A"]
[]
["Low-side MOSFET/Diode"]
["Part Power"]
["Power Dis"]
[]
["SCHEMATIC LABELS"]
[{"$f":"\"RC1 = \"&'Design Regulator'!D72&\"kΩ\"","v":"RC1 = 5.36kΩ"},{"$f":"'Design Regulator'!D72&\"kΩ\"","v":"5.36kΩ"},null,{"$f":"'Design Regulator'!D75&\"kΩ\"","v":"kΩ"}]
[{"$f":"\"RC2 = \"&'Design Regulator'!D75&\"kΩ\"","v":"RC2 = kΩ"},{"$f":"'Design Regulator'!D75&\"kΩ\"","v":"kΩ"}]
[]
[{"$f":"\"Lo = \"&'Design Regulator'!E28&\"µH\"","v":"Lo = 0.55µH"},{"$f":"'Design Regulator'!E28&\"µH\"","v":"0.55µH"},null,{"$f":"IF(MODE = 1, 'Design Regulator'!J28&\"µH\", 'Design Regulator'!E28&\"µH\")","v":"µH"}]
[{"$f":"\"Rdcr = \"&Rdcr*1000&\"mΩ\"","v":"Rdcr = 2.9mΩ"},{"$f":"Rdcr*1000&\"mΩ\"","v":"2.9mΩ"},null,{"$f":"IF(MODE=1, Rdcr2*1000&\"mΩ\", Rdcr*1000&\"mΩ\")","v":"0mΩ"}]
[{"$f":"\"Rs = \"&'Design Regulator'!E19&\"mΩ\"","v":"Rs = 4mΩ"},{"$f":"'Design Regulator'!E19&\"mΩ\"","v":"4mΩ"},null,{"$f":"IF(MODE = 1, 'Design Regulator'!J19&\"mΩ\", 'Design Regulator'!E19&\"mΩ\")","v":"mΩ"}]
[]
[{"$f":"\"VOUT = \"&'Design Regulator'!E9&\"V\"","v":"VOUT = 5V"},{"$f":"'Design Regulator'!E9&\"V\"","v":"5V"},null,{"$f":"IF(MODE=1, 'Design Regulator'!J10&\"V\", \"\")","v":"V"}]
[]
[{"$f":"\"COUT = \"&'Design Regulator'!$E$37&\"µF\"","v":"COUT = 85µF"},{"$f":"ROUND('Design Regulator'!$E$37/Number_of_Phases, 0)&\"µF\"","v":"85µF"},null,{"$f":"IF(MODE=1, 'Design Regulator'!$J$37&\"µF\", ROUND('Design Regulator'!$E$37/Number_of_Phases, 0)&\"µF\")","v":"µF"}]
["Capacitance per component (Cout)",{"$f":"\"22µF\"","v":"22µF"}]
["# of output caps",{"$f":"ROUNDUP(Cout*1000000/22,0)&\" x\"","v":"4 x"}]
[]
["CIN",{"$f":"Cin*1000000&\"µF\"","v":"30µF"}]
["Capacitance per component (Cin)",{"$f":"\"10µF\"","v":"10µF"}]
["# of input caps",{"$f":"ROUNDUP(Cin*1000000/10,0)&\" x\"","v":"3 x"}]
[]
[{"$f":"\"RC1 = \"&Rcea1_u/1000&\"kΩ\"","v":"RC1 = 5.36kΩ"},{"$f":"ROUND(Rcea1_u/1000,2)&\"kΩ\"","v":"5.36kΩ"}]
[{"$f":"\"CC1 = \"&Cc1ea_u*10^9&\"nF\"","v":"CC1 = 4.7nF"},{"$f":"Cc1ea_u*10^9&\"nF\"","v":"4.7nF"}]
[{"$f":"\"CC2 = \"&IF(Cc2ea_u>0, Cc2ea_u*10^12&\"pF\", \"OPEN\")","v":"CC2 = OPEN"},{"$f":"IF(Cc2ea_u>0, ROUND(Cc2ea_u*10^12,1)&\"pF\", \"N/A\")","v":"N/A"}]
[]
[{"$f":"\"gm = \"&$B$187*1000&\"mS\"","v":"gm = 1.2mS"},{"$f":"$B$187*1000&\"mS\"","v":"1.2mS"}]
[{"$f":"\"RoEA = \"&RoEA/1000000&\"MΩ\"","v":"RoEA = 64MΩ"},{"$f":"RoEA/1000000&\"MΩ\"","v":"64MΩ"}]
[{"$f":"\"GBW = \"&GBW&\"MHz\"","v":"GBW = 6MHz"},{"$f":"GBW&\"MHz\"","v":"6MHz"}]
[]
[{"$f":"\"Cslope = \"&Cslope&\"pF\"","v":{"$error":"#NAME?"}},{"$f":"ROUND(Cslope*1,0)&\"pF\"","v":{"$error":"#NAME?"}}]
["Cd",{"$f":"IF(DITHER=1, ROUND(Cdither*1000000000,1)&\"nF\", \"\")","v":"10nF"},{"$f":"IF(DITHER=1, \"Cd\", \"\")","v":"Cd"}]
[{"$f":"\"RFB1 = \"&'Design Regulator'!E67&\"kΩ\"","v":"RFB1 = 49.9kΩ"},{"$f":"IF(VOUT_setting=1, 'Design Regulator'!E67&\"kΩ\", \"\")","v":""},null,{"$f":"'Design Regulator'!J67&\"kΩ\"","v":"kΩ"}]
[{"$f":"\"RFB2 = \"&IF(Vout=Vref,\"OPEN\",'Design Regulator'!E68&\"kΩ\")","v":"RFB2 = 15.8kΩ"},{"$f":"IF(VOUT_setting=1, IF(Vout=Vref,\"OPEN\",Rfb2_u/1000&\"kΩ\"), \"\")","v":""},null,{"$f":"IF(Vout2=Vref,\"OPEN\",Rfb4_u/1000&\"kΩ\")","v":"0kΩ"}]
[{"$f":"CHOOSE(BODE_PLOT_TYPE, \"Crossover Frequency = \"&ROUND('Stability Calculations'!Q4,1)&\" kHz\",  \"Crossover Frequency = \"&ROUND(#REF!,1)&\" kHz\")","v":"Crossover Frequency = 59.9 kHz"},{"$f":"CHOOSE(BODE_PLOT_TYPE, ROUND('Stability Calculations'!Q4,1)&\" kHz\", ROUND(#REF!,1)&\" kHz\")","v":"59.9 kHz"},null,{"$f":"'Stability Calculations'!Q4","v":59.912999999999997}]
[{"$f":"CHOOSE(BODE_PLOT_TYPE, \"Phase Margin = \"&ROUND('Stability Calculations'!Q5,0)&\"°\", \"Phase Margin = \"&ROUND(#REF!,0)&\"°\")","v":"Phase Margin = 81°"},{"$f":"CHOOSE(BODE_PLOT_TYPE, ROUND('Stability Calculations'!Q5,0)&\"°\", ROUND(#REF!,0)&\"°\")","v":"81°"}]
[]
["Full-load/high line efficiency",{"$f":"IF(PLOT_TYPE=1, ROUND('Efficiency Calculations'!AZ109,1)&\"%\", ROUND(#REF!,1)&\"%\")","v":"92.9%"}]
["Half-load/mid-line efficiency",{"$f":"IF(PLOT_TYPE=1, ROUND('Efficiency Calculations'!AZ59,1)&\"%\", ROUND(#REF!,1)&\"%\")","v":"93.1%"}]
["OSC pin setting",{"$f":"IF(VOUT_setting=1, \"\", IF(OSC=1, \"Tie OSC to VDDA\", \"Tie OSC to AGND\"))","v":"Tie OSC to VDDA"}]
[]
[{"$f":"\"CDITH = \"&Cdither*1000000000&\"nF\"","v":"CDITH = 10nF"},{"$f":"Cdither*1000000000&\"nF\"","v":"10nF"}]
[{"$f":"\"Rs = \"&Rs&\"Ω\"","v":"Rs = 0.004Ω"},{"$f":"'Standard Value Calculator'!O6&\"Ω\"","v":"Ω"}]
["Rset",{"$f":"'Standard Value Calculator'!O16&\"mΩ\"","v":"3.83mΩ"}]
["Rs",{"$f":"'Standard Value Calculator'!O6&\"mΩ\"","v":"mΩ"}]
[{"$f":"\"Rshunt = \"&ROUND(Rshunt,1)&\"mΩ\"","v":{"$error":"#NAME?"}},{"$f":"IF(Rshunt=\"0\", \"N/A\",ROUND(Rshunt,1)&\"mΩ\")","v":{"$error":"#NAME?"}}]
[]
["Rpgood","20kΩ"]
[]
[]
["Rt",{"$f":"IF(No_RT,\"\", Rfadj&\"kΩ\")","v":"52.3kΩ"},{"$f":"IF(OR((Fsw=440000),(Fsw=2200000)),\"N/A\",Rfadj)","v":52.3},{"$f":"Fsw","v":2100000},null,{"$f":"OR((Fsw=440000),(Fsw=2200000))","v":false},null,{"$f":"OR(OR(AND(OSC=1, OR(Fsw/1000>2530, Fsw/1000<1800)), AND(OSC=2, OR(Fsw/1000>500, Fsw/1000<300))), OR((Fsw=440000),(Fsw=2200000)))","v":false}]
["Css",{"$f":"'Standard Value Calculator'!B4*1000000000&\"nF\"","v":"56nF"},{"$f":"IF(MODE=1,\"Css\",\"\")","v":"Css"}]
["Cres",{"$f":"IF(Cres_u = 0, \"N/A\", Cres_u*1000000000 &\"nF\")","v":"330nF"},{"$f":"IF(Cres_u = 0, \"N/A\", Cres_u*1000000 &\"µF\")","v":"0.33µF"},{"$f":"Cres_u","v":3.3000000000000002E-7}]
[]
["Blank out",{"$f":"IF(B76=\"y\",\"\",\"|\")","v":"|"}]
["OUTPUT CURRENT",{"$f":"'Design Regulator'!$E$10&\"A\"","v":"12A"},null,{"$f":"IF(MODE=1,'Design Regulator'!$J$11&\"A\",\"\")","v":"A"}]
["VIN",{"$f":"VIN_nom&\"V\"","v":"13.5V"}]
["VIN range",{"$f":"VIN_min&\"V\"&\"...\"&VIN_max&\"V\"","v":"8V...18V"}]

{"sheet":"Stability Calculations","index":4,"n_rows":687,"n_cols":31,"rows_kept":687,"cut":false,"hidden":true,"merged":[[9,23,9,24],[9,26,9,27],[10,2,10,3],[10,4,10,5],[10,8,10,9],[10,10,10,11],[10,12,10,13],[10,14,10,15],[9,1,10,1],[1,0,1,3],[1,9,1,11],[1,12,1,14],[9,0,11,0],[9,14,9,15],[1,15,1,17],[10,6,10,7],[1,4,1,6],[9,2,9,7],[9,8,9,13],[9,16,9,18]]}
[]
["Divider Network & EA Poles/Zeros",null,null,null,"Modulator",null,null,null,null,"Power Stage Poles/Zeros",null,null,"Complex Pole Pair",null,null,"Total System"]
[null,"Afb1",{"$f":"Afb","v":0.24},"V/V","Acs",{"$f":"Acs","v":20.833333333333332},"A/V","gm",{"$f":"gm","v":1.1999999999999999E-3},"z_ESR",{"$f":"Fesr","v":1872411.0973383102},"Hz","p3",{"$f":"Fsw/2","v":1050000},"Hz","Adc",{"$f":"Am*Afb*AEA","v":130011.27983908019},"V/V"]
[null,"EA zero, z1",{"$f":"Fz1_u","v":6317.6779641853109},"Hz","Am",{"$f":"Am","v":7.0535633593250973},"V/V",null,null,"p_dom",{"$f":"Fp_dominant","v":5530.3344622701316},"Hz","pterm1",{"$f":"Q*pole3","v":522720.22352889768},null,"Crossover",{"$f":"AE7","v":59.912999999999997},"kHz"]
[null,"EA pole, p1",{"$f":"Fp1_u","v":0.52906122062329253},"Hz","Q",{"$f":"Q","v":0.49782878431323591},null,null,null,null,null,null,"pterm2",{"$f":"pole3^2","v":1102500000000},null,"Phase Margin",{"$f":"AE9","v":80.852945152287006},"°"]
[null,"Aea",{"$f":"AEA","v":76800},"V/V","mc",{"$f":"mc","v":1.8235294117647061},null,null,null,null,null,null,null,null,null,"radconv",{"$f":"180/Pi","v":57.295779578552292},null,null,null,null,null,null,null,null,null,null,null,null,"XOVER SEARCH"]
[null,"EA pole, p2",{"$f":"Fp2_u","v":932835.82089552248},"Hz","k",{"$f":"k","v":1.1393963076816203},null,null,null,null,null,null,null,null,null,null,null,null,null,null,null,null,null,null,null,null,null,null,null,"xover",{"$f":"SUM(AD12:AD613)/1000","v":59.912999999999997}]
[]
[null,null,null,null,null,null,null,null,null,null,null,null,null,null,null,null,null,null,null,null,null,null,null,null,null,null,null,null,null,"phase margin",{"$f":"SUM(AE13:AE613)","v":80.852945152287006}]
["Freq (Hz)",null,"Power Stage",null,null,null,null,null,"Error Amplifier",null,null,null,null,null,"Sampling Double Pole",null,"System Response",null,null,null,null,null,null,"ERROR AMP Response",null,null,"PLANT Response"]
[null,null,"p_dom",null,"z_ESR",null,"z_RHP",null,"p1",null,"z1",null,"p2",null,"p3"]
[null,null,"Gain(V/V)","Phase(rad)","Gain(V/V)","Phase(rad)","Gain(V/V)","Phase(rad)","Gain(V/V)","Phase(rad)","Gain(V/V)","Phase(rad)","Gain(V/V)","Phase(rad)","Gain(V/V)","Phase(rad)","Gain (dB)","Phase (°)","Phase Margin (°)",null,null,"Fsquare",null,"Gain(dB)","Phase(Deg)",null,"Gain(dB)","Phase(Deg)"]
[1,{"$f":"A13/1000","v":1E-3},{"$f":"SQRT(1+(A13/pole1)^2)","v":1.0000000163480969},{"$f":"ATAN(A13/pole1)","v":1.8082088812595642E-4},{"$f":"SQRT(1+(A13/Zero1)^2)","v":1.0000000000001426},{"$f":"ATAN(A13/Zero1)","v":5.3407075049994922E-7},{"$f":"IF(VIN_nom>Vout, 1, SQRT(1+(A13/z_RHP)^2))","v":1},{"$f":"IF(VIN_nom>Vout, 0, -ATAN(A13/z_RHP))","v":0},{"$f":"SQRT(1+(A13/Pole2)^2)","v":2.1383710677432912},{"$f":"ATAN(A13/Pole2)","v":1.084170938022619},{"$f":"SQRT(1+(A13/Zero2)^2)","v":1.0000000125272295},{"$f":"ATAN(A13/Zero2)","v":1.5828600275567665E-4},{"$f":"SQRT(1+(A13/pole4)^2)","v":1.0000000000005747},{"$f":"ATAN(A13/pole4)","v":1.0719999999995893E-6},{"$f":"SQRT((1-(V13/pterm2))^2+(A13/pterm1)^2)","v":1.0000000000009228},{"$f":"IF((ATAN((A13/pterm1)/(1-A13^2/pterm2))>0),ATAN((A13/pterm1)/(1-A13^2/pterm2)),PI()+ATAN((A13/pterm1)/(1-A13^2/pterm2)))","v":1.9130692768086555E-6},{"$f":"20*LOG10(((E13*K13*G13)/(C13*I13*O13*M13))*Adc)","v":95.677959242165983},{"$f":"((F13+L13+H13)-(D13+J13+P13+N13))*radconv","v":-62.119850676112577},{"$f":"IF(R13>0,R13,R13+180)","v":117.88014932388742},null,{"$f":"IF(Q13<0,A13,1000000000)","v":1000000000},{"$f":"A13^2","v":1},null,{"$f":"20*LOG10((K13/(I13*M13))*AEA)","v":91.10556311414814},{"$f":"(L13-(J13+N13))*radconv","v":-62.109411391567718},null,{"$f":"20*LOG10((E13*G13/(C13*O13))*Acs*Am)","v":43.343346546273978},{"$f":"(F13+H13-(D13+P13))*radconv","v":-1.0439284544865396E-2},null,{"$f":"SUM((Q14<0)*(Q13>0))*A13","v":0},{"$f":"IF(AD13>0,S11,0)","v":0}]
[1.0965,{"$f":"A14/1000","v":1.0965E-3},1.0000000196555172,1.9827010339293618E-4,1.0000000000001714,5.8560857792318316E-7,1,0,2.3011774819981223,1.1212464963265845,1.0000000150616413,1.7356060172835007E-4,1.000000000000691,1.1754479999994584E-6,1.0000000000011096,2.0976804620205582E-6,95.040618318381462,-64.244261840459785,115.75573815954021,null,{"$f":"IF(Q14<0,A14,1000000000)","v":1000000000},{"$f":"A14^2","v":1.2023122500000001},null,90.46822221909288,-64.232815164981389,null,43.343346517544717,-1.1446675478396614E-2,null,{"$f":"SUM((Q15<0)*(Q14>0))*A14","v":0},0]
[1.2022999999999999,1.2022999999999999E-3,1.0000000236315876,2.1740095273821222E-4,1.0000000000002061,6.4211326332606184E-7,1,0,2.4828065182375147,1.1562551542020933,1.000000018108427,1.903072604050551E-4,1.0000000000008304,1.2888655999992862E-6,1.000000000001334,2.3000831915067259E-6,94.380763084859595,-66.250261647190896,113.7497383528091,null,1000000000,1.4455252899999997,null,89.808367020108363,-66.237710495443096,null,43.343346483007359,-1.2551151747808778E-2,null,0,0]
[1.3183,1.3183000000000001E-3,1.0000000284116011,2.3837617489934709E-4,1.0000000000002478,7.0406547038403368E-7,1,0,2.684944748852955,1.189151841308641,1.0000000217712586,2.0866843614685048E-4,1.0000000000009988,1.4132175999990591E-6,1.0000000000016041,2.5219992276162686E-6,93.700913549786549,-68.135269044436797,111.8647309555632,null,1000000000,1.7379148900000001,null,89.128517526555981,-68.121506935731134,null,43.343346441486716,-1.3762108705654209E-2,null,0,0]
[1.4454,1.4454000000000001E-3,1.000000034154136,2.613585085947509E-4,1.000000000000298,7.7194586277254677E-7,1,0,2.9092736220235986,1.2199119728189987,1.0000000261716515,2.2878658630194788E-4,1.0000000000012004,1.5494687999987598E-6,1.0000000000019282,2.7651503326982885E-6,93.003929215563957,-69.897876713781145,110.10212328621886,null,1000000000,2.0891811599999999,null,88.431533242214783,-69.882787772077762,null,43.343346391605309,-1.5088941703387862E-2,null,0,0]
[1.5849,1.5849E-3,1.0000000410649152,2.8658302086854808E-4,1.0000000000003584,8.4644873246724796E-7,1,0,3.1581830190751865,1.2486135685888227,1.0000000314672477,2.508674825998488E-4,1.0000000000014433,1.699012799998365E-6,1.0000000000023181,3.0320234968126036E-6,92.290874705407276,-71.542556724735775,108.45744327526423,null,1000000000,2.51190801,null,87.718478792087225,-71.526011502931198,null,43.343346331576178,-1.6545221804590362E-2,null,0,0]
[1.7378,1.7378000000000001E-3,1.0000000493704158,3.1423053246753993E-4,1.0000000000004308,9.2810815021863358E-7,1,0,3.4335349584297319,1.2752682941464886,1.0000000378315916,2.7506941094851097E-4,1.0000000000017353,1.8629215999978447E-6,1.0000000000027871,3.3245317892359805E-6,91.564791100221385,-73.069978894426171,106.93002110557383,null,1000000000,3.0199488400000001,null,86.992395259045438,-73.051837506140458,null,43.343346259432074,-1.814138828570926E-2,null,0,0]
[1.9055,1.9055000000000001E-3,1.0000000593587988,3.4455419244433164E-4,1.0000000000005178,1.0176718150773989E-6,1,0,3.7379102890018614,1.2999685212897363,1.0000000454854956,3.0161397162382621E-4,1.0000000000020863,2.0426959999971589E-6,1.0000000000033511,3.6453535069558919E-6,90.827043070776483,-74.485437741231252,105.51456225876875,null,1000000000,3.63093025,null,86.254647316362679,-74.465545685097069,null,43.343346172669953,-1.989205613417698E-2,null,0,0]
[2.0893000000000002,2.0893000000000001E-3,1.0000000713622941,3.7778906770571946E-4,1.0000000000006226,1.115834019019187E-6,1,0,4.0737153720314927,1.3227854773249033,1.0000000546835413,3.3070693626317886E-4,1.0000000000025082,2.239729599996255E-6,1.0000000000040286,3.9969756400321158E-6,90.079806888974701,-75.793016150251688,104.20698384974831,null,1000000000,4.3651744900000002,null,85.50741123882689,-75.771205353845971,null,43.343346068403946,-2.181079640570582E-2,null,0,0]
[2.2909000000000002,2.2909000000000002E-3,1.0000000857984526,4.1424255342822544E-4,1.0000000000007485,1.2235026823198396E-6,1,0,4.4440929984503414,1.3438350289671233,1.0000000657456898,3.6261739084768703E-4,1.0000000000030156,2.4558447999950624E-6,1.0000000000048435,4.3826504062351231E-6,89.323957725551182,-76.999355228947621,103.00064477105238,null,1000000000,5.2482228100000006,null,84.751562200800223,-76.975439873082706,null,43.343345943007094,-2.3915355864925814E-2,null,0,0]
[2.5118999999999998,2.5118999999999996E-3,1.0000001031506287,4.542039625995544E-4,1.0000000000008997,1.3415323181801452E-6,1,0,4.8520119641495949,1.36320854784866,1.0000000790423256,3.9759859269111194E-4,1.0000000000036255,2.6927567999934913E-6,1.0000000000058231,4.8054387164076778E-6,88.561183199487829,-78.10969247674997,101.89030752325003,null,1000000000,6.309641609999999,null,83.988787825463135,-78.083470039407672,null,43.343345792280829,-2.6222437342282662E-2,null,0,0]
[2.7542,2.7542000000000001E-3,1.0000001240104064,4.9801685433141334E-4,1.0000000000010818,1.4709376610260392E-6,1,0,5.3010009804657985,1.38101554498432,1.0000000950267689,4.3595128481249809E-4,1.0000000000043587,2.9525023999914203E-6,1.0000000000070006,5.268975402175541E-6,87.792462727755918,-79.130305132626404,100.8696948673736,null,1000000000,7.5856176399999997,null,83.220067534925576,-79.101553257180981,null,43.343345611086477,-2.8751875445424572E-2,null,0,0]
[3.02,3.0200000000000001E-3,1.0000001491011741,5.4607903381127441E-4,1.0000000000013007,1.6128936665086015E-6,1,0,5.7951550593048839,1.3973703534630273,1.0000001142533379,4.7802369590381705E-4,1.0000000000052405,3.2374399999886891E-6,1.000000000008417,5.7774692159474597E-6,87.018319152896865,-80.06774714951257,99.93225285048743,null,1000000000,9.1204000000000001,null,82.445924178012547,-80.03622051295612,null,43.34334539314046,-3.1526636556438455E-2,null,0,0]
[3.3113000000000001,3.3113000000000001E-3,1.0000001792520905,5.9875214182540399E-4,1.0000000000015636,1.7684684761288067E-6,1,0,6.3382057920553345,1.4123609675545588,1.0000001373574008,5.2413239730651469E-4,1.0000000000063003,3.5497135999850904E-6,1.0000000000101192,6.3347462962767493E-6,86.240293587131006,-80.92706309084646,99.07293690915354,null,1000000000,10.964707690000001,null,81.667898874146672,-80.892495491658792,null,43.343345131240476,-3.4567599187692054E-2,null,0,0]
[3.6307999999999998,3.6308E-3,1.0000002155121783,6.5652439343700565E-4,1.0000000000018801,1.9391040809129696E-6,1,0,6.9351965525613668,1.4260999157439482,1.0000001651428034,5.7470476033271367E-4,1.0000000000075748,3.8922175999803447E-6,1.0000000000121663,6.9459719302103866E-6,85.458444751821901,-81.714704229159153,98.285295770840847,null,1000000000,13.182708639999998,null,80.886050353803654,-81.676801279828169,null,43.343344816274374,-3.7902949330981706E-2,null,0,0]
[3.9811000000000001,3.9811000000000004E-3,1.0000002591035282,7.1986592121733937E-4,1.0000000000022604,2.1261890648123463E-6,1,0,7.590993846180452,1.4386772396201601,1.0000001985460107,6.3015232742384686E-4,1.0000000000091069,4.2677391999740898E-6,1.000000000014627,7.6161200978675508E-6,84.673647357375245,-82.435833289574816,97.564166710425184,null,1000000000,15.849157210000001,null,80.101253338004625,-82.394273460548263,null,43.343344437626747,-4.1559829026551545E-2,null,0,0]
[4.3651999999999997,4.3651999999999996E-3,1.0000003115124692,7.8931918552816035E-4,1.0000000000027174,2.3313256400783762E-6,1,0,8.3112199390803223,1.450184834076268,1.0000002387059677,6.9094995504362215E-4,1.0000000000109488,4.6794943999658424E-6,1.0000000000175855,8.3509300070779618E-6,83.886324534859142,-83.095719756345076,96.904280243654924,null,1000000000,19.054971039999998,null,79.313930970728421,-83.050150200348966,null,43.34334398238687,-4.5569555996105598E-2,null,0,0]
[4.7862999999999998,4.7862999999999994E-3,1.0000003745130548,8.6546281018496957E-4,1.0000000000032672,2.5562228331125824E-6,1,0,9.1018796032161191,1.4607066685081089,1.0000002869820976,7.5760415637073184E-4,1.0000000000131632,5.1309135999549739E-6,1.0000000000211422,9.1565234795264941E-6,83.096998180131891,-83.699179302482293,96.300820697517707,null,1000000000,22.908667689999998,null,78.524605163243237,-83.6492137667055,null,43.343343435144803,-4.9965535776781568E-2,null,0,0]
[5.2481,5.2481000000000003E-3,1.0000004502682407,9.4896582845691328E-4,1.000000000003928,2.8028567056917102E-6,1,0,9.9699235694750872,1.4703257096174061,1.0000003450318318,8.3070058692089152E-4,1.0000000000158258,5.6259631999406428E-6,1.0000000000254188,1.0039978871536118E-5,82.305783176748989,-84.250970866632059,95.749029133367941,null,1000000000,27.542553609999999,null,77.733390817892627,-84.196184473140818,null,43.34334277711249,-5.4786393491242848E-2,null,0,0]
[5.7544000000000004,5.7544000000000007E-3,1.0000005413363457,1.0405153544597919E-3,1.0000000000047224,3.0732567266675249E-6,1,0,10.92249746546948,1.4791137856634895,1.0000004148155612,9.1084072997687289E-4,1.0000000000190266,6.1687167999217535E-6,1.0000000000305598,1.1008565846357107E-5,81.513180519218395,-84.755215344834895,95.244784655165105,null,1000000000,33.113119360000006,null,76.940788951406901,-84.695143546715457,null,43.343341986067614,-6.0071798119436845E-2,null,0,0]
[6.3095999999999997,6.3095999999999994E-3,1.0000006508347365,1.1409069931260546E-3,1.0000000000056777,3.3697728073420451E-6,1,0,11.967881686299867,1.4871418150422895,1.0000004987220643,9.9872103927188495E-4,1.000000000022875,6.7638911998968492E-6,1.0000000000367413,1.2070701908805297E-5,80.719273606258994,-85.215982360717604,94.784017639282396,null,1000000000,39.811052159999996,null,76.146882989583276,-85.150114678603884,null,43.343341034931846,-6.5867682113705348E-2,null,0,0]
[6.9183000000000003,6.9183000000000005E-3,1.0000007824666224,1.2509725113930179E-3,1.0000000000068261,3.6948616731673366E-6,1,0,13.114739117752714,1.4944721584136103,1.0000005995890406,1.0950696242822389E-3,1.0000000000275016,7.4164175998640234E-6,1.000000000044172,1.3235187177551239E-5,79.924425963661037,-85.63685150202032,94.36314849797968,null,1000000000,47.862874890000008,null,75.352036490379106,-85.564629436361514,null,43.343339891538065,-7.2222065658809162E-2,null,0,0]
[7.5857999999999999,7.5858000000000002E-3,1.0000009407403718,1.371670247838329E-3,1.0000000000082068,4.051353899120734E-6,1,0,14.373056741894883,1.5011654506505494,1.0000007208711674,1.2007253926863285E-3,1.0000000000330647,8.1319775998207469E-6,1.0000000000531069,1.4512160919758327E-5,79.12863595847378,-86.021304478242243,93.978695521757757,null,1000000000,57.544361639999998,null,74.556247860004603,-85.942114201974363,null,43.343338516725318,-7.9190276267871326E-2,null,0,0]
[8.3176000000000005,8.3176000000000014E-3,1.000001131001097,1.5039947014550395E-3,1.0000000000098666,4.4421868743295814E-6,1,0,15.753203607547791,1.5072744650749756,1.0000008666643034,1.3165589068394627E-3,1.0000000000397518,8.9164671997637029E-6,1.0000000000638476,1.5912145016444182E-5,78.332240649295528,-86.372372851422327,93.627627148577673,null,1000000000,69.182469760000004,null,73.75985420348718,-86.285543122326956,null,43.34333686406449,-8.6829729095364336E-2,null,0,0]
[9.1201000000000008,9.1201000000000008E-3,1.0000013597720661,1.6491031048345268E-3,1.0000000000118623,4.870778651596532E-6,1,0,17.267250553256993,1.512850805583295,1.0000010419671079,1.4435831830106923E-3,1.0000000000477924,9.7767471996884961E-6,1.0000000000767622,1.7447383110973976E-5,77.535154093182982,-86.693022468785045,93.306977531214955,null,1000000000,83.176224010000013,null,72.96276963454639,-86.597815234431195,null,43.34333487689274,-9.520723435385639E-2,null,0,0]
[10,0.01,1.0000016348083784,1.8082069302522946E-3,1.0000000000142615,5.3407075049492229E-6,1,0,18.927838818421886,1.517939484427334,1.0000012527221698,1.5828587188545832E-3,1.0000000000574591,1.0719999999589357E-5,1.0000000000922888,1.9130692767493912E-5,76.737596770142062,-86.985841933491557,93.014158066508443,null,1000000000,100,null,72.165214700550962,-86.881449199827415,null,43.343332487847235,-0.1043927336641404,null,0,0]
[10.965,1.0964999999999999E-2,1.0000019655498147,1.9826984618484789E-3,1.0000000000171467,5.8560857791655576E-6,1,0,20.749500725692698,1.5225837202580383,1.0000015061630196,1.7356042919756376E-3,1.0000000000690838,1.1754479999458635E-5,1.0000000001109599,2.0976804619424278E-5,75.939463655386447,-87.253318514357701,92.746681485642299,null,1000000000,120.23122499999999,null,71.367084458710906,-87.138851906943174,null,43.343329614931676,-0.11446660741454584,null,0,0]
[12.023,1.2022999999999999E-2,1.0000023631559947,2.1740061366221667E-3,1.0000000000206155,6.4211326331732508E-6,1,0,22.747149726949733,1.5268206025629976,1.0000018108410724,1.903070329586513E-3,1.0000000000830589,1.2888655999286323E-5,1.0000000001334057,2.3000831914037275E-5,75.141076146616342,-87.497588591110429,92.502411408889571,null,1000000000,144.55252899999999,null,70.568700403661552,-87.372077267908622,null,43.343326161210925,-0.12551132320179878,null,0,0]
[13.183,1.3183E-2,1.0000028411561095,2.3837572790605184E-3,1.0000000000247855,7.0406547037251643E-6,1,0,24.937779180177724,1.5306857706022925,1.0000021771235055,2.0866813631131918E-3,1.0000000000998592,1.4132175999059179E-5,1.0000000001603899,2.5219992274804885E-5,74.342459400606728,-87.720707026012988,92.279292973987012,null,1000000000,173.79148899999998,null,69.770087809695539,-87.583086195064794,null,43.343322009167323,-0.1376208309481777,null,0,0]
[14.454000000000001,1.4454E-2,1.0000034154078237,2.6135791944987942E-3,1.0000000000297951,7.7194586275736661E-6,1,0,27.338385116539545,1.534209559538092,1.0000026171617702,2.2878619111348264E-3,1.0000000001200426,1.5494687998759984E-5,1.000000000192808,2.7651503325193281E-5,73.544156592054478,-87.924424778542615,92.075575221457385,null,1000000000,208.91811600000003,null,68.97178998925277,-87.773535699063984,null,43.343317021057842,-0.15088907947863783,null,0,0]
[15.849,1.5848999999999999E-2,1.0000041064831857,2.8658224415088252E-3,1.0000000000358238,8.4644873244723481E-6,1,0,29.973521618213063,1.5374273547323631,1.0000031467198724,2.508669615906079E-3,1.0000000001443321,1.6990127998365184E-5,1.0000000002318208,3.0320234965766659E-5,72.744856898837241,-88.110787889081976,91.889212110918024,null,1000000000,251.19080099999999,null,68.172496298903781,-87.945336116062634,null,43.343311018189596,-0.16545177301933831,null,0,0]
[17.378,1.7378000000000001E-2,1.0000049370295145,3.1422950856993268E-3,1.0000000000430691,9.2810815019225151E-6,1,0,32.862078922002269,1.5403614173152493,1.0000037831520767,2.7506872413493085E-3,1.0000000001735239,1.8629215997844923E-5,1.0000000002787073,3.3245317889249576E-5,71.945709958269532,-88.281086139591395,91.718913860408605,null,1000000000,301.99488400000001,null,67.37335657268153,-88.099672843384567,null,43.343303803844144,-0.18141329620681332,null,0,0]
[19.055,1.9054999999999999E-2,1.0000059358624291,3.4455284260063459E-3,1.0000000000517828,1.0176718150426182E-5,1,0,36.030505587107683,1.5430385029348506,1.0000045485393252,3.016130661707439E-3,1.0000000002086304,2.0426959997158875E-5,1.000000000335094,3.6453535065458586E-5,71.146201490897212,-88.436872554336773,91.563127445663227,null,1000000000,363.09302500000001,null,66.573856781428589,-88.237952766398678,null,43.343295127724765,-0.19891978793808548,null,0,{"$f":"IF(AD45>0,S43,0)","v":0}]
[20.893000000000001,2.0893000000000002E-2,1.0000071362042002,3.777872883679206E-3,1.0000000000622542,1.1158340189733399E-5,1,0,39.503363062308608,1.5454793219734746,1.000005468339332,3.3070574271206938E-3,1.0000000002508194,2.239729599625488E-5,1.0000000004028564,3.996975639491616E-5,70.346924773919255,-88.579352356710601,91.420647643289399,null,1000000000,436.51744900000006,null,65.774590490916239,-88.361245412139283,null,43.343284701259137,-0.21810694457131161,null,0,0]
[22.909000000000002,2.2909000000000002E-2,1.0000085798088285,4.1424020772195553E-3,1.0000000000748479,1.2235026822593992E-5,1,0,43.312772456719223,1.5477063972827472,1.0000065745475712,3.6261581738509462E-3,1.0000000003015588,2.455844799506279E-5,1.0000000004843519,4.3826504055225805E-5,69.547283569708554,-88.70984034166294,91.29015965833706,null,1000000000,524.82228100000009,null,64.97496182619598,-88.470688127004749,null,43.343272161768702,-0.23915221465819053,null,0,0]
[25.119,2.5118999999999999E-2,1.0000103150102011,4.5420087044383646E-3,1.0000000000899854,1.3415323181004711E-5,1,0,47.488967245298994,1.5497372476872338,1.0000079042016403,3.9759651852103962E-3,1.0000000003625469,2.6927567993491658E-5,1.0000000005823089,4.8054387154683886E-5,68.7477452239673,-88.829363161044171,91.170636838955829,null,1000000000,630.96416099999999,null,64.175438552799321,-88.567140559296561,null,43.343257089424114,-0.2622226017476097,null,0,0]
[27.542000000000002,2.7542000000000001E-2,1.0000124009645184,4.9801277828010124E-3,1.0000000001081828,1.4709376609210134E-5,1,0,52.067851304715234,1.5515894369062229,1.0000095026321905,4.3594855065891358E-3,1.0000000004358636,2.9525023991420744E-5,1.0000000007000671,5.2689754009373747E-5,67.948202368983985,-88.938954331042481,91.061045668957519,null,1000000000,758.56176400000004,null,63.375913816843983,-88.65143791199425,null,43.343238970396136,-0.28751641904822117,null,0,0]
[30.2,3.0199999999999998E-2,1.0000149100073685,5.4607366011979117E-3,1.0000000001300713,1.6128936663701393E-5,1,0,57.090999431948099,1.5532795351561781,1.0000114252691643,4.7802009131026595E-3,1.0000000005240508,3.237439998868944E-5,1.0000000008417103,5.7774692143151088E-5,67.148237476087857,-89.039594735477053,90.960405264522947,null,1000000000,912.04,null,62.575970717959734,-88.724331448811967,null,43.343217176384258,-0.31526328666510117,null,0,0]
[33.113,3.3112999999999997E-2,1.0000179250499976,5.9874505835798945E-3,1.000000000156374,1.7684684759462883E-5,1,0,62.596208081994703,1.5548202386077483,1.0000137356466769,5.2412764581625014E-3,1.0000000006300234,3.5497135985090642E-5,1.0000000010119192,6.3347462941250169E-5,66.348623758439032,-89.132040424311484,90.867959575688516,null,1000000000,1096.470769,null,61.77638318945845,-88.786368490963568,null,43.343190987236717,-0.34567193334791596,null,0,0]
[36.308,3.6308E-2,1.0000215509879291,6.5651505540442606E-3,1.0000000001880063,1.9391040806723578E-5,1,0,68.634503875717684,1.5562258800459312,1.0000165141453552,5.7469849650542857E-3,1.0000000007574679,3.8922175980345135E-5,1.0000000012166157,6.9459719273737779E-5,65.548726931849032,-89.217151233176679,90.782848766823321,null,1000000000,1318.2708640000001,null,60.976517858246751,-88.838127090166921,null,43.343159491858422,-0.37902414300976583,null,0,0]
[39.811,3.9810999999999999E-2,1.0000259100205133,7.1985361129338708E-3,1.0000000002260339,2.1261890644951564E-5,1,0,75.255024797517336,1.5575077864724263,1.0000198544059453,6.301440700814058E-3,1.0000000009106798,4.26773919740897E-5,1.0000000014626989,7.6161200941281495E-5,64.748857991021097,-89.295613339822069,90.704386660177931,null,1000000000,1584.9157210000001,null,60.17668678040345,-88.880022102625404,null,43.343121628873782,-0.41559123719666075,null,0,0]
[43.652000000000001,4.3652000000000003E-2,1.0000311507665856,7.8930295787222014E-3,1.000000000271754,2.331325639660236E-5,1,0,82.514469564898945,1.5586769435448915,1.0000238703147202,6.9093906971959039E-3,1.0000000010948833,4.6794943965843324E-5,1.0000000017585595,8.3509300021484398E-5,63.948955168754793,-89.368099080102411,90.631900919897589,null,1000000000,1905.497104,null,59.376829479553166,-88.912412817905917,null,43.343076107457762,-0.45568626219649283,null,0,0]
[47.863,4.7863000000000003E-2,1.000037450611218,8.6544141875661666E-3,1.0000000003267138,2.5562228325613818E-5,1,0,90.47331778565524,1.5597431192084077,1.0000286978020867,7.5758980722224799E-3,1.0000000013163137,5.1309135954974044E-5,1.0000000021142124,9.1565234730283071E-5,63.149134284132565,-89.435213869595714,90.564786130404286,null,1000000000,2290.8667689999997,null,58.577063315421078,-88.935570768216948,null,43.343021386967628,-0.49964310137877055,null,0,0]
[52.481000000000002,5.2481E-2,1.0000450258205489,9.4893762889551436E-3,1.0000000003928002,2.8028567049650752E-5,1,0,99.201499979171118,1.5607156633267021,1.0000345025939139,8.3068167090671833E-3,1.000000001582573,5.625963194064334E-5,1.000000002541868,1.0039978862969707E-4,62.349164458965376,-89.497546308818841,90.502453691181159,null,1000000000,2754.255361,null,57.77715928811341,-88.949698531069444,null,43.342955589108101,-0.5478477777493953,null,0,0]
[57.544000000000004,5.7544000000000005E-2,1.0000541321840692,1.0404781811357748E-2,1.0000000004722454,3.0732567257096462E-5,1,0,108.77083749019644,1.5616025565639966,1.0000414807043878,9.1081579437848822E-3,1.0000000019026534,6.1687167921753807E-5,1.0000000030559684,1.100856583506454E-4,61.549261298932684,-89.555607957099483,90.444392042900517,null,1000000000,3311.3119360000005,null,56.977335224803284,-88.954911274656823,null,43.342876492385535,-0.60069668244265639,null,0,0]
[63.095999999999997,6.3095999999999999E-2,1.0000650813770335,1.1408579891887314E-2,1.0000000005677683,3.3697728060793002E-5,1,0,119.26449264440434,1.5624115033200521,1.0000498709753203,9.9868816768124424E-3,1.0000000022875111,6.763891189685015E-5,1.0000000036741123,1.2070701893918612E-4,60.749265215275834,-89.609903102116803,90.390096897883197,null,1000000000,3981.1052159999995,null,56.177434243499107,-88.951254358175461,null,43.342781390032869,-0.6586487439413341,null,0,0]
[69.183000000000007,6.9183000000000008E-2,1.0000782436318139,1.2509079137405048E-2,1.0000000006826,3.6948616715027421E-5,1,0,130.76940855059075,1.5631492038357486,1.0000599571246072,1.0950262923456277E-2,1.0000000027501625,7.4164175864024315E-5,1.000000004417205,1.3235187157927098E-4,59.949338600791037,-89.660881319695136,90.339118680304864,null,1000000000,4786.2874890000012,null,55.377621952171424,-88.93869767484594,null,43.342667066875734,-0.72218364484920483,null,0,0]
[75.858000000000004,7.5858000000000009E-2,1.000094069656889,1.3715850920057206E-2,1.0000000008206733,4.0513538969263415E-5,1,0,143.38575944135107,1.5638220769765354,1.0000720845446287,1.2006682701201584E-2,1.0000000033064529,8.1319775820746661E-5,1.0000000053106974,1.451216089388831E-4,59.14930924043005,-89.708986028921544,90.291013971078456,null,1000000000,5754.4361640000006,null,54.577730049636806,-88.917132056954543,null,43.342529609049379,-0.79185397196699836,null,0,0]
[83.176000000000002,8.3176E-2,1.0001130937785538,1.5038824493963729E-2,1.0000000009866512,4.4421868714368744E-5,1,0,157.2175002666232,1.5644356688444085,1.0000866627126936,1.3164836077084434E-2,1.0000000039751693,8.9164671763703544E-5,1.0000000063847641,1.5912144982341649E-4,58.349373299222734,-89.754613435497077,90.245386564502923,null,1000000000,6918.2469760000004,null,53.777959340624079,-88.886380460253434,null,43.342364376854796,-0.86823297524365528,null,0,0]
[91.201000000000008,9.1201000000000004E-2,1.0001359680553932,1.6489551302997198E-2,1.0000000011862242,4.8707786477831604E-5,1,0,172.38559733021606,1.564995345598827,1.0001041913371556,1.4434839204564297E-2,1.0000000047792392,9.7767471688497236E-5,1.0000000076762301,1.7447383066017592E-4,57.549325035431529,-89.798162221433614,90.201837778566386,null,1000000000,8317.6224010000005,null,52.978109745021975,-88.846174661081903,null,43.342165708665696,-0.95198756035169529,null,0,0]
[100,0.1,1.000163467610647,1.8080118677868719E-2,1.0000000014261579,5.3407074999222062E-5,1,0,189.01668771200028,1.565505763950265,1.0001252644498431,1.582727868304051E-2,1.00000000574592,1.0719999958935824E-4,1.0000000092288754,1.9130692708229695E-4,56.749285804171016,-89.839994591093074,90.160005408906926,null,1000000000,10000,null,52.178309347509604,-88.796179017042988,null,43.341926874917547,-1.0438155740500994,null,0,0]
[109.65,0.10965000000000001,1.0001965358614759,1.9824413144037368E-2,1.0000000017146871,5.8560857725382651E-5,1,0,207.25631000418826,1.565971364505286,1.000150605074442,1.7354317923626628E-2,1.0000000069083899,1.1754479945863646E-4,1.0000000110959901,2.0976804541294165E-4,55.949066414669829,-89.880474512923129,90.119525487076871,null,1000000000,12023.122500000001,null,51.378377147205001,-88.735955773451778,null,43.341639685720963,-1.1445187394713592,null,0,0]
[120.23,0.12023,1.0002362879627027,2.1736671567393541E-2,1.0000000020615472,6.4211326244365222E-5,1,0,227.25378340090825,1.5663959458099579,1.0001810678783982,1.9028429325893256E-2,1.0000000083058727,1.288865592863231E-4,1.0000000133405731,2.3000831811038726E-4,55.148918520221386,-89.919931818171861,90.080068181828139,null,1000000000,14455.252900000001,null,50.578574476897103,-88.665012807374353,null,43.341294461580418,-1.2549190107975075,null,0,0]
[131.83000000000001,0.13183,1.0002840756650695,2.38331043808571E-2,1.0000000024785409,7.040654692207801E-5,1,0,249.17921872405526,1.5667831402643211,1.0002176888933125,2.0863816058832155E-2,1.0000000099859199,1.413217590591815E-4,1.0000000160390001,2.5219992139025038E-4,54.348807586392866,-89.958702274649497,90.041297725350503,null,1000000000,17379.148900000004,null,49.778878533625914,-88.582749986258918,null,43.340879471023086,-1.375952288390587,null,0,0]
[144.54,0.14454,1.0003414830602875,2.6129902909460406E-2,1.000000002979502,7.7194586123935729E-5,1,0,273.20272706915483,1.5671360330500661,1.0002616822806831,2.2874668467235397E-2,1.0000000120042678,1.5494687875998409E-4,1.0000000192807927,2.7651503146232978E-4,53.549226891118408,-89.997089936835081,90.002910063164919,null,1000000000,20891.811599999997,null,48.979796340543672,-88.48853655902407,null,43.340380968830871,-1.5085533778110232,null,0,0]
[158.49,0.15849000000000002,1.0004105648799748,2.8650461063303798E-2,1.0000000035823773,8.4644873044591764E-5,1,0,299.57002490193941,1.5674582029038022,1.00031462298852,2.5081488032937017E-2,1.0000000144332224,1.6990127836518472E-4,1.0000000231820863,3.0320234729828516E-4,52.748820226028229,-90.035483831305044,89.964516168694956,null,1000000000,25119.080100000003,null,48.179989515621713,-88.381410908528011,null,43.339781128662636,-1.6540729227770341,null,0,0]
[173.78,0.17377999999999999,1.0004935823584011,3.1412717942063066E-2,1.0000000043069237,9.2810814755403946E-5,1,0,328.47012513711292,1.5677519051923696,1.000378244388872,2.7500007393684047E-2,1.0000000173523842,1.8629215784492459E-4,1.0000000278707319,3.3245317578226989E-4,51.948701420074173,-90.074153645200184,89.925846354799816,null,1000000000,30199.488400000002,null,47.380591498921206,-88.260606986133439,null,43.339060339409102,-1.8135466590667595,null,0,0]
[190.55,0.19055000000000002,1.0005934119357716,3.4441795428985046E-2,1.0000000051782796,1.0176718115645574E-4,1,0,360.16764608479184,1.5680198384132047,1.0004547515674853,3.0152257024740909E-2,1.0000000208630346,2.0426959715887756E-4,1.0000000335094033,3.6453534655425023E-4,51.148322535659752,-90.11345077612178,89.88654922387822,null,1000000000,36309.302500000005,null,46.581079293592431,-88.125025750048152,null,43.338193660323455,-1.9884250260736098,null,0,0]
[208.93,0.20893,1.0007133685189689,3.776095067905566E-2,1.0000000062254277,1.1158340143886208E-4,1,0,394.90830495604524,1.5682640906880481,1.0005466859955445,3.3058646585319255E-2,1.0000000250819432,2.2397295625488202E-4,1.0000000402856519,3.9969755854417084E-4,50.348247940847052,-90.153676270259297,89.846323729740703,null,1000000000,43651.744900000005,null,45.7820459978442,-87.973625438236567,null,43.33715236125898,-2.1800508320227241,null,0,0]
[229.09,0.22909000000000002,1.0008576168102088,4.1400587828431562E-2,1.0000000074847941,1.2235026762153398E-4,1,0,433.01342449022695,1.5684869275191922,1.0006572409355354,3.6245859513485211E-2,1.0000000301558678,2.4558447506279132E-4,1.000000048435195,4.3826503342683023E-4,49.547853712190609,-90.195196985039161,89.804803014960839,null,1000000000,52482.2281,null,44.982903770384681,-87.805017447611661,null,43.335900360062062,-2.3901795374274997,null,0,0]
[251.19,0.25119000000000002,1.0010309748854658,4.5389203701919227E-2,1.0000000089985448,1.3415323101330579E-4,1,0,474.78542627434143,1.5686901106306703,1.0007901111500375,3.9738929800859774E-2,1.0000000362546952,2.6927567349166166E-4,1.0000000582308968,4.8054386215394128E-4,48.747582122576759,-90.238334734627415,89.761665265372585,null,1000000000,63096.416100000002,null,44.184136601270161,-87.617878202826319,null,43.334395939562739,-2.6204565318010831,null,0,0]
[275.42,0.27542,1.0012393361639749,4.9760577858147671E-2,1.000000010818288,1.4709376504184156E-4,1,0,520.58343610702173,1.5688754039501953,1.0009498166582074,4.3567544662736504E-2,1.0000000435863512,2.9525023142074649E-4,1.0000000700067206,5.2689752771207501E-4,47.947300880290769,-90.283451740678572,89.716548259321428,null,1000000000,75856.176400000011,null,43.385663196459554,-87.410619487347702,null,43.332588102087357,-2.872832253330877,null,0,0]
[302,0.30199999999999999,1.001489901948349,5.4553725029754266E-2,1.0000000130071298,1.6128936525239219E-4,1,0,570.82328405021281,1.5690444702406141,1.0011418814966027,4.7766012530355263E-2,1.0000000524050874,3.2374398868944529E-4,1.0000000841710361,5.7774690510800772E-4,47.146567106538491,-90.330943818683949,89.669056181316051,null,1000000000,91204,null,42.587102947594879,-87.181384354782807,null,43.330414577199754,-3.1495594639011451,null,0,0]
[331.13,0.33112999999999998,1.0017909173726023,5.9803823123914177E-2,1.0000000156374036,1.7684684576944803E-4,1,0,625.88299755180913,1.5691985833997641,1.0013726320417311,5.2365327835849594E-2,1.0000000630023314,3.5497134509065184E-4,1.000000101191922,6.3347460789518447E-4,46.346128860419029,-90.381151739423643,89.618848260576357,null,1000000000,109647.0769,null,41.789275131275545,-86.92848222815293,null,43.327804147399618,-3.4526695112707193,null,0,0]
[363.08,0.36307999999999996,{"$f":"SQRT(1+(A77/pole1)^2)","v":1.0021528047310575},{"$f":"ATAN(A77/pole1)","v":6.5558365943551494E-2},{"$f":"SQRT(1+(A77/Zero1)^2)","v":1.0000000188006231},{"$f":"ATAN(A77/Zero1)","v":1.9391040566111572E-4},{"$f":"IF(VIN_nom>Vout, 1, SQRT(1+(A77/z_RHP)^2))","v":1},{"$f":"IF(VIN_nom>Vout, 0, -ATAN(A77/z_RHP))","v":0},{"$f":"SQRT(1+(A77/Pole2)^2)","v":686.27291380804957},{"$f":"ATAN(A77/Pole2)","v":1.5693391800333689},{"$f":"SQRT(1+(A77/Zero2)^2)","v":1.0016500668111334},{"$f":"ATAN(A77/Zero2)","v":5.7407335203868599E-2},{"$f":"SQRT(1+(A77/pole4)^2)","v":1.0000000757467864},{"$f":"ATAN(A77/pole4)","v":3.8922174034513598E-4},{"$f":"SQRT((1-(V77/pterm2))^2+(A77/pterm1)^2)","v":1.0000001216615766},{"$f":"IF((ATAN((A77/pterm1)/(1-A77^2/pterm2))>0),ATAN((A77/pterm1)/(1-A77^2/pterm2)),PI()+ATAN((A77/pterm1)/(1-A77^2/pterm2)))","v":6.945971643712856E-4},{"$f":"20*LOG10(((E77*K77*G77)/(C77*I77*O77*M77))*Adc)","v":45.545323515225647},{"$f":"((F77+L77+H77)-(D77+J77+P77+N77))*radconv","v":-90.434519404983732},{"$f":"IF(R77>0,R77,R77+180)","v":89.565480595016268},null,1000000000,131827.0864,null,{"$f":"20*LOG10((K77/(I77*M77))*AEA)","v":40.991607064115108},{"$f":"(L77-(J77+N77))*radconv","v":-86.649614482186976},null,{"$f":"20*LOG10((E77*G77/(C77*O77))*Acs*Am)","v":43.324666869366681},{"$f":"(F77+H77-(D77+P77))*radconv","v":-3.7849049227967533},null,0,{"$f":"IF(AD77>0,S75,0)","v":0}]
[398.11,{"$f":"A78/1000","v":0.39811000000000002},1.0025876875543394,7.1862643183785269E-2,1.0000000226033994,2.1261890327761503E-4,1,0,752.48446876164485,1.5694673953207507,1.0019834931817941,6.2932029742425205E-2,1.0000000910679852,4.2677389408970763E-4,1.0000001462698984,7.6161197201882744E-4,44.744431996161786,-90.491451726082147,89.508548273917853,null,{"$f":"IF(Q78<0,A78,1000000000)","v":1000000000},{"$f":"A78^2","v":158491.57210000002},null,40.194484137969162,-86.342570576435079,null,43.320898276448759,-4.148881149647063,null,{"$f":"SUM((Q79<0)*(Q78>0))*A78","v":0},0]
[436.52,0.43651999999999996,1.003110288230642,7.876862309072441E-2,1.0000000271753957,2.3313255978461362E-4,1,0,825.08470398963493,1.569584329723581,1.0023842177145592,6.8985364446556383E-2,1.0000001094883333,4.6794940584333306E-4,1.0000001758559549,8.3509295091960755E-4,43.943358419289083,-90.552398532524847,89.447601467475153,null,1000000000,190549.71039999998,null,39.397937134733169,-86.00479907632716,null,43.316371702812049,-4.5475994561976991,null,0,0]
[478.63,0.47863,1.0037381443874689,8.6331183739049619E-2,1.0000000326713754,2.5562227774412745E-4,1,0,904.67846393866159,1.5696909614706409,1.0028657152249918,7.5615981321934853E-2,1.0000001316313631,5.1309131497406075E-4,1.0000002114212414,9.156522823209536E-4,43.142180050548333,-90.61781811124213,89.38218188875787,null,1000000000,229086.67689999999,null,38.602193906433527,-85.633588703316576,null,43.310936562370934,-4.9842294079255494,null,0,0]
[524.80999999999995,0.52481,1.0044925917308836,9.4613281060049806E-2,1.0000000392800279,2.8028566323015262E-4,1,0,991.96510009765382,1.5697882266416965,1.0034443870119023,8.2879786220403373E-2,1.000000158257297,5.6259626064335776E-4,1.0000002541867974,1.0039978006328824E-3,42.340620970353136,-90.688219995132073,89.311780004867927,null,1000000000,275425.53609999997,null,37.807161329294289,-85.225812647208897,null,43.304410059314989,-5.4624073479231798,null,0,0]
[575.44000000000005,0.57544000000000006,1.0053987914470546,0.10367848087854604,1.0000000472245334,3.0732566299217939E-4,1,0,1087.6628654283793,1.5698769241264148,1.0041395883752577,9.0833457251623978E-2,1.0000001902653166,6.1687160175382001E-4,1.0000003055968547,1.1008564705807986E-3,41.538845362585228,-90.764097958174887,89.235902041825113,null,1000000000,331131.19360000006,null,37.013218513614532,-84.778292604478168,null,43.29657726722683,-5.9858053536967102,null,0,0]
[630.96,0.63096000000000008,1.0064873069071751,0.11359955109914036,1.0000000567768423,3.3697726798047665E-4,1,0,1192.603421331969,1.5699578249934645,1.0049748473347349,9.9542053990925292E-2,1.0000002287510947,6.7638901685018206E-4,1.0000003674112419,1.2070700405250304E-3,40.736632768429139,-90.84599962391475,89.15400037608525,null,1000000000,398110.52160000004,null,36.220405241543816,-84.28737214020731,null,43.287177945141465,-6.5586274837074381,null,0,0]
[691.83,0.69183000000000006,1.0077942937769475,0.12445081261908239,1.0000000682600116,3.6948615050432914E-4,1,0,1307.6562320683261,1.5700315997412992,1.0059780238191622,0.10907240082146173,1.0000002750162122,7.4164162402435424E-4,1.0000004417205104,1.3235185195513196E-3,39.934075247544754,-90.934457526108105,89.065542473891895,null,1000000000,478628.74890000006,null,35.429120121594451,-83.749289169585737,null,43.275905544206438,-7.1851683565223787,null,0,0]
[758.58,0.75858000000000003,1.0093635699230656,0.13631643553887599,1.0000000820673387,4.0513536774870252E-4,1,0,1433.8230717411755,1.5700988906183011,1.0071829171227464,0.11950049182039546,1.0000003306452439,8.1319758074672706E-4,1.0000005310697446,1.4512158306887412E-3,39.130917111445676,-91.030051343061388,88.969948656938612,null,1000000000,575443.61640000006,null,34.639477262796525,-83.159758903865978,null,43.262390266905292,-7.8702924391954134,null,0,0]
[831.76,0.83175999999999994,1.0112467724205867,0.1492807154381644,1.0000000986651163,4.442186582166231E-4,1,0,1572.1435173064087,1.5701602525075153,1.0086294134028089,0.13090310395778093,1.0000003975168577,8.916464837036641E-4,1.0000006384763938,1.5912141572089601E-3,38.327258350395319,-91.133320888915065,88.866679111084935,null,1000000000,691824.69759999996,null,33.8520097389545,-82.51444792055355,null,43.246199029696967,-8.6188729683615115,null,0,0]
[912.01,0.91200999999999999,1.0135065169054653,0.16343945066354343,1.0000001186224163,4.8707782664460605E-4,1,0,1723.8272583671308,1.5702162222332399,1.0103659500470983,0.14336799459019381,1.000000477923815,9.7767440849741622E-4,1.0000007676230063,1.7447378570381485E-3,37.522779130862226,-91.244847512037083,88.755152487962917,null,1000000000,831762.24009999994,null,33.066919409517212,-81.808398160492843,null,43.226810139601149,-9.4364493515442405,null,0,0]
[1000,1,1.0162166079607997,0.17888795222992507,1.0000001426157732,5.3407069972206316E-4,1,0,1890.1406887746703,1.5702672656236358,1.0124497316345409,0.1569836038787478,1.000000574591835,1.0719995893585337E-3,1.0000009228875359,1.9130686781811325E-3,36.71746990484715,-91.365145661921986,88.634854338078014,null,1000000000,1000000,null,32.284806177740855,-81.036610217484537,null,43.20361414536243,-10.32853544443744,null,0,0]
[1096.5,1.0965,1.0194660538388141,0.19573164822422323,1.0000001714686886,5.8560851098090152E-4,1,0,2072.5392164336045,1.570313826859131,1.014949891904644,0.17184870103785183,1.0000006908387618,1.1754474586369013E-3,1.0000011095989865,2.0976796728288064E-3,35.91098803037562,-91.494730445042791,88.505269554957209,null,1000000000,1202312.25,null,31.506055293355338,-80.193497775844648,null,43.175883155276409,-11.301232669198154,null,0,0]
[1202.3,1.2022999999999999,1.0233587717612469,0.21406989980952534,1.0000002061547002,6.4211317507638463E-4,1,0,2272.5160520891141,1.570356285884579,1.0179473730195081,0.18805848679107268,1.0000008305869226,1.2888648863238067E-3,1.0000013340572638,2.3000821511192653E-3,35.10341265692653,-91.633972946101608,88.366027053898392,null,1000000000,1445525.2899999998,null,30.731584513507563,-79.273676527212842,null,43.142778561675101,-12.360296418888767,null,0,{"$f":"IF(AD90>0,S90,0)","v":0}]
[1318.3,1.3183,1.0280190673874821,0.23400903339360363,1.0000002478540626,7.0406535404717876E-4,1,0,2491.7723219413642,1.5703950060088692,1.0215392882840775,0.20571653402229859,1.0000009985914939,1.4132166591826079E-3,1.0000016038999719,2.5219978561054099E-3,34.294511155266768,-91.783178133375984,88.216821866624016,null,1000000000,1737914.89,null,29.962150061638049,-78.271288276739369,null,43.103311511884854,-13.511889856636611,null,0,0]
[1445.4,1.4454,1.0335899927560988,0.25564013095815563,1.0000002979501632,7.7194570943846838E-4,1,0,2732.0091522178891,1.5704302958020948,1.0258378545843618,0.22491563760617297,1.0000012004260606,1.5494675599858902E-3,1.0000019280792198,2.7651485250224368E-3,33.484561590150044,-91.942391931473495,88.057608068526505,null,1000000000,2089181.1600000001,null,29.199145395661738,-77.181089227485728,null,43.056366612744448,-14.761302703987775,null,0,0]
[1584.9,1.5849000000000002,1.0402546959024099,0.27910265205271856,1.0000003582376642,8.4644853031428963E-4,1,0,2995.6837252912501,1.5704625131782823,1.0309871466058567,0.24579495549296268,1.0000014433212057,1.6990111651875163E-3,1.0000023182085389,3.032021113604897E-3,32.671943229169599,-92.111834686006446,87.888165313993554,null,1000000000,2511908.0100000002,null,28.442357682318278,-75.995206569219363,null,43.00053596510746,-16.116628116787084,null,0,0]
[1737.8,1.7378,1.0482083924652903,0.30446067062836968,1.0000004306922765,9.2810788373297239E-4,1,0,3284.6861814729059,1.5704918837034718,1.0371418343969026,0.26843074701651032,1.0000017352369384,1.862919444929035E-3,1.0000027870730552,3.3245286476022667E-3,31.857517860001433,-92.290961577830046,87.709038422169954,null,1000000000,3019948.84,null,27.6940947082688,-74.709345307304645,null,42.934373569988765,-17.581616270525398,null,0,0]
[1905.5,1.9055,1.0576944742820948,0.33181511891926974,1.0000005178278275,1.0176714637586872E-3,1,0,3601.6627172218641,1.5705186772504052,1.0444955688732458,0.29293685223559712,1.0000020863012979,2.0426931588846051E-3,1.0000033509401329,3.6453493652154841E-3,31.040444464127663,-92.479245104865981,87.520754895134019,null,1000000000,3630930.25,null,26.955277511611143,-73.31708433659108,null,42.856117370772651,-19.162160768274898,null,0,0]
[2089.3000000000002,2.0893000000000002,1.068982971453784,0.3612136510919256,1.0000006225425853,1.1158335559170555E-3,1,0,3949.070514985227,1.5705431026483809,1.0532649646060976,0.31938494839564308,1.000002508191195,2.2397258548932006E-3,1.0000040285649159,3.9969701804645737E-3,30.221008550890531,-92.675503365574372,87.324496634425628,null,1000000000,4365174.4900000012,null,26.228057607053422,-71.814408662871543,null,42.76390136209325,-20.861094702702832,null,0,0]
[2290.9,2.2909000000000002,1.0824033040882068,0.39272384708237729,1.0000007484791267,1.2235020718099573E-3,1,0,4330.1228133709265,1.5705653864608717,1.0637158378400873,0.34787075458505523,1.0000030155822939,2.4558398628090248E-3,1.000004843519094,4.3826432088622282E-3,29.398284949577445,-92.878375811214696,87.121624188785304,null,1000000000,5248222.8100000005,null,25.513706434449006,-70.19595137929565,null,42.655528933384581,-22.682424431919049,null,0,0]
[2511.9,2.5119000000000002,1.0983174714146218,0.42634446531618603,1.0000008998540755,1.3415315133925745E-3,1,0,4747.8438369696632,1.5705857048701384,1.0761434186810124,0.37843450377727089,1.00000362546302,2.6927502916897169E-3,1.0000058230891122,4.8054292286763712E-3,28.572463135523265,-93.085720898565526,86.914279101434474,null,1000000000,6309641.6100000003,null,24.814667471387615,-68.459515669296039,null,42.528746082391777,-24.62620522926948,null,0,0]
[2754.2,2.7542,1.1171485255809552,0.4620598672742478,1.0000010818282161,1.4709366001599928E-3,1,0,5205.8248524992996,1.570604234276519,1.0908957543275608,0.41110982064379092,1.0000043586257121,2.952493820790924E-3,1.0000070006712478,5.2689628955127996E-3,27.743187051197957,-93.294992966119125,86.705007033880875,null,1000000000,7585617.6399999987,null,24.13306052481871,-66.603301781226605,null,42.381076944635382,-26.691691184892509,null,0,0]
[3020,3.02,1.139386839686743,0.49982793071163989,1.0000013007121438,1.6128922679043544E-3,1,0,5708.2241688100321,1.5706211409620452,1.1083802094298434,0.44591253789111451,1.0000052404951454,3.2374286895157549E-3,1.0000084171024084,5.7774527276635065E-3,26.909844215289329,-93.503189895651232,86.496810104348768,null,1000000000,9120400,null,23.470933735101184,-64.626547212249278,null,42.209860898444276,-28.87664268340194,null,0,0]
[3311.3,3.3113000000000001,1.1655488891608103,0.53950150501345739,1.0000015637391528,1.7684666325170706E-3,1,0,6258.8220666866537,1.5706365523207864,1.12903269227176,0.48276665707887495,1.0000063002134747,3.549698690763449E-3,1.0000101191904773,6.3347245617718989E-3,26.073159989695554,-93.706523103041263,86.293476896958737,null,1000000000,10964707.690000001,null,22.831447926943795,-62.53373648167959,null,42.012662481007894,-31.172786621361677,null,0,0]
[3630.8,3.6308000000000002,1.196254322053834,0.58094818980014107,1.000001880060551,1.9391016504965409E-3,1,0,6862.721925202788,1.5706506120166441,1.1533800909824987,0.52161241862443297,1.0000075746502353,3.8921979453129074E-3,1.000012166155164,6.9459432778382372E-3,25.232516112890863,-93.901217937246329,86.098782062753671,null,1000000000,13182708.640000001,null,22.216679583902955,-60.328467613633585,null,41.786786947244039,-33.572750323612738,null,0,0]
[3981.1,3.9811000000000001,1.2321554786453559,0.62393482659045008,1.000002260337415,2.1261858608841566E-3,1,0,7524.8381094047118,1.570663433570032,1.1819864892963297,0.56229584287431045,1.000009106757473,4.2677132899879341E-3,1.00001462698623,7.6160823265452073E-3,24.388430937552435,-94.083109364139773,85.916890635860227,null,1000000000,15849157.209999999,null,21.629452330378104,-58.019729170625503,null,41.529929025430469,-36.063380193514263,null,0,0]
[4365.2,4.3651999999999997,1.2739799980439952,0.6681943351604912,1.0000027175359274,2.3313214164498441E-3,1,0,8250.8410405101331,1.5706751270290136,1.2154883760541966,0.60462632431780705,1.0000109487739821,4.6794602437774209E-3,1.0000175855902793,8.3508802145060464E-3,23.541196037309163,-94.248243241986088,85.751756758013912,null,1000000000,19054971.039999999,null,21.072181097640218,-55.618632584939711,null,41.23996535792508,-38.629610657046356,null,0,0]
[4786.3,4.7862999999999998,1.3225075613545398,0.71340293091549623,1.0000032671322492,2.5562172654521806E-3,1,0,9046.7791678277208,1.5706857902179021,1.2545773301687861,0.6483501242720533,1.0000131630505524,5.1308685747648028E-3,1.0000211421165948,9.1564578421982328E-3,22.691456733018157,-94.393061138054961,85.606938861945039,null,1000000000,22908667.690000001,null,20.547178996561193,-53.139918128376841,null,40.915228154713091,-41.253143009678098,null,0,0]
[5248.1,5.2481,1.3785995372923769,0.759219038389078,1.0000039279951418,2.8028493659808832E-3,1,0,9919.6460108803713,1.5706955167457681,1.3000245315259356,0.69318262413497589,1.000015825605739,5.6259038444738648E-3,1.0000254186688287,1.0039892343612753E-2,21.839641445464114,-94.514824513596821,85.485175486403179,null,1000000000,27542553.610000003,null,20.056194406189324,-50.600125818968891,null,40.554397457530918,-43.914698694627951,null,0,0]
[5370.3,5.3703000000000003,1.3939018026232559,0.7707180118443826,1.0000041130481427,2.868112286955285E-3,1,0,10150.621169576043,1.5706978106563361,1.3124685363709789,0.70451921766547598,1.0000165711661302,5.7568980010263499E-3,1.0000266161775631,1.0273663223162118E-2,21.626563307399572,-94.541419836542318,85.458580163457682,null,1000000000,28840122.090000004,null,19.9390060886669,-49.958223698587886,null,40.458507636988806,-44.583196137954452,null,0,0]
[5432.85,5.4328500000000002,1.4018046456848217,0.77650641361004868,1.000004209418508,2.9015181343856437E-3,1,0,10268.849452545388,1.5706989449016084,1.3189025304388582,0.7102388826931233,1.0000169594327137,5.823949352785773E-3,1.0000272398062857,1.0393322428952001E-2,21.519341721289042,-94.554206861879237,85.445793138120763,null,1000000000,29515859.122500002,null,19.88089538621001,-49.634417778838625,null,40.409396753335173,-44.919789083040627,null,0,0]
[5495.4,5.4954000000000001,1.4097539295403918,0.78222972636612653,1.0000043069048283,2.9349239753400833E-3,1,0,10387.077735527642,1.5707000533263613,1.325379252101033,0.71590283101728602,1.0000173521952538,5.8910006521770437E-3,1.0000278706565879,1.051298155839943E-2,21.413334725439668,-94.566455407221184,85.433544592778816,null,1000000000,30199421.159999996,null,19.824009400514488,-49.313802708643784,null,40.360275743181319,-45.2526526985774,null,0,0]
[5559.4,5.5593999999999992,1.4179347427618583,0.78801909821562921,1.0000044078060821,2.969104205507265E-3,1,0,10508.046722125109,1.5707011616297661,1.3320496882984312,0.72164088037572571,1.0000177587160941,5.9596062434048918E-3,1.0000285236055473,1.0635414480617644E-2,21.306100682691422,-94.578446788087959,85.421553211912041,null,1000000000,30906928.359999996,null,19.767038754115372,-48.989031009332201,null,40.310012346832181,-45.589415778755757,null,0,0]
[5623.4,5.6233999999999993,1.4261625345069777,0.79374186015464254,1.0000045098756289,3.0032844287368895E-3,1,0,10629.015708735194,1.5707022447059358,1.3387635446264743,0.72732156294841577,1.0000181699437416,6.0282117785316397E-3,1.0000291841147795,1.0757847321051457E-2,21.200084646838917,-94.589907124000163,85.410092875999837,null,1000000000,31622627.559999995,null,19.71128315659913,-48.667544736103615,null,40.259751908495922,-45.922362387896555,null,0,0]
[5688.9,5.6888999999999994,1.4346309646484028,0.79953058763725859,1.0000046155471172,3.0382657436817586E-3,1,0,10752.819905981565,1.5707033279341154,1.3456790373038217,0.73307650358156196,1.000018595683104,6.0984251971252616E-3,1.0000298679328365,1.0883149595518487E-2,21.092818111783295,-94.601102974626357,85.398897025373643,null,1000000000,32363583.209999997,null,19.65544518308694,-48.341895923057415,null,40.20832334695249,-46.259207051568943,null,0,0]
[5754.4,5.7543999999999995,1.4431469032360491,0.8052511869475385,1.0000047224423034,3.073247051190801E-3,1,0,10876.624103240269,1.5707043865024017,1.3526386414128622,0.7387724105423995,1.0000190263524782,6.1686385555886417E-3,1.0000305596697059,1.1008451782327374E-2,20.986773568426642,-94.611776327834178,85.388223672165822,null,1000000000,33113119.359999996,null,19.600812549307747,-48.019628073934513,null,40.15691143737503,-46.592148253899651,null,0,0]
[5821.4,5.8213999999999997,1.4519061446652524,0.81103316901326539,1.0000048330515243,3.1090294495626338E-3,1,0,11003.263511135539,1.5707054446670292,1.3598025579272799,0.74453824382585931,1.0000194719851592,6.240459790625626E-3,1.0000312754407863,1.1136623393120383E-2,20.879537804918307,-94.6221707788727,85.3778292211273,null,1000000000,33888697.959999993,null,19.546142071289832,-47.693445843057717,null,40.104346151884613,-46.928724935815012,null,0,0]
[5888.4,5.8883999999999999,1.4607133421537637,0.81674561659649769,1.0000049449411312,3.144811839972964E-3,1,0,11129.902919042852,1.5707064787514213,1.3670112061653314,0.75024345528284442,1.0000199227762256,6.3122809612816315E-3,1.0000319994975246,1.1264794910058459E-2,20.77352668496253,-94.632053184030553,85.367946815969447,null,1000000000,34673254.559999995,null,19.492665326068543,-47.370735603603649,null,40.051811777150121,-47.261317580426912,null,0,0]
[5957,5.9569999999999999,1.4697796479879504,0.82252335546069,1.000005060829344,3.1814487268842619E-3,1,0,11259.566551628657,1.5707075134292374,1.3744376129649463,0.75602271141425337,1.0000203896770792,6.3858171968919743E-3,1.0000327494299899,1.1396027140969692E-2,20.666225673097884,-94.641658763620171,85.358341236379829,null,1000000000,35485849,null,19.43911448700781,-47.043881216789096,null,39.998061604346205,-47.597777546831075,null,0,0]
[6025.6,6.0256000000000007,1.4788944158722623,0.82823006380199793,1.0000051780598249,3.2180856052548609E-3,1,0,11389.230184226242,1.5707085245479397,1.3819094314203566,0.76173966128966419,1.0000208619856159,6.4593533634378338E-3,1.0000335080485696,1.1527259271198293E-2,20.560154227882258,-94.650763120463054,85.349236879536946,null,1000000000,36307855.360000007,null,19.386747406277788,-46.720595361689682,null,39.944357239860601,-47.930167758773379,null,0,0]
[6095.8,6.0958000000000006,1.4882710148004914,0.83399731581999459,1.0000052994141366,3.2555769791328213E-3,1,0,11521.918041502604,1.570709535689661,1.3896017681691708,0.76752611005719984,1.000021350908431,6.5346045869034168E-3,1.0000342933532411,1.1661552103687084E-2,20.452854443308908,-94.65957905443419,85.34042094556581,null,1000000000,37158777.640000001,null,19.334350478974628,-46.393425780228256,null,39.889454382590415,-48.266153274205934,null,0,0]
[6166,6.1660000000000004,1.4976964946206826,0.83969216498019916,1.0000054221740586,3.2930683438586539E-3,1,0,11654.605898790478,1.5707105238076562,1.397340119764102,0.77324865894352157,1.0000218454941083,6.6098557363603993E-3,1.0000350877539346,1.1795844828285608E-2,20.346787713635187,-94.667906474673558,85.332093525326442,null,1000000000,38019556,null,19.28312537673229,-46.069916068873241,null,39.834612755159036,-48.597990405800282,null,0,0]
[6237.8,6.2378,1.5073864091644757,0.84544294866790715,1.0000055491859572,3.3314142030465713E-3,1,0,11790.317980757389,1.5707115114402275,1.4053016516659973,0.77903624816403927,1.0000223572103197,6.6868219342847025E-3,1.0000359096699851,1.1933198242822291E-2,20.239551645865564,-94.675936813535628,85.324063186464372,null,1000000000,38910148.840000004,null,19.231910983896942,-45.742778058092632,null,39.778591080224757,-48.933158755443003,null,0,0]
[6309.6,6.3096000000000005,1.5171255374970856,0.85112008424393726,1.0000056776682686,3.3697600524373993E-3,1,0,11926.030062735535,1.5707124765952987,1.4133097245640571,0.78475844016443919,1.0000228748504534,6.7637880529851742E-3,1.0000367411014144,1.2070551541865831E-2,20.133550749467734,-94.683493112672593,85.316506887327407,null,1000000000,39811052.160000004,null,19.181854663543586,-45.419385739615869,null,39.722646504180283,-49.264107373056724,null,0,0]
[6383.05,6.3830499999999999,1.5271384173419678,0.85685256836031687,1.0000058106246545,3.4089870984185958E-3,1,0,12064.86087641383,1.5707134414627417,1.4215491644550282,0.79054522730697674,1.0000234105158954,6.8425228087573477E-3,1.0000376014854475,1.2211061167698687E-2,20.026364476709414,-94.690751294869941,85.309248705130059,null,1000000000,40743327.302500002,null,19.131812384318582,-45.092393711073271,null,39.665502510646967,-49.598357583796684,null,0,0]
[6456.5,6.4565000000000001,1.5372008263328274,0.86251018749587094,1.0000059451198102,3.4482141339085203E-3,1,0,12203.6916901031,1.5707143843772648,1.4298356580761906,0.79626513046317737,1.0000239523806373,6.9212574796924759E-3,1.0000384718272188,1.2351570669855341E-2,19.920415849543083,-94.697550930610774,85.302449069389226,null,1000000000,41686392.25,null,19.082914281644207,-44.769232589998694,null,39.608451986155011,-49.928318340612108,null,0,0]
[6531.7,6.5316999999999998,1.5475532839700528,0.86822619233548048,1.0000060844136105,3.4883757712297057E-3,1,0,12345.830249534551,1.5707153277870631,1.4383674829419171,0.80205284097718288,1.0000245135783072,7.0018679728675983E-3,1.0000393732219595,1.2495427784107163E-2,19.81319749393661,-94.704056505734115,85.295943494265885,null,1000000000,42663104.890000001,null,19.034002584030439,-44.442293898572302,null,39.550145328162309,-50.26176260716182,null,0,0]
[6606.9,6.6068999999999996,1.5579556314439249,0.87386604877239116,1.0000062253203774,3.5285373972976479E-3,1,0,12487.968808976735,1.5707162497210052,1.4469469205191283,0.80777210660324394,1.0000250812741807,7.0824783750443373E-3,1.00004028505459,1.263928476570063E-2,19.707221171092016,-94.710119459328354,85.289880540671646,null,1000000000,43651127.609999992,null,18.986222440662335,-44.119275574669103,null,39.491949148685819,-50.590843884659243,null,0,0]
[6683.85,6.6838500000000005,1.5686506642379328,0.87955953468145986,1.0000063711759308,3.5696336238900945E-3,1,0,12633.415114161364,1.5707171716343951,1.4557744219777136,0.81355448988787304,1.0000256689078453,7.1649645888944092E-3,1.0000412289117999,1.2786489343984993E-2,19.600036556905266,-94.715884509296515,85.284115490703485,null,1000000000,44673850.822500005,null,18.938467804771125,-43.792748350227697,null,39.432519170390272,-50.923136159068818,null,0,0]
[6760.8,6.7608000000000006,1.5793958564572781,0.8851757309669197,1.0000065187203944,3.6107298384249861E-3,1,0,12778.861419356481,1.5707180725617373,1.4646500109690905,0.81926698127078323,1.0000262633456525,7.2474507052424399E-3,1.0000421836983562,1.2933693780129801E-2,19.494096867200298,-94.721224485570318,85.278775514429682,null,1000000000,45708416.640000001,null,18.891830257849087,-43.470224428783077,null,39.373217027607346,-51.251000056787241,null,0,0]
[6839.55,6.83955,1.5904432704983844,0.89084454635729959,1.0000066714648217,3.6527873552909939E-3,1,0,12927.709977315195,1.5707189735743532,1.4737820974883995,0.82504166702436921,1.0000268787331701,7.3318662192672105E-3,1.0000431721349228,1.3084341446024881E-2,19.386940041821873,-94.726268594724147,85.273731405275853,null,1000000000,46779444.202500001,null,18.845224462192096,-43.144247583615012,null,39.312665997885915,-51.582021011109134,null,0,0]
[6918.3,6.9183000000000003,1.6015410881203287,0.89643497565568819,1.000006825978095,3.6948448592345941E-3,1,0,13076.558535284166,1.5707198540747787,1.4829627239788321,0.83074504193849086,1.0000275012468494,7.4162816287967901E-3,1.0000441720181283,1.3234988959585602E-2,19.281031172522617,-94.730906132531928,85.269093867468072,null,1000000000,47862874.890000001,null,18.79972098033096,-42.822355367337394,null,39.252260610447792,-51.908550765194541,null,0,0]
[6998.9,6.9988999999999999,1.6129507241830352,0.90207689357507392,1.000006985952868,3.7378903671945502E-3,1,0,13228.903853037904,1.5707207347419145,1.4924083512570561,0.83650954743015526,1.0000281457638864,7.5026800210251489E-3,1.000045207243808,1.3389175334525298E-2,19.173898440345212,-94.735251006375378,85.264748993624622,null,1000000000,48984601.209999993,null,18.754256144550268,-42.497074253054791,null,39.190592714051085,-52.238176753320587,null,0,0]
[7079.5,7.0795000000000003,1.624410980277176,0.90763937876700185,1.000007147780569,3.7809358613024552E-3,1,0,13381.249170801671,1.5707215953562867,1.5019029458205875,0.84220135701313703,1.000028797745806,7.5890783012413088E-3,1.0000462544602517,1.3543361546172118E-2,19.068016771543299,-94.739208725016326,85.260791274983674,null,1000000000,50119320.25,null,18.7098784979652,-42.175957152175783,null,39.129088691834234,-52.563251572840564,null,0,0]
[7161.95,7.16195,1.6361855491125288,0.9132487356399287,1.0000073152398878,3.8249693578357464E-3,1,0,13537.091248350433,1.5707224556816299,1.5116651724995669,0.84794963934403966,1.0000294724164154,7.6774595512915864E-3,1.0000473381200561,1.3701086600443509E-2,18.960971024364163,-94.742876094663387,85.257123905336613,null,1000000000,51293527.802499995,null,18.665573431716137,-41.851718000422089,null,39.066348010904157,-52.891158094241327,null,0,0]
[7244.4,7.2443999999999997,1.6480108637461706,0.91877776444571335,1.000007484638169,3.8690028395361306E-3,1,0,13692.933325908984,1.5707232964238953,1.5214767068157005,0.85362396936305296,1.0000301548984898,7.7658406813986298E-3,1.0000484343273832,1.3858811479859907E-2,18.855177960723516,-94.746177022374326,85.253822977625674,null,1000000000,52481331.359999992,null,18.622338770341713,-41.531714875129779,null,39.003789608637938,-53.214462147244539,null,0,0]
[7328.75,7.3287500000000003,1.6601600666812135,0.92435252098631115,1.000007659946609,3.9140510251173943E-3,1,0,13852.366670273705,1.5707241369644747,1.5315643776924615,0.85935363678555976,1.0000308611914017,7.8562583645042129E-3,1.0000495687805833,1.402017083082146E-2,18.748214907097204,-94.749194132593274,85.250805867406726,null,1000000000,53710576.5625,null,18.579181905678222,-41.208657824500399,null,38.939983419675116,-53.540536308092875,null,0,0]
[7413.1,7.4131,1.672360113359995,0.9298461092946021,1.0000078372844028,3.9590991948127091E-3,1,0,14011.800014647984,1.570724958376863,1.5417016694936829,0.86500813820458777,1.0000315756599114,7.9466759191518955E-3,1.0000507163662635,1.4181529994515057E-2,18.642506213796693,-94.751866227288133,85.248133772711867,null,1000000000,54954051.610000007,null,18.537078392992182,-40.889906365313429,null,38.876378239060642,-53.861959861974711,null,0,0]
[7499.45,7.4994499999999995,1.6849009452787744,0.93538737521923376,1.0000080209291042,4.0052154728100484E-3,1,0,14175.013639870587,1.5707257801255081,1.5521297084738264,0.870720015439853,1.0000323155376429,8.0392372053382042E-3,1.0000519047652783,1.434671490539681E-2,18.535561870903582,-94.754263503165021,85.245736496834979,null,1000000000,56241750.302499995,null,18.495034238444127,-40.567990360041989,null,38.811478050715593,-54.186273143123017,null,0,0]
[7585.8,7.5857999999999999,1.6974927477852562,0.94084659778617941,1.0000082067005331,4.0513317337714308E-3,1,0,14338.227265102543,1.570726583166042,1.5626077096918829,0.87635547297806127,1.00003306398323,8.1317983537679498E-3,1.0000531069269143,1.4511899615454687E-2,18.429875007093148,-94.756337476703109,85.243662523296891,null,1000000000,57544361.640000001,null,18.4540272738456,-40.250451801099906,null,38.746798151503683,-54.505885675603189,null,0,0]
[7674.15,7.67415,1.7104277769368623,0.94634890303296826,1.0000083989759005,4.098516101064026E-3,1,0,14505.221171183039,1.5707273861018185,1.5733790679918731,0.88204358420905582,1.0000338386317795,8.2265032178005081E-3,1.000054351176936,1.4680910049469037E-2,18.323013076608081,-94.758143891299369,85.241856108700631,null,1000000000,58892578.222499996,null,18.413110745013967,-39.930019227636457,null,38.680852749850253,-54.828124663662926,null,0,0]
[7762.5,7.7625000000000002,1.7234138116801099,0.95176844985461384,1.0000085934776504,4.1457004501069443E-3,1,0,14672.215077272675,1.5707281707601393,1.5842006391589039,0.88765416467831348,1.0000346222496299,8.3212079342627702E-3,1.0000556098344862,1.4849920268352671E-2,18.21741019381107,-94.759649715888727,85.240350284111273,null,1000000000,60256406.25,null,18.373213671974554,-39.614027783931796,null,38.61514694009265,-55.145621931956931,null,0,0]
[7852.9,7.8529,1.7367527646924001,0.95722969440097871,1.0000087947969263,4.1939796064760244E-3,1,0,14843.083771232044,1.5707289553499753,1.5953242132274827,0.89331595947916331,1.0000354333337655,8.4181099457686058E-3,1.0000569126097354,1.5022851834684828E-2,18.11063136157799,-94.760898119696762,85.239101880303238,null,1000000000,61668038.409999996,null,18.333413001621643,-39.29522786698157,null,38.548168778212485,-55.465670252715206,null,0,0]
[7943.3,7.9432999999999998,{"$f":"SQRT(1+(A141/pole1)^2)","v":1.7501427262100571},{"$f":"ATAN(A141/pole1)","v":0.96260753171735813},{"$f":"SQRT(1+(A141/Zero1)^2)","v":1.0000089984470988},{"$f":"ATAN(A141/Zero1)","v":4.242258743293697E-3},{"$f":"IF(VIN_nom>Vout, 1, SQRT(1+(A141/z_RHP)^2))","v":1},{"$f":"IF(VIN_nom>Vout, 0, -ATAN(A141/z_RHP))","v":0},{"$f":"SQRT(1+(A141/Pole2)^2)","v":15013.952465200344},{"$f":"ATAN(A141/Pole2)","v":1.5707297220815104},{"$f":"SQRT(1+(A141/Zero2)^2)","v":1.6064982177410085},{"$f":"ATAN(A141/Zero2)","v":0.89889916991924967},{"$f":"SQRT(1+(A141/pole4)^2)","v":1.0000362538082184},{"$f":"ATAN(A141/pole4)","v":8.5150117991788649E-3},{"$f":"SQRT((1-(V141/pterm2))^2+(A141/pterm1)^2)","v":1.0000582304688663},{"$f":"IF((ATAN((A141/pterm1)/(1-A141^2/pterm2))>0),ATAN((A141/pterm1)/(1-A141^2/pterm2)),PI()+ATAN((A141/pterm1)/(1-A141^2/pterm2)))","v":1.5195783170542088E-2},{"$f":"20*LOG10(((E141*K141*G141)/(C141*I141*O141*M141))*Adc)","v":18.005113053876627},{"$f":"((F141+L141+H141)-(D141+J141+P141+N141))*radconv","v":-94.761869149104442},{"$f":"IF(R141>0,R141,R141+180)","v":85.238130850895558},null,1000000000,63096014.890000001,null,{"$f":"20*LOG10((K141/(I141*M141))*AEA)","v":18.294613740575787},{"$f":"(L141-(J141+N141))*radconv","v":-38.980929469980488},null,{"$f":"20*LOG10((E141*G141/(C141*O141))*Acs*Am)","v":38.481449731556971},{"$f":"(F141+H141-(D141+P141))*radconv","v":-55.780939679123946},null,0,0]
[8035.8,{"$f":"A142/1000","v":8.0358000000000001},1.7638953256203931,0.96802562132801051,1.000009209240827,4.29165938825942E-3,1,0,15188.790454059577,1.5707304887675864,1.6179829067454796,0.90453207415145054,1.0000371030623991,8.6141645256742408E-3,1.0000595945555308,1.5372731475300062E-2,17.898419362469937,-94.762594081137465,85.237405918862535,null,{"$f":"IF(Q142<0,A142,1000000000)","v":1000000000},{"$f":"A142^2","v":64574081.640000001},null,18.255916905404554,-38.663912791343527,null,38.413452875321518,-56.098681289793952,null,{"$f":"SUM((Q143<0)*(Q142>0))*A142","v":0},0]
[8128.3,8.1282999999999994,1.7776989033607051,0.97335972412626048,1.0000094224750002,4.3410600122780882E-3,1,0,15363.628442927538,1.5707312380038978,1.6295182091241538,0.91008540225574663,1.000037962148191,8.7133170827894818E-3,1.0000609744350124,1.5549679533132027E-2,17.792987539192474,-94.763065277113469,85.236934722886531,null,1000000000,66069260.890000001,null,18.218203118181972,-38.351454479488076,null,38.34573483926664,-56.411610797625393,null,0,0]
[8222.9500000000007,8.2229500000000009,1.7918748614777049,0.97873258295062748,1.0000096431916161,4.391608845082654E-3,1,0,15542.530233707637,1.5707319872063192,1.6413729078297263,0.91568683242569882,1.0000388513789411,8.8147740895433754E-3,1.0000624027350635,1.5730740179147589E-2,17.68638223557263,-94.763302864193463,85.236697135806537,null,1000000000,67616906.702500015,null,18.180597746956366,-38.036372155578313,null,38.276734906872399,-56.726930708615143,null,0,0]
[8270.2750000000015,8.2702750000000016,1.7989820087858297,0.98138722053387306,1.000009754508127,4.4168832530850025E-3,1,0,15631.981129100906,1.5707323553767876,1.647319360956824,0.91845727166785196,1.0000392998545327,8.8655025249978758E-3,1.0000631230859007,1.5821270403136464E-2,17.633554997353329,-94.763334420589004,85.236665579410996,null,1000000000,68397448.575625017,null,18.162158665735081,-37.880565299294304,null,38.242346749874379,-56.8827691212947,null,0,0]
[8317.6,8.3176000000000005,1.806101733874754,0.98402094718108435,1.0000098664634398,4.4421576554443424E-3,1,0,15721.432024496264,1.5707327193576659,1.6532783668001696,0.92120776058895382,1.0000397509035972,8.9162309148227131E-3,1.0000638475706118,1.5911800560605344E-2,17.581039973075981,-94.763310691651995,85.236689308348005,null,1000000000,69182469.760000005,null,18.14395675075783,-37.725901269547549,null,38.208033640574286,-57.037409422104467,null,0,0]
[8366.0499999999993,8.3660499999999995,1.8134035827187351,0.98669583900357438,1.000009981741891,4.4680328697298405E-3,1,0,15813.009327866705,1.5707330877250945,1.6593918915421457,0.92400314742609024,1.0000402153408663,8.9681651617763477E-3,1.0000645935600678,1.6004482712731322E-2,17.52759637870205,-94.763231310502377,85.236768689497623,null,1000000000,69990792.602499992,null,18.125563831717098,-37.56873412055522,null,38.172982965241083,-57.194497189947157,null,0,0]
[8414.5,8.4145000000000003,1.8207183024249951,0.9893492569760105,1.0000100976898756,4.4939080780323657E-3,1,0,15904.586631239268,1.5707334518504643,{"$f":"SQRT(1+(A148/Zero2)^2)","v":1.6655182878317487},{"$f":"ATAN(A148/Zero2)","v":0.92677799086689727},1.0000406824754073,9.0200993603514763E-3,1.0000653438822722,1.6097164794329932E-2,17.474472705798355,-94.763098368759145,85.236901631240855,null,1000000000,70803810.25,null,18.107411437903721,-37.412743775646831,null,38.138011686150769,-57.350354593112328,null,0,0]
[8462.9500000000007,8.4629500000000011,1.8280457384896109,0.99198142173330672,1.0000102143073932,4.5197832803172706E-3,1,0,15996.163934613916,1.5707338118066321,1.6716574141515876,0.92953247427994534,1.0000411523072166,9.0720335102680068E-3,1.0000660985372249,1.6189846804992834E-2,17.421665343644865,-94.762914005763491,85.237085994236509,null,1000000000,71621522.702500015,null,18.089495614719681,-37.257919732735516,null,38.103120147181315,-57.504994273027982,null,0,0]
[8511.4,8.5114000000000001,1.8353857386095043,0.99459255156814086,1.0000103315944435,4.5456584765499108E-3,1,0,16087.741237990611,1.5707341676647957,1.6778091307636094,0.93226677958867255,1.00004162483629,9.1239676112458631E-3,1.0000668575249254,1.6282528744311707E-2,17.369170739445771,-94.762680309361201,85.237319690638799,null,1000000000,72443929.959999993,null,18.071812484637263,-37.104251572439345,null,38.068308673064649,-57.658428736921849,null,0,0]
[8560.9500000000007,8.5609500000000001,1.8429052234806773,0.99724143236943041,1.0000104522368642,4.5721211322420447E-3,1,0,16181.397695832024,1.5707345274361864,1.684113393355906,0.93504248165521198,1.0000421108833908,9.1770807637096934E-3,1.0000676382259637,1.6377314843329379E-2,17.315804153968607,-94.762392403909004,85.237607596090996,null,1000000000,73289864.902500018,null,18.053964595612939,-36.948279331517767,null,38.032789976611802,-57.814113072391223,null,0,0]
[8610.5,8.6105,1.8504375340793113,0.99986876664270841,1.0000105735795641,4.5985837815306777E-3,1,0,16275.054153675499,1.570734883066895,1.6904305343991286,0.93779745921139301,1.0000425997516145,9.2301938643949005E-3,1.0000684234587225,1.6472100866862821E-2,17.262757353263204,-94.76205715614617,85.23794284385383,null,1000000000,74140710.25,null,18.036352121765834,-36.793494277363237,null,37.997355649753509,-57.968562878782926,null,0,0]
[8660.0499999999993,8.66005,1.857982514417891,1.0024747803852698,1.0000106956225432,4.625046424378749E-3,1,0,16368.710611521012,1.5707352346279964,1.696760410051541,0.94053190214517834,1.000043091440957,9.2833069130018979E-3,1.000069213223201,1.6566886814475271E-2,17.210026717213726,-94.761676639017324,85.238323360982676,null,1000000000,74996466.002499983,null,18.01897115442728,-36.639885534252045,null,37.96200598104258,-58.121791104765265,null,0,0]
[8709.6,8.7096,1.8655400107721314,1.0050596970998404,1.0000108183658012,4.6515090607492015E-3,1,0,16462.367069368527,1.5707355821889477,1.7031028783220343,0.94324599875277304,1.0000435859514145,9.3364199092311022E-3,1.0000700075193993,1.6661672685729968E-2,17.157608683926998,-94.761252873646995,85.238747126353005,null,1000000000,75857132.160000011,null,18.001817861887922,-36.487442317568778,null,37.926741240295208,-58.273810556078232,null,0,{"$f":"IF(AD154>0,S154,0)","v":0}]
[8760.3250000000007,8.7603249999999999,1.8732895277940858,1.0076842883934349,1.0000109447451058,4.6785992100024966E-3,1,0,16558.244442212446,1.5707359339190639,1.7096086459654405,0.94600357502296317,1.0000440951106573,9.3907923417207682E-3,1.0000708253452648,1.6758706174683106E-2,17.104267790845448,-94.760776317473429,85.239223682526571,null,1000000000,76743294.105625018,null,17.984489721873441,-36.332580298979195,null,37.890728487228145,-58.428196018494241,null,0,0]
[8811.0499999999993,8.8110499999999998,1.8810518425566625,1.0102872363117341,1.0000110718582946,4.7056893523887188E-3,1,0,16654.121815058381,1.5707362815993766,1.7161273152366279,0.94874022279451953,1.0000446072263889,9.4451647186837035E-3,1.0000716479203224,1.6855739582687827E-2,17.051247129626709,-94.760258562421598,85.239741437578402,null,1000000000,77634602.102499992,null,17.96739229580368,-36.178917159816166,null,37.854805252079167,-58.581341402605446,null,0,0]
[8861.7749999999996,8.8617749999999997,1.8888267972792441,1.012868772635527,1.0000111997053673,4.7327794878681082E-3,1,0,16749.999187906313,1.5707366252994293,1.7226587396734354,0.95145613889288527,1.0000451222986046,9.4995370397985106E-3,1.000072475244572,1.6952772909275566E-2,16.99854306068865,-94.759701615226859,85.240298384773141,null,1000000000,78531056.15062499,null,17.950521712244257,-36.026441626778585,null,37.818971766700528,-58.733259988448268,null,0,0]
[8912.5,8.9124999999999996,1.8966142365135938,1.0154291264897048,1.0000113282863232,4.7598696164009077E-3,1,0,16845.876560756202,1.5707369650871825,{"$f":"SQRT(1+(A158/Zero2)^2)","v":1.7292027747420959},{"$f":"ATAN(A158/Zero2)","v":0.95415151839611612},1.0000456403273004,9.5539093047437885E-3,1.000073307318013,1.7049806153977744E-2,16.946152003204595,-94.759107430480057,85.240892569519943,null,1000000000,79432656.25,null,17.933874176841883,-35.875142526592633,null,37.78322824461884,-58.883964903887417,null,0,0]
[8964.4,8.9643999999999995,1.9045948268511046,1.0180271007418162,1.0000114606053236,4.7875872566975055E-3,1,0,16943.974848602629,1.5707373087658028,1.7359113000587292,0.95688827995786296,1.0000461734156691,9.609540996901365E-3,1.0000741635811847,1.7149087003187596E-2,16.892867649867988,-94.758462925728622,85.241537074271378,null,1000000000,80360467.359999999,null,17.917067995467796,-35.721544791897628,null,37.746750072656326,-59.036918133830973,null,0,0]
[9016.2999999999993,9.0162999999999993,1.9125881648650263,1.0206033766756353,1.0000115936926004,4.8153048896377544E-3,1,0,17042.073136451036,1.5707376484878288,1.7426327269538158,0.95960395006004695,1.0000467095990628,9.665172629576323E-3,1.000075024816117,1.7248367765681914E-2,16.839903576190871,-94.757783415881974,85.242216584118026,null,1000000000,81293665.689999983,null,17.900487518552975,-35.569155278716494,null,37.710366475894034,-59.18862813716548,null,0,0]
[9068.2000000000007,9.0682000000000009,1.9205940913913542,1.0231581912239205,1.0000117275481528,4.8430225151790676E-3,1,0,17140.171424301388,1.5707379843211948,1.7493669067158211,0.96229873198985283,1.0000472488774763,9.7208042024244119E-3,1.0000758910228094,1.7347648440958822E-2,16.787256129774153,-94.757070832535817,85.242929167464183,null,1000000000,82232251.24000001,null,17.884128921102263,-35.417962343424101,null,37.674077626928025,-59.339108489111744,null,0,0]
[9120.1,9.1201000000000008,1.9286124496603314,1.0256917785091069,1.0000118621719811,4.8707401332788568E-3,1,0,17238.269712153648,1.5707383163322888,1.756113692634264,0.96497282713281141,1.0000477912509045,9.7764357151013826E-3,1.0000767622012616,1.7446929028516411E-2,16.7349217173821,-94.756327055134335,85.243672944865665,null,1000000000,83176224.010000005,null,17.867988455083413,-35.267954451263485,null,37.637883680554822,-59.488372603870836,null,0,0]
[9173.2000000000007,9.1732000000000014,1.9368289086913186,1.0282622179563059,1.0000120007036248,4.8990986134152875E-3,1,0,17338.636168513112,1.5707386521317435,1.7630293693983403,0.96768754932878354,1.0000483493679373,9.8333534428950257E-3,1.0000776586680873,1.7548505029680167E-2,16.681697548421063,-94.755535702987004,85.244464297012996,null,1000000000,84147598.24000001,null,17.851696724026777,-35.115692712183375,null,37.600951242650417,-59.639842990803643,null,0,0]
[9226.2999999999993,9.2262999999999984,1.945058056494144,1.030810924104429,1.0000121400394815,4.9274570856719128E-3,1,0,17439.002624874498,1.570738984065954,1.76995793759949,0.97038103747758353,1.0000489107247508,9.8902711069738768E-3,1.0000785603392377,1.7650080937958477E-2,16.628793631134918,-94.754715515829417,85.245284484170583,null,1000000000,85124611.689999983,null,17.835625629673597,-34.964647369276847,null,37.56411841971746,-59.790068146552606,null,0,0]
[9279.4,9.279399999999999,1.9532997326974542,1.033338138732609,1.0000122801795506,4.9558155500031252E-3,1,0,17539.369081237794,1.5707393122012752,1.7768992464370461,0.97305350111484046,1.0000494753213394,9.9471887069692618E-3,1.0000794672147122,1.7751656752813837E-2,16.576206301554105,-94.753868344830835,85.246131655169165,null,1000000000,86107264.359999999,null,17.819771396631026,-34.814806420817384,null,37.52738532317921,-59.939061924013451,null,0,0]
[9332.5,9.3324999999999996,1.9615537793830451,1.0358441006578241,1.0000124211238317,4.9841740063633171E-3,1,0,17639.735537602955,1.5707396366025519,1.783853147182362,0.9757051477191615,1.000050043157698,1.0004106242512505E-2,1.0000803792945103,1.7853232473708756E-2,16.523931955269326,-94.75299598921363,85.24700401078637,null,1000000000,87095556.25,null,17.804130326264293,-34.66615798285067,null,37.490752047261168,-60.086838006362946,null,0,0]
[9386.85,9.3868500000000008,1.9700147788002542,1.0383872912921865,1.0000125662188424,5.013200026369429E-3,1,0,17742.464669496505,1.5707399648396014,1.7909836330962576,0.97839787191486227,1.0000506277162629,1.0062363577581029E-2,1.0000813182346471,1.7957199238944017E-2,16.470747466207463,-94.752078841690235,85.247921158309765,null,1000000000,88112952.922499999,null,17.788338024491058,-34.515232956894522,null,37.453359859972537,-60.23684588479572,null,0,0]
[9441.2000000000007,9.4412000000000003,1.9784884108881984,1.0409087137485467,1.0000127121563731,5.0422260379281323E-3,1,0,17845.193801391943,1.5707402892975373,1.7981270019622548,0.98106922073169234,1.0000512156689125,1.0120620844345672E-2,1.0000822626270154,1.8061165904603577E-2,16.417883414134128,-94.751138962772373,85.248861037227627,null,1000000000,89136257.440000013,null,17.772761437220534,-34.365532429493776,null,37.416072395169728,-60.385606533278569,null,0,0]
[9495.5499999999993,9.4955499999999997,1.9869745140273911,1.0434086146673029,1.0000128589364237,5.0712520409905201E-3,1,0,17947.922933289232,1.5707406100412513,1.8052831008497552,0.98371941001070029,1.0000518070156412,1.017887804241111E-2,1.0000832124716141,1.8165132470111076E-2,16.365336119860071,-94.750178120797855,85.249821879202145,null,1000000000,90165469.80249998,null,17.757396836682847,-34.217044037562651,null,37.378889701433359,-60.533134083235204,null,0,0]
[9549.9,9.5498999999999992,1.9954729291117568,1.0458872375725035,1.0000130065589936,5.1002780355076886E-3,1,0,18050.652065188355,1.5707409271341586,1.8124517789730274,0.98634865337615285,1.0000524017564429,1.0237135171382038E-2,1.0000841677684433,1.826909893489018E-2,16.313101964246709,-94.749198032478603,85.250801967521397,null,1000000000,91200590.00999999,null,17.742240571710806,-34.069755544943042,null,37.341811810792038,-60.679442487535567,null,0,0]
[9605.5249999999996,9.6055250000000001,2.0041832941680795,1.0484022249305285,1.0000131585170486,5.1299849437200238E-3,1,0,18155.791126126522,1.5707412479501601,1.8198014977649133,0.98901810820488478,1.0000530139637389,1.0296758885974918E-2,1.0000851511212259,1.8375504250472727E-2,16.259962973006864,-94.748176761979494,85.251823238020506,null,1000000000,92266110.52562499,null,17.726940747200555,-33.92024161809298,null,37.303972644062448,-60.827935143886521,null,0,0]
[9661.15,9.6611499999999992,2.0129062262492705,1.050895430542051,1.0000133113576153,5.1596918428778553E-3,1,0,18260.930187066537,1.5707415650719037,1.8271640800628028,0.99166606856807893,1.0000536297262064,1.0356382527355606E-2,1.0000861401850465,1.8481909459323903E-2,16.207144501106697,-94.747138810036972,85.252861189963028,null,1000000000,93337819.32249999,null,17.711851646968487,-33.771959017542407,null,37.266243272394355,-60.975179792494565,null,0,0]
[9716.7749999999996,9.7167750000000002,2.0216415626836146,1.0533671055603873,1.0000134650806933,5.1893987329287537E-3,1,0,18366.069248008367,1.570741878562834,1.8345393709908411,0.99429275634651848,1.0000542490438387,1.0416006095100317E-2,1.0000871349599048,1.8588314560825849E-2,16.154642855950815,-94.746085857422003,85.253914142577997,null,1000000000,94415716.40062499,null,17.6969695944085,-33.624895034069695,null,37.228623679798453,-61.121190823352343,null,0,0]
[9772.4,9.7723999999999993,2.0303891433694976,1.0558174978721553,1.0000136196862821,5.2191056138202914E-3,1,0,18471.208308951984,1.5707421884849517,1.8419272178885322,0.99689839104455624,1.0000548719166293,1.0475629588785266E-2,1.0000881354457993,1.8694719554360733E-2,16.102454405458936,-94.745019533814371,85.254980466185629,null,1000000000,95499801.75999999,null,17.682290989259226,-33.479037094529914,null,37.191113834455848,-61.265982439284493,null,0,0]
[9829.2999999999993,9.8292999999999999,2.0393497345824589,1.0583022914892513,1.0000137787487244,5.2494934069447401E-3,1,0,18578.757298934775,1.5707425018816157,1.8494972382970567,0.99954219431341373,1.0000555127448227,1.0536619656269347E-2,1.0000891647730736,1.8803563381463152E-2,16.049390046007471,-94.743916581254851,85.256083418745149,null,1000000000,96615138.48999998,null,17.667482751157952,-33.331070754957622,null,37.152857713105654,-61.412845826297222,null,0,0]
[9886.2000000000007,9.8862000000000005,2.0483228069378119,1.0607653299693522,1.0000139387345972,5.2798811903741515E-3,1,0,18686.306288919372,1.5707428116707722,1.8570800806838834,1.0021644253944011,1.0000561572930065,1.0597609645362644E-2,1.0000902000761933,1.8912407094284472E-2,15.996645903778436,-94.742802929303821,85.257197070696179,null,1000000000,97736950.440000013,null,17.652880009974325,-33.184340199520157,null,37.114716312060246,-61.558462729783642,null,0,0]
[9943.1,9.9431000000000012,2.0573081971238221,1.0632068682811151,1.0000140996439,5.3102689640524064E-3,1,0,18793.855278905736,1.5707431179143538,1.8646755886244251,1.0047653116192945,1.0000568055611729,1.065859955561156E-2,1.0000912413551579,1.9021250692163396E-2,15.944218279520006,-94.741680164925711,85.258319835074289,null,1000000000,98865237.610000014,null,17.63847914840057,-33.038832406588668,null,37.076689549375565,-61.70284775833705,null,0,0]
[10000,10,2.0663057444471695,1.065627157986706,1.0000142614766321,5.3406567279233883E-3,1,0,18901.404268893843,1.5707434206728836,1.872283607973269,1.0073450777891868,1.0000574575493151,1.0719589386562516E-2,1.0000922886099664,1.9130094174438624E-2,15.892103534823928,-94.7405498248242,85.2594501751758,null,1000000000,100000000,null,17.624276624980055,-32.894534499450998,null,37.038777328100011,-61.846015325373187,null,0,0]
[10058.25,10.058249999999999,2.0755291942346208,1.0680831194018796,1.0000144281055336,5.371765456642202E-3,1,0,19011.504948452864,1.5707437270663021,1.8800849355460438,1.0099644054979569,1.0000581288598245,1.0782026169551009E-2,1.0000933669019678,1.924151993875229E-2,15.839072690746603,-94.739386372049012,85.260613627950988,null,1000000000,101168393.0625,null,17.609938967653701,-32.748052995610777,null,37.000084141349035,-61.991333376438256,null,0,0]
[10116.5,10.1165,2.0847650522700563,1.0705173347513959,1.0000145957022017,5.4028741749638336E-3,1,0,19121.605628013647,1.5707440299313429,1.8878990554953177,1.0125620678180798,1.0000588040689071,1.0844462868472094E-2,1.00009445145674,1.9352945580509061E-2,15.786362222196622,-94.73821808341755,85.26178191658245,null,1000000000,102343572.25,null,17.595801896262785,-32.602812620125121,null,36.961510744189972,-62.135405463292436,null,0,0]
[10174.75,10.17475,2.094013154369962,1.0729300631168959,1.0000147642666362,5.4339828828280793E-3,1,0,19231.706307576165,1.5707443293286054,1.8957258096318215,1.0151382978196049,1.000059483176555,1.0906899482839141E-2,1.0000955422742819,1.9464371098999473E-2,15.733968415477499,-94.737046452691203,85.262953547308797,null,1000000000,103525537.5625,null,17.581861846491311,-32.458800022508058,null,36.923056987242319,-62.278246430183138,null,0,0]
[10233,10.233000000000001,2.1032733390227287,1.0753215600270607,1.000014933798836,5.4650915801747321E-3,1,0,19341.80698714039,1.5707446253173092,1.9035650421142714,1.0176933258805463,1.0000601661827604,1.0969336012165529E-2,1.0000966393545929,1.9575796493514038E-2,15.681887618244888,-94.735872924224921,85.264127075775079,null,1000000000,104714289,null,17.568115329543396,-32.316002006436797,null,36.884722706957625,-62.419870917788131,null,0,0]
[10292.5,10.2925,2.1127445491436898,1.077742718888554,1.0000151079682054,5.4968678352128094E-3,1,0,19454.270342233474,1.5707449241988163,1.9115852217227323,1.0202815303396111,1.0000608678706879,1.103311229287344E-2,1.0000977664432016,1.968961286218246E-2,15.629008629360573,-94.73467370512482,85.26532629487518,null,1000000000,105935556.25,null,17.554270079296916,-32.171380050616733,null,36.845688968319791,-62.56329365450808,null,0,0]
[10352,10.352,2.1222280336082249,1.080142253110983,1.0000152831473199,5.5286440791500694E-3,1,0,19566.733697328273,1.5707452196445717,1.9196180996113656,1.0228480905525525,1.0000615736262715,1.1096888483825363E-2,1.0000989000662504,1.980342910000072E-2,15.576448714859424,-94.733475400568594,85.266524599431406,null,1000000000,107163904,null,17.540619631841011,-32.027998016754978,null,36.806779501274548,-62.705477383813601,null,0,0]
[10411.5,10.4115,2.1317236286002466,1.0825204238525667,1.0000154593361792,5.5604203119223481E-3,1,0,19679.197052424763,1.5707455117134801,1.9276635170329701,1.0253932435011299,1.0000622834495021,1.1160664584502687E-2,1.0001000402237383,1.9917245206212714E-2,15.524204172148364,-94.732279399070976,85.267720600929024,null,1000000000,108399332.25,null,17.527160501212368,-31.885842330142161,null,36.767994089192129,-62.846437068928793,null,0,0]
[10471,10.471,2.1412311730021769,1.0848774886086112,1.0000156365347828,5.5921965334654791E-3,1,0,19791.660407522908,1.5707458004631065,1.9357213176337789,1.0279172233397895,1.0000629973403714,1.1224440594386794E-2,1.0001011869156646,2.0031061180062322E-2,15.472271359940786,-94.731087041193604,85.268912958806396,null,1000000000,109641841,null,17.513889275902493,-31.74489957798529,null,36.729332502294426,-62.986187463208317,null,0,0]
[10532,10.532,2.1509906425952163,1.0872723301030587,1.0000158192488262,5.6247738244994665E-3,1,0,19906.958973255478,1.5707460931051722,1.943994950250161,1.0304830945963539,1.0000637334512297,1.1289824308041079E-2,1.0001023692994058,2.0147746325975761E-2,15.419349186170241,-94.729869760756841,85.270130239243159,null,1000000000,110923024,null,17.500475057720376,-31.601648962043082,null,36.689824546705999,-63.128220798713762,null,0,0]
[10593,10.593,2.1607623372101878,1.0896455245473484,1.0000160030241658,5.6573511035944131E-3,1,0,20022.257538989732,1.5707463823768675,1.9522812730083039,1.0330272011583741,1.0000644738373845,1.135520792516273E-2,1.0001035585512041,2.0264431331159509E-2,15.366747099735578,-94.728659014828821,85.271340985171179,null,1000000000,112211649,null,17.487251308926226,-31.45964517260316,null,36.650446209065485,-63.269013842225661,null,0,0]
[10654,10.654,2.1705460917377057,1.0919973377505812,1.0000161878608009,5.6899283706811797E-3,1,0,20137.556104725638,1.570746668336084,1.9605801250049038,1.0355497862629082,1.0000652184988257,1.142059144519293E-2,1.0001047546710591,2.0381116194798824E-2,15.314461369208621,-94.727456099934585,85.272543900065415,null,1000000000,113507716,null,17.474214585294966,-31.318874276493606,null,36.611197202169791,-63.408581823440969,null,0,0]
[10715,10.715,2.1803417438299828,1.0943280316999695,1.0000163737587315,5.7225056256906236E-3,1,0,20252.854670463174,1.5707469510393957,1.9688913478082255,1.0380510901448508,1.0000659674355439,1.1485974867572864E-2,1.0001059576589695,2.0497800916078984E-2,15.26248832530851,-94.726262265556798,85.273737734443202,null,1000000000,114811225,null,17.461361517012605,-31.179322512478244,null,36.57207722655204,-63.546939753078547,null,0,0]
[10777.5,10.7775,2.1903904457038879,1.0966944031626322,1.0000165653286841,5.7558839481425374E-3,1,0,20370.988446835261,1.570747237375254,1.9774196126756591,1.0405920769647581,1.0000667392229934,1.1552965977161739E-2,1.000107197352011,2.0617354785278968E-2,15.209557797487616,-94.725049751353566,85.274950248646434,null,1000000000,116154506.25,null,17.448379427278773,-31.037589405417783,null,36.532128788464973,-63.68746034593579,null,0,0]
[10840,10.84,2.2004513010726039,1.0990391487115687,1.000016758012767,5.7892622577689111E-3,1,0,20489.122223209,1.5707475204092691,1.9859605352766285,1.0431112241399392,1.0000675154985439,1.1619956983051153E-2,1.0001084442550325,2.0736908503300851E-2,15.156947919112797,-94.723849279984378,85.276150720015622,null,1000000000,117505600,null,17.435583205584841,-30.897107422704394,null,36.492315131784089,-63.82674185727997,null,0,0]
[10902.5,10.9025,2.210524143991937,1.1013625380202174,1.0000169518109798,5.8226405544953772E-3,1,0,20607.255999584362,1.5707478001982254,1.9945139530020162,1.0456087804663792,1.0000682962621854,1.1686947884640069E-2,1.0001096983680331,2.085646206926833E-2,15.1046549379395,-94.722662050812261,85.277337949187739,null,1000000000,118864506.25,null,17.422969458451764,-30.75786231259724,null,36.452635897743868,-63.964799738215028,null,0,0]
[10965,10.965,2.2206088113326912,1.1036648367942721,1.0000171467233219,5.8560188382475696E-3,1,0,20725.389775961317,1.5707480767976132,2.0030797057842804,1.0480849915711357,1.0000690815139075,1.1753938681327453E-2,1.000110959691012,2.097601548230511E-2,15.052675164542666,-94.721489217357387,85.278510782642613,null,1000000000,120231225,null,17.410534866499596,-30.619840004847504,null,36.413090716299209,-64.101649212509884,null,0,0]
[11028.75,11.02875,2.2309071872396906,1.1059917255574814,1.0000173466816857,5.8900646742315859E-3,1,0,20845.886227867424,1.5707483556993311,2.0118293177996263,1.0505889885169046,1.0000698870942732,1.1822269185255713E-2,1.000112253668169,2.1097959805144655E-2,14.999974700213471,-94.720308907678984,85.279691092321016,null,1000000000,121633326.5625,null,17.398032781234939,-30.480302577160273,null,36.372892337234674,-64.240006330518696,null,0,0]
[11092.5,11.092499999999999,2.241217531151602,1.1082972177881083,1.0000175477991882,5.924110496560879E-3,1,0,20966.382679775139,1.5707486313952823,2.0205914346959517,1.053071284189762,1.0000706973440157,1.1890599578781294E-2,1.0001135551465852,2.1219903967033497E-2,14.947592537417229,-94.719145859893345,85.280854140106655,null,1000000000,123043556.25,null,17.385710340513086,-30.342008350819849,null,36.332832615160278,-64.377137509073478,null,0,0]
[11156.25,11.15625,2.2515396786552788,1.1105815830840282,1.0000177500758287,5.9581563051565303E-3,1,0,21086.879131684425,1.5707489039404225,2.0293658944976989,1.0555321292918642,1.0000715122631232,1.1958929861266385E-2,1.0001148641262598,2.1341847967041725E-2,14.89552495434573,-94.718001159708876,85.281998840291124,null,1000000000,124461914.0625,null,17.373564248200076,-30.204942964762928,null,36.29291112440179,-64.513058194945927,null,0,0]
[11220,11.22,2.2618734681522761,1.1128450870067281,1.0000179535116063,5.992202099939622E-3,1,0,21207.375583595262,1.5707491733884589,2.0381525377923784,1.0579717712505063,1.0000723318515845,1.2027260032073191E-2,1.0001161806071917,2.1463791804239445E-2,14.843768291544251,-94.716875849130076,85.283124150869924,null,1000000000,125888400,null,17.361591280569268,-30.069092245490395,null,36.253127429231114,-64.647783603639709,null,0,0]
[11285.5,11.285500000000001,2.2725028891242314,1.1151492730232044,1.0000181637391978,6.0271824706982753E-3,1,0,21331.17978124641,1.5707494470624757,2.0471929079248126,1.0604565562124306,1.000073178801921,1.2097465816069753E-2,1.0001175410397736,2.158908294876781E-2,14.790910915800318,-94.715740893438223,85.284259106561777,null,1000000000,127362510.25,null,17.349466648086715,-29.930762729503027,null,36.212394685969734,-64.784978163935179,null,0,0]
[11351,11.351000000000001,2.2831442630547683,1.1174319921729137,1.0000183751904375,6.0621628267067173E-3,1,0,21454.983978899141,1.5707497175780665,2.056245806559124,1.0629194770697286,1.0000740306814622,1.216767148080746E-2,1.0001189093910974,2.1714373919434125E-2,14.738374128998677,-94.714628500885226,85.285371499114774,null,1000000000,128845201,null,17.337518102926236,-29.793685746637507,null,36.171806444328574,-64.920942754247704,null,0,0]
[11416.5,11.416499999999999,2.2937974235875704,1.1196935195973368,1.000018587865324,6.097143167879353E-3,1,0,21578.788176553422,1.5707499849895934,2.0653110689463969,1.0653607916487318,1.000074887490195,1.2237877025594552E-2,1.0001202856611613,2.1839664715229822E-2,14.686154158903621,-94.713539666578285,85.286460333421715,null,1000000000,130336472.25,null,17.325742375376461,-29.657846527608257,null,36.131362201783297,-65.055693138970042,null,0,0]
[11482,11.481999999999999,2.304462207259907,1.1219341262202143,1.0000188017638576,6.1321234941305843E-3,1,0,21702.592374209231,1.5707502493501788,2.0743885329945377,1.0677807543022457,1.0000757492281069,1.230808244973928E-2,1.0001216698499644,2.1964955335146322E-2,14.634247296974245,-94.712475342913237,85.287524657086763,null,1000000000,131836324,null,17.314136268492096,-29.52323050207703,null,36.091061446738287,-65.189244840836196,null,0,0]
[11548.75,11.54875,2.3153423090254814,1.1241962452080294,1.0000190210033204,6.1677713684200114E-3,1,0,21828.759247394359,1.5707505156707271,2.0836516191473811,1.0702251921937753,1.0000766324825652,1.2379627547220672E-2,1.0001230886014463,2.2092636815437498E-2,14.581668199458733,-94.711416867574911,85.288583132425089,null,1000000000,133373626.5625,null,17.302479941908398,-29.387289018629151,null,36.050138675806465,-65.324127848945793,null,0,0]
[11615.5,11.615500000000001,2.3262341479550344,1.1264371922930403,1.000019241513578,6.2034192270335967E-3,1,0,21954.926120581022,1.570750778930383,2.0929270454434157,1.07264797795393,1.0000775208561075,1.2451172517960593E-2,1.0001245155767908,2.2220318110957663E-2,14.529406694486324,-94.710385714980575,85.289614285019425,null,1000000000,134919840.25,null,17.29099329091175,-29.252587928289948,null,36.009363821830711,-65.457797786690648,null,0,0]
[11682.25,11.68225,{"$f":"SQRT(1+(A205/pole1)^2)","v":2.3371375599512985},{"$f":"ATAN(A205/pole1)","v":1.1286572411282068},{"$f":"SQRT(1+(A205/Zero1)^2)","v":1.0000194632946293},{"$f":"ATAN(A205/Zero1)","v":6.2390670698807523E-3},{"$f":"IF(VIN_nom>Vout, 1, SQRT(1+(A205/z_RHP)^2))","v":1},{"$f":"IF(VIN_nom>Vout, 0, -ATAN(A205/z_RHP))","v":0},{"$f":"SQRT(1+(A205/Pole2)^2)","v":22081.092993769187},{"$f":"ATAN(A205/Pole2)","v":1.5707510391816148},2.1022146485404951,1.0750493699281807,{"$f":"SQRT(1+(A205/pole4)^2)","v":1.0000784143487202},{"$f":"ATAN(A205/pole4)","v":1.2522717361226945E-2},{"$f":"SQRT((1-(V205/pterm2))^2+(A205/pterm1)^2)","v":1.000125950775997},{"$f":"IF((ATAN((A205/pterm1)/(1-A205^2/pterm2))>0),ATAN((A205/pterm1)/(1-A205^2/pterm2)),PI()+ATAN((A205/pterm1)/(1-A205^2/pterm2)))","v":2.234799922063942E-2},{"$f":"20*LOG10(((E205*K205*G205)/(C205*I205*O205*M205))*Adc)","v":14.477459052563439},{"$f":"((F205+L205+H205)-(D205+J205+P205+N205))*radconv","v":-94.709382765092982},{"$f":"IF(R205>0,R205,R205+180)","v":85.290617234907018},null,1000000000,136474965.0625,null,{"$f":"20*LOG10((K205/(I205*M205))*AEA)","v":17.279673153425193},{"$f":"(L205-(J205+N205))*radconv","v":-29.11911243191857},null,{"$f":"20*LOG10((E205*G205/(C205*O205))*Acs*Am)","v":35.968736317394374},{"$f":"(F205+H205-(D205+P205))*radconv","v":-65.590270333174416},null,0,0]
[11749,{"$f":"A206/1000","v":11.749000000000001},2.348052383792262,1.1308566611103457,1.0000196863464732,6.2747148968708864E-3,1,0,22207.259866958833,1.570751296475698,2.1115142677577863,1.0774296229066687,1.0000793129603898,1.2594262076287647E-2,1.0001273941990638,2.2475680143415389E-2,14.42582160714565,-94.708408857652898,85.291591142347102,null,{"$f":"IF(Q206<0,A206,1000000000)","v":1000000000},{"$f":"A206^2","v":138039001},null,17.268516438073423,-28.986847934011124,null,35.928255587328366,-65.721560923641775,null,{"$f":"SUM((Q207<0)*(Q206>0))*A206","v":0},0]
[11817.5,11.817500000000001,2.3592650625011453,1.1330925747130687,1.0000199165673223,6.3112972945044126E-3,1,0,22336.734485889046,1.5707515574934141,2.1210700242529756,1.079850565461655,1.0000802404532796,1.2667682361429237E-2,1.0001288840147786,2.260670831067467E-2,14.373149092576856,-94.707440451274564,85.292559548725436,null,1000000000,139653306.25,null,17.257233960181612,-28.852359770695895,null,35.886865550651379,-65.855080680578695,null,0,0]
[11886,11.885999999999999,2.370489424291935,1.1353073250210048,1.000020148126469,6.3478796752452597E-3,1,0,22466.209104820759,1.570751815502597,2.1306381007096533,1.0822497784745722,1.0000811733371302,1.2741102509992525E-2,1.0001303824912176,2.273773627882178E-2,14.320795626521001,-94.706504297833689,85.293495702166311,null,1000000000,141276996,null,17.246117209900174,-28.719116438231779,null,35.845628834876962,-65.987387859601924,null,0,0]
[11954.5,11.954499999999999,2.3817253039879822,1.1375011896680916,1.0000203810239128,6.3844620389955252E-3,1,0,22595.683723753951,1.5707520705549638,2.1402183318946828,1.0846275259411224,1.0000821116119267,1.2814522521186346E-2,1.0001318896283795,2.2868764046703211E-2,14.268757444341041,-94.705601181600954,85.294398818399046,null,1000000000,142910070.25,null,17.235163066642393,-28.587102813697054,null,35.804544795954783,-66.118498367903882,null,0,0]
[12023,12.023,2.3929725393469838,1.1396744418808578,1.0000206152596525,6.4210443856573081E-3,1,0,22725.158342688599,1.5707523227010529,2.1498105553122064,1.0869840681251828,1.0000830552776536,1.2887942394219545E-2,1.0001334054262627,2.2999791613165444E-2,14.217030845352374,-94.704731848071376,85.295268151928624,null,1000000000,144552529,null,17.224368480393892,-28.456303987920315,null,35.763612783214626,-66.248427860151068,null,0,0]
[12093,12.093,2.4044776300857165,1.1418742689265307,1.0000208560072166,6.4584277878478938E-3,1,0,22857.468172258326,1.5707525774175473,2.1596250501430747,1.0893705735204051,1.000084025176875,1.2962969858143577E-2,1.0001349633640733,2.3133688187127719E-2,14.164489653918347,-94.703879115135194,85.296120884864806,null,1000000000,146240649,null,17.213499250509447,-28.323880652048064,null,35.721940821665036,-66.379998463087148,null,0,0]
[12163,12.163,2.4159942458128061,1.1440531340625726,1.0000210981523276,6.4958111719866894E-3,1,0,22989.77800182952,1.5707528292021737,2.1694517335903627,1.0917354725968573,1.000085000705679,1.3037997176119481E-2,1.000136530346057,2.3267584548317427E-2,14.112266225728048,-94.703063116620498,85.296936883379502,null,1000000000,147938569,null,17.202790419760706,-28.192695090707716,null,35.680426224223474,-66.510368025912783,null,0,0]
[12233,12.233000000000001,2.4275222224982107,1.1462113150883531,1.0000213416949852,6.5331945379692204E-3,1,0,23122.087831402154,1.5707530781052625,2.1792904407742517,1.0940790313559281,1.0000859818640486,1.3113024347303017E-2,1.0001381063722128,2.340148069550365E-2,14.060356809694504,-94.702284531272511,85.297715468727489,null,1000000000,149646289,null,17.192238949955968,-28.062732065977659,null,35.639068277994667,-66.639552465294869,null,0,0]
[12303,12.303000000000001,2.4390613990526782,1.1483490853246963,1.0000215866351878,6.5705778856910112E-3,1,0,23254.397660976203,1.570753324175999,2.1891410095790733,1.0964015119577026,1.0000869686519678,1.3188051370849949E-2,1.0001396914425387,2.353537662745548E-2,14.008757718587596,-94.70154400125972,85.29845599874028,null,1000000000,151363809,null,17.181841872093408,-27.933976559961181,null,35.597866264750323,-66.767567441298581,null,0,0]
[12374.5,12.374499999999999,2.4508592416296668,1.1505118729728354,1.0000218382668951,6.6087622861891876E-3,1,0,23389.542701185423,1.5707535726456137,{"$f":"SQRT(1+(A215/Zero2)^2)","v":2.1992147418863324},{"$f":"ATAN(A215/Zero2)","v":1.0987522681158763},1.0000879823971165,1.3264685963036288E-2,1.0001413198156082,2.3672141534467252E-2,13.956369535082038,-94.700827520875308,85.299172479124692,null,1000000000,153128250.25,null,17.171378373097362,-27.803693228241809,null,35.555941580240813,-66.89713429263351,null,0,0]
[12446,12.446,2.4626684385951867,1.152653928194636,1.0000220913566822,6.6469466674153018E-3,1,0,23524.687741396068,1.5707538182604033,2.2093005163074544,1.1010815739686979,1.0000890020156308,1.3341320399410498E-2,1.0001429576246053,2.3808906214325513E-2,13.904297540089029,-94.700151987521082,85.299848012478918,null,1000000000,154902916,null,17.16106990510918,-27.674638735992989,null,35.51417805323598,-67.025513251528096,null,0,0]
[12517.5,12.5175,2.4744888273869283,1.154775528301299,1.0000223459045474,6.6851310292580192E-3,1,0,23659.832781608111,1.5707540610692878,2.2193981686708524,1.103389696845579,1.0000900275074927,1.3417954679072936E-2,1.0001446048695279,2.3945670665718573E-2,13.852538001659777,-94.699517975794038,85.300482024205962,null,1000000000,156687806.25,null,17.150913516079612,-27.546797769119021,null,35.472574903836296,-67.152720206675014,null,0,0]
[12589,12.589,2.4863202483813689,1.1568769460696586,1.0000226019104901,6.7233153716060061E-3,1,0,23794.97782182154,1.5707543011200764,2.2295075375875313,1.1056769001386482,1.0000910588726841,1.3494588801123968E-2,1.0001462615503753,2.4082434887334723E-2,13.801087251474931,-94.698926026017105,85.301073973982895,null,1000000000,158482921,null,17.140906321613809,-27.420155239050292,null,35.431131348117255,-67.278770786966831,null,0,{"$f":"IF(AD218>0,S218,0)","v":0}]
[12662.25,12.66225,2.4984525262885988,1.1590091482949769,1.0000228656943562,6.7624342754270313E-3,1,0,23933.430607775859,1.5707545442349002,2.2398763229681582,1.1079986613467654,1.0000921215717784,1.3573098419119339E-2,1.000147968564528,2.4222546245351483E-2,13.748693664892514,-94.69836373693704,85.30163626306296,null,1000000000,160332575.0625,null,17.130805966199613,-27.291640319856793,null,35.388838116949032,-67.406723417080258,null,0,0]
[12735.5,12.7355,2.5105960530663993,1.1611207335030678,1.0000231310085452,6.8015531585507976E-3,1,0,24071.883393731579,1.5707547845531065,2.2502570712608292,1.1102990136463826,1.0000931904351873,1.3651607869782145E-2,1.0001496854821526,2.4362657359418841E-2,13.696616571405031,-94.697846637271539,85.302153362728461,null,1000000000,162192960.25,null,17.120856279211271,-27.164351870943889,null,35.346710710449891,-67.533494766327649,null,0,0]
[12808.75,12.80875,2.5227506662718944,1.1632119807250005,1.0000233978530557,6.8406720208575985E-3,1,0,24210.336179688675,1.5707550221226747,2.2606496176669308,1.1125782277833285,1.0000942654628915,1.3730117152145104E-2,1.0001514123032473,2.4502768228126449E-2,13.644852225457436,-94.697375204349584,85.302624795650416,null,1000000000,164064076.5625,null,17.111054368549063,-27.038274382411874,null,35.304748275164506,-67.659100821937713,null,0,0]
[12882,12.882,2.534916206430895,1.1652831643542554,1.0000236662278865,6.8797908622277235E-3,1,0,24348.78896564712,1.5707552569904932,2.2710538002187852,1.1148365704289898,1.0000953466548708,1.380862626524094E-2,1.0001531490278106,2.4642878850063984E-2,13.59339694563509,-94.696949883171655,85.303050116828345,null,1000000000,165945924,null,17.101397408996021,-26.913392577746833,null,35.262949954895205,-67.783557305424821,null,0,0]
[12957.25,12.95725,2.5474251255520897,1.1673902898035049,1.0000239435239227,6.9199777729020504E-3,1,0,24491.022032452227,1.5707554955058245,2.2817540058019348,1.1171351162088088,1.0000964637864638,1.3889278794589345E-2,1.0001549434842354,2.4786814759542346E-2,13.5408547807343,-94.69656140133732,85.30343859866268,null,1000000000,167890327.5625,null,17.091624819997534,-26.786330320860955,null,35.2201803789929,-67.91023108047635,null,0,0]
[13032.5,13.032500000000001,2.5599452446194184,1.169476813483884,1.0000242224349842,6.9601646612246744E-3,1,0,24633.255099258713,1.5707557312667684,2.2924661540313154,1.1194121928119198,1.0000975874235003,1.3969931143231726E-2,1.0001567483923115,2.4930750405573791E-2,13.488631115165248,-94.696222436329009,85.303777563670991,null,1000000000,169846056.25,null,17.081999370150655,-26.660497989023,null,35.177582163270728,-68.035724447306023,null,0,0]
[13107.75,13.107749999999999,2.572476400104089,1.1715430181625712,1.0000245029610699,7.0003515270658104E-3,1,0,24775.488166066552,1.5707559643207623,2.3031900782710166,1.1216680763477576,1.0000987175659581,1.4050583310119441E-2,1.0001585637520374,2.5074685786629351E-2,13.436722159902192,-94.695933372185152,85.304066627814848,null,1000000000,171813110.0625,null,17.072518205253694,-26.535879764985552,null,35.13515437290463,-68.160053607199586,null,0,0]
[13183,13.183,2.5850184315054365,1.1735891818202442,1.0000247851021786,7.0405383702956768E-3,1,0,24917.721232875723,1.5707561947141608,2.3139256147927356,1.1239030386729518,1.0000998542138155,1.4131235294203855E-2,1.0001603895634106,2.5218620901180058E-2,13.385124191252624,-94.695694562303444,85.304305437696556,null,1000000000,173791489,null,17.063178537875139,-26.412460075106903,null,35.092896071633618,-68.283234487196523,null,0,0]
[13259.75,13.25975,2.5978215101043927,1.1756557719153613,1.0000250745309947,7.0815262567415728E-3,1,0,25062.789510320308,1.5707564270064132,2.324886943711864,1.1261612783650068,1.0001010202202878,1.4213494769641292E-2,1.0001622625359246,2.5365424878114981E-2,13.33281424398155,-94.695503094776072,85.304496905223928,null,1000000000,175820970.0625,null,17.053795631457248,-26.287798901613986,null,35.049969030780439,-68.40770419316209,null,0,0]
[13336.5,13.336499999999999,2.6106355746161367,1.1777020833438607,1.0000253656398586,7.1225141193930605E-3,1,0,25207.857787766236,1.5707566566250359,2.3358600174248778,1.1283983124962431,1.000102192994049,1.4295754052711548E-2,1.0001641463809121,2.551222857460168E-2,13.280820181968471,-94.695364555459875,85.304635444540125,null,1000000000,177862232.25,null,17.044554267176217,-26.164352553050051,null,35.00721633304839,-68.53101200240981,null,0,0]
[13413.25,13.41325,2.6234604640614663,1.1797283962408875,1.000025658428769,7.163501958112441E-3,1,0,25352.926065213469,1.5707568836159245,2.3468446711874056,1.1306144162833445,1.0001033725350754,1.4378013142302078E-2,1.0001660410983706,2.5659031989017984E-2,13.229138255201162,-94.695279228642676,85.304720771357324,null,1000000000,179915275.5625,null,17.035451690720556,-26.042105263226528,null,34.964636982736735,-68.653173965416144,null,0,0]
[13490,13.49,2.6362960204589885,1.1817349859497441,1.0000259528977247,7.2044897727620147E-3,1,0,25497.994342662001,1.5707571080239291,2.3578407431528539,1.1328098606394383,1.0001045588433435,1.4460272037300345E-2,1.0001679466882984,2.5805835119741747E-2,13.177764778300869,-94.695247370575785,85.304752629424215,null,1000000000,181980100,null,17.026485212480829,-25.921041512470559,null,34.922229984076175,-68.774205858105205,null,0,0]
[13568.5,13.5685,2.6494351172269068,1.1837672077035437,1.000026255818897,7.2464121379470937E-3,1,0,25646.370365851712,1.570757334922519,2.3690991858607209,1.1350342705375593,1.0001057792014136,1.4544406339824397E-2,1.0001699069753125,2.5955985257960515E-2,13.12553522371482,-94.69527033643314,85.30472966356686,null,1000000000,184104192.25,null,17.017452337797717,-25.798425754039471,null,34.879033304173241,-68.896844582393655,null,0,0]
[13647,13.647,2.6625850479466378,1.1857793642932091,1.0000265604975991,7.2883344776608263E-3,1,0,25794.746389042728,1.5707575592107859,2.3803692399502387,1.1372376279485672,1.0001070066387963,1.462854043642692E-2,1.0001718786362566,2.6106135095969561E-2,13.073620747718318,-94.695349694629982,85.304650305370018,null,1000000000,186240609,null,17.008556346717196,-25.677016052910684,null,34.836014819257251,-69.018333641719323,null,0,0]
[13725.5,13.7255,2.675745652888077,1.1877717353744686,1.0000268669338295,7.330256791755879E-3,1,0,25943.122412235025,1.5707577809335174,2.3916507412742432,1.1394202092424066,1.0001082411554649,1.471267432591758E-2,1.0001738616711284,2.6256284632033267E-2,13.02201760767138,-94.695485635834842,85.304514364165158,null,1000000000,188389350.25,null,16.999794560163895,-25.556796576750678,null,34.793173465763623,-69.138689059084172,null,0,0]
[13804,13.804,2.6889167753198455,1.1897445957586994,1.0000271751275864,7.3721790800849209E-3,1,0,26091.498435428584,1.5707580001344819,2.4029435286029952,1.1415822863934373,1.0001094827513939,1.479680800710606E-2,1.0001758560799261,2.6406433864416063E-2,12.970722125585059,-94.695678324945348,85.304321675054652,null,1000000000,190550416,null,16.99116436242284,-25.437751745016058,null,34.750508181418354,-69.25792657992929,null,0,0]
[13884.25,13.88425,2.7023922331580157,1.1917415503420694,1.0000274920086372,7.415035914933219E-3,1,0,26243.182204363409,1.5707582216599152,2.4144995672668159,1.1437716465337469,1.0001107593439313,1.4882817063354396E-2,1.0001779067071539,2.6559930056961344E-2,12.918597372024504,-94.695934115217526,85.304065884782474,null,1000000000,192772398.0625,null,16.982475134106302,-25.317251297399768,null,34.707072656174333,-69.378682817817761,null,0,0]
[13964.5,13.964499999999999,2.715878360703698,1.1937186803512636,1.0000278107264455,7.4578927225425187E-3,1,0,26394.865973299511,1.5707584406392612,2.4260670690591222,1.1459401392223034,1.0001120433348272,1.4968825899394038E-2,1.0001799692210729,2.6713425928466865E-2,12.866786573869808,-94.696249482642827,85.303750517357173,null,1000000000,195007260.25,null,16.973918093992413,-25.197946308202408,null,34.663818898133535,-69.498303174440451,null,0,0]
[14044.75,14.044750000000001,2.7293749997964727,1.1956762643082874,1.0000281312810098,7.5007495027554164E-3,1,0,26546.549742236857,1.5707586571161645,2.43764587078998,1.1480880412794987,1.0001133347240525,1.5054834513953336E-2,1.00018204362168,2.6866921477078431E-2,12.815286001927923,-94.696624527047192,85.303375472952808,null,1000000000,197255002.5625,null,16.965490641700743,-25.07982091921161,null,34.620745778483311,-69.616803607835621,null,0,0]
[14125,14.125,2.7428819952668273,1.1976145758546044,1.0000284536723283,7.5436062554145086E-3,1,0,26698.233511175436,1.5707588711332772,2.4492358121974718,1.1502156250536411,1.0001146335115789,1.5140842905760654E-2,1.0001841299089731,2.7020416700941886E-2,12.76409199152722,-94.697059324796641,85.302940675203359,null,1000000000,199515625,null,16.957190238722745,-24.962859528389657,null,34.577852171060613,-69.734199796406983,null,0,0]
[14207.25,14.20725,2.7567362011469738,1.1995814766514925,1.0000287860043076,7.5875310603796481E-3,1,0,26853.697560961089,1.5707590879752533,2.4611259944026092,1.1523754289052908,1.0001159723447826,1.522899457641143E-2,1.0001862805257022,2.7177737012016142E-2,12.711936466940744,-94.69756702063539,85.30243297936461,null,1000000000,201845952.5625,null,16.94881221764906,-24.844175025793785,null,34.53407466754782,-69.853391994841587,null,0,0]
[14289.5,14.2895,2.770600965326008,1.2015286992145833,1.0000291202657297,7.6314558360656565E-3,1,0,27009.161610747993,1.5707593023209554,2.4730275467250884,1.1545144543557093,1.0001173189495831,1.5317146010364128E-2,1.0001884436289774,2.7335056978009822E-2,12.660095381150654,-94.698137576743022,85.301862423256978,null,1000000000,204189810.25,null,16.940562449767583,-24.726680881307068,null,34.490483349639206,-69.971456695435961,null,0,0]
[14371.75,14.37175,2.7844761300848684,1.2034565228386076,1.0000294564565924,7.6753805823030659E-3,1,0,27164.625660536123,1.5707595142132427,2.4849403057943342,1.1566329805230633,1.0001186733259499,1.5405297206249717E-2,1.0001906192187964,2.7492376596926729E-2,12.608564990277255,-94.698771005508576,85.301228994491424,null,1000000000,206547198.0625,null,16.932438393271575,-24.610361105013798,null,34.447077015261812,-70.088409900494767,null,0,0]
[14454,14.454000000000001,2.7983615407154314,1.2053652218578981,1.0000297945768941,7.7193052989224104E-3,1,0,27320.089710325457,1.5707597236939981,2.4968641112052175,1.1587312819373619,1.0001200354738513,1.549344816269918E-2,1.0001928072951558,2.7649695866770692E-2,12.557341615473641,-94.699467297937133,85.300532702062867,null,1000000000,208918116,null,16.924437567339794,-24.495199969824338,null,34.40385446638998,-70.204267328112806,null,0,0]
[14622.5,14.6225,2.8268389993238041,1.2092168529515923,1.0000304932862103,7.8092907953880618E-3,1,0,27638.578371599691,1.5707601454838764,2.5213254376208116,1.1629679057939417,1.0001228502824553,1.5674036298731955E-2,1.0001973288513799,2.7971984093133773E-2,12.453347330746984,-94.701089908279727,85.298910091720273,null,1000000000,213817506.25,null,16.908421495974299,-24.26283040799704,null,34.315876253028826,-70.438259500282697,null,0,0]
[14706.75,14.70675,2.8410932182456192,1.2111136995714893,1.0000308456774789,7.8542834962849022E-3,1,0,27797.82270223862,1.5707603527543781,2.5335728256807348,1.1650555209577289,1.000124269917736,1.5764329984082604E-2,1.000199609281238,2.8133127648427202E-2,12.401818213868934,-94.701999952408016,85.298000047591984,null,1000000000,216288495.5625,null,16.900597306216827,-24.148404192546003,null,34.272171325908246,-70.553595759862006,null,0,0]
[14791,14.791,2.8553575574147856,1.2129916009653186,1.0000312000931517,7.8992761653815802E-3,1,0,27957.067032878727,1.5707605576636412,2.5458311491328236,1.1671230410856694,1.0001256977069564,1.5854623412361109E-2,1.0002019028122557,2.8294270828934896E-2,12.350596178026604,-94.702975706114174,85.297024293885826,null,1000000000,218773681,null,16.892892436065033,-24.035129187821312,null,34.228654160217708,-70.667846518292848,null,0,0]
[14877.25,14.87725,2.8699708418227878,1.2148947376660619,1.0000315650193108,7.9453368765774138E-3,1,0,28120.091644366097,1.5707607650331195,2.5583916351065192,1.1692191088303134,1.0001271678368315,1.5947060036977857E-2,1.0002042643604721,2.8459238976366773E-2,12.298472509994461,-94.704042575670741,85.295957424329259,null,1000000000,221332567.5625,null,16.885125799225179,-23.920341462207418,null,34.18429712902541,-70.783701113463323,null,0,0]
[14963.5,14.9635,2.8845944157205223,1.2167785850677924,1.0000319320671245,7.9913975540590824E-3,1,0,28283.116255854657,1.5707609700120315,2.570963251515892,1.1712946867195895,1.0001286465122976,1.6039496389052055E-2,1.0002066396392382,2.8624206726457865E-2,12.246663062067007,-94.705178058620461,85.294821941379539,null,1000000000,223906332.25,null,16.877479270317743,-23.806727566245396,null,34.140134210005399,-70.898450492375062,null,0,0]
[15049.75,15.04975,2.8992281234088484,1.2186434217826199,1.0000323012365901,8.0374581976311761E-3,1,0,28446.140867344391,1.5707611726414785,2.5835458358777821,1.1733500561124259,1.0001301337333168,1.6131932467005273E-2,1.0002090286485505,2.8789174076906607E-2,12.19516408325428,-94.706381999725991,85.293618000274009,null,1000000000,226494975.0625,null,16.869950438986695,-23.694271381520583,null,34.096164062523719,-71.012110618205426,null,0,0]
[15136,15.135999999999999,2.9138718122095408,1.2204895213567133,1.000032672527706,8.0835188070982958E-3,1,0,28609.165478835283,1.5707613729616243,2.5961392287186351,1.1753854935986006,1.000131629499851,1.6224368269259111E-2,1.0002114313884063,2.8954141025411471E-2,12.143971888089862,-94.70765422669156,85.29234577330844,null,1000000000,229098496,null,16.862536953539305,-23.582957062816821,null,34.052385352806695,-71.124697163874743,null,0,0]
[15224,15.224,2.9288227509298554,1.2223540454291255,1.0000330535389206,8.1305139443033254E-3,1,0,28775.497836067738,1.5707615750069033,2.6089991169306583,1.1774419692983507,1.0001331644225866,1.6318679294759469E-2,1.0002138970307575,2.9122454712745494E-2,12.092053437097459,-94.709022449539518,85.290977550460482,null,1000000000,231770176,null,16.855089548993945,-23.470544884485946,null,34.007914306359645,-71.238477565053557,null,0,0]
[15312,15.311999999999999,2.9437837681114734,1.2241996239437547,1.0000334367587496,8.1775090455944114E-3,1,0,28941.830193301357,1.5707617747298226,2.6218699305763544,1.1794782629761058,1.0001347082410486,1.6412990029939692E-2,1.0002163769664785,2.9290767976819145E-2,12.040446796387133,-94.710461344679572,85.289538655320428,null,1000000000,234457344,null,16.847757452147981,-23.359288901143231,null,33.963639762495291,-71.351172443536328,null,0,0]
[15400,15.4,2.9587547108684231,1.2260265318184242,1.0000338221871901,8.2245041107640166E-3,1,0,29108.162550536119,1.5707619721701944,2.6347515095428444,1.1814946536362543,1.000136260955196,1.6507300473123435E-2,1.0002188711955662,2.9459080815188055E-2,11.989148253047308,-94.711970680025658,85.288029319974342,null,1000000000,237160000,null,16.840538343489293,-23.249173129199757,null,33.919560327814146,-71.462797550825897,null,0,0]
[15488,15.488,2.9737354292930696,1.2278350389352142,1.0000342098242399,8.271499139604602E-3,1,0,29274.494907771998,1.5707621673669254,2.6476436967006105,1.1834914155031615,1.0001378225649875,1.6601610622634384E-2,1.0002213797180166,2.9627393225407882E-2,11.938154158956994,-94.713550208788149,85.286449791211851,null,1000000000,239878144,null,16.833429960140418,-23.140181858889846,null,33.875674617072711,-71.573368349898288,null,0,0]
[15578.25,15.578250000000001,2.989109177265338,1.2296709513230442,1.0000346096664976,8.3196957079355351E-3,1,0,29445.080080961077,1.5707623652638889,2.6608763706278249,1.1855191252406108,1.0001394333419784,1.6698331804407558E-2,1.000223967225039,2.9800008630664471E-2,11.886168708913367,-94.715242758548769,85.284757241451231,null,1000000000,242681873.0625,null,16.826252523984845,-23.029555702895927,null,33.83086660318466,-71.685687055652849,null,0,0]
[15668.5,15.6685,3.0044928971264002,1.2314880691652985,1.0000350118317431,8.3678922376138123E-3,1,0,29615.665254151296,1.5707625608810936,2.6741198767300745,1.1875267588098175,1.0001410534752302,1.679505267372735E-2,1.0002265697656711,2.9972623580390628E-2,11.834495906159745,-94.717008567471055,85.282991432528945,null,1000000000,245501892.25,null,16.819186902464555,-22.920079678089579,null,33.786259421951328,-71.796928889381476,null,0,0]
[15758.75,15.758749999999999,3.0198864364817117,1.2332866677788832,1.0000354163199738,8.4160887284155696E-3,1,0,29786.250427342638,1.5707627542577078,2.6873740548629557,1.1895145969543051,1.000142682964698,1.6891773228785642E-2,1.0002291873399085,3.0145238071949826E-2,11.783132018362252,-94.718847326635114,85.281152673364886,null,1000000000,248338201.5625,null,16.812230829818404,-22.811737701192389,null,33.74185160679999,-71.907109625442729,null,0,0]
[15849,15.849,3.035289645931921,1.2350670173767266,1.0000358231311866,8.4642851801169389E-3,1,0,29956.835600535076,1.5707629454320078,2.7006387478980947,1.1914829155343512,1.0001443218103356,1.6988493467774361E-2,1.0002318199477478,3.0317852102705569E-2,11.732073378571837,-94.720758714422828,85.279241285577172,null,1000000000,251190801,null,16.805382096058516,-22.704513968664138,null,33.697641700769452,-72.016244745758726,null,0,0]
[15941.25,15.94125,3.051044042175302,1.2368682366909773,1.0000362413583737,8.5135496565871827E-3,1,0,30131.201054575005,1.5707631386057377,2.7142081018563746,1.1934749623493721,1.0001460066433103,1.7087356763024586E-2,1.0002345264329475,3.0494290896161073E-2,11.680194964239757,-94.722787173247752,85.277212826752248,null,1000000000,254123451.5625,null,16.798490278939305,-22.596053611053048,null,33.652655103556583,-72.126733562194715,null,0,0]
[16033.5,16.0335,3.0668082354785762,1.2386509442665263,1.0000366620126357,8.5628140917318879E-3,1,0,30305.566508616048,1.5707633295565875,2.7277881192905076,1.1954471825184367,1.00014770125163,1.7186219724221442E-2,1.0002372486254323,3.0670729202593221E-2,11.628627932040876,-94.724890798670771,85.275109201329229,null,1000000000,257073122.25,null,16.791706113065082,-22.488729090076966,null,33.607872237231931,-72.236161708593798,null,0,0]
[16125.75,16.12575,3.0825820755365068,1.2404154128631084,1.000037085093969,8.6120784853119751E-3,1,0,30479.931962658182,1.5707635183227056,2.7413786417289336,1.1973998554588283,1.0001494056352453,1.7285082349434086E-2,1.0002399865251983,3.0847167019186463E-2,11.577368568077892,-94.72706921116999,85.27293078883001,null,1000000000,260039813.0625,null,16.785027408667837,-22.382524398379925,null,33.563291577666192,-72.344544812790076,null,0,0]
[16218,16.218,3.0983654150136375,1.2421619101420007,1.0000375106023711,8.6613428370883733E-3,1,0,30654.297416701389,1.5707637049413736,2.7549795137057127,1.1993332556727585,1.000151119794106,1.7383944636731714E-2,1.0002427401322402,3.1023604343125309E-2,11.52641322354415,-94.729322020666544,85.270677979333456,null,1000000000,263023524,null,16.778452030131842,-22.277423810169154,null,33.518911611668443,-72.45189821049739,null,0,0]
[16312.5,16.3125,3.1145434128116181,1.2439326453116886,1.0000379490056088,8.7118087148248587E-3,1,0,30832.915686697961,1.5707638939231456,2.7689226861043572,1.2012941103074375,1.0001528858974511,1.748521784693275E-2,1.00024557718703,3.1204344502660627E-2,11.474526550994801,-94.731706499628359,85.268293500371641,null,1000000000,266097656.25,null,16.771821236230576,-22.170888470621851,null,33.473655733020358,-72.560818029006512,null,0,0]
[16407,16.407,3.1307310753244306,1.2456850745104715,1.0000383899557459,8.7622745481857056E-3,1,0,31011.533956695625,1.570764080727947,2.7828763981670286,1.2032353083722871,1.0001546622585911,1.7586490698432516E-2,1.0002484307246393,3.1385084139235624E-2,11.422951360647577,-94.734168189504302,85.265831810495698,null,1000000000,269189649,null,16.765294500647553,-22.065479224283461,null,33.428607278256159,-72.668688965220824,null,0,0]
[16501.5,16.5015,3.1469282534074563,1.2474194695524861,1.0000388334527788,8.8127403369139233E-3,1,0,31190.152226694354,1.570764265393179,2.7968404921434717,1.2051571295515879,1.0001564488774712,1.7687763189155575E-2,1.0002513007450635,3.1565823249823904E-2,11.371683933034294,-94.736706641233596,85.263293358766404,null,1000000000,272299502.25,null,16.758869694337708,-21.961180048449123,null,33.383764656952721,-72.775526592784487,null,0,0]
[16596,16.596,3.1631348008841407,1.2491360971201497,1.0000392794967043,8.8632060807525195E-3,1,0,31368.770496694142,1.5707644479553904,2.8108148133020259,1.2070598485464301,1.0001582457540366,1.7789035317026546E-2,1.0002541872482977,3.1746561831399102E-2,11.320720614034681,-94.739321397196719,85.260678602803281,null,1000000000,275427216,null,16.752544741253807,-21.85797520588088,null,33.339126291037012,-72.881346191315828,null,0,0]
[16692.5,16.692499999999999,3.1796938641198054,1.250870991838313,1.0000397376090258,8.9147398360699508E-3,1,0,31551.169047541549,1.5707646322482172,2.8250952837107604,1.208983404229983,1.0001600912453015,1.7892450393745832E-2,1.0002571518513075,3.1931125019069209E-2,11.268988806397767,-94.742069751784172,85.257930248215828,null,1000000000,278639556.25,null,16.746186868480443,-21.75369939007096,null,33.293752356173457,-72.988370361713237,null,0,0]
[16789,16.789000000000001,3.1962623986069385,1.2525879052570972,1.0000401983771783,8.9662735440359242E-3,1,0,31733.567598390015,1.5707648144224833,2.8393861019918942,1.210887604133964,1.0001619474329169,1.7995865087717697E-2,1.000260133642185,3.211568764871895E-2,11.217566616365314,-94.744896685712305,85.255103314287695,null,1000000000,281870521,null,16.739928907114109,-21.650532435426548,null,33.24858812750734,-73.094364250285736,null,0,0]
[16885.5,16.8855,3.2128402578165431,1.2542871055191067,1.0000406618011584,9.0178072043767855E-3,1,0,31915.966149239524,1.570764994514511,2.8536871126838572,1.2127727253440816,1.0001638143168234,1.8099279396732327E-2,1.0002631326209248,3.230024971712591E-2,11.166450354292961,-94.747801688364376,85.252198311635624,null,1000000000,285120110.25,null,16.733768807757986,-21.548458468060488,null,33.203631964791107,-73.199343220303888,null,0,0]
[16982,16.981999999999999,{"$f":"SQRT(1+(A269/pole1)^2)","v":3.2294272981467498},{"$f":"ATAN(A269/pole1)","v":1.2559688556717969},{"$f":"SQRT(1+(A269/Zero1)^2)","v":1.0000411278809618},{"$f":"ATAN(A269/Zero1)","v":9.0693408168188872E-3},{"$f":"IF(VIN_nom>Vout, 1, SQRT(1+(A269/z_RHP)^2))","v":1},{"$f":"IF(VIN_nom>Vout, 0, -ATAN(A269/z_RHP))","v":0},{"$f":"SQRT(1+(A269/Pole2)^2)","v":32098.364700090056},{"$f":"ATAN(A269/Pole2)","v":1.5707651725597975},2.8679981633160785,1.2146390399638409,{"$f":"SQRT(1+(A269/pole4)^2)","v":1.0001656918969615},{"$f":"ATAN(A269/pole4)","v":1.8202693318579936E-2},{"$f":"SQRT((1-(V269/pterm2))^2+(A269/pterm1)^2)","v":1.000266148787522},{"$f":"IF((ATAN((A269/pterm1)/(1-A269^2/pterm2))>0),ATAN((A269/pterm1)/(1-A269^2/pterm2)),PI()+ATAN((A269/pterm1)/(1-A269^2/pterm2)))","v":3.2484811221067729E-2},{"$f":"20*LOG10(((E269*K269*G269)/(C269*I269*O269*M269))*Adc)","v":11.115636395307092},{"$f":"((F269+L269+H269)-(D269+J269+P269+N269))*radconv","v":-94.750784242605349},{"$f":"IF(R269>0,R269,R269+180)","v":85.249215757394651},null,1000000000,288388324,null,{"$f":"20*LOG10((K269/(I269*M269))*AEA)","v":16.727704572197659},{"$f":"(L269-(J269+N269))*radconv","v":-21.447461899497558},null,{"$f":"20*LOG10((E269*G269/(C269*O269))*Acs*Am)","v":33.158882241365568},{"$f":"(F269+H269-(D269+P269))*radconv","v":-73.303322343107794},null,0,0]
[17081,{"$f":"A270/1000","v":17.081},3.246453448022534,1.2576763108680447,1.0000416087952884,9.1222094468778152E-3,1,0,32285.488601999936,1.570765353127052,2.8826902432852672,1.216534441040811,1.0001676292344859,1.8308785952915411E-2,1.0002692609546917,3.2674153521154763E-2,11.063816431854661,-94.753924108100392,85.246075891899608,null,{"$f":"IF(Q270<0,A270,1000000000)","v":1000000000},{"$f":"A270^2","v":291760561},null,16.72158081127354,-21.344952423111938,null,33.113186038837256,-73.408971684988458,null,{"$f":"SUM((Q271<0)*(Q270>0))*A270","v":0},0]
[17180,17.18,3.2634889638452829,1.2593659450070216,1.0000420925048203,9.175078025940548E-3,1,0,32472.612503910856,1.5707655316132636,2.8973925743997433,1.2184106130134396,1.0001695778295006,1.8414878175051962E-2,1.0002723912118054,3.286349522028028E-2,11.0123071115369,-94.757144474387133,85.242855525612867,null,1000000000,295152400,null,16.715553843765939,-21.243544550397921,null,33.067703686027102,-73.51359992398919,null,0,0]
[17279,17.279,3.2805336997054444,1.2610380261451988,1.0000425790095542,9.2279465537116155E-3,1,0,32659.736405822798,1.5707657080542023,2.9121050013947793,1.220267834018127,1.0001715376819396,1.852096998260375E-2,1.0002755395588578,3.3052836314965112E-2,10.961104723289449,-94.760444765658463,85.239555234341537,null,1000000000,298563841,null,16.709621670343033,-21.143222347226402,null,33.022433471202547,-73.617222418432064,null,0,0]
[17378,17.378,3.2975875126320457,1.2626928171910397,1.0000430683094854,9.2808150298955491E-3,1,0,32846.860307735747,1.570765882484823,2.9268273720220024,1.2221063771237199,1.0001735087917369,1.8627061373184997E-2,1.0002787059958427,3.3242176801730187E-2,10.910205621431023,-94.763824401451018,85.236175598548982,null,1000000000,301994884,null,16.703782341988646,-21.043970169770997,null,32.977373697698511,-73.719854231680017,null,0,0]
[17479.25,17.47925,3.3150381550745731,1.2643676018590517,1.0000435716210758,9.334885008689349E-3,1,0,33038.237025602291,1.5707660588360046,2.9418944715859121,1.2239676652208247,1.0001755363434539,1.8735563497954497E-2,1.0002819631086053,3.3435819848949229E-2,10.858459693302526,-94.767362307853702,85.232637692146298,null,1000000000,305524180.5625,null,16.697904355785681,-20.943553035230135,null,32.931505755772982,-73.823809272623578,null,0,0]
[17580.5,17.580500000000001,3.3324979984828671,1.2660248418502802,1.0000440778563531,9.3889549328993772E-3,1,0,33229.613743469832,1.5707662331558951,2.9569716591446649,1.2258099787476291,1.0001775756699005,1.8844065181537421E-2,1.0002852391429016,3.3629462252941271E-2,10.807023483669662,-94.77098196573084,85.22901803426916,null,1000000000,309073980.25,null,16.692119514049022,-20.844222921824255,null,32.885854387876769,-73.926759043906571,null,0,0]
[17681.75,17.681750000000001,3.3499668989921472,1.2676648024578083,1.000044587015313,9.4430248022095639E-3,1,0,33420.990461338384,1.5707664054793897,2.9720587811697485,1.2276335940650158,1.000179626771005,1.895256642138177E-2,1.0002885340987255,3.3823104009984832E-2,10.755893295154369,-94.774682742602252,85.225317257397748,null,1000000000,312644283.0625,null,16.686425885645072,-20.745963997094286,null,32.840417827765435,-74.028718745507959,null,0,0]
[17783,17.783000000000001,3.3674447156490146,1.2692877438430668,1.0000450990979508,9.4970946163038406E-3,1,0,33612.367179207919,1.5707665758405882,2.9871556871341904,1.229438782450015,1.0001816896466948,1.9061067214935619E-2,1.0002918479760705,3.4016745116358486E-2,10.705065495545519,-94.778464003203425,85.221535996796575,null,1000000000,316235089,null,16.680821588253188,-20.648760719818839,null,32.795194325548465,-74.129703283384572,null,0,0]
[17886.5,17.886500000000002,3.3853199999930212,1.2709294255016079,1.0000456255820542,9.5523659244232603E-3,1,0,33807.996713031105,1.5707667479940988,3.0025980387187006,1.2312653176750012,1.0001838105339695,1.9171978673300973E-2,1.0002952550520385,3.4214688682034984E-2,10.653417017144433,-94.782411814367848,85.217588185632152,null,1000000000,319926882.25,null,16.675183171335881,-20.550472582316395,null,32.749184264064681,-74.231939232051459,null,0,0]
[17990,17.989999999999998,3.4032043123162183,1.2725538569687149,1.0000461551212114,9.6076371741775912E-3,1,0,34003.626246855274,1.5707669181667436,{"$f":"SQRT(1+(A279/Zero2)^2)","v":3.0180503051333227},{"$f":"ATAN(A279/Zero2)","v":1.2330731553422509},1.0001859437248048,1.9282889659928037E-2,1.0002986818998143,3.4412631559938123E-2,10.602077043224188,-94.786442376926644,85.213557623073356,null,1000000000,323640100,null,16.669634272189043,-20.453255595436829,null,32.703393189291276,-74.333186781489815,null,0,0]
[18093.5,18.093499999999999,3.4210975110331687,1.2741613002719705,1.0000466877154173,9.6629083652292214E-3,1,0,34199.255780680433,1.5707670863925161,3.0335123348639943,1.2348625694519815,1.0001880892191217,1.939380017209115E-2,1.0003021285193912,3.4610573746093096E-2,10.551041895537658,-94.790555006481441,85.209444993518559,null,1000000000,327374742.25,null,16.664173029111701,-20.357094061915582,null,32.657819284682091,-74.433460944565851,null,0,0]
[18197,18.196999999999999,3.4389994574354992,1.2757520123381874,1.0000472233646671,9.7181794972405512E-3,1,0,34394.885314506537,1.5707672527046359,3.048983979375322,1.2366338289201289,1.0001902470168411,1.9504710207064718E-2,1.000305594910762,3.480851523652518E-2,10.500307960652972,-94.794749017644861,85.205250982355139,null,1000000000,331130809,null,16.658797627636687,-20.261972575751635,null,32.612460751272422,-74.532776441893233,null,0,0]
[18303,18.303000000000001,3.457342743201834,1.2773640682975149,1.0000477751189247,9.7747856192003258E-3,1,0,34595.240199392218,1.5707674210843314,3.0648391489104951,1.2384293304735294,1.0001924696879625,1.9618298730924272E-2,1.0003091655253173,3.5011237197092149E-2,10.448657073576831,-94.799127970675627,85.200872029324373,null,1000000000,334999809,null,16.653379514679706,-20.165615704986685,null,32.566227977153261,-74.633512265688921,null,0,{"$f":"IF(AD282>0,S282,0)","v":0}]
[18409,18.408999999999999,3.4756949188007442,1.2789591045848083,1.0000483300775849,9.8313916785164029E-3,1,0,34795.595084278866,1.5707675875249483,3.0807040972326516,1.2402063448307079,1.0001947052638624,1.9731886748476701E-2,1.000312756878347,3.5213958419481953E-2,10.397314656592911,-94.803590827833247,85.196409172166753,null,1000000000,338891281,null,16.648047733834215,-20.070317932431198,null,32.520217341014835,-74.733272895402038,null,0,0]
[18515,18.515000000000001,3.494055844153388,1.2805373813296876,1.0000488882406424,9.8879976748261263E-3,1,0,34995.949969166475,1.5707677520597911,3.0965786740404782,1.2419651450049958,1.0001969537444546,1.9845474256794338E-2,1.0003163689698431,3.5416678899425118E-2,10.346277029810798,-94.808136852452137,85.191863147547863,null,1000000000,342805225,null,16.642800480959064,-19.976063617314022,null,32.474426967107867,-74.832073235138097,null,0,0]
[18621,18.620999999999999,3.5124253820438356,1.2820991535578752,1.0000494496080916,9.9446036077668418E-3,1,0,35196.304854055015,1.5707679147214053,3.1124627320087099,1.243705998892402,1.0001992151296515,1.9959061252949589E-2,1.000320001799798,3.561939863265226E-2,10.29554057828304,-94.812765308592262,85.187234691407738,null,1000000000,346741641,null,16.637635997935377,-19.882837412021427,null,32.428854998603796,-74.929927896570831,null,0,0]
[18729.5,18.729500000000002,3.5312369430797741,1.2836809280064623,1.0000500275339796,1.000254452028879E-2,1,0,35401.385090003205,1.5707680793125569,3.1287310824734567,1.2454695988597455,1.0002015432140388,2.0075326654213882E-2,1.0003237417875954,3.5826898713866254E-2,10.243915719469307,-94.817587530092922,85.182412469907078,null,1000000000,350794170.25,null,16.63243364386533,-19.788461524209563,null,32.382432493860108,-75.029126005883398,null,0,0]
[18838,18.838000000000001,3.5500572456600725,1.2852459350721426,1.000050608817181,1.0060485365648507E-2,1,0,35606.46532595234,1.5707682420077385,3.1450090634908991,1.2472149480791359,1.0002038848187309,2.0191591512665572E-2,1.0003275035036003,3.6034398003674951E-2,10.19259894755632,-94.822494560922351,85.177505439077649,null,1000000000,354870244,null,16.627314424244709,-19.695131187497608,null,32.336234941567746,-75.127363373424757,null,0,0]
[18946.5,18.9465,3.568886151490736,1.2867944324140534,1.0000511934576899,1.0118426143457076E-2,1,0,35811.545561902407,1.570768402839523,3.1612965262936417,1.2489423179257269,1.0002062399436327,2.0307855825165255E-2,1.0003312869478045,3.6241896497500002E-2,10.141586587483074,-94.827485616657,85.172514383343,null,1000000000,358969862.25,null,16.622276594567683,-19.602830854921006,null,32.290260411171523,-75.224654761736005,null,0,0]
[19055,19.055,3.5877235251183617,1.2883266726003892,1.0000517814555006,1.0176366853325586E-2,1,0,36016.625797853383,1.5707685618397411,3.1775933250786772,1.2506519746415594,1.0002086085886492,2.0424119588573621E-2,1.0003350921201992,3.6449394190763228E-2,10.090875029100603,-94.832559915247046,85.167440084752954,null,1000000000,363093025,null,16.617318455038617,-19.511545273578346,null,32.244506992318122,-75.321014641668711,null,0,0]
[19165.75,19.165749999999999,3.6069601307723604,1.2898741780986414,1.0000523851092638,1.0235509028180328E-2,1,0,36225.958849758201,1.5707687222805682,3.1942375559174128,1.2523790883855987,1.0002110402965105,2.0542793782134663E-2,1.0003389986104299,3.6661194001192207E-2,10.039418388868482,-94.837824482042976,85.162175517957024,null,1000000000,367325973.0625,null,16.612337963178827,-19.419397668210976,null,32.198030843945787,-75.418426813832014,null,0,0]
[19276.5,19.276499999999999,3.6262052826204263,1.2914052612563311,1.0000529922610029,1.0294651131429192E-2,1,0,36435.291901663935,1.570768880877822,3.210891216118914,1.2540882914320506,1.0002134860908396,2.066146739698561E-2,1.0003429277393463,3.6872992967873358E-2,9.9882677547523979,-94.843174142387852,85.156825857612148,null,1000000000,371583452.25,null,16.607437058722027,-19.328276131438063,null,32.151781114286507,-75.514898010949793,null,0,0]
[19387.25,19.387250000000002,3.645458845311039,1.292920175042412,1.0000536029107114,1.0353793162658579E-2,1,0,36644.624953570572,1.5707690376630965,3.2275541597211994,1.2557798511199409,1.0002159459715334,2.0780140429788055E-2,1.0003468795069399,3.7084791085938033E-2,9.9374194869971415,-94.84860807430087,85.15139192569913,null,1000000000,375865462.5625,null,16.60261406949736,-19.238165347480628,null,32.105755835755915,-75.610442726820239,null,0,0]
[19498,19.498000000000001,3.6647206862785584,1.2944191674077605,1.000054217058383,1.0412935121454888E-2,1,0,36853.958005478104,1.5707691926672684,3.2442262436805018,1.2574540297013552,1.0002184199384876,2.0898812877203691E-2,1.0003508539132016,3.7296588350517752E-2,9.8868700100065823,-94.854125459705685,85.145874540294315,null,1000000000,380172004,null,16.59786736626727,-19.149050291978824,null,32.059953061995451,-75.705075167726861,null,0,0]
[19611.75,19.611750000000001,3.6845127739924917,1.2959424456182904,1.0000548514834779,1.0473679043929925E-2,1,0,37068.961478657176,1.5707693500477682,3.2613593095122932,1.259155734991193,1.0002209755840206,2.1020699315267576E-2,1.0003549595451429,3.751412189345929E-2,9.8352585982982834,-94.859878320360608,85.140121679639392,null,1000000000,384620738.0625,null,16.593069830484609,-19.058542356511964,null,32.013139186069807,-75.801335963848643,null,0,0]
[19725.5,19.7255,3.7043133197925768,1.2974494426353504,1.0000554895985947,1.0534422889110169E-2,1,0,37283.964951837159,1.5707695056131523,3.2785017208663714,1.2608396495884442,1.0002235460890638,2.1142585128662867E-2,1.0003590890588177,3.7731654525640743E-2,9.7839549394200667,-94.865717481400821,85.134282518599179,null,1000000000,389095350.25,null,16.588349419161482,-18.969053612856769,null,31.966555938514716,-75.896663868544053,null,0,0]
[19839.25,19.83925,3.7241221887680536,1.298940411361351,1.0000561314037264,1.0595166656547498E-2,1,0,37498.968425018029,1.5707696593946421,3.295653331909937,1.2625060416331599,1.0002261314535035,2.126447031377288E-2,1.0003632424542164,3.7949186241787572E-2,9.7329553609513724,-94.871642071078895,85.128357928921105,null,1000000000,393595840.5625,null,16.583704500056172,-18.880568699301584,null,31.920201279151328,-75.991073371777318,null,0,0]
[19953,19.952999999999999,3.7439392488072527,1.3004155996325792,1.0000567768988655,1.0655910345793799E-2,1,0,37713.971898199779,1.5707698114227471,3.3128139997528452,1.2641551741031809,1.0002287316772236,2.1386354866981053E-2,1.0003674197313284,3.8166717036625351E-2,9.6822562554666582,-94.87765122311211,85.12234877688789,null,1000000000,398122209,null,16.579133483160852,-18.79307254986686,null,31.874073190561944,-76.084578673245218,null,0,0]
[20069,20.068999999999999,3.7641565962347663,1.3019039674700275,1.0000574389622463,1.0717855477572836E-2,1,0,37933.228187335466,1.570769964683157,3.3303232915290724,1.2658194190909473,1.000231398636888,2.1510649668916287E-2,1.0003717042308531,3.8388549684101561E-2,9.6308600839028067,-94.883865433280405,85.116134566719595,null,1000000000,402764761,null,16.574546554280225,-18.704848684632196,null,31.827263947878713,-76.179016748648209,null,0,0]
[20185,20.184999999999999,3.7843821930635997,1.3033764294031167,1.0000581048630417,1.0779800527095736E-2,1,0,38152.484476472026,1.5707701161820404,3.3478417108409668,1.2674662514437611,1.0002340810492423,2.1634943806107986E-2,1.0003760135661846,3.8610381362382554E-2,9.5797690124006643,-94.89016578291978,85.10983421708022,null,1000000000,407434225,null,16.570033269024009,-18.617622350876623,null,31.780686161632794,-76.272543432043165,null,0,0]
[20301,20.300999999999998,3.804615907730621,1.304833232767816,1.0000587746012441,1.0841745493887275E-2,1,0,38371.740765609458,1.5707702659495932,3.3653691151484493,1.2690959342223216,1.0002367789141626,2.1759237274721059E-2,1.0003803477373123,3.883221206587513E-2,9.5289794144481803,-94.896551372286737,85.103448627713263,null,1000000000,412130601,null,16.565592068722253,-18.531378477842658,null,31.734337763982062,-76.365172894444058,null,0,0]
[20417,20.417000000000002,3.8248576114043522,1.3062746199333597,1.0000594481768459,1.0903690377472231E-2,1,0,38590.997054747735,1.5707704140153254,3.382905364793181,1.2707087254013125,1.0002394922315239,2.1883530070920559E-2,1.0003847067442251,3.9054041788986263E-2,9.4784877275126416,-94.903021308432585,85.096978691567415,null,1000000000,416853889,null,16.5612214350569,-18.446102286140761,null,31.688216710711878,-76.456919022291842,null,0,0]
[20536,20.536000000000001,3.8456309767930339,1.3077375138684191,1.0000601431600453,1.0967237196948204E-2,1,0,38815.923765157699,1.5707705641721605,3.4009041861601412,1.2723459393098382,1.0002422917778104,2.2011036633244586E-2,1.0003892042916116,3.9281607463091936E-2,9.4269961207048514,-94.909745289040956,85.090254710959044,null,1000000000,421727296,null,16.556809545432127,-18.359611030157602,null,31.641136993528857,-76.550134258883389,null,0,0]
[20655,20.655000000000001,3.8664124836128533,1.3091846851113311,1.0000608421816806,1.1030783927844991E-2,1,0,39040.850475568535,1.5707707125987935,3.4189120275501268,1.2739659106978096,1.0002451075858685,2.2138542479749536E-2,1.0003937279759805,3.9509172093527195E-2,9.3758106383066924,-94.916556154533396,85.083443845466604,null,1000000000,426629025,null,16.552468807636146,-18.2741075576848,null,31.594292248926685,-76.642448596848595,null,0,0]
[20774,20.774000000000001,3.8872020012882422,1.310616379815464,1.0000615452417425,1.1094330569649554E-2,1,0,39265.777185980216,1.5707708593249579,3.4369287471814896,1.2755689021561223,1.0002479396555606,2.2266047606295556E-2,1.0003982777973199,3.9736735674254245E-2,9.3249276344300007,-94.923452964258729,85.076547035741271,null,1000000000,431559076,null,16.548197706901032,-18.189576824838696,null,31.5476803457851,-76.733876139420019,null,0,0]
[20893,20.893000000000001,3.9079994019723383,1.3120328391511424,1.0000622523402232,1.1157877121848856E-2,1,0,39490.703896392733,1.5707710043797092,3.454954206160826,1.277155171148747,1.0002507879867486,2.2393552008742931E-2,1.0004028537556171,3.9964298199235478E-2,9.2743435276776101,-94.930434785770856,85.069565214229144,null,1000000000,436517449,null,16.543994767920484,-18.106004081447953,null,31.501299178013259,-76.824430704322921,null,0,0]
[21014.75,21.014749999999999,3.9292854426832786,1.3134665106563939,1.00006297995869,1.122289209353877E-2,1,0,39720.828492971094,1.5707711510863818,3.4734051225875855,1.2787610542802557,1.0002537189700957,2.252400218778975E-2,1.0004075625107827,4.019711842314249E-2,9.2228961293570535,-94.937664969512966,85.062335030487034,null,1000000000,441619717.5625,null,16.539763746419634,-18.021476405893946,null,31.45408280119355,-76.916188563619016,null,0,0]
[21136.5,21.136500000000002,3.950579472661246,1.3148847297765935,1.0000637118043634,1.1287906970347709E-2,1,0,39950.953089550305,1.5707712961029414,3.4918649017670882,1.28034996243843,1.0002566669749098,2.2654451600118298E-2,1.0004122986248492,4.0429937529159646E-2,9.1717542183433309,-94.944982191757518,85.055017808242482,null,1000000000,446751632.25,null,16.535601070474577,-17.937921183904397,null,31.407103566124889,-77.007061007853125,null,0,0]
[21258.25,21.25825,3.9718813634101902,1.3162877393818193,1.000064447877234,1.1352921751726253E-2,1,0,40181.077686130346,1.5707714394584267,3.5103334038797462,1.2819221554618114,1.0002596320010402,2.2784900241295643E-2,1.0004170620978035,4.0662755510821554E-2,9.1209141591110683,-94.952385481354028,85.047614518645972,null,1000000000,451913193.0625,null,16.53150528061197,-17.855323529237296,null,31.360359296755234,-77.097061952116746,null,0,0]
[21380,21.38,3.9931909891290047,1.3176757774002463,1.0000651881772928,1.1417936437124993E-2,1,0,40411.202282711201,1.5707715811812148,3.528810491967648,1.2834778880812128,1.0002626140483355,2.2915348106889014E-2,1.0004218529296323,4.0895572361663045E-2,9.0703723804335095,-94.959873876615262,85.040126123384738,null,1000000000,457104400,null,16.527474955510645,-17.773668848264084,null,31.313847843178998,-77.186205028351196,null,0,0]
[21504.5,21.5045,4.0149898117830061,1.3190799276025817,1.0000659495701856,1.1484419526882771E-2,1,0,40646.524765457958,1.5707717244455968,3.5477136663045923,1.2850519983399564,1.0002656810539763,2.3048741626834478E-2,1.0004267802660516,4.1133646733182691E-2,9.018993808522227,-94.967618433104008,85.032381566895992,null,1000000000,462443520.25,null,16.523419853672113,-17.691130068007219,null,31.26652437310625,-77.27648836509681,null,0,0]
[21629,21.629000000000001,4.0367964650391839,1.320468910164452,1.0000667153833642,1.1550902515113941E-2,1,0,40881.847248205537,1.5707718660606733,3.5666255380550833,1.2866094191257709,1.0002687658580662,2.3182134326388878E-2,1.0004317362111994,4.1371719908547551E-2,8.9679197903230055,-94.97544997994946,85.02455002005054,null,1000000000,467813641,null,16.51943031835367,-17.609547382609403,null,31.21943989022547,-77.365902597340039,null,0,0]
[21753.5,21.753499999999999,4.0586108226775837,1.3218429642533918,1.000067485616819,1.1617385401231034E-2,1,0,41117.16973095393,1.5707720060547621,3.5855459695962586,1.2881504070271907,1.0002718684604408,2.3315526200812745E-2,1.0004367207650617,4.1609791880845043E-2,8.9171467060955827,-94.983367519990267,85.016632480009733,null,1000000000,473214762.25,null,16.515504945991225,-17.52890609198144,null,31.172592178360496,-77.454461428008813,null,0,0]
[21878,21.878,4.0804327611332631,1.3232023241489173,1.0000682602705391,1.1683868184646578E-2,1,0,41352.492213703117,1.5707721444555365,3.6044748261332273,1.2896752135587133,1.0002749888609346,2.3448917245366793E-2,1.0004417339276237,4.1847862643162773E-2,8.8666710000731097,-94.991370066686486,85.008629933313514,null,1000000000,478646884,null,16.511642369814322,-17.449191786718171,null,31.125979048514925,-77.542178279968283,null,0,0]
[22005.25,22.00525,4.1027444181940309,1.3245767643247728,1.0000690566028723,1.1751819356537224E-2,1,0,41593.012582618248,1.5707722842950149,3.6238303587019542,1.2912172357471403,1.0002781965779211,2.3585253815953878E-2,1.0004468873862344,4.2091190739055928E-2,8.8153840363577345,-94.999636204522417,85.000363795477583,null,1000000000,484231027.5625,null,16.507757982321458,-17.368659945613604,null,31.078576472292415,-77.630976258908831,null,0,0]
[22132.5,22.1325,4.1250637418413554,1.3259363337847281,1.0000698575528786,1.1819770419898245E-2,1,0,41833.532951534195,1.5707724225264894,3.6431944165609726,1.2927428694294072,1.00028142288762,2.3721589509594618E-2,1.00045207073131,4.2334517556325009E-2,8.7644004200180596,-95.007989095915946,84.992010904084054,null,1000000000,489847556.25,null,16.503936421362042,-17.289066954368451,null,31.031414416912156,-77.71892214154748,null,0,0]
[22259.75,22.25975,4.1473906083012499,1.3272812676245782,1.0000706631205472,1.1887721374102395E-2,1,0,42074.053320450927,1.5707725591775368,3.6625668644901888,1.2942523674982431,1.0002846677898509,2.3857924321229265E-2,1.0004572839628347,4.2577843087590092E-2,8.7137165520638415,-95.016427722081005,84.983572277918995,null,1000000000,495496470.0625,null,16.500176339487748,-17.210398324586777,null,30.984490630832227,-77.806029397494243,null,0,0]
[22387,22.387,4.1697248964093427,1.3286117961174968,1.0000714733058667,1.1955672218522435E-2,1,0,42314.573689368444,1.5707726942751072,3.6819475700573565,1.2957459778193632,1.0002879312844331,2.3994258245798265E-2,1.0004625270807925,4.2821167325471497E-2,8.6633288970315405,-95.024951075906642,84.975048924093358,null,1000000000,501177769,null,16.496476424650702,-17.132639855863435,null,30.937802890636977,-77.892311220043197,null,0,0]
[22517.5,22.517499999999998,4.1926371925364476,1.3299615810037437,1.0000723089795915,1.2025358431515974E-2,1,0,42561.237014663813,1.5707728312371958,3.7018317050048126,1.2972614882254081,1.0002912974400695,2.4134073249660905E-2,1.0004679351505512,4.307070478022914E-2,8.6119583470817247,-95.033779077151507,84.966220922848493,null,1000000000,507037806.25,null,16.492743166469729,-17.053826162682402,null,30.890165598868133,-77.979952914469109,null,0,0]
[22648,22.648,4.2155570442670705,1.331296690824088,1.0000731495098276,1.2095044527709752E-2,1,0,42807.900339959968,1.5707729666209065,3.7217242513531454,1.2987608012950134,1.0002946831495039,2.4273887309789598E-2,1.0004733746528194,4.3320240858972327E-2,8.5608920009541798,-95.042694081419484,84.957305918580516,null,1000000000,512931904,null,16.489070502379167,-16.975940364013422,null,30.842771916831147,-78.066753717406073,null,0,0]
[22778.5,22.778500000000001,4.2384843290291068,1.3326173589258374,1.0000739948965629,1.2164730506427251E-2,1,0,43054.563665256908,1.5707731004533672,3.7416250749433928,1.3002441686826132,1.0002980884125374,2.4413700420727793E-2,1.0004788455875799,4.3569775553742203E-2,8.5101262439054626,-95.051695040613922,84.948304959386078,null,1000000000,518860062.25,null,16.485457126132648,-16.898968042361165,null,30.795619536028948,-78.15272699825276,null,0,0]
[22909,22.908999999999999,4.2614189268489815,1.3339238138368401,1.0000748451397847,1.2234416366991959E-2,1,0,43301.226990554605,1.5707732327610877,3.7615340444004892,1.3017118369988649,1.0003015132289708,2.4553512577019165E-2,1.0004843479548151,4.3819308856580162E-2,8.4596575251247508,-95.060780919455183,84.939219080544817,null,1000000000,524822281,null,16.4819017659871,-16.822895069182039,null,30.748706177393785,-78.23788585027313,null,0,0]
[23042.25,23.042249999999999,4.2848442446144368,1.3352433663441015,1.0000757183110713,1.2305570580928901E-2,1,0,43553.088202018356,1.5707733663105459,3.7818708230129237,1.3031944855067963,1.0003050303914649,2.4696269975785362E-2,1.0004899987053084,4.407409907952916E-2,8.4084281582863198,-95.070144823518916,84.929855176481084,null,1000000000,530945285.0625,null,16.478330060755098,-16.746132615352369,null,30.701048515787356,-78.324012208166536,null,0,0]
[23175.5,23.1755,4.3082769420902887,1.336548567024024,1.0000765965456544,1.2376724670255477E-2,1,0,43804.949413482871,1.5707734983242905,3.8022158261673464,1.3046612704158989,1.0003085679397066,2.4839026367750063E-2,1.0004956822269373,4.4328887834495255E-2,8.357501195784117,-95.079595123063783,84.920404876936217,null,1000000000,537103800.25,null,16.47481626814961,-16.670278933109131,null,30.653635345890642,-78.409316189954623,null,0,0]
[23308.75,23.30875,4.3317168995135038,1.3378396443767204,1.000077479843521,1.2447878634251527E-2,1,0,44056.810624948135,1.5707736288286593,3.8225689225423869,1.3061124387588756,1.0003121258734797,2.4981781747105414E-2,1.0005013985196831,4.4583675113006933E-2,8.3068730543797997,-95.089130756982669,84.910869243017331,null,1000000000,543297826.5625,null,16.471359138845109,-16.595319869697313,null,30.606464333790825,-78.493810887285349,null,0,0]
[23442,23.442,4.3551639996626488,1.3391168221721867,1.0000783682046572,1.2519032472196894E-2,1,0,44308.671836414156,1.5707737578493914,3.8429299835470241,1.307548232599228,1.0003157041925668,2.5124536108043785E-2,1.0005071475835265,4.4838460906592985E-2,8.2565402140591964,-95.098750677832825,84.901249322167175,null,1000000000,549527364,null,16.467957456547204,-16.521241557041872,null,30.559533175768124,-78.577509120790978,null,0,0]
[23578.5,23.578499999999998,4.3791902665430156,1.3404109674946381,1.000079283483142,1.2591921638151779E-2,1,0,44566.676004258145,1.5707738885049063,3.863795782563642,1.3090033521776872,1.0003193909246821,2.5270771220614018E-2,1.0005130708482071,4.5099459439278879E-2,8.2052823215248605,-95.108691545941738,84.891308454058262,null,1000000000,555945662.25,null,16.464529060677467,-16.446255487200084,null,30.511703679103526,-78.662436058741633,null,0,0]
[23715,23.715,4.4032237876974794,1.3416909876244947,1.0000802040748684,1.2664810670302347E-2,1,0,44824.680172102882,1.570774017656354,3.8846696747804796,1.3104428368916208,1.0003230990481777,2.5417005252145984E-2,1.0005190285020293,4.5360456395725605E-2,8.1543270300111033,-95.118718681119731,84.881281318880269,null,1000000000,562401225,null,16.461156367540191,-16.372165080994279,null,30.464121080727047,-78.746553600125452,null,0,0]
[23851.5,23.851500000000001,4.4272644449859895,1.3429571084379763,1.0000811299798222,1.2737699567874475E-2,1,0,45082.68433994837,1.5707741453295574,3.9055515304310369,1.3118669315124629,1.0003268285628157,2.5563238196397487E-2,1.0005250205449727,4.5621451766827872E-2,8.1036707524694993,-95.128831001395369,84.871168998604631,null,1000000000,568894052.25,null,16.457838170843509,-16.298956315176174,null,30.416782999882123,-78.829874686219199,null,0,0]
[23988,23.988,4.4513121227859989,1.3442095511106602,1.0000820611979888,1.2810588330094054E-2,1,0,45340.68850779457,1.5707742715497517,3.9264412224603582,1.3132758758553409,1.0003305794683568,2.570947004712661E-2,1.0005310469770157,4.588244554348074E-2,8.0533099651923639,-95.139027439412033,84.860972560587967,null,1000000000,575424144,null,16.454573296317886,-16.226615450439354,null,30.369687087130611,-78.912411988972679,null,0,0]
[24127.75,24.127749999999999,4.4759395194168183,1.3454778694681524,1.0000830200924771,1.2885212397999876E-2,1,0,45604.835632018803,1.5707743992956256,3.9478362766820387,1.3147029161800572,1.0003344418418485,2.5859182469183038E-2,1.000537252522544,4.6149651796319795E-2,8.0020526242467245,-95.149552696216105,84.850447303783895,null,1000000000,582148320.0625,null,16.451284734715284,-16.153437271778451,null,30.321718307787577,-78.996115424437662,null,0,0]
[24267.5,24.267499999999998,4.5005740373789118,1.3467323051913318,1.0000839845561684,1.2959836322388943E-2,1,0,45868.982756243779,1.5707745255701913,3.9692392837722887,1.3161145695261269,1.0003383266364723,2.6008893731784426E-2,1.000543494114198,4.6416856358565906E-2,7.9510977341924205,-95.16016390622903,84.83983609377097,null,1000000000,588911556.25,null,16.448049672198831,-16.081140551322832,null,30.273998480249723,-79.07902335490617,null,0,0]
[24407.25,24.407250000000001,4.5252155603702677,1.347973081088335,1.0000849545890467,1.3034460102430546E-2,1,0,46133.129880469482,1.5707746503987217,3.9906501157705296,1.3175110778865535,1.0003422338519667,2.6158603828233231E-2,1.0005497717519554,4.6684059220449325E-2,7.900441710409229,-95.170859970790886,84.829140029209114,null,1000000000,595713852.5625,null,16.444866946485842,-16.009711424959011,null,30.226525182179525,-79.161148545831892,null,0,0]
[24547,24.547000000000001,{"$f":"SQRT(1+(A333/pole1)^2)","v":4.5498639745756648},{"$f":"ATAN(A333/pole1)","v":1.3492004153094428},{"$f":"SQRT(1+(A333/Zero1)^2)","v":1.000085930191096},{"$f":"ATAN(A333/Zero1)","v":1.3109083737293989E-2},{"$f":"IF(VIN_nom>Vout, 1, SQRT(1+(A333/z_RHP)^2))","v":1},{"$f":"IF(VIN_nom>Vout, 0, -ATAN(A333/z_RHP))","v":0},{"$f":"SQRT(1+(A333/Pole2)^2)","v":46397.277004695883},{"$f":"ATAN(A333/Pole2)","v":1.5707747738059146},4.0120686474013967,1.3188926783259303,{"$f":"SQRT(1+(A333/pole4)^2)","v":1.0003461634880695},{"$f":"ATAN(A333/pole4)","v":2.6308312751832215E-2},{"$f":"SQRT((1-(V333/pterm2))^2+(A333/pterm1)^2)","v":1.0005560854357929},{"$f":"IF((ATAN((A333/pterm1)/(1-A333^2/pterm2))>0),ATAN((A333/pterm1)/(1-A333^2/pterm2)),PI()+ATAN((A333/pterm1)/(1-A333^2/pterm2)))","v":4.6951260372200647E-2},{"$f":"20*LOG10(((E333*K333*G333)/(C333*I333*O333*M333))*Adc)","v":7.8500810315840397},{"$f":"((F333+L333+H333)-(D333+J333+P333+N333))*radconv","v":-95.181639806710706},{"$f":"IF(R333>0,R333,R333+180)","v":84.818360193289294},null,1000000000,602555209,null,{"$f":"20*LOG10((K333/(I333*M333))*AEA)","v":16.441735426250911},{"$f":"(L333-(J333+N333))*radconv","v":-15.939136310917638},null,{"$f":"20*LOG10((E333*G333/(C333*O333))*Acs*Am)","v":30.179296023589263},{"$f":"(F333+H333-(D333+P333))*radconv","v":-79.242503495793088},null,0,0]
[24690,{"$f":"A334/1000","v":24.69},4.5750926249956807,1.3504426007881072,1.0000869342464982,1.3185442654378026E-2,1,0,46667.567085300368,1.5707748986369159,4.0339931267858855,1.3202912192696978,1.0003502077195678,2.6461502057239173E-2,1.0005625832627119,4.7224673723784139E-2,7.7988512932462415,-95.192755938856266,84.807244061143734,null,{"$f":"IF(Q334<0,A334,1000000000)","v":1000000000},{"$f":"A334^2","v":609596100},null,16.438582936807183,-15.867790070237875,null,30.131218774695192,-79.324965868618378,null,{"$f":"SUM((Q335<0)*(Q334>0))*A334","v":0},0]
[24833,24.832999999999998,4.6003282574608271,1.3516711598410918,1.0000879441330797,1.326180141769316E-2,1,0,46937.857165905574,1.570775022030247,4.0559254110150986,1.3216746377660085,1.0003542754260575,2.6614690120424063E-2,1.0005691188317185,4.7498085264074841E-2,7.7479235335057561,-95.203957538220152,84.796042461779848,null,1000000000,616677889,null,16.435481760629386,-15.797310128427776,null,30.083392191132511,-79.406647409792356,null,0,0]
[24976,24.975999999999999,4.6255707576956988,1.3528863118139887,1.0000889598508229,1.3338160026349407E-2,1,0,47208.147246511493,1.5707751440106019,4.0778653741569215,1.3230431725643506,1.0003583666072524,2.6767876934212485E-2,1.0005756921427877,4.7771494982607063E-2,7.6972941759579685,-95.215243493496132,84.784756506503868,null,1000000000,623800576,null,16.432430780032693,-15.727682807153085,null,30.035813814181409,-79.487560686343059,null,0,0]
[25119,25.119,4.6508200138750624,1.3540882714494165,1.0000899813997099,1.3414518479456806E-2,1,0,47478.437327118096,1.5707752646021125,4.0998128929312943,1.3243970575275226,1.0003624812628644,2.6921062491430382E-2,1.0005823031958943,4.8044902868915579E-2,7.6469597073322859,-95.226612709601653,84.773387290398347,null,1000000000,630964161,null,16.429428907181837,-15.658894708034047,null,29.988481218406584,-79.567718001567627,null,0,0]
[25265.25,25.265250000000002,4.676649990748917,1.3553041219672495,1.0000910321970378,1.3492612190133689E-2,1,0,47754.870364102826,1.5707753865223664,4.1222669083399079,1.3257667982928938,1.0003667137138186,2.7077728231376049E-2,1.0005891035386261,4.8324522664756654E-2,7.5957826947654414,-95.238325313273748,84.761674686726252,null,1000000000,638332857.5625,null,16.426408501072274,-15.58939761428101,null,29.940324611949304,-79.648927698992736,null,0,0]
[25411.5,25.4115,4.7024868051244368,1.3565066137819226,1.0000920890935352,1.3570705736228095E-2,1,0,48031.303401088277,1.5707755070392526,4.1447285740957138,1.3271216954138025,1.0003709707177195,2.723439264180819E-2,1.0005959433583831,4.8604140522004631E-2,7.5449068902492069,-95.250122739589528,84.749877260410472,null,1000000000,645744332.25,null,16.423437250249624,-15.520750842126676,null,29.892420058255716,-79.72937189746284,null,0,0]
[25557.75,25.557749999999999,4.7283303449160181,1.3576959624302356,1.0000931520891836,1.3648799116788025E-2,1,0,48307.736438074397,1.5707756261768631,4.1671977664900117,1.3284619839822953,1.0003752522742535,2.7391055715053569E-2,1.0006028226551378,4.8883756429465804E-2,7.4943287309354298,-95.262003868469776,84.737996131530224,null,1000000000,653198585.0625,null,16.420514081869232,-15.452940922729699,null,29.844765067322335,-79.809062945740081,null,0,0]
[25704,25.704000000000001,4.7541805004463598,1.3588723789117596,1.000094221183963,1.3726892330861494E-2,1,0,48584.169475061208,1.5707757439587409,4.1896743644268835,1.3297878942580532,1.0003795583831057,2.7547717443439333E-2,1.0006097414288626,4.9163370375946945E-2,7.4440447168083557,-95.27396759671403,84.72603240328597,null,1000000000,660695616,null,16.417637951797865,-15.385954664091427,null,29.797357183266627,-79.888012932622587,null,0,0]
[25853.75,25.853750000000002,4.7806560352096277,1.3600637645828035,1.0000953221837172,1.3806854268860915E-2,1,0,48867.218003532143,1.5707758631785722,4.2126964135514324,1.3311308727105822,1.0003839929845182,2.770812693985809E-2,1.000616866685446,4.944967389461534E-2,7.3928585219228369,-95.28630208978656,84.71369791021344,null,1000000000,668416389.0625,null,16.414740670260464,-15.318205284638875,null,29.74906826991851,-79.968096805147667,null,0,0]
[26003.5,26.003499999999999,4.8071382808849217,1.3612420253619766,1.0000964295779782,1.3886816030289895E-2,1,0,49150.266532003778,1.5707759810252675,{"$f":"SQRT(1+(A343/Zero2)^2)","v":4.2357259780566832},{"$f":"ATAN(A343/Zero2)","v":1.3324592500388395},1.0003884533267893,2.7868535009997433E-2,1.0006240333310457,4.9735975333571693E-2,7.3419734881045597,-95.298720895308634,84.701279104691366,null,1000000000,676182012.25,null,16.411890578119646,-15.251292327589503,null,29.701033328241046,-80.047428567719152,null,0,0]
[26153.25,26.15325,4.8336271271699696,1.3624073737284097,1.000097543366725,1.3966777614126494E-2,1,0,49433.315060476074,1.5707760975224141,4.258762936022765,1.3337732584622353,1.0003929394095745,2.8028941645621669E-2,1.0006312413656311,5.0022274680801379E-2,7.2913860533124009,-95.311222882495386,84.688777117504614,null,1000000000,683992485.5625,null,16.409086642210372,-15.185202488630752,null,29.65324982935816,-80.126020393864621,null,0,0]
[26303,26.303000000000001,4.86012246614,1.3635600176698701,1.000098663549936,1.4046739019348779E-2,1,0,49716.363588949047,1.5707762126930622,4.281807168114895,1.3350731254019521,1.0003974512325278,2.8189346838495524E-2,1.0006384907891719,5.0308571924290314E-2,7.2410927183319815,-95.32380693811308,84.67619306188692,null,1000000000,691847809,null,16.406327857103658,-15.119922738337513,null,29.605715279484457,-80.203884199775572,null,0,0]
[26456,26.456,4.8871994248902437,1.3647247680421133,1.0000998146484168,1.4128435628465831E-2,1,0,50005.55507380022,1.5707763290166779,4.3053589165812269,1.3363868296493717,1.0004020875586637,2.8353231780670674E-2,1.000645940291836,5.0601080445273568E-2,7.1900080425957338,-95.336747722923775,84.663252277076225,null,1000000000,699919936,null,16.403554811992755,-15.054049609721307,null,29.557403648859108,-80.282698113202471,null,0,{"$f":"IF(AD346>0,S346,0)","v":0}]
[26609,26.609000000000002,4.9142829407596,1.3658766816563204,1.0001009724218843,1.421013204897492E-2,1,0,50294.74655865207,1.5707764440025875,4.3289180144600099,1.3376862370785656,1.0004067507536238,2.8517115199413995E-2,1.0006534329994012,5.0893586744858006E-2,7.1392231803525652,-95.349771882619791,84.650228117380209,null,1000000000,708038881,null,16.400826861689943,-14.988995464519707,null,29.509346736918758,-80.360776418100102,null,0,0]
[26762,26.762,4.9413729059299536,1.36701596655404,1.0001021368703154,1.4291828279786166E-2,1,0,50583.938043504582,1.570776557673734,4.3524843424086939,1.3389715754939471,1.0004114408170324,2.8680997085943755E-2,1.0006609689118344,5.1186090810232024E-2,7.0887345933974464,-95.362878285012201,84.637121714987799,null,1000000000,716204644,null,16.398143017973236,-14.924747251312654,null,29.461541993680346,-80.438131033699548,null,0,0]
[26915,26.914999999999999,4.9684692149092529,1.3681428263712359,1.0001033079936867,1.4373524319809709E-2,1,0,50873.129528357735,1.570776670052539,4.376057783619272,1.3402430679794946,1.0004161577485113,2.8844877431478733E-2,1.0006685480291029,5.1478592628584591E-2,7.0385388058041638,-95.376065815921777,84.623934184078223,null,1000000000,724417225,null,16.395502319173612,-14.861292189111198,null,29.413986904886684,-80.514773626810552,null,0,0]
[27071.75,27.071750000000002,4.9962361201370324,1.3692846280799653,1.0001045147433851,1.4457222514756658E-2,1,0,51169.409039801089,1.5707767838683937,4.4002162626364028,1.3415315937693226,1.0004210181545963,2.9012772844856916E-2,1.0006763577152398,5.1778261265450459E-2,6.9874128110581388,-95.389659559913227,84.610340440086773,null,1000000000,732879648.0625,null,16.392840663029297,-14.797091319241218,null,29.36552256628498,-80.592568240672009,null,0,0]
[27228.5,27.2285,5.0240094670087778,1.3704138072046272,1.0001057284991866,1.4540920507133084E-2,1,0,51465.68855124509,1.57077689637381,4.4243819675374692,1.3428060459570961,1.0004259067611445,2.9180666622117414E-2,1.0006842127499791,5.2077927516575917E-2,6.9365869524253378,-95.403336147199795,84.596663852800205,null,1000000000,741391212.25,null,16.390222330979856,-14.733696638547221,null,29.317315039701619,-80.66963950865258,null,0,0]
[27385.25,27.385249999999999,5.0517891492813298,1.3715305690756805,1.0001069492610657,1.4624618295767057E-2,1,0,51761.968062689739,1.5707770075912904,4.4485547805638372,1.3440666497905664,1.0004308235677428,2.934855875381899E-2,1.0006921131332844,5.237759136818667E-2,6.8860576860702905,-95.417094436630947,84.582905563369053,null,1000000000,749951917.5625,null,16.387646370176064,-14.671095242032001,null,29.269361734150365,-80.745999194598966,null,0,0]
[27542,27.542000000000002,5.0795750630116929,1.3726351146562834,1.0001081770289966,1.4708315879486667E-2,1,0,52058.247574135028,1.5707771175428249,4.4727345864683059,1.3453136258248972,1.0004357685739753,2.9516449230520971E-2,1.0007000588651198,5.2677252806509145E-2,6.8358215305759096,-95.430933305664482,84.569066694335518,null,1000000000,758561764,null,16.385111853460742,-14.609274493534588,null,29.221660095371305,-80.821658812129897,null,0,0]
[27702.5,27.702500000000001,5.1080320621686655,1.373753632026639,1.0001094414288092,1.4794015584194667E-2,1,0,52361.615112170548,1.5707772288354864,4.4974999846499299,1.3465765386377067,1.000440861101008,2.9688354501081617E-2,1.0007082416750412,5.2984080663797756E-2,6.7846836941848307,-95.445185589200619,84.554814410799381,null,1000000000,767428506.25,null,16.382558703324552,-14.546770742475168,null,29.173075409116414,-80.898414846725458,null,0,0]
[27863,27.863,5.1364953810739564,1.3748597544884302,1.0001107131738465,1.487971507157986E-2,1,0,52664.98265020673,1.5707773388459838,4.5222724775406666,1.3478256172398662,1.0004459831921895,2.9860258016478316E-2,1.0007164720291548,5.329090596172429E-2,6.7338459678468432,-95.459520030456744,84.540479969543256,null,1000000000,776346769,null,16.380047115643769,-14.485059459273717,null,29.124749270459212,-80.97446057118303,null,0,0]
[28023.5,28.023499999999999,5.1649649152461139,1.3759536842763318,1.0001119922640804,1.4965414340384259E-2,1,0,52968.35018824353,1.5707774475963467,4.5470519491838752,1.3490610838730066,1.0004511348470653,3.0032159766578321E-2,1.0007247499274208,5.3597728685505053E-2,6.6833048082836424,-95.473935483025414,84.526064516974586,null,1000000000,785316552.25,null,16.377576173580938,-14.424127911104359,null,29.076679052958841,-81.049807571921008,null,0,0]
[28184,28.184000000000001,5.1934405624721158,1.3770356193077897,1.0001132786994824,1.5051113389349891E-2,1,0,53271.717726280942,1.570777555108104,4.5718382861045441,1.3502831561274651,1.0004563160651789,3.0204059741249512E-2,1.0007330753697985,5.3904548820357119E-2,6.6330567346276572,-95.488430819610997,84.511569180389003,null,1000000000,794337856,null,16.375144985089293,-14.363963631612117,null,29.0288621677945,-81.124467187998874,null,0,0]
[28348,28.347999999999999,5.2225433843960651,1.3781289595046067,1.0001146007751409,1.5138681036537604E-2,1,0,53581.700755802674,1.5707776637068283,4.5971721109820782,1.3515182638875105,1.0004616408061686,3.0379706469032104E-2,1.0007416314744353,5.4218057047357035E-2,6.5820120931714632,-95.503323616662911,84.496676383337089,null,1000000000,803609104,null,16.372700940364567,-14.30326720808408,null,28.980261571063032,-81.200056408578831,null,0,0]
[28512,28.512,5.2516523801134296,1.3792101805929049,1.0001159305197507,1.5226248451538573E-2,1,0,53891.683785325033,1.5707777710562405,4.622512871929584,1.3527398316948875,1.0004669964128445,3.0555351321722223E-2,1.0007502372192829,5.4531562540080805E-2,6.531266304730674,-95.518297499713682,84.481702500286318,null,1000000000,812934144,null,16.370296594645541,-14.243346387684456,null,28.931920128341268,-81.274951112029257,null,0,0]
[28676,28.675999999999998,5.2807674475294331,1.3802794804766321,1.000117267933281,1.5313815633010786E-2,1,0,54201.666814847995,1.5707778771777756,4.6478604554979022,1.3539480773983075,1.0004723828847109,3.0730994288512385E-2,1.0007588926042976,5.4845065282759668E-2,6.4808158483200931,-95.533351325794911,84.466648674205089,null,1000000000,822312976,null,16.367931071400665,-14.184188689210385,null,28.883835195175564,-81.349162636584509,null,0,0]
[28840,28.84,5.309888486767453,1.3813370528286844,1.0001186130157014,1.5401382579612245E-2,1,0,54511.649844371568,1.5707779820923806,4.6732147506690556,1.3551432142762747,1.0004778002212695,3.0906635358595808E-2,1.0007675976294359,5.5158565259625716E-2,6.4306572648469764,-95.54848397134235,84.45151602865765,null,1000000000,831745600,null,16.365603517815529,-14.125781893284703,null,28.83600416528758,-81.42270207805764,null,0,0]
[29008,29.007999999999999,5.3397258852025304,1.3824084576686464,1.000119998856718,1.5491085060462883E-2,1,0,54829.193435591456,1.5707780883358313,4.699194288869732,1.356354126778492,1.0004833816905325,3.1086558379259516E-2,1.0007765664432051,5.5479708693085689E-2,6.3795743870544284,-95.56406627791678,84.43593372208322,null,1000000000,841464064,null,16.363257697400254,-14.066716634503132,null,28.78726710791031,-81.497349643413642,null,0,0]
[29176,29.175999999999998,5.3695693450288848,1.3834679542194428,1.0001213927452128,1.5580787291995154E-2,1,0,55146.737026811941,1.5707781933557492,4.7251806417667783,1.3575517220803226,1.0004889955473752,3.126647938661082E-2,1.0007855873480038,5.5800849190676106E-2,6.3287906381339152,-95.579728969772376,84.420271030227624,null,1000000000,851238976,null,16.360949982776354,-14.008414209641959,null,28.738791073613697,-81.57131476013042,null,0,0]
[29344,29.344000000000001,5.3994187657396511,1.3845157375790507,1.0001227946811522,1.5670489272766524E-2,1,0,55464.280618033037,1.5707782971731488,4.7511736975420753,1.3587362152880487,1.0004946417912521,3.1446398369035039E-2,1.0007946603437841,5.6121986735449776E-2,6.2783024923742436,-95.595470900167925,84.404529099832075,null,1000000000,861070336,null,16.358679529724334,-13.950862294557604,null,28.690573380906041,-81.644608605610301,null,0,0]
[29512,29.512,5.4292740490184004,1.3855519986582798,1.0001242046645025,1.5760191001334488E-2,1,0,55781.82420925473,1.5707783998085667,4.7771733467826243,1.3599078169739887,1.0005003204216152,3.1626315314918316E-2,1.0008037854304974,5.6443121310460462E-2,6.2281064860683957,-95.61129094220486,84.38870905779514,null,1000000000,870958144,null,16.356445516938354,-13.89404882485619,null,28.642611387386179,-81.717242117348661,null,0,0]
[29684,29.684000000000001,5.4598461455572158,1.3866011906349449,1.0001256565559486,1.585202822255612E-2,1,0,56106.928362172774,1.5707785036841109,4.8037987543139691,1.3610941735952786,1.0005061678092133,3.1810513875629921E-2,1.0008131817472186,5.6771898852418651E-2,6.1770144393010931,-95.627567419114158,84.372432580885842,null,1000000000,881139856,null,16.354195231072538,-13.836635349144705,null,28.593769626484693,-81.790932069969458,null,0,0]
[29856,29.856000000000002,5.4904241853787026,1.3876386971291366,1.0001271168825054,1.5943865176361736E-2,1,0,56432.032515091414,1.5707786063628038,4.8304308483738607,1.3622674501372167,1.0005120491426973,3.1994710277033642E-2,1.0008226326648209,5.7100673245567647E-2,6.1262214542750018,-95.643923443153369,84.356076556846631,null,1000000000,891380736,null,16.351981469558993,-13.779971114482882,null,28.545190402972143,-81.863952328670493,null,0,0]
[30028,30.027999999999999,5.521008069732452,1.3886647100853513,1.0001285856441355,1.60357018612034E-2,1,0,56757.136668010651,1.570778707865212,4.8570695189723656,1.3634278585564092,1.0005179644214692,3.2178904506668694E-2,1.0008321381832515,5.7429444471724919E-2,6.0757240066069222,-95.66035786722442,84.33964213277558,null,1000000000,901680784,null,16.349803420938652,-13.724043977116148,null,28.496871003924404,-81.936313890108281,null,0,0]
[30200,30.2,5.5515977020254628,1.3896794173155953,1.0001300628408021,1.6127538275533204E-2,1,0,57082.240820930456,1.570778808211434,4.8837146584924822,1.3645756063241323,1.0005239136449264,3.2363096552075234E-2,1.0008416983024579,5.7758212512709003E-2,6.0255186338862501,-95.676869564418723,84.323130435581277,null,1000000000,912040000,null,16.3476602958306,-13.668842050253659,null,28.448808756311784,-82.008027514165065,null,0,0]
[30375.75,30.37575,5.5828600984200536,1.3907047605739165,1.0001315809566487,1.6221376656235128E-2,1,0,57414.433000440673,1.5707789095715994,4.9109472964813206,1.3657355112472427,1.0005300276375229,3.2551302143282751E-2,1.0008515232538291,5.8094145152551215E-2,5.9745168243728397,-95.693819921821159,84.306180078178841,null,1000000000,922686188.0625,null,16.345505720583084,-13.613173587026029,null,28.399961522045892,-82.080646334795134,null,0,0]
[30551.5,30.551500000000001,5.6141282988646566,1.3917186834754895,1.0001331078792688,1.6315214751233605E-2,1,0,57746.625179951472,1.5707790097655996,4.938186468680219,1.3668826215646661,1.0005361770698045,3.2739505427681982E-2,1.0008614052126652,5.8430074428441697E-2,5.9238128473291294,-95.710848642530507,84.289151357469493,null,1000000000,933394152.25,null,16.343386009430887,-13.5582380017189,null,28.351377256154375,-82.152610640811602,null,0,0]
[30727.25,30.727250000000002,5.6454022069185612,1.3927213737145943,1.0001346436086223,1.6409052558877341E-2,1,0,58078.817359462846,1.5707791088134446,4.9654320675538379,1.3680171448465299,1.0005423619411178,3.2927706391983065E-2,1.0008713441789088,5.8766000320987236E-2,5.8734032001618042,-95.727954587113075,84.272045412886925,null,1000000000,944163892.5625,null,16.341300387127667,-13.504023401825055,null,28.303053231290271,-82.223931185288052,null,0,0]
[30903,30.902999999999999,5.6766817282488882,1.3937130149400774,1.0001361881446682,1.6502890077515084E-2,1,0,58411.00953897478,1.5707792067346897,4.9926839878890714,1.3691392842622025,1.0005485822508051,3.3115905022897144E-2,1.0008813401525025,5.9101922810795862E-2,5.8232844417391139,-95.745136636468018,84.254863363531982,null,1000000000,954995409,null,16.339248099528959,-13.450518146956183,null,28.254986760466284,-82.294618489511819,null,0,0]
[31083,31.082999999999998,5.7087233754808349,1.3947173708424998,1.0001377791594748,1.6598996480937486E-2,1,0,58751.234815289143,1.570779305876048,5.0206013613008862,1.3702759304412861,1.0005549897140049,3.3308652254966986E-2,1.000891636941289,5.9445965056634957E-2,5.7722517002773053,-95.762811922617217,84.237188077382783,null,1000000000,966152889,null,16.337179970401138,-13.39644240132507,null,28.206022148132298,-82.366369521292171,null,0,0]
[31263,31.263000000000002,5.740770716992464,1.3957105142825925,1.0001393794119653,1.6695102577701404E-2,1,0,59091.460091604073,1.5707794038757728,5.048525149409234,1.3714000043011512,1.000561434348842,3.3501397011220485E-2,1.0009019935277508,5.979000369200644E-2,5.7215169712789749,-95.780564726268096,84.219435273731904,null,1000000000,977375169,null,16.335145271354378,-13.343086789260084,null,28.15732211818073,-82.437477937008012,null,0,0]
[31443,31.443000000000001,5.7728236579498402,1.3966926300524503,1.0001409889020951,1.6791208366032977E-2,1,0,59431.68536791957,1.5707795007534702,5.0764552463591732,1.3725117104920177,1.0005679161545979,3.3694139277384474E-2,1.0009124099118245,6.0134038696081207E-2,5.6710767491261285,-95.798393908847601,84.201606091152399,null,1000000000,988662249,null,16.333143256657884,-13.290439585472875,null,28.10888391072438,-82.507954323374705,null,0,0]
[31623,31.623000000000001,5.8048821055972279,1.3976638989481525,1.0001426076298201,1.6887313844158359E-2,1,0,59771.910644235621,1.5707795965283002,5.104391548588965,1.3736112493077119,1.0005744351305508,3.3886879039186898E-2,1.0009228860934467,6.0478070048031539E-2,5.6209275897293072,-95.816298352405468,84.183701647594532,null,1000000000,1000014129,null,16.331173200933154,-13.238489314252604,null,28.060704807052289,-82.577809038152864,null,0,0]
[31807,31.806999999999999,5.8376585603345541,1.3986457246615129,1.0001442718770215,1.698555467710549E-2,1,0,60119.696482248139,1.5707796933110543,5.1329549656941484,1.3747228504721472,1.0005811373902602,3.4083899303489089E-2,1.0009336568846037,6.0829742744687471E-2,5.5699613180872642,-95.834677317846513,84.165322682153487,null,1000000000,1011685249,null,16.329191663680419,-13.186093233835173,null,28.011720072662985,-82.648584084011361,null,0,0]
[31991,31.991,5.8704405796260142,1.3996165857777543,1.0001459457768442,1.7083795182158124E-2,1,0,60467.482320261217,1.5707797889804933,5.1615246551688259,1.3758221472773533,1.000587878488991,3.4280916920733359E-2,1.0009444901603726,6.1181411581092165E-2,5.5192921019667205,-95.853132628159514,84.146867371840486,null,1000000000,1023424081,null,16.327242051051496,-13.134401925818491,null,27.963000469171355,-82.71873070234102,null,0,0]
[32175,32.174999999999997,5.9032280707677609,1.4005766631487302,1.00014762932924,1.718203535742165E-2,1,0,60815.268158274841,1.5707798835557178,5.1901005134313927,1.3769093402817205,1.0005946584259582,3.4477931875678519E-2,1.0009553859206848,6.153307653500277E-2,5.468916452702695,-95.871663153298272,84.128336846701728,null,1000000000,1035230625,null,16.325323649970024,-13.083403899274352,null,27.914543220988804,-82.788259254023913,null,0,0]
[32359,32.359000000000002,5.9360209430888311,1.4015261337104359,1.0001493225341598,1.7280275201001467E-2,1,0,61163.053996288996,1.5707799770553936,5.2186824391468427,1.3779846257658097,1.0006014772003722,3.4674944153084614E-2,1.0009663441654706,6.1884737584177937E-2,5.4188309427586443,-95.890267783931336,84.109732216068664,null,1000000000,1047104881,null,16.323435766834098,-13.033087908351309,null,27.866345594180682,-82.857179875580044,null,0,0]
[32547.5,32.547499999999999,5.9696213024900198,1.4024880068966947,1.0001510671584433,1.738091730352017E-2,1,0,61519.345466211664,1.5707800717454896,5.2479695675607276,1.379074061904328,1.0006085030112659,3.4876771873040106E-2,1.0009776352061255,6.2244994967049182E-2,5.367817864758333,-95.909403126912906,84.090596873087094,null,1000000000,1059339756.25,null,16.321532653959302,-12.982237117392128,null,27.817235629055169,-82.927166009520761,null,0,0]
[32736,32.735999999999997,6.0032271231559751,1.4034391119009688,1.0001528219130542,1.7481559053907834E-2,1,0,61875.63693613487,1.570780165345099,5.2772628554995435,1.38015140471925,1.0006155695808017,3.5078596750512295E-2,1.000988991824785,6.2605248204606001E-2,5.3171021993348297,-95.928613952240113,84.071386047759887,null,1000000000,1071645696,null,16.319660156275123,-12.932078997493525,null,27.768392461315841,-82.996534954746608,null,0,0]
[32924.5,32.924500000000002,6.0368383138815283,1.4043796268493989,1.0001545867979393,1.758220045012757E-2,1,0,62231.928406058614,1.5707802578729517,5.3065622009578517,1.3812168520028982,1.0006226769081161,3.5280418769119595E-2,1.0010004140213731,6.2965497272939999E-2,5.266680451665068,-95.947899132005261,84.052100867994739,null,1000000000,1084022700.25,null,16.317817587562473,-12.882602216124726,null,27.719813282358729,-83.065296915880552,null,0,0]
[33113,33.113,6.0704547854670574,1.4053097259983676,1.0001563618130451,1.7682841490142525E-2,1,0,62588.21987598289,1.5707803493473509,5.335867504149804,1.3822705973117686,1.0006298249923409,3.5482237912481833E-2,1.0010119017958137,6.3325742148144556E-2,5.2165491881918582,-95.967257559250399,84.032742440749601,null,1000000000,1096470769,null,16.316004280395163,-12.833795683425576,null,27.671495326052835,-83.133461875824835,null,0,0]
[33305.75,33.305750000000003,6.1048345580202339,1.4062502024499197,1.0001581873237249,1.7785751254760056E-2,1,0,62952.544442709703,1.5707804418134572,5.3658395960270662,1.3833361974335887,1.000637176385011,3.5688604364552595E-2,1.0010237163906908,6.3694104894372869E-2,5.1655845117930479,-95.987127061209407,84.012872938790593,null,1000000000,1109272983.0625,null,16.314179671934035,-12.784570518394798,null,27.622355258115149,-83.202556542814619,null,0,0]
[33498.5,33.4985,6.1392196697952137,1.4071801447006074,1.0001600234264607,1.7888660642622102E-2,1,0,63316.869009437039,1.5707805332154654,5.3958177131419314,1.384389958205531,1.0006445703913023,3.5894967775627777E-2,1.0010355995536853,6.4062463205708367E-2,5.1149164947751764,-96.007070874979945,83.992929125020055,null,1000000000,1122149502.25,null,16.312384305459709,-12.736023462940421,null,27.573482607571602,-83.271047412039493,null,0,0]
[33691.25,33.691249999999997,6.1736100315785212,1.4080997271720936,1.0001618701211945,1.7991569651551052E-2,1,0,63681.193576164907,1.5707806235716391,5.4258017556242129,1.3854320735474648,1.0006520070102696,3.6101328128198669E-2,1.0010475512847143,6.4430817056596257E-2,5.064541655637731,-96.027087882100872,83.972912117899128,null,1000000000,1135100326.5625,null,16.310617524436619,-12.688143406315628,null,27.524874549457245,-83.338944475785226,null,0,0]
[33884,33.884,6.2080055561200629,1.4090091204914743,1.0001637274078674,1.8094478279369341E-2,1,0,64045.518142893299,1.5707807128998257,5.455791625779673,1.3864627332178816,1.000659486240963,3.6307685404758108E-2,1.0010595715836945,6.47991664214837E-2,5.0144565738288005,-96.047176985104144,83.952823014895856,null,1000000000,1148125456,null,16.308878690324505,-12.640919476179191,null,27.476528301760432,-83.406257508924952,null,0,0]
[34081.5,34.081499999999998,6.2432539665234108,1.4099305299486438,1.0001656414508753,1.819992251987974E-2,1,0,64418.820876636259,1.5707808033812973,5.4865264908358418,1.3875071033406425,1.0006671939835419,3.6519124800835759E-2,1.0010719592260506,6.517658845786721E-2,4.9634342709481967,-96.067834806992494,83.932165193007506,null,1000000000,1161548642.25,null,16.307125344558102,-12.593201245065401,null,27.427259344646227,-83.474633561927135,null,0,0]
[34279,34.279000000000003,6.2785076179025596,1.4108415927934486,1.0001675666141701,1.8305366355635771E-2,1,0,64792.123610379749,1.570780892820143,5.517267273419769,1.3885398366603552,1.0006749464618767,3.6730560930218425E-2,1.0010844188573038,6.5554005730115578E-2,4.9127091017118607,-96.088566054681905,83.911433945318095,null,1000000000,1175049841,null,16.305400038184054,-12.546149506748151,null,27.378259481783939,-83.542416547933755,null,0,0]
[34476.5,34.476500000000001,6.3137664224667143,1.4117424808405359,1.0001695028976878,1.8410809784295042E-2,1,0,65165.426344123742,1.5707809812342806,5.5480138751668315,1.3895611244260064,1.0006827436749277,3.6941993774077649E-2,1.0010969504773635,6.5931418210746204E-2,4.8622775763599089,-96.109369613174039,83.890630386825961,null,1000000000,1188629052.25,null,16.303702139307301,-12.499753303415483,null,27.329525855308741,-83.609616309758565,null,0,0]
[34674,34.673999999999999,6.3490302943625387,1.4126333621542753,1.0001714503013632,1.851625280351521E-2,1,0,65538.729077868236,1.57078106864122,5.578766199862482,1.390571153766335,1.000690585621649,3.7153423313586738E-2,1.0011095540861374,6.6308825872278709E-2,4.8121362662654574,-96.130244388645309,83.869755611354691,null,1000000000,1202286276,null,16.302031033401253,-12.454001913305001,null,27.281055651120333,-83.676242475340317,null,0,0]
[34875.75,34.875749999999996,6.3850581538319213,1.4135332532371303,1.0001734510928011,1.8623964424545517E-2,1,0,65920.06490841537,1.5707811569069206,5.6101860945777497,1.3915914838832952,1.0006986425059916,3.7369399171329254E-2,1.001122503240782,6.6694349960160312E-2,4.7612121130514087,-96.151640784551077,83.848359215448923,null,1000000000,1216317938.0625,null,16.30035100950672,-12.407920866217912,null,27.231811521800825,-83.743719918333156,null,0,0]
[35077.5,35.077500000000001,6.4210911259207011,1.4144230452705122,1.000175463487998,1.8731675613384818E-2,1,0,66301.400738962984,1.5707812441572917,5.6416117648494071,1.3926004478787943,1.000706746067741,3.75853715412705E-2,1.0011355275155298,6.7079868961346212E-2,4.7105837562297959,-96.17310925364032,83.82689074635968,null,1000000000,1230431006.25,null,16.298697700800531,-12.362490791910336,null,27.182836473685402,-83.810618461729987,null,0,0]
[35279.25,35.279249999999998,6.4571291250384233,1.4153029059255031,1.0001774874868841,1.8839386367536466E-2,1,0,66682.736569511093,1.5707813304097529,5.6730431146968359,1.3935982326024199,1.0007148963057635,3.7801340403347788E-2,1.0011486269102814,6.7465382846550639E-2,4.6602477295411129,-96.194648695379286,83.805351304620714,null,1000000000,1244625480.5625,null,16.297070504761226,-12.317700984538057,null,27.13412764303602,-83.876947710841208,null,0,0]
[35481,35.481000000000002,{"$f":"SQRT(1+(A397/pole1)^2)","v":6.4931720674829814},{"$f":"ATAN(A397/pole1)","v":1.4161729992125742},{"$f":"SQRT(1+(A397/Zero1)^2)","v":1.0001795230893886},{"$f":"ATAN(A397/Zero1)","v":1.8947096684503867E-2},{"$f":"IF(VIN_nom>Vout, 1, SQRT(1+(A397/z_RHP)^2))","v":1},{"$f":"IF(VIN_nom>Vout, 0, -ATAN(A397/z_RHP))","v":0},{"$f":"SQRT(1+(A397/Pole2)^2)","v":67064.072400059697},{"$f":"ATAN(A397/Pole2)","v":1.5707814156813265},5.7044800502376498,1.3945850208750663,{"$f":"SQRT(1+(A397/pole4)^2)","v":1.0007230932189182},{"$f":"ATAN(A397/pole4)","v":3.8017305737500402E-2},{"$f":"SQRT((1-(V397/pterm2))^2+(A397/pterm1)^2)","v":1.001161801424937},{"$f":"IF((ATAN((A397/pterm1)/(1-A397^2/pterm2))>0),ATAN((A397/pterm1)/(1-A397^2/pterm2)),PI()+ATAN((A397/pterm1)/(1-A397^2/pterm2)))","v":6.7850891586490117E-2},{"$f":"20*LOG10(((E397*K397*G397)/(C397*I397*O397*M397))*Adc)","v":4.6102006273035414},{"$f":"((F397+L397+H397)-(D397+J397+P397+N397))*radconv","v":-96.216258030301205},{"$f":"IF(R397>0,R397,R397+180)","v":83.783741969698795},null,1000000000,1258901361,null,{"$f":"20*LOG10((K397/(I397*M397))*AEA)","v":16.295468835423939},{"$f":"(L397-(J397+N397))*radconv","v":-12.273540969061312},null,{"$f":"20*LOG10((E397*G397/(C397*O397))*Acs*Am)","v":27.085682210135737},{"$f":"(F397+H397-(D397+P397))*radconv","v":-83.942717061239904},null,0,0]
[35687.75,{"$f":"A398/1000","v":35.687750000000001},6.5301133104730713,1.4170546904980377,1.0001816211789996,1.9057475945957397E-2,1,0,67454.858932728966,1.5707815020659466,5.7367017909857427,1.395585043361818,1.0007315417007818,3.82386196912353E-2,1.0011753803809618,6.8245949077630291E-2,4.5592094539690935,-96.238474317958875,83.761525682041125,null,{"$f":"IF(Q398<0,A398,1000000000)","v":1000000000},{"$f":"A398^2","v":1273615500.0625},null,16.293853359073708,-12.228929206071793,null,27.036306513151519,-84.009545111887078,null,{"$f":"SUM((Q399<0)*(Q398>0))*A398","v":0},0]
[35894.5,35.894500000000001,6.5670595727256398,1.4179264616685161,1.0001837314543536,1.916785474298004E-2,1,0,67845.645465398731,1.5707815874554272,5.7689292046039462,1.3965738938229721,1.0007400391975136,3.845992989736198E-2,1.0011890382262301,6.8641001103053531E-2,4.5085146507007199,-96.260761776519018,83.739238223480982,null,1000000000,1288415130.25,null,16.292263495382176,-12.184957281258939,null,26.987201573574673,-84.075804495260101,null,0,0]
[36101.25,36.10125,6.6040107699996122,1.4187884779047468,1.0001858539153734,1.9278233072885148E-2,1,0,68236.431998069005,1.5707816718668655,5.8011621965481366,1.3975517565337345,1.0007485857078648,3.8681236334297452E-2,1.0012027749606327,6.9036047631252775E-2,4.4581127411820196,-96.283119310040945,83.716880689959055,null,1000000000,1303300251.5625,null,16.290698664369859,-12.14161463617414,null,26.938364495068292,-84.141504673866805,null,0,0]
[36308,36.308,6.6409668199176997,1.4196409007693644,1.0001879885619813,1.938861093298614E-2,1,0,68627.21853073973,1.5707817553169692,5.833400674347657,1.3985188117808145,1.0007571812305796,3.8902538980460893E-2,1.0012165905840593,6.9431088630723781E-2,4.4080003098987781,-96.305545843783761,83.694454156216239,null,1000000000,1318270864,null,16.289158302039407,-12.098890940870644,null,26.889792426115502,-84.206654902913115,null,0,0]
[36519.5,36.519500000000001,6.6787768577256941,1.4205031459670627,1.000190184859918,1.9501524192126383E-2,1,0,69026.983230425147,1.5707818397066127,5.866385400562212,1.3994970858856368,1.0007660249450925,3.9128922023042349E-2,1.0012308052443999,6.9835199788348679E-2,4.3570325968931245,-96.328557915780252,83.671442084219748,null,1000000000,1333673880.25,null,16.287607297023566,-12.055815591471823,null,26.840375718125692,-84.272742324308425,null,0,0]
[36731,36.731000000000002,6.7165918050757947,1.4213556827742471,1.0001923939096271,1.9614436953940148E-2,1,0,69426.747930111087,1.5707819231244116,5.8993756782420812,1.4004644195686857,1.0007749199472373,3.9355301052988553E-2,1.0012451024600584,7.0239305093600615E-2,4.306360774355479,-96.351639985556972,83.648360014443028,null,1000000000,1349166361,null,16.286080752917098,-12.013366796477763,null,26.791230439694516,-84.338273189079217,null,0,0]
[36942.5,36.942500000000003,6.7544115795089716,1.4221986730208134,1.0001946157110244,1.972734921555162E-2,1,0,69826.512629797464,1.5707820055870578,5.9323714147711568,1.4014209935556079,1.0007838662356472,3.9581676047204119E-2,1.0012594822309147,7.0643404512762534E-2,4.2559813743425696,-96.37479096833323,83.62520903166677,null,1000000000,1364748306.25,null,16.284578114523715,-11.971534200704767,null,26.742353678074991,-84.403256767628463,null,0,0]
[37154,37.154000000000003,6.7922361003923442,1.4230322749868385,1.0001968502640253,1.9840260974085071E-2,1,0,70226.277329484321,1.5707820871108629,5.9653725195672935,1.4023669846526332,1.0007928638089461,3.9808046982596115E-2,1.0012739445568482,7.104749801212043E-2,4.2058909895088092,-96.398009800483194,83.601990199516806,null,1000000000,1380419716,null,16.283098841961692,-11.930307673513507,null,26.693742565803255,-84.46770212696967,null,0,0]
[37370.25,37.370249999999999,6.8309149335633634,1.4238750528497186,1.0001991481863279,1.9955708052747195E-2,1,0,70635.020196185913,1.5707821695114803,5.9991202421091829,1.4033234595178821,1.0008021164794689,4.0039497678173178E-2,1.0012888170436738,7.1460660741558754E-2,4.154970980341063,-96.421819161645359,83.578180838354641,null,1000000000,1396535585.0625,null,16.281609958967454,-11.888771569706488,null,26.644311439629746,-84.533047591938868,null,0,0]
[37586.5,37.586500000000001,6.8695985639214774,1.424708339708685,1.0002014594392512,2.0071154599400683E-2,1,0,71043.763062887956,1.5707822509639311,{"$f":"SQRT(1+(A407/Zero2)^2)","v":6.0328733915059853},{"$f":"ATAN(A407/Zero2)","v":1.4042692325330237},1.000811422761392,4.0270944081750332E-2,1.0013037758351071,7.1873817211033419E-2,4.104346097539338,-96.44569727075708,83.55430272924292,null,1000000000,1412744982.25,null,16.280144408494696,-11.847848336504859,null,26.595152107300777,-84.597848934252227,null,0,0]
[37802.75,37.802750000000003,6.9082869108797276,1.4255322938535566,1.0002037840227032,2.0186600610971907E-2,1,0,71452.505929590479,1.5707823314844869,6.0666318771769063,1.4052044806469237,1.0008207826532203,4.0502386168651684E-2,1.0013188209310169,7.2286967384517564E-2,4.0540128864657738,-96.46964305636412,83.53035694363588,null,1000000000,1429047907.5625,null,16.278701659923239,-11.807527835003905,null,26.546261644798669,-84.66211522136021,null,0,0]
[38019,38.018999999999998,6.9469798956366207,1.4263470700989456,1.0002061219365905,2.0302046084387335E-2,1,0,71861.248796293468,1.5707824110890498,6.1003956105320203,1.4061293769656076,1.0008301961534491,4.073382391420409E-2,1.0013339523312712,7.2700111225987657E-2,4.0039679527610819,-96.493655468055209,83.506344531944791,null,1000000000,1445444361,null,16.277281197276359,-11.767800146456395,null,26.497637173740856,-84.725855321598829,null,0,0]
[38240.5,38.240499999999997,6.9866169751799996,1.4271722704533385,1.0002085304287909,2.0420293719154707E-2,1,0,72279.914900223215,1.5707824916928297,6.1349843912420763,1.4070661725770142,1.0008398937643532,4.0970875853084052E-2,1.0013495405559543,7.3123278547045811E-2,3.9530034300908494,-96.518318835837363,83.481681164162637,null,1000000000,1462335840.25,null,16.275848829111762,-11.727712405490225,null,26.448105019235225,-84.790606430347125,null,0,{"$f":"IF(AD410>0,S410,0)","v":0}]
[38462,38.462000000000003,7.0262587586200089,1.427988159883856,1.0002109529063428,2.0538540782791808E-2,1,0,72698.581004153457,1.5707825713682264,6.1695784955570625,1.4079924633797429,1.000849647614984,4.1207923184871667E-2,1.0013652193260667,7.3546439148413356E-2,3.9023343310277432,-96.543049938734057,83.456950061265943,null,1000000000,1479325444,null,16.274438791322744,-11.688226228567196,null,26.398845957961136,-84.854823710166855,null,0,0]
[38683.5,38.683500000000002,7.0659051667859645,1.4287948940242752,1.0002133893691443,2.065678727199606E-2,1,0,73117.247108084121,1.5707826501311875,6.2041778344247236,1.4089084235198499,1.0008594577036973,4.144496588306195E-2,1.0013809886414646,7.3969592991390179E-2,3.8519571956017096,-96.567847713436777,83.432152286563223,null,1000000000,1496413172.25,null,16.273050574130195,-11.649331637248361,null,26.349857039727649,-84.918516076188439,null,0,0]
[38905,38.905000000000001,7.1055561222650221,1.4295926250827338,1.0002158398170935,2.0775033183464964E-2,1,0,73535.913212015264,1.5707827279972977,6.2387823207549582,1.4098142233498836,1.0008693240288393,4.1682003921153052E-2,1.0013968485020031,7.4392740037279997E-2,3.8018686242343236,-96.592711117694009,83.407288882305991,null,1000000000,1513599025,null,16.271683681853734,-11.61101887042614,null,26.301135360636721,-84.981692247267873,null,0,0]
[39131.5,39.131500000000003,7.1461067567512764,1.4303992084874813,1.0002183600420362,2.0895947701982272E-2,1,0,73964.030018067191,1.5707828067095282,6.2741731810597132,1.4107301368234211,1.0008794712233162,4.1924387858338449E-2,1.001413160006857,7.4825431865939651E-2,3.7509443135087701,-96.618202576727811,83.381797423272189,null,1000000000,1531274292.25,null,16.270307484470315,-11.572432980450278,null,26.251587247294594,-85.045769596277509,null,0,0]
[39358,39.357999999999997,7.1866619878621059,1.431196689104415,1.0002208948904183,2.1016861609402811E-2,1,0,74392.146824119569,1.5707828845158023,6.3095692457045489,1.411635774680096,1.0008896772182407,4.2166766866622706E-2,1.0014295661904971,7.5258116505355591E-2,3.7003147390742974,-96.64376052270346,83.35623947729654,null,1000000000,1549052164,null,16.268952580444072,-11.534435505640499,null,26.202312576886357,-85.109325017062972,null,0,0]
[39584.5,39.584499999999998,7.2272217382162545,1.4319852191672786,1.0002234443621287,2.113777490219567E-2,1,0,74820.263630172398,1.5707829614316713,6.3449704275906411,1.4125313074173578,1.0008999420118141,4.2409140917678674E-2,1.0014460670527652,7.5690793914164028E-2,3.6499764528160306,-96.66938390628809,83.33061609371191,null,1000000000,1566932640.25,null,16.267618482542947,-11.497016676480513,null,26.153308388529219,-85.172367229807591,null,0,0]
[39811,39.811,7.2677859321513187,1.4327649475562179,1.0002260084570558,2.1258687576830058E-2,1,0,75248.380436225663,1.5707830374723326,6.3803766415397636,1.4134169018137905,1.0009102656022275,4.2651509983182685E-2,1.0014626625935028,7.6123464051005466E-2,3.5999260667248434,-96.695071699057223,83.304928300942777,null,1000000000,1584915721,null,16.26630471701629,-11.460166936509248,null,26.104571767964689,-85.234904762547984,null,0,0]
[40042.75,40.042749999999998,7.3092948778520785,1.4335537909279423,1.000228647120097,2.1382402219628734E-2,1,0,75686.420479505774,1.5707831143851447,6.4166086508087234,1.4143129068434199,1.0009208893361581,4.2899491684939513E-2,1.0014797407946299,7.6566155395964577E-2,3.5490100874071167,-96.721420518847239,83.278579481152761,null,1000000000,1603421827.5625,null,16.264981064265399,-11.423042341533222,null,26.054979441397851,-85.298378177313992,null,0,0]
[40274.5,40.274500000000003,7.3508083205662569,1.4343337248476307,1.0002313010918698,2.1506116207802396E-2,1,0,76124.460522786321,1.570783190412804,6.4528457536399815,1.4151988492265057,1.0009315746203342,4.3147468107367755E-2,1.0014969181138222,7.7008839040350913E-2,3.4983885200414475,-96.747834654913675,83.252165345086325,null,1000000000,1622035350.25,null,16.263677735270434,-11.386493940536781,null,26.005661203027152,-85.361340714376908,null,0,0]
[40506.25,40.506250000000001,7.3923261845315666,1.4351048984740404,1.000233970372252,2.162982953756935E-2,1,0,76562.500566067305,1.570783265570503,6.4890878647013883,1.4160748961627523,1.0009423214527848,4.3395439220139685E-2,1.0015141945509076,7.7451514939875912E-2,3.4480579219556073,-96.774313070398449,83.225686929601551,null,1000000000,1640756289.0625,null,16.262394263557116,-11.350512152815311,null,25.956614076654624,-85.423800917583137,null,0,0]
[40738,40.738,7.4338483956702675,1.4358674576756019,1.0002366549611215,2.1753542205148017E-2,1,0,77000.540609348711,1.570783339873089,6.5253349005448902,1.4169412111983377,1.0009531298315273,4.3643404992931491E-2,1.0015315701057119,7.7894183050255875E-2,3.3980149104459012,-96.800854749233835,83.199145250766165,null,1000000000,1659584644,null,16.261130195571283,-11.315087606976324,null,25.907835133130753,-85.485767142257515,null,0,0]
[40975.25,40.975250000000003,7.4763604589820094,1.4366393397140647,1.0002394191195481,2.1880190190044051E-2,1,0,77448.976424963039,1.570783415068413,6.562447184374661,1.4178181719665537,1.0009642584723089,4.3897250042833513E-2,1.0015494606992674,7.8347348653580881E-2,3.3470786896475686,-96.828090821390518,83.171909178609482,null,1000000000,1678971112.5625,null,16.259855767645149,-11.279390014502576,null,25.858173340258549,-85.548700806887936,null,0,0]
[41212.5,41.212499999999999,7.518876926350754,1.4374024927882092,1.0002421993214383,2.2006837472928049E-2,1,0,77897.41224057776,1.570783489397976,6.5995644583569435,1.4186852689889331,1.0009754516110971,4.4151089431983953E-2,1.0015674551706133,7.8800505999755424E-2,3.2964368798131942,-96.855391104919775,83.144608895080225,null,1000000000,1698470156.25,null,16.258600753082568,-11.244257199094481,null,25.808786544986759,-85.611133905825298,null,0,0]
[41449.75,41.449750000000002,7.5613977234866896,1.438157063261017,1.0002449955666584,2.2133484049743149E-2,1,0,78345.848056192946,1.570783562876644,6.6366866387658323,1.4195426664685717,1.000986709245729,4.4404923127861255E-2,1.0015855535195595,7.9253655041283302E-2,3.2460860379995804,-96.882754574157886,83.117245425842114,null,1000000000,1718081775.0625,null,16.257364704618059,-11.20967975159606,null,25.759671751637654,-85.673074822561816,null,0,0]
[41687,41.686999999999998,7.6039227777542182,1.4389031942609163,1.0002478078550734,2.2260129916432635E-2,1,0,78794.283871808526,1.5707836355189451,6.6738136437273399,1.4203905250124325,1.0009980313740279,4.4658751097948285E-2,1.0016037557459156,7.9706795730673796E-2,3.1960227812270587,-96.910180224139239,83.089819775860761,null,1000000000,1737805969,null,16.25614718739277,-11.175648468875483,null,25.710826012090426,-85.734531755263788,null,0,0]
[41929.75,41.929749999999999,7.6474379927024856,1.4396580330696278,1.0002507019440363,2.2389710985996028E-2,1,0,79253.115459757028,1.5707837089943948,6.7118062480572585,1.4212483295136036,1.0010096827266513,4.4918457423117716E-2,1.0016224874589903,8.0170432567835334E-2,3.1450931386608105,-96.938304996342424,83.061695003657576,null,1000000000,1758103935.0625,null,16.254920184944222,-11.141384177450117,null,25.661123371972721,-85.796920818892303,null,0,0]
[42172.5,42.172499999999999,7.6909575157112338,1.4404043297416744,1.000253612828365,2.2519291303535496E-2,1,0,79711.94704770598,1.5707837816239774,6.7498037355264779,1.4220964767475324,1.001021401593176,4.5178157685086234E-2,1.0016413279211269,8.0634060560555984E-2,3.0944575903522971,-96.966492801299566,83.033507198700434,null,1000000000,1778519756.25,null,16.253711699852285,-11.107672810819576,null,25.611696308756144,-85.858819990480001,null,0,0]
[42415.25,42.41525,7.7344812740601112,1.4411422276445269,1.0002565405079131,2.2648870864706037E-2,1,0,80170.778635655326,1.5707838534222158,6.7878060241289626,1.422935127685482,1.0010331879712311,4.5437851849036842E-2,1.0016602771321181,8.1097679657982757E-2,3.044112698547623,-96.994742626560225,83.005257373439775,null,1000000000,1799053432.5625,null,16.252521304022633,-11.074505144847059,null,25.562541812781131,-85.920237481713173,null,0,0]
[42658,42.658000000000001,7.7780091966494629,1.4418718669734121,1.0002594849825328,2.2778449665162806E-2,1,0,80629.610223605079,1.5707839244033031,6.8258130336746818,1.4237644397675964,1.0010450418584318,4.5697539880157456E-2,1.0016793350917546,8.1561289809268744E-2,2.994055085324888,-97.023053480217669,82.976946519782331,null,1000000000,1819704964,null,16.251348581246596,-11.041872157695403,null,25.51365692233443,-85.981181322522261,null,0,0]
[42906.5,42.906500000000001,7.8225724024827441,1.4426103780125961,1.0002625165990531,2.2911096995898998E-2,1,0,81099.310118993832,1.5707839962337788,6.8647251203832358,1.4246038831687791,1.0010572464519247,4.5963372732287545E-2,1.0016989571185844,8.2035872137856639E-2,2.9431058625385962,-97.052097130202853,82.947902869797147,null,1000000000,1840967742.25,null,16.250165963771689,-11.009010809696063,null,25.463890317023047,-86.043086320506774,null,0,0]
[43155,43.155000000000001,7.8671398264003178,1.4433405221017552,1.0002655658154,2.3043743520243087E-2,1,0,81569.010014382977,1.5707840672370099,6.9036419898920309,1.4254338630116108,1.0010695217855081,4.6229199083801208E-2,1.0017186931064694,8.2510444983660308E-2,2.8924507116347926,-97.081202694240787,82.918797305759213,null,1000000000,1862354025,null,16.249001020337758,-10.976691263794519,null,25.414400109553167,-86.104511430446266,null,0,0]
[43403.5,43.403500000000001,7.9117113971195723,1.4440624398643775,1.0002686326314123,2.317638923353461E-2,1,0,82038.709909772544,1.5707841374272051,6.9425635617704256,1.4262545373073834,1.0010818678565789,4.6495018897369726E-2,1.001738543055182,8.2985008292153314E-2,2.8420861948383007,-97.110369171901965,82.889630828098035,null,1000000000,1883863812.25,null,16.247853340644042,-10.944904465285925,null,25.365183272450395,-86.165464706616021,null,0,0]
[43652,43.652000000000001,7.9562870449486551,1.4447762688072794,1.0002717170469284,2.3309034131113279E-2,1,0,82508.40980516249,1.5707842068182496,6.9814897573717607,1.4270660605941197,1.0010942846625204,4.6760832135669964E-2,1.0017585069644921,8.3459562008816074E-2,2.7920089341950014,-97.139595583170433,82.860404416829567,null,1000000000,1905497104,null,16.246722525796898,-10.913641558450932,null,25.31623682665424,-86.225954024719513,null,0,0]
[43906,43.905999999999999,8.0018534190627619,1.4454976774190558,1.0002748879171206,2.3444613983408892E-2,1,0,82988.50547288543,1.5707842769333606,7.0212821968486212,1.4278862454521133,1.0011070493849006,4.703252173033258E-2,1.0017790305026206,8.3944608957079184E-2,2.7411167313897056,-97.169529795269625,82.830470204730375,null,1000000000,1927736836,null,16.245583708000403,-10.882219112043186,null,25.266483441645441,-86.287310683226451,null,0,0]
[44160,44.16,8.047423910423591,1.4462109160957637,1.0002780771741455,2.358019297363911E-2,1,0,83468.601140608778,1.570784346241894,7.0610793063273904,1.4286971855254973,1.0011198880023464,4.7304204376615415E-2,1.0017996731012169,8.4429645769067321E-2,2.6905176899467422,-97.199524616011786,82.800475383988214,null,1000000000,1950105600,null,16.24446170198512,-10.851325908450345,null,25.217006406217756,-86.348198707561451,null,0,0]
[44414,44.414000000000001,8.0929984494802998,1.4469161221289308,1.0002812848178269,2.3715771096827876E-2,1,0,83948.696808332505,1.5707844147576877,7.1008810072885522,1.4294990351946024,1.0011328005120144,4.7575880034679982E-2,1.0018204347600319,8.4914672386582499E-2,2.6402083875211217,-97.229579061741504,82.770420938258496,null,1000000000,1972603396,null,16.24335611632744,-10.820953100841301,null,25.167802689449815,-86.408625960900238,null,0,0]
[44668,44.667999999999999,8.138576968233826,1.4476134297669561,1.0002845108479881,2.3851348347999301E-2,1,0,84428.792476056638,1.5707844824942654,7.140687222954285,1.4302919454447041,1.0011457869110458,4.7847548664693949E-2,1.0018413154788153,8.5399688751434263E-2,2.5901854612207948,-97.259692168950139,82.740307831049861,null,1000000000,1995230224,null,16.242266570484166,-10.791092036889612,null,25.118869308992764,-86.468600132060516,null,0,0]
[44928.25,44.928249999999998,8.1852810639269293,1.448319840526207,1.0002878353293074,2.3990260743909309E-2,1,0,84920.701521431853,1.570784551103197,7.1814775264737341,1.431095248620939,1.0011591694932385,4.8125894723078128E-2,1.001862833484999,8.5896628879052445E-2,2.5392252330960696,-97.290606105792705,82.709393894207295,null,1000000000,2018547648.0625,null,16.241166464766962,-10.761018140579269,null,25.069009186585241,-86.529587965213437,null,0,0]
[45188.5,45.188499999999998,8.2319891978586615,1.449018235311037,1.0002911791127065,2.4129172213784324E-2,1,0,85412.61056680746,1.5707846189218626,7.2222724118238402,1.4318894774156672,1.0011726296396906,4.8404233318645525E-2,1.0018844764819519,8.6393558119582173E-2,2.4885586855534023,-97.321579641301241,82.678420358698759,null,1000000000,2042000532.25,null,16.240082422584749,-10.73146369516474,null,25.019426681224793,-86.590115946136507,null,0,0]
[45448.75,45.448749999999997,8.2787013016782325,1.4497087491233698,1.0002945421979912,2.4268082752272681E-2,1,0,85904.51961218346,1.5707846859638375,7.2630718017995592,1.4326747837409339,1.0011861673472739,4.8682564408570897E-2,1.0019062444694,8.6890476410456094E-2,2.4381823866297561,-97.352611801642993,82.647388198357007,null,1000000000,2065588876.5625,null,16.239014067835782,-10.702419995051043,null,24.970118737050111,-86.650191806591963,null,0,0]
[45709,45.709000000000003,8.3254173085631198,1.4503915139654597,1.0002979245849672,2.4406992354022924E-2,1,0,86396.428657559853,1.5707847522423883,7.3038756209124873,1.4334513161586839,1.0011997826128423,4.8960887950035968E-2,1.0019281374470677,8.7387383689115375E-2,2.3880929640258826,-97.383701633046741,82.616298366953259,null,1000000000,2089312681,null,16.237961034895577,-10.67387852657259,null,24.921082347386442,-86.709823106474161,null,0,0]
[45975.25,45.975250000000003,8.3732143124979448,1.4510821353710008,1.0003014049261567,2.4549103507652936E-2,1,0,86899.678545481307,1.5707848192724667,7.3456246685945255,1.4342368231843796,1.0012137920324404,4.9245620316420463E-2,1.0019506645075491,8.7895735582168927E-2,2.3371421598975677,-97.415566939591727,82.584433060408273,null,1000000000,2113723612.5625,null,16.236899209629886,-10.645190092614762,null,24.871193368523819,-86.770376846976973,null,0,0]
[46241.5,46.241500000000002,8.4210152647670906,1.4517649166286353,1.0003049054688724,2.469121366952387E-2,1,0,87402.928433403184,1.5707848855306512,7.3873781974528221,1.4350134512990402,1.0012278826206893,4.9530344691635239E-2,1.0019733223873342,8.8404075816951685E-2,2.2864846570610302,-97.44749064964725,82.55250935035275,null,1000000000,2138276322.25,null,16.235852678716025,-10.617009880699946,null,24.821582396601141,-86.830480768947353,null,0,0]
[46507.75,46.507750000000001,8.4688200985132571,1.4524399898646063,1.0003084262129025,2.4833322833906255E-2,1,0,87906.178321325409,1.5707849510301992,7.4291361319315179,1.4357813492784612,1.0012420543741611,4.9815061029854592E-2,1.0019961110861233,8.8912404326505684E-2,2.2361170295591544,-97.479471803890206,82.520528196109794,null,1000000000,2162970810.0625,null,16.234821082479037,-10.589329364736919,null,24.772246365336255,-86.89014243915328,null,0,0]
[46774,46.774000000000001,8.5166287483748917,1.4531074842668239,1.0003119671580332,2.4975430995070855E-2,1,0,88409.428209248013,1.5707850157840657,7.4708983981561223,1.4365406626135278,1.0012563072894103,5.009976928526063E-2,1.0020190306036145,8.9420721043882517E-2,2.1860359109484966,-97.511509462838248,82.488490537161752,null,1000000000,2187807076,null,16.233804071269901,-10.562140206829092,null,24.723182257934727,-86.949369256009163,null,0,0]
[47046.25,47.046250000000001,8.5655186557696847,1.4537823154500318,1.0003156087879714,2.5120740550317454E-2,1,0,88924.018939715737,1.570785081239287,7.51360618989274,1.437308358454348,1.0012709653193865,5.0390885095538344E-2,1.0020426018909181,8.9940480522357771E-2,2.1351190238624471,-97.544326567755022,82.455673432244978,null,1000000000,2213349639.0625,null,16.232778869126061,-10.534837932755512,null,24.673290572992524,-87.009488634999485,null,0,0]
[47318.5,47.3185,8.6144124196001144,1.4544494865077215,1.0003192715392863,2.5266049044506418E-2,1,0,89438.60967018384,1.5707851459413065,7.5563183597678139,1.4380673759204896,1.0012857082030018,5.0681992357735385E-2,1.0020663099587688,9.0460227529642917E-2,2.0844947697414931,-97.577200827374554,82.422799172625446,null,1000000000,2239040442.25,null,16.231768208028232,-10.508032360000392,null,24.623676979969396,-87.069168467374155,null,0,0]
[47590.75,47.59075,8.6633099745716269,1.4551091265469778,1.0003229554117463,2.5411356471513186E-2,1,0,89953.20040065232,1.570785209903051,7.5990348339562592,1.438817860481254,1.0013005359365073,5.0973091022891541E-2,1.0020901548068384,9.0979961994192296E-2,2.0341597336026132,-97.610131298397988,82.389868701602012,null,1000000000,2264879485.5625,null,16.230771744551554,-10.481715151722151,null,24.574338407307195,-87.128416146675846,null,0,0]
[47863,47.863,8.7122112568505354,1.4557613618027476,1.0003266604051175,2.5556662825213471E-2,1,0,90467.79113112115,1.5707852731371525,7.6417555402763275,1.4395599543919402,1.001315448516134,5.1264181042055358E-2,1.0021141364347967,9.1499683844470853E-2,1.9841105597120077,-97.643117057098124,82.356882942901876,null,1000000000,2290866769,null,16.229789144845164,-10.455878155211556,null,24.525271833122979,-87.187238901886545,null,0,0]
[48141.75,48.141750000000002,8.7622838595392238,1.4564216260697784,1.0003304757387133,2.5705437266341294E-2,1,0,90994.667774347181,1.5707853371399587,7.6855005195613577,1.4403112176262491,1.0013308050402214,5.1562211859633701E-2,1.0021388323438545,9.2031800969268232E-2,1.9331591935294359,-97.676946693355916,82.323053306644084,null,1000000000,2317628093.0625,null,16.228797110746459,-10.429913517655381,null,24.475312501039109,-87.247033175700523,null,0,0]
[48420.5,48.420499999999997,8.8123602387248745,1.4570743866939981,1.0003343132132889,2.5854210569307347E-2,1,0,91521.54441757359,1.5707854004058548,7.7292497874146315,1.441053976642807,1.0013462505021498,5.1860233509612573E-2,1.0021636716413336,9.2563904718531306E-2,1.8825005672363024,-97.710832389698538,82.289167610301462,null,1000000000,2344544820.25,null,16.227818931393333,-10.404435568398361,null,24.425632054099108,-87.306396821300169,null,0,0]
[48699.25,48.699249999999999,8.8624403303912729,1.4577197703196567,1.0003381728285894,2.600298272753903E-2,1,0,92048.421060800349,1.5707854629474944,7.7730032714233204,1.441788374223328,1.0013617848978036,5.2158245939478709E-2,1.0021886543268737,9.3095995015513439E-2,1.8321312632088504,-97.74477321521293,82.25522678478707,null,1000000000,2371616950.5625,null,16.226854277608162,-10.379436124367089,null,24.376227403856824,-87.365337090845813,null,0,0]
[48978,48.978000000000002,8.9125240719563568,1.4583579007692058,1.0003420545843589,2.6151753734464028E-2,1,0,92575.297704027471,1.5707855247772438,7.8167609007889851,1.4425145499889427,1.001377408223044,5.2456249096728635E-2,1.0022137804001123,9.3628071783480135E-2,1.7820479231224673,-97.778768258381731,82.221231741618269,null,1000000000,2398844484,null,16.225902829402724,-10.354907183560334,null,24.327095511975877,-87.423861074821374,null,0,0]
[49263.25,49.263249999999999,8.9637794002490505,1.4590035288484717,1.0003460497770456,2.6303992642355924E-2,1,0,93114.460260011809,1.5707855873243866,7.8615431066932748,1.4432492898124418,1.0013934879189708,5.2761191552287125E-2,1.0022396408144729,9.4172541636767873E-2,1.7310893214697598,-97.813611208722662,82.186388791277338,null,1000000000,2426867800.5625,null,16.224942541509193,-10.330285191990676,null,24.277097198216705,-87.483326016732008,null,0,0]
[49548.5,49.548499999999997,9.0150384224762234,1.4596418151784114,1.0003500681542519,2.6456230330697609E-2,1,0,93653.622815996525,1.5707856491513634,7.9063295085153742,1.4439757059713882,1.0014096607313834,5.3066124186530936E-2,1.0022656513808641,9.4716997160189637E-2,1.6804232444635023,-97.84850906351393,82.15149093648607,null,1000000000,2455053852.25,null,16.223995432425479,-10.306139507288155,null,24.227378230294157,-87.542369556225751,null,0,0]
[49833.75,49.833750000000002,9.0663010759836151,1.4602728837695698,1.0003541097156989,2.6608466792447206E-2,1,0,94192.78537198159,1.5707857102705411,7.9511200353520444,1.4446939383600721,1.0014259266557703,5.3371046943229625E-2,1.0022918120988908,9.5261438271556517E-2,1.6300462773814415,-97.883460905865064,82.116539094134936,null,1000000000,2483402639.0625,null,16.223061187186246,-10.282462111587176,null,24.177935508451331,-87.600998794277871,null,0,0]
[50119,50.119,9.1175672995216441,1.4608968558666404,1.0003581744611052,2.6760702020563173E-2,1,0,94731.947927967005,1.5707857706940047,7.9959146178822929,1.445404123772138,1.0014422856875951,5.3675959766163753E-2,1.0023181229681559,9.5805864888693096E-2,1.5799550647227145,-97.918465838053208,82.081534161946792,null,1000000000,2511914161,null,16.22213949962579,-10.259245164660506,null,24.128765983353055,-87.659220673392724,null,0,0]
[50410.75,50.41075,9.1700053585523094,1.4615278290895739,1.0003623558121073,2.6916404953765977E-2,1,0,95283.396396709679,1.5707858317869747,8.0417340605920025,1.4461223075028038,1.0014591138024682,5.3987810311941872E-2,1.0023451887060164,9.6362682291849286E-2,1.5290145812176612,-97.954322430783165,82.045677569216835,null,1000000000,2541243715.5625,null,16.221209489511999,-10.235967488433067,null,24.078755509961791,-87.718354942350103,null,0,0]
[50702.5,50.702500000000001,9.2224470268941552,1.4621516267431558,1.0003665614150941,2.707210658157394E-2,1,0,95834.844865452673,1.5707858921768678,8.0875576041309447,1.4468323532372911,1.0014760393067257,5.429965034714912E-2,1.002372411515235,9.6919484358846758E-2,1.4783661069950167,-97.990232720110228,82.009767279889772,null,1000000000,2570743506.25,null,16.220291994980354,-10.213155442546203,null,24.029024530270799,-87.777077277564018,null,0,0]
[50994.25,50.994250000000001,9.274892243324377,1.4627683700613086,1.0003707912697604,2.7227806896454224E-2,1,0,96386.293334196031,1.5707859518757517,8.1333851791868259,1.4475343978141868,1.0014930621954297,5.4611479811670666E-2,1.0023997913953797,9.7476271001807946E-2,1.428006235387195,-98.026195804596625,81.973804195403375,null,1000000000,2600413533.0625,null,16.219386715153952,-10.190801183973477,null,23.979569938489377,-87.835394620623134,null,0,0]
[51286,51.286000000000001,{"$f":"SQRT(1+(A461/pole1)^2)","v":9.3273409479930365},{"$f":"ATAN(A461/pole1)","v":1.4633781775728494},{"$f":"SQRT(1+(A461/Zero1)^2)","v":1.000375045375798},{"$f":"ATAN(A461/Zero1)","v":2.738350589087438E-2},{"$f":"IF(VIN_nom>Vout, 1, SQRT(1+(A461/z_RHP)^2))","v":1},{"$f":"IF(VIN_nom>Vout, 0, -ATAN(A461/z_RHP))","v":0},{"$f":"SQRT(1+(A461/Pole2)^2)","v":96937.741802939752},{"$f":"ATAN(A461/Pole2)","v":1.570786010895419},8.1792167179947288,1.4482285750369794,{"$f":"SQRT(1+(A461/pole4)^2)","v":1.0015101824636146},{"$f":"ATAN(A461/pole4)","v":5.4923298645403962E-2},{"$f":"SQRT((1-(V461/pterm2))^2+(A461/pterm1)^2)","v":1.0024273283460161},{"$f":"IF((ATAN((A461/pterm1)/(1-A461^2/pterm2))>0),ATAN((A461/pterm1)/(1-A461^2/pterm2)),PI()+ATAN((A461/pterm1)/(1-A461^2/pterm2)))","v":9.8033042132870493E-2},{"$f":"20*LOG10(((E461*K461*G461)/(C461*I461*O461*M461))*Adc)","v":1.3779316187517381},{"$f":"((F461+L461+H461)-(D461+J461+P461+N461))*radconv","v":-98.06221080169766},{"$f":"IF(R461>0,R461,R461+180)","v":81.93778919830234},null,1000000000,2630253796,null,{"$f":"20*LOG10((K461/(I461*M461))*AEA)","v":16.218493357564153},{"$f":"(L461-(J461+N461))*radconv","v":-10.168897043571784},null,{"$f":"20*LOG10((E461*G461/(C461*O461))*Acs*Am)","v":23.930388679443723},{"$f":"(F461+H461-(D461+P461))*radconv","v":-87.893313758125885},null,0,0]
[51584.75,{"$f":"A462/1000","v":51.58475},9.3810516156965917,1.4639955499110169,1.0003794266820467,2.7542939217584394E-2,1,0,97502.4212546528,1.5707860706393351,8.2261519378936079,1.4489313916569591,1.0015278144078266,5.5242587914356052E-2,1.0024556887628653,9.8603155787915522E-2,1.3269477216723735,-98.099142805180193,81.900857194819807,null,{"$f":"IF(Q462<0,A462,1000000000)","v":1000000000},{"$f":"A462^2","v":2660986432.5625},null,16.217590623300357,-10.146925968079209,null,23.88030751662815,-87.952216837100949,null,{"$f":"SUM((Q463<0)*(Q462>0))*A462","v":0},0]
[51883.5,51.883499999999998,9.434765818263692,1.4646058928058576,1.0003838334167026,2.7702371143725382E-2,1,0,98067.100706366182,1.570786129695229,8.2730911750046161,1.4496262334416734,1.0015455484498288,5.5561865908753234E-2,1.0024842138769272,9.9173252991353975E-2,1.2762560112989139,-98.136127427864665,81.863872572135335,null,1000000000,2691897572.25,null,16.216699795361087,-10.125411131584997,null,23.830506634193963,-88.010716296279682,null,0,0]
[52182.25,52.182250000000003,9.488483495661864,1.4652093251872691,1.0003882655794296,2.7861801661210862E-2,1,0,98631.780158079913,1.5707861880749179,8.3200343613358942,1.4503132347009589,1.0015633845841982,5.5881132564102758E-2,1.0025129036877274,9.974333364889619E-2,1.2258530768389855,-98.173163780588453,81.826836219411547,null,1000000000,2722987215.0625,null,16.215820585332668,-10.10434483568425,null,23.78098290976245,-88.068818944904194,null,0,0]
[52481,52.481000000000002,9.5422045892066034,1.4658059633273148,1.0003927231698901,2.8021230761954764E-2,1,0,99196.459609793979,1.57078624578995,8.3669814304157999,1.4509925267601922,1.0015813228054802,5.6200387815925672E-2,1.0025417581947886,0.10031339766626959,1.1757355666100147,-98.210250992889314,81.789749007110686,null,1000000000,2754255361,null,16.214952712872677,-10.083719552954458,null,23.73173327199347,-88.126531439934865,null,0,0]
[52786.5,52.786499999999997,9.5971429378046054,1.466409174194123,1.0003973077714294,2.8184260552938181E-2,1,0,99773.897509371367,1.5707863041334091,8.4149931758734091,1.4516793281905562,1.00159977189259,5.6526844506240348E-2,1.0025714349642429,0.10089632448456877,1.1247774329527522,-98.248227867311925,81.751772132688075,null,1000000000,2786414582.25,null,16.214076672360871,-10.063076662990277,null,23.681651178848018,-88.185151204321684,null,0,0]
[53092,53.091999999999999,9.6520847386979227,1.4670055180565567,1.0004019189619973,2.8347288845335827E-2,1,0,100351.33540894909,1.570786361805433,8.4630088456133414,1.4523583366742854,1.0016183277202257,5.6853289135571236E-2,1.0026012839553589,0.10147923370292979,1.0741108615470738,-98.286256142264818,81.713743857735182,null,1000000000,2818760464,null,16.213211919287012,-10.042879546464878,null,23.631849360516192,-88.24337659579993,null,0,0]
[53397.5,53.397500000000001,9.7070299332665702,1.4675951110957839,1.0004065567412261,2.8510315630502481E-2,1,0,100928.77330852716,1.5707864188175455,8.5110283732181049,1.4530296834841572,1.0016369902824547,5.7179721635014717E-2,1.0026313051676177,0.10206212522060039,1.0237324513799448,-98.324334944497394,81.675665055502606,null,1000000000,2851293006.25,null,16.21235817834388,-10.023120678714522,null,23.5823246912922,-88.301214265782903,null,0,0]
[53703,53.703000000000003,9.7619784642067433,1.4681780668961322,1.0004112211087461,2.8673340899793405E-2,1,0,101506.21120810554,1.570786475181009,8.5590516937554462,1.4536934969747382,1.0016557595733113,5.7506141935682639E-2,1.0026614986004971,0.10264499893684742,0.97363886031282587,-98.362463419159454,81.637536580840546,null,1000000000,2884012209,null,16.211515181928917,-10.003792702262535,null,23.533074096640046,-88.358670716896881,null,0,0]
[54015.75,54.015749999999997,9.8182344086117403,1.4687680977257362,1.0004160237109758,2.8840233438248181E-2,1,0,102097.35262575935,1.5707865322216359,8.6082185466706633,1.4543653912375876,1.0016750848409146,5.78402959999346E-2,1.0026925869706456,0.10324168662645572,0.92264807788862868,-98.401547323974924,81.598452676025076,null,1000000000,2917701248.0625,null,16.210663038326089,-9.9844448824760708,null,23.482935457818677,-88.417102441498855,null,0,0]
[54328.5,54.328499999999998,9.8744937321543134,1.4693514054274248,1.0004208541776443,2.9007124369691942E-2,1,0,102688.49404341349,1.5707865886055372,{"$f":"SQRT(1+(A471/Zero2)^2)","v":8.6573892415555793},{"$f":"ATAN(A471/Zero2)","v":1.4550296535871523},1.0016945219501718,5.8174437133491651E-2,1.0027238558314286,0.10383835544611709,0.87194888820375382,-98.44068153076141,81.55931846923859,null,1000000000,2951585912.25,null,16.209821611349287,-9.9655335606090638,null,23.433077695110605,-88.475147970152321,null,0,0]
[54641.25,54.641249999999999,9.9307563774043999,1.4699281038703791,1.0004257125083482,2.9174013684851341E-2,1,0,103279.63546106796,1.57078664434399,8.7065637133171254,1.4556864127468179,1.0017140708945724,5.8508565262494788E-2,1.002755305182278,0.10443500528781791,0.82153788850106846,-98.479865179192544,81.520134820807456,null,1000000000,2985666201.5625,null,16.20899063733745,-9.9470513577691371,null,23.383497669419754,-88.532813821423417,null,0,0]
[54954,54.954000000000001,9.9870222882227324,1.4704983043754825,1.0004305987026814,2.9340901374453575E-2,1,0,103870.77687872274,1.5707866994480137,8.7557418983196005,1.4563357945742037,1.0017337316675692,5.8842680313102351E-2,1.0027869350226202,0.10503163604356594,0.77141173492819959,-98.519097427119107,81.480902572880893,null,1000000000,3019942116,null,16.208169860016429,-9.9289910592464068,null,23.334192293167906,-88.590106367872679,null,0,0]
[55274,55.274000000000001,10.044595847468919,1.4710751108396514,1.0004356270056776,2.9511656071305608E-2,1,0,104475.62181445298,1.5707867551840016,8.8060638836645726,1.4569927225278076,1.0017539639461868,5.9184527022990291E-2,1.0028194849020797,0.1056420777008735,0.72041498417805938,-98.559288578266987,81.440711421733013,null,1000000000,3055215076,null,16.207340350060843,-9.9109414271939897,null,23.284025052373352,-88.648347151073025,null,0,{"$f":"IF(AD474>0,S474,0)","v":0}]
[55594,55.594000000000001,10.102172710516971,1.4716453425285638,1.0004406844782479,2.9682409046722681E-2,1,0,105080.46675018354,1.5707868102783551,8.8563896261171138,1.4576421848754482,1.0017743132842076,5.9526359884756477E-2,1.002852223734819,0.10625249914842569,0.66970953945852008,-98.599528880750157,81.400471119249843,null,1000000000,3090692836,null,16.206520994848031,-9.8933187126534037,null,23.234138962866627,-88.706210168096746,null,0,0]
[55914,55.914000000000001,10.159752821197442,1.4722091108552497,1.0004457711199504,2.9853160290773839E-2,1,0,105685.31168591442,1.5707868647420904,8.9067190619907279,1.4582843076228389,1.0017947796744984,5.9868178819361087E-2,1.0028851515202144,0.10686290027061496,0.61929200170603727,-98.639817488517025,81.360182511482975,null,1000000000,3126375396,null,16.205711542303376,-9.8761156921315916,null,23.184530877658787,-88.763701796385448,null,0,0]
[56234,56.234000000000002,10.217336124603941,1.472766524737761,1.0004508869303399,3.002390979352872E-2,1,0,106290.15662164558,1.5707869185859731,8.9570521290257226,1.458919213967921,1.0018153631098852,6.0209983747783774E-2,1.002918268257639,0.10747328095185771,0.56915903066725704,-98.680153573426111,81.319846426573889,null,1000000000,3162262756,null,16.204911747418514,-9.8593253029957477,null,23.135197701504879,-88.82082827043034,null,0,0]
[56561.5,56.561500000000002,10.276272286523907,1.4733305345326064,1.0004561528442288,3.0198659424400542E-2,1,0,106909.1776105583,1.5707869730609856,9.0085685736226537,1.4595616545385306,1.0018365501541202,6.0559785144343924E-2,1.0029523568147101,0.10809794614454084,0.51814229197314288,-98.721483348746105,81.278516651253895,null,1000000000,3199203282.25,null,16.204102958677666,-9.842561434571671,null,23.08498975155161,-88.878921914174441,null,0,0]
[56889,56.889000000000003,10.335211680115734,1.4738881116604809,1.0004614493091588,3.0373407210351883E-2,1,0,107528.19859947132,1.570787026908792,9.0600886940412497,1.4601967889026772,1.001857859778901,6.0909571703075885E-2,1.0029866432833903,0.10872258968198951,0.46741671893689074,-98.762861153063795,81.237138846936205,null,1000000000,3236358321,null,16.203303787997527,-9.8262152948614503,null,23.035063349195504,-88.936645858202297,null,0,0]
[57216.5,57.216500000000003,10.39415425040445,1.4744393652056991,1.0004667763246446,3.0548153140739658E-2,1,0,108147.21958838461,1.5707870801401622,9.1116124279285096,1.4608247404874799,1.0018792919764057,6.1259343339335998E-2,1.0030211276629966,0.10934721144038013,0.41697891353405603,-98.804286153879389,81.195713846120611,null,1000000000,3273727872.25,null,16.202513994217689,-9.8102798077794393,null,22.985415337572501,-88.994006346099994,null,0,0]
[57544,57.543999999999997,10.453099943652115,1.4749844018076148,1.0004721338901983,3.0722897204921457E-2,1,0,108766.24057729825,1.5707871327656215,9.1631397143295459,1.4614456299667287,1.001900846738768,6.1609099968502383E-2,1.0030558099528408,0.10997181129591602,0.36682553651722954,-98.84575753635049,81.15424246364951,null,1000000000,3311311936,null,16.201733342943342,-9.7947480549813299,null,22.936042611830022,-89.051009481369164,null,0,0]
[57879,57.878999999999998,10.51339871456519,1.4755355967118686,1.0004776457550897,3.0901641099669676E-2,1,0,109399.43761939341,1.5707871859800828,9.215850628280025,1.4620735547372463,1.0019230219206359,6.1966850676730488E-2,1.0030914912534554,0.1106106921749201,0.31581446129392687,-98.888225800758534,81.111774199241466,null,1000000000,3349978641,null,16.200944035613791,-9.7792712704245961,null,22.885820843936266,-89.108954530333975,null,0,0]
[58214,58.213999999999999,10.573700643184091,1.4760805048391568,1.0004831895842687,3.1080383019234444E-2,1,0,110032.63466148886,1.5707872385820851,9.2685651346126559,1.4626943371679917,1.0019453253285064,6.2324585503605333E-2,1.0031273796312248,0.11124954987445551,0.26509410549055695,-98.930740925362727,81.069259074637273,null,1000000000,3388869796,null,16.200163818911378,-9.7642027667672924,null,22.835880704835311,-89.166538158595429,null,0,0]
[58549,58.548999999999999,10.63400567578991,1.4766192328193037,1.0004887653772041,3.1259122952227561E-2,1,0,110665.83170358464,1.5707872905821414,9.3212831723796139,1.4633080979604003,1.0019677569538168,6.2682304358628871E-2,1.003163475085401,0.11188838426211253,0.21466107735603993,-98.973302092402236,81.026697907597764,null,1000000000,3427985401,null,16.199392462495766,-9.7495356237437694,null,22.78621903311641,-89.223766468658482,null,0,0]
[58884,58.884,10.694313759872669,1.4771518848914149,1.0004943731333613,3.1437860887261568E-2,1,0,111299.0287456807,1.5707873419905252,9.3740046820000806,1.4639149551219341,1.0019903167879558,6.304000715132746E-2,1.0031997776152319,0.11252719520551159,0.16451204376318762,-99.015908501480951,80.984091498519049,null,1000000000,3467325456,null,16.198629742490336,-9.7352630754293781,null,22.736832719528984,-89.280645426051535,null,0,0]
[59227,59.226999999999997,10.756065145057343,1.4776910681489543,1.0005001479228093,3.1620865108904217E-2,1,0,111947.3469111704,1.5707873940240218,9.4279887491268042,1.4645292719910068,1.0020135481932997,6.3406235363537136E-2,1.0032371616226938,0.11318123690666222,0.11345624897347138,-99.059578434456668,80.940421565543332,null,1000000000,3507837529,null,16.19785752926909,-9.7210516237295703,null,22.686549137960515,-89.338526810727089,null,0,0]
[59570,59.57,10.817819621529948,1.478224095609717,1.0005059562191652,3.1803867211865185E-2,1,0,112595.6650766604,1.5707874454583075,9.481976333722729,1.4651365936079399,1.0020369139855685,6.3772446545227374E-2,1.0032747627124725,0.11383525374968731,6.2691285255211143E-2,-99.103294151698506,80.896705848301494,null,1000000000,3548584900,null,16.197093914709924,-9.7072399603453032,null,22.636547788801419,-89.39605419135323,null,0,0]
[59913,59.912999999999997,10.879577136650324,1.4787510717976633,1.0005117980218452,3.1986867183924114E-2,1,0,113243.9832421507,1.5707874963036741,9.5359673760457326,1.4657370383386972,1.0020604141553611,6.4138640599367344E-2,1.0033125808837469,0.11448924559259434,1.2213757286085324E-2,-99.147054847712994,80.852945152287006,null,1000000000,3589567569,null,16.196338678189875,-9.6938212984366281,null,22.586825497352343,-89.453233549276348,null,59913,80.852945152287006]
[60256,60.256,10.941337638964258,1.4792720988903489,1.000517673330263,3.216986501286144E-2,1,0,113892.30140764128,1.5707875465701786,9.5899618176952774,1.4663307219035873,1.0020840486932234,6.450481742895367E-2,1.0033506161356909,0.11514321229342458,-3.7979671558910702E-2,-99.190859734142251,80.809140265857749,null,60256,3630785536,null,16.195591605284406,-9.6807890027365939,null,22.537379141412821,-89.510070731405662,null,0,0]
[60607,60.606999999999999,11.004541659507625,1.4797992235824271,1.0005237203585604,3.2357128781305748E-2,1,0,114555.74069652554,1.5707875974200618,9.6452190645395408,1.4669313708009273,1.0021083735695733,6.4879516892971695E-2,1.0033897632407214,0.11581240568532064,-8.9053097841113801E-2,-99.235731252343825,80.764268747656175,null,60607,3673208449,null,16.194835341956228,-9.6678459672927701,null,22.487061978458797,-89.567885285051048,null,0,0]
[60958,60.957999999999998,11.067748702854095,1.4803203276825148,1.0005298024725178,3.2544390279603867E-2,1,0,115219.17998541008,1.5707876476843514,9.7004797515323222,1.4675251764817829,1.0021328391347848,6.5254198114145623E-2,1.0034291376689595,0.11648157244798098,-0.13983590519478156,-99.28064742899403,80.71935257100597,null,60958,3715877764,null,16.194087192164172,-9.6552939404822418,null,22.43702732089718,-89.625353488511792,null,0,0]
[61309,61.308999999999997,11.13095871750879,1.4808355134736069,1.0005359196714951,3.2731649494663985E-2,1,0,115882.61927429489,1.5707876973731052,9.7557438202142279,1.4681122548195895,1.002157445378554,6.5628860988615409E-2,1.0034687394195048,0.11715071242939185,-0.19033148697382887,-99.325607472083874,80.674392527916126,null,61309,3758793481,null,16.193346944961384,-9.643126277871696,null,22.387271986320918,-89.682481194212187,null,0,0]
[61660,61.66,11.194171653137541,1.4813448809410805,1.000542071954849,3.2918906413395205E-2,1,0,116546.05856318002,1.5707877464961517,9.8110112134394942,1.4686927190956187,1.0021821922905187,6.6003505412551719E-2,1.0035085684914529,0.11781982547757738,-0.24054317788838503,-99.370610606471359,80.629389393528641,null,61660,3801955600,null,16.192614395331361,-9.6313364835365363,null,22.337792845036386,-89.739274122934816,null,0,0]
[62019,62.018999999999998,11.258828309749893,1.4818599410459141,1.0005484007534657,3.3110428907010138E-2,1,0,117224.6189754588,1.5707877961636285,9.8675416431923502,1.4692796868574298,1.0022076487377052,6.6386669546434546E-2,1.0035495404996868,0.11850416094622716,-0.29160904026904827,-99.416683238292379,80.583316761707621,null,62019,3846356361,null,16.191872904468031,-9.6196622415302588,null,22.287468473519056,-89.797020996762129,null,0,0]
[62378,62.378,11.323487919072337,1.4823691190713253,1.0005547662525986,3.3301948970729495E-2,1,0,117903.1793877379,1.5707878452594095,9.9240754338889445,1.4698599673403749,1.0022332523162734,6.6769814159540697E-2,1.0035907503077102,0.11918846791846904,-0.34238479778390685,-99.462799359928212,80.537200640071788,null,62378,3891014884,null,16.191139050383246,-9.6083700011659872,null,22.237426570088981,-89.854429358762218,null,0,0]
[62737,62.737000000000002,11.388150430810205,1.4828725149472788,1.0005611684515474,3.3493466590549921E-2,1,0,118581.73980001724,1.5707878937933089,9.9806125284164793,1.4704336737944281,1.0022590030149472,6.7152939140879414E-2,1.0036321979145379,0.11987274623182155,-0.39287383666102726,-99.508958193894401,80.491041806105599,null,62737,3935931169,null,16.190412631706504,-9.5974532679011766,null,22.187663949888602,-89.911504925993199,null,0,0]
[63096,63.095999999999997,11.452815795802451,1.4833702263586988,1.0005676073496077,3.3684981752469097E-2,1,0,119260.30021229686,1.5707879417749173,10.037152870945681,1.4710009169353007,1.0022849008223877,6.7536044379494412E-2,1.0036738833191805,0.12055699572384578,-0.44307948465627356,-99.555158979269166,80.444841020730834,null,63096,3981105216,null,16.189693452729198,-9.5869056923850309,null,22.138177480870667,-89.968253286884135,null,0,0]
[63463.25,63.463250000000002,11.518970105563644,1.4838735930784777,1.0005742321898827,3.3880895470959016E-2,1,0,119954.45428307625,1.5707879902974653,10.094995842812759,1.471574620648272,1.002311545981099,6.7927933024442042E-2,1.00371677273196,0.12125693962051892,-0.49414905902300643,-99.602464113958604,80.397535886041396,null,63463.25,4027584100.5625,null,16.188965039507508,-9.5764912364606989,null,22.087836319725621,-90.025972877497892,null,0,0]
[63830.5,63.830500000000001,11.585127300645986,1.484371210943541,1.000580895433874,3.4076806587642276E-2,1,0,120648.6083538559,1.5707880382616624,10.152842099445792,1.4721417871427533,1.0023383450633221,6.8319800774057943E-2,1.0037599109954489,0.12195685301223534,-0.54492893125364916,-99.649811590626868,80.350188409373132,null,63830.5,4074332730.25,null,16.188243805565403,-9.5664501063605591,null,22.037777681437085,-90.083361484266291,null,0,0]
[64197.75,64.197749999999999,11.651287331900035,1.4848631776372661,1.0005875970808138,3.4272715087532414E-2,1,0,121342.76242463583,1.5707880856770908,10.210691585017589,1.4727025271621126,1.0023652980567115,6.8711647509672236E-2,1.0038032981085701,0.12265673572523741,-0.59542248251212848,-99.697200645644443,80.302799354355557,null,64197.75,4121351105.0625,null,16.187529558572258,-9.5567759507067507,null,21.987998377171746,-90.140424694937707,null,0,0]
[64565,64.564999999999998,11.717450151284309,1.4853495886478301,1.0005943371299306,3.4468620955644173E-2,1,0,122036.91649541604,1.5707881325531152,10.268544244955919,1.4732569489703944,1.0023924049488515,6.910347311265358E-2,1.0038469340702396,0.12335658758581509,-0.64563303561392127,-99.744630531653272,80.255369468346728,null,64565,4168639225,null,16.186822111606929,-9.5474625601659078,null,21.938495271035279,-90.197167971487374,null,0,0]
[64941,64.941000000000003,11.785192187787029,1.4858419304164316,1.0006012775503565,3.466919168219719E-2,1,0,122747.60929490808,1.5707881799967165,10.327778519862543,1.4738181449984817,1.0024203171120534,6.9504612229638288E-2,1.0038918675021689,0.12407308178396553,-0.69675010941768267,-99.793232007431996,80.206767992568004,null,64941,4217333481,null,16.186104664480318,-9.5382946929854668,null,21.888095644358131,-90.254937314446522,null,0,0]
[65317,65.316999999999993,11.852937048371155,1.4863286443930726,1.000608258223028,3.4869759618283737E-2,1,0,123458.30209440039,1.5707882268940958,10.387016010311463,1.4743729401612047,1.0024483905683079,6.9905728943451567E-2,1.0039370617795889,0.1247895432736576,-0.74757740653637439,-99.841874747976007,80.158125252023993,null,65317,4266310489,null,16.18539396533604,-9.5294922534726663,null,21.837979046383719,-90.312382494503339,null,0,0]
[65693,65.692999999999998,11.920684684889201,1.4868098262967719,1.0006152791471026,3.507032474782569E-2,1,0,124168.994893893,1.5707882732546319,10.446256661599641,1.4749214430118887,1.0024766253040649,7.0306823126905948E-2,1.0039825169013181,0.12550597186862336,-0.79811831152595725,-99.890558001432595,80.109441998567405,null,65693,4315570249,null,16.184689830035296,-9.5210490152301723,null,21.788142276694881,-90.369508986202419,null,0,0]
[66069,66.069000000000003,11.988435050280078,1.4872855696931784,1.0006223403217331,3.5270887054746285E-2,1,0,124879.68769338586,1.5707883190874905,10.505500420255041,1.4754637596705376,1.0025050213056976,7.0707894652857248E-2,1.0040282328661672,0.12622236738264825,-0.84837615052326343,-99.939281031982375,80.060718968017625,null,66069,4365112761,null,16.183992079624289,-9.5129588912699496,null,21.738582188108584,-90.426322140712429,null,0,0]
[66453.75,66.453749999999999,12.057764830045066,1.4877668498365679,1.0006296074845,3.5476113763901272E-2,1,0,125606.91922159059,1.5707883654500423,10.566126018954916,1.4760124011453826,1.002534245043079,7.1118276038089859E-2,1.0040752827176107,0.12695539989597582,-0.89951393995710938,-99.989178334769306,80.010821665230694,null,66453.75,4416100889.0625,null,16.183284519737388,-9.5050398280295632,null,21.68815195856164,-90.484138506739768,null,0,0]
[66838.5,66.838499999999996,12.127097370822529,1.4882426269791535,1.0006369167911735,3.5681337483479479E-2,1,0,126334.15074979558,1.5707884112788302,10.626754761847785,1.4765547824618956,1.0025636376102818,7.1528633429791558E-2,1.0041226056911998,0.12768839737644652,-0.95036220042582931,-100.03911577823189,79.960884221768112,null,66838.5,4467385082.25,null,16.182583282132651,-9.4974780401305967,null,21.638004935697658,-90.541637738101301,null,0,0]
[67223.25,67.223249999999993,12.196432625526233,1.4887129947553761,1.0006442682408305,3.5886558196259875E-2,1,0,127061.38227800083,1.5707884565830188,10.687386595423339,1.4770910098438748,1.0025931989924572,7.1938966691875897E-2,1.0041702017856395,0.12842135962471607,-1.0009243143778823,-100.08909262334612,79.910907376653881,null,67223.25,4518965340.5625,null,16.181888190819642,-9.4902674341256787,null,21.58813791305861,-90.598825189220435,null,0,0]
[67608,67.608000000000004,12.265770548132794,1.4891780446921277,1.0006516618325416,3.6091775885022971E-2,1,0,127788.61380620634,1.5707885013715648,10.748021467376017,1.4776211871324156,1.0026229291746733,7.2349275688304931E-2,1.0042180709996271,0.12915428644150012,-1.0512036058978032,-100.13910814684728,79.860891853152722,null,67608,4570841664,null,16.181199074766482,-9.4834020530770324,null,21.538547737591848,-90.655706093770249,null,0,0]
[68001.75,68.001750000000001,12.336733125754563,1.4896485604571221,1.0006592720050445,3.6301790838641976E-2,1,0,128532.8565982298,1.5707885466830522,10.8100777913762,1.4781576081166872,1.0026535295531112,7.2769157290379388E-2,1.004267342737357,0.12990432085296039,-1.1023696064108337,-100.19033293163366,79.809667068366338,null,68001.75,4624238003.0625,null,16.180499852160942,-9.4767274344794554,null,21.488080959684357,-90.713605497154205,null,0,0]
[68395.5,68.395499999999998,12.407698403304288,1.4901136941362516,1.0006669263122336,3.6511802588628517E-2,1,0,129277.09939025351,1.570788591472827,10.872137190439176,1.4786879053477864,1.0026843066891196,7.3189013190156096E-2,1.0043169005188197,0.13065431773381239,-1.1532462610535874,-100.24159674151065,79.758403258489352,null,68395.5,4677944420.25,null,16.179806540381819,-9.470402178568694,null,21.437897616820727,-90.771194562941943,null,0,0]
[68789.25,68.789249999999996,12.47866633471908,1.4905735373525555,1.0006746247530964,3.6721811116531229E-2,1,0,130021.34218227747,1.570788635749848,10.934199612205409,1.4792121827999989,1.0027152605664231,7.3608843241985036E-2,1.0043667443425965,0.13140427687065412,-1.2038369514278691,-100.29289884980227,79.70710115019773,null,68789.25,4731960915.5625,null,16.179118971179832,-9.4644203202251997,null,21.387994495648432,-90.82847852957704,null,0,0]
[69183,69.183000000000007,12.549636874976288,1.4910281796655582,1.0006823673266141,3.6931816403900433E-2,1,0,130765.5849743017,1.57078867952287,10.9962650054949,1.4797305421136022,1.0027463911686538,7.4028647300270645E-2,1.0044168742072608,0.13215419805015061,-1.2541450007973878,-100.34423854532582,79.655761454674177,null,69183,4786287489,null,16.178436981049678,-9.4587760280496358,null,21.33836843640907,-90.88546251727621,null,0,0]
[69586,69.585999999999999,12.622277315238795,1.4914882082172591,1.0006903374880749,3.714675177394354E-2,1,0,131527.3115652499,1.5707887238112417,11.059791467789085,1.4802550541339985,1.0027784360769336,7.4458286353579275E-2,1.0044684779237441,0.13292169689767586,-1.3053456197318101,-100.39682251195948,79.603177488040515,null,69586,4842211396,null,16.177744580945703,-9.453342744976192,null,21.287860217578618,-90.943479766983302,null,0,0]
[69989,69.989000000000004,12.694920396137103,1.4919429720984956,1.0006983538779028,3.73616837103092E-2,1,0,132289.0381561984,1.5707887675895842,11.123320938019386,1.4807735749247746,1.0028106660759504,7.4887897869274939E-2,1.0045203812753054,0.13368915553153038,-1.3562570248289165,-100.44944439301645,79.550555606983551,null,69989,4898460121,null,16.17705769308408,-9.4482511270629566,null,21.237635700343137,-91.001193265953489,null,0,0]
[70392,70.391999999999996,12.767566072598269,1.4923925609852735,1.0007064164949875,3.7576612193222295E-2,1,0,133050.76474714713,1.5707888108666574,11.186853364940131,1.4812862062809578,1.0028430811478584,7.5317481691436941E-2,1.0045725842603899,0.13445657372320904,-1.4068825978737101,-100.50210347373692,79.497896526263077,null,70392,4955033664,null,16.17637615658353,-9.4434953334527982,null,21.187691663798894,-91.058608140284136,null,0,0]
[70795,70.795000000000002,12.840214300567791,1.4928370625325766,1.000714525338211,3.7791537202909613E-2,1,0,133812.49133809609,1.5707888536510219,11.250388698460863,1.4817930477106132,1.0028756812747119,7.574703766420561E-2,1.0046250868774338,0.13522395124428196,-1.457225662314928,-100.5547990545946,79.445200945405404,null,70795,5011932025,null,16.175699815102863,-9.4390696543138954,null,21.138024940838346,-91.115729400280699,null,0,0]
[71207.25,71.207250000000002,12.914532607811331,1.493286592155981,1.0007228681312026,3.8011391740543778E-2,1,0,134591.70172796908,1.5707888969163293,11.315385305580516,1.4823056332197164,1.0029092211236896,7.6186424194329111E-2,1.0046791046047208,0.13600889994958812,-1.5084353394484444,-100.60874120203781,79.391258797962195,null,71207.25,5070472452.5625,null,16.175013166501905,-9.4348781406684115,null,21.087501912305786,-91.173863061369374,null,0,0]
[71619.5,71.619500000000002,12.988853494918892,1.4937309775435597,1.0007312592943447,3.8231242601830057E-2,1,0,135370.91211784229,1.5707889396835566,11.380384851788383,1.4828123635533543,1.0029429545818738,7.6625781252201208E-2,1.0047334358733018,0.13679380561253254,-1.5593562445546114,-100.6627201106419,79.337279889358101,null,71619.5,5129352780.25,null,16.174331637078961,-9.431020386692273,null,21.037262536622563,-91.231699723949617,null,0,0]
[72031.75,72.031750000000002,13.063176917857284,1.4941703063232381,1.0007396988264206,3.8451089765608487E-2,1,0,136150.1225077158,1.5707889819612557,11.4453872870103,1.4833133382099395,1.00297688162973,7.7065108671181978E-2,1.0047880806814755,0.13757866798883941,-1.6099917543250808,-100.71673507843676,79.283264921563244,null,72031.75,5188573008.0625,null,16.173655073252956,-9.4274906824886013,null,20.987303590678099,-91.289244395948145,null,0,0]
[72444,72.444000000000003,13.137502833588274,1.4946046641478183,1.0007481867262062,3.8670933210721216E-2,1,0,136929.33289758951,1.5707890237577837,11.510392562301028,1.4838086544519109,1.0030110022476129,7.7504406284699789E-2,1.0048430390275305,0.13836348683431729,-1.6603451872375552,-100.77078541839525,79.229214581604751,null,72444,5248133136,null,16.172983325778482,-9.4242834462650933,null,20.9376219052401,-91.346501972130156,null,0,0]
[72865.75,72.865750000000006,13.213544071489947,1.4950439746318402,1.0007569202746069,3.8895838917122193E-2,1,0,137726.49962149333,1.570789066028067,11.576898725763959,1.4843096285306341,1.0030461094420451,7.7953796173435855E-2,1.0048995883057243,0.13916634595494506,-1.7115704768726911,-100.82611721201209,79.173882787987907,null,72865.75,5309417523.0625,null,16.172300931252337,-9.4213303117946765,null,20.887079010131107,-91.404786900217417,null,0,0]
[73287.5,73.287499999999994,13.2895878303391,1.4954782576809551,1.0007657044429865,3.912074068670307E-2,1,0,138523.66634539736,1.5707891078118421,11.643407761546859,1.4848048794419013,1.0030814191887116,7.8403154514719381E-2,1.0049564657351495,0.13996915899858614,-1.7625073848941923,-100.88148461830329,79.11851538169671,null,73287.5,5371057656.25,null,16.171623274881949,-9.4187032552545737,null,20.83681975847999,-91.462781363048705,null,0,0]
[73709.25,73.709249999999997,13.365634067106951,1.4959075989434858,1.0007745392300118,3.9345638496816396E-2,1,0,139320.83306930165,1.5707891491174597,11.709919620707829,1.4852945044627384,1.0031169314662234,7.8852481130419927E-2,1.0050136713139437,0.14077192570405211,-1.813159283942531,-100.93688694759813,79.063113052401874,null,73709.25,5433053535.5625,null,16.170950210022859,-9.4163966933540593,null,20.786840924290747,-91.520490254244066,null,0,0]
[74131,74.131,{"$f":"SQRT(1+(A525/pole1)^2)","v":13.441682739737074},{"$f":"ATAN(A525/pole1)","v":1.4963320821368571},{"$f":"SQRT(1+(A525/Zero1)^2)","v":1.0007834246343421},{"$f":"ATAN(A525/Zero1)","v":3.9570532324817109E-2},{"$f":"IF(VIN_nom>Vout, 1, SQRT(1+(A525/z_RHP)^2))","v":1},{"$f":"IF(VIN_nom>Vout, 0, -ATAN(A525/z_RHP))","v":0},{"$f":"SQRT(1+(A525/Pole2)^2)","v":140117.9997932062},{"$f":"ATAN(A525/Pole2)","v":1.5707891899530813},11.776434255408592,1.4857785986833743,{"$f":"SQRT(1+(A525/pole4)^2)","v":1.0031526462530707},{"$f":"ATAN(A525/pole4)","v":7.9301775842483435E-2},{"$f":"SQRT((1-(V525/pterm2))^2+(A525/pterm1)^2)","v":1.0050712050402337},{"$f":"IF((ATAN((A525/pterm1)/(1-A525^2/pterm2))>0),ATAN((A525/pterm1)/(1-A525^2/pterm2)),PI()+ATAN((A525/pterm1)/(1-A525^2/pterm2)))","v":0.14157464581024881},{"$f":"20*LOG10(((E525*K525*G525)/(C525*I525*O525*M525))*Adc)","v":-1.8635294885422198},{"$f":"((F525+L525+H525)-(D525+J525+P525+N525))*radconv","v":-100.99232352488671},{"$f":"IF(R525>0,R525,R525+180)","v":79.007676475113286},null,74131,5495405161,null,{"$f":"20*LOG10((K525/(I525*M525))*AEA)","v":16.170281594172458},{"$f":"(L525-(J525+N525))*radconv","v":-9.4144051680902283},null,{"$f":"20*LOG10((E525*G525/(C525*O525))*Acs*Am)","v":20.737139335541457},{"$f":"(F525+H525-(D525+P525))*radconv","v":-91.577918356796502},null,0,0]
[74562.75,{"$f":"A526/1000","v":74.562749999999994},13.519537062107876,1.4967616833518871,1.0007925731484737,3.9800754400951065E-2,1,0,140934.06792135289,1.5707892312784275,11.844528826811025,1.486268539112205,1.0031894176096994,7.9761690426646215E-2,1.0051304428418191,0.14239635045321689,-1.9148056158581308,-101.04910932977378,78.950890670226215,null,{"$f":"IF(Q526<0,A526,1000000000)","v":74562.75},{"$f":"A526^2","v":5559603687.5625},null,16.169601588871597,-9.4126871816804041,null,20.686543213526406,-91.636422148093416,null,{"$f":"SUM((Q527<0)*(Q526>0))*A526","v":0},0]
[74994.5,74.994500000000002,13.597393851033765,1.4971863649707515,1.0008017747058462,4.0030972255877845E-2,1,0,141750.13604949985,1.5707892721279462,11.91262620888881,1.4867528782615052,1.0032264011468013,8.0221571198945976E-2,1.0051900245326126,0.14321800570748494,-1.965793380596264,-101.10592963979406,78.894070360205944,null,74994.5,5624175030.25,null,16.168925956541706,-9.4112881604079579,null,20.636231081118165,-91.694641479386107,null,0,0]
[75426.25,75.426249999999996,13.67525306438651,1.4976062108671961,1.0008110293049968,4.0261185865310994E-2,1,0,142566.20417764707,1.5707893125098087,11.980726353715056,1.4872317114174756,1.0032635968409118,8.0681417968612071E-2,1.0052499501105718,0.14403961129325352,-2.0164961579941543,-101.16278377595994,78.837216224040063,null,75426.25,5689119189.0625,null,16.168254556899953,-9.4102026343135705,null,20.586199703362027,-91.752581141646402,null,0,0]
[75858,75.858000000000004,13.753114660990574,1.4980213030225109,1.0008203369444539,4.0491395204966786E-2,1,0,143382.27230579444,1.570789352432,12.048829214444496,1.487705131722227,1.0033010046684345,8.1141230544959628E-2,1.0053102195736434,0.14486116693082882,-2.0669172651186134,-101.21967107370175,78.780328926298253,null,75858,5754436164,null,16.167587253630341,-9.4094252562794516,null,20.536445899507182,-91.810245817422285,null,0,0]
[76299.75,76.299750000000003,13.832782077714839,1.4984411727612044,1.0008299150590183,4.0726932105583591E-2,1,0,144217.2418381841,1.5707893928112255,12.118512206343603,1.4881840097789063,1.003339498454866,8.1611657504883736E-2,1.005372240893575,0.14570169908336358,-2.1182180717058348,-101.27790961368387,78.722090386316125,null,76299.75,5821651850.0625,null,16.166908596213069,-9.4089433576617694,null,20.485823750337229,-91.868966256022119,null,0,0]
[76741.5,76.741500000000002,13.912451905099893,1.4988562337939006,1.0008395486961914,4.0962464484919685E-2,1,0,145052.21137057396,1.570789432725578,12.188197945533114,1.488657411994742,1.0033782142647929,8.2082048265618102E-2,1.0054346222085389,0.14654217835511493,-2.1692308537243625,-101.33618150618571,78.66381849381429,null,76741.5,5889257822.25,null,16.166233950557643,-9.4087731009180171,null,20.43548561397413,-91.927408405267698,null,0,0]
[77183.25,77.183250000000001,13.992124101967514,1.4992665681197448,1.0008492378543701,4.119799231697345E-2,1,0,145887.18090296406,1.5707894721830395,12.257886385158223,1.4891254315493381,1.0034171520725153,8.2552402623200585E-2,1.0054973635162991,0.14738260444684892,-2.2199589835835374,-101.39448608373017,78.605513916269828,null,77183.25,5957254080.5625,null,16.165563182698122,-9.4089091360212969,null,20.385428251974474,-91.985576947708864,null,0,0]
[77625,77.625,14.071798628070846,1.4996722558872146,1.0008589825319416,4.1433515575746302E-2,1,0,146722.15043535436,1.5707895111914105,12.327577479421816,1.4895881595247766,1.0034563118521902,8.3022720373765097E-2,1.0055604648146073,0.14822297705945048,-2.2704057755910374,-101.45282269298573,78.547177307014266,null,77625,6025640625,null,16.16489616245935,-9.4093462331189883,null,20.335648480205752,-92.043476459866739,null,0,0]
[78077,78.076999999999998,14.153324225585441,1.5000826290793576,1.0008690107819016,4.1674498959746793E-2,1,0,147576.49390709295,1.5707895506480081,12.398888328993815,1.4900562399470061,1.0034966099931379,8.3503912883162029E-2,1.005625402877498,0.14908279331325178,-2.3217352850992223,-101.51254538460445,78.487454615395549,null,78077,6096017929,null,16.164217412361531,-9.4100997610716721,null,20.284997720795381,-92.102445623532773,null,0,0]
[78529,78.528999999999996,14.234852179305184,1.500488301638915,1.0008790971541524,4.1915477500714948E-2,1,0,148430.83737883178,1.5707895896503945,{"$f":"SQRT(1+(A535/Zero2)^2)","v":12.470201864083384},{"$f":"ATAN(A535/Zero2)","v":1.4905189668322432},1.0035371404712512,8.3985066635519037E-2,1.0056907178257934,0.14994255294415992,-2.3727770891402917,-101.57230027148346,78.427699728516544,null,78529,6166803841,null,16.163542321691246,-9.4111577774606374,null,20.234631007424596,-92.161142494022826,null,0,0]
[78981,78.980999999999995,14.316382448976206,1.5008893537400123,1.0008892416469366,4.2156451170810065E-2,1,0,149285.18085057085,1.5707896282063676,12.541518038879381,1.4909764313077922,1.0035779032583805,8.4466181412762603E-2,1.0057564096570457,0.15080225563214122,-2.423534557786577,-101.63208669726248,78.36791330273752,null,78981,6237998361,null,16.162870762510163,-9.4125150490280198,null,20.184545097959393,-92.219571648234464,null,0,0]
[79433,79.433000000000007,14.397914995255288,1.5012858637467565,1.0008994442584871,4.2397419942194793E-2,1,0,150139.52432231011,1.5707896663235483,12.612836808605099,1.491428722448781,1.0036188983262198,8.494725699692672E-2,1.0058224783687935,0.15166190105729491,-2.4740110030660531,-101.69190401945937,78.308095980540628,null,79433,6309601489,null,16.162202610503023,-9.4141664600930763,null,20.134736804687059,-92.277737559366315,null,0,0]
[79895.5,79.895499999999998,14.481343866239111,1.5016869630246361,1.0009099440353568,4.2643981339700703E-2,1,0,151013.71426850371,1.5707897048797623,12.685814960060325,1.4918862561813016,1.0036610861206567,8.5439467212887976E-2,1.0058904719746162,0.15254145651458265,-2.5253725245224388,-101.75314222865782,78.246857771342178,null,79895.5,6383290920.25,null,16.161522338078392,-9.4161554853531921,null,20.084055555655304,-92.336986743304621,null,0,{"$f":"IF(AD538>0,S538,0)","v":0}]
[80358,80.358000000000004,14.564775040300049,1.5020834671442027,1.0009205046587883,4.2890537549300271E-2,1,0,151887.90421469754,1.5707897429921562,12.75879573674785,1.4923385557883493,1.0037035170524899,8.5931635932327416E-2,1.0059588601689917,0.15342095134047665,-2.5764466500747654,-101.81441146829535,78.185588531704653,null,80358,6457408164,null,16.160845380722101,-9.4184420009081027,null,20.033658387459266,-92.39596946738726,null,0,0]
[80820.5,80.820499999999996,14.648208478085479,1.5024754544991754,1.0009311261268556,4.3137088541181895E-2,1,0,152762.0941608916,1.5707897806683493,12.831779093874628,1.492785710393733,1.0037461910908851,8.6423762922086617E-2,1.0060276429492396,0.15430038519269682,-2.6272367477914753,-101.87571109275761,78.124288907242388,null,80820.5,6531953220.25,null,16.160171616254331,-9.4210208874172494,null,19.983542054210329,-92.454690205340341,null,0,0]
[81283,81.283000000000001,14.731644141133243,1.5028630017129034,1.0009418084376218,4.3383634285537778E-2,1,0,153636.28410708587,1.5707898179157875,12.904764987659361,1.4932278071133565,1.0037891082048367,8.6915847949127531E-2,1.0060968203126655,0.15517975772911169,-2.6777461277458281,-101.93704047004519,78.06295952995481,null,81283,6606926089,null,16.159500925958326,-9.4238871405815541,null,19.933703364551981,-92.513153329463591,null,0,0]
[81756.25,81.756249999999994,14.817021383825191,1.5032550387600492,1.0009528020183101,4.3635905089612653E-2,1,0,154530.7930628405,1.5707898555927486,12.979449891471036,1.493675032827855,1.0038332744351972,8.741932694810263E-2,1.0061680140264038,0.15607950590841743,-2.7291423221926303,-101.99982549377717,78.000174506222834,null,81756.25,6684084414.0625,null,16.15881770849834,-9.4271123751003643,null,19.882990387565162,-92.572713118676816,null,0,0]
[82229.5,82.229500000000002,14.902400877696669,1.5036425837142291,1.0009638592987919,4.3888170336255521E-2,1,0,155425.30201859542,1.57078989283603,13.054137361608431,1.4941171411478298,1.0038776951059329,8.7922761517713194E-2,1.0062396208735238,0.15697918916414869,-2.7802514293754803,-102.0626403727569,77.937359627243097,null,82229.5,6761690670.25,null,16.15813746889777,-9.4306282442647049,null,19.832561519982889,-92.632012128492221,null,0,0]
[82702.75,82.702749999999995,14.987782584275429,1.504025713229068,1.0009749802769567,4.4140429993543888E-2,1,0,156319.81097435052,1.5707899296530772,13.128827354273488,1.4945542192376426,1.0039223701832691,8.8426151408686524E-2,1.0063116408510915,0.15787880713024741,-2.8310768155471937,-102.12548447176324,77.874515528236756,null,82702.75,6839744857.5625,null,16.157460090484165,-9.4344297400688788,null,19.782413512224778,-92.691054731694393,null,0,0]
[83176,83.176000000000002,15.07316646595994,1.5044045022265855,1.0009861649506813,4.4392684029559544E-2,1,0,157214.31993010582,1.5707899660511651,13.203519826657718,1.4949863522970832,1.0039672996332438,8.8929496371884756E-2,1.0063840739561571,0.15877835944082244,-2.8816217890097979,-102.18835716893042,77.811642831069577,null,83176,6918246976,null,16.156785459895289,-9.4385119670667628,null,19.732543169351043,-92.749845201863664,null,0,0]
[83660.5,83.660499999999999,15.16058229032495,1.5047878756625592,1.0009976814866937,4.4650928739124428E-2,1,0,158130.09296563367,1.570790002887908,13.279990398022962,1.4954237221330278,1.0040135606158969,8.9444759943767937E-2,1.0064586568981444,0.15969922732367769,-2.9330812110875835,-102.25275345300953,77.747246546990468,null,83660.5,6999079260.25,null,16.15609752370391,-9.4429770599815619,null,19.681771683464643,-92.809776393027988,null,0,0]
[84145,84.144999999999996,15.248000317370655,1.5051668533314704,1.0010092647780331,4.490916748929559E-2,1,0,159045.86600116169,1.5707900393004453,13.356463480659841,1.4958560836862673,1.0040600881360804,8.9959975898441555E-2,1.0065336728363399,0.16062002561684355,-2.9842535670987136,-102.31717843333213,77.682821566667869,null,84145,7080381025,null,16.155412237229761,-9.4477263537879406,null,19.631284613927658,-92.869452079544189,null,0,0]
[84629.5,84.629499999999993,15.335420509428577,1.5055415102982663,1.0010209148223821,4.5167400245838027E-2,1,0,159961.63903668997,1.5707900752960622,13.432939031678705,1.4962835223322628,1.0041068821567427,9.0475143969018498E-2,1.0066091217675266,0.16154075392825851,-3.0351422267044992,-102.38163148377329,77.61836851622671,null,84629.5,7162152270.25,null,16.154729488902554,-9.4527549419582542,null,19.58107870264908,-92.928876541815058,null,0,0]
[85114,85.114000000000004,15.422842829683365,1.5059119199308277,1.0010326316174103,4.5425626974521544E-2,1,0,160877.4120722184,1.5707901108818787,13.509417009159714,1.4967061215204942,1.0041539426406267,9.0990263888762926E-2,1.0066850036884702,0.16246141186604804,-3.0857505015396551,-102.44611199133351,77.55388800866649,null,85114,7244392996,null,16.154049170322487,-9.4580580283145679,null,19.53115074639399,-92.98805396301897,null,0,0]
[85609.5,85.609499999999997,15.512252134143399,1.5062864209326365,1.0010446834671076,4.5689710165587961E-2,1,0,161813.97665241337,1.5707901468590177,13.587633795774538,1.4971333948119765,1.0042023471446437,9.1517028916732607E-2,1.0067630562625089,0.16340289905785815,-3.137221163483142,-102.51208422643924,77.487915773560758,null,85609.5,7328986490.25,null,16.153355809275894,-9.4637605462564647,null,19.480373445497097,-93.04832368018279,null,0,0]
[86105,86.105000000000004,15.601663589276377,1.5066566295359904,1.0010568051279092,4.5953786979575771E-2,1,0,162750.54123260855,1.5707901824220889,13.665853034585593,1.497555777011822,1.0042510302692218,9.2043743018817653E-2,1.0068415617036388,0.16434431181582407,-3.1884053904773917,-102.5780839232095,77.421916076790495,null,86105,7414071025,null,16.152664769924584,-9.4697403615440816,null,19.429880257854158,-93.108343561665421,null,0,0]
[86600.5,86.600499999999997,15.691077158317171,1.5070226190175624,1.001068996597279,4.621785737988568E-2,1,0,163687.10581280393,1.5707902175781991,13.744074683725616,1.4979733514780236,1.0042999919738433,9.2570405910195039E-2,1.0069205200083438,0.16528564972138318,-3.2393065450722607,-102.64411046623037,77.355889533769627,null,86600.5,7499646600.25,null,16.151975945926274,-9.4759926822042662,null,19.379667927257604,-93.168117784026123,null,0,0]
[87096,87.096000000000004,15.780492805333058,1.5073844609978013,1.0010812578726664,4.6481921329923744E-2,1,0,164623.67039299945,1.5707902523342943,13.822298702273793,1.4983861996883892,1.0043492322177658,9.3097017306210769E-2,1.0069999311730888,0.1662269123561817,-3.2899279319555008,-102.71016325293208,77.289836747067923,null,87096,7585713216,null,16.15128923396264,-9.482512823990989,null,19.329733252337991,-93.227650428941075,null,0,0]
[87603.25,87.603250000000003,15.872030919019116,1.5077506603787165,1.0010938822108124,4.6752240419801486E-2,1,0,165582.44412317968,1.5707902875073061,13.902380092486993,1.4988040253907797,1.0043999285988365,9.3636062821303004E-2,1.0070816945401477,0.16719041714203875,-3.3414633181885884,-102.77780894572085,77.222191054279151,null,87603.25,7674329410.5625,null,16.150588320663388,-9.489460222925242,null,19.278898779404159,-93.288348722795618,null,0,0]
[88110.5,88.110500000000002,15.963571136765783,1.5081126599991894,1.0011065796994532,4.7022552672272025E-2,1,0,166541.21785336011,1.5707903222753374,13.982463881953269,1.4992170650173333,1.0044509167989524,9.4175053766657843E-2,1.007163932492066,0.16815384215837309,-3.3927123394526237,-102.84548090338554,77.154519096614465,null,88110.5,7763460210.25,null,16.1498894109079,-9.4966786939863646,null,19.228348667895609,-93.348802209399182,null,0,0]
[88617.75,88.617750000000001,16.055113422583371,1.5084705316015099,1.0011193503358056,4.7292858048093543E-2,1,0,167499.99158354072,1.5707903566453429,14.06255002968263,1.499625400195931,1.0045021967736756,9.471398983744321E-2,1.0072466450249904,0.16911718695704595,-3.4436783612306376,-102.91317851902825,77.08682148097175,null,88617.75,7853105615.0625,null,16.14919240304943,-9.5041635431741636,null,19.178079653976067,-93.409014975854106,null,0,0]
[89125,89.125,16.146657741297552,1.5088243453052652,1.0011321941170701,4.7563156508030231E-2,1,0,168458.76531372155,1.5707903906241183,14.142638495612351,1.5000291107118062,1.0045537684783228,9.5252870729016628E-2,1.0073298321350466,0.17008045109015307,-3.4943646910775921,-102.98090119836797,77.019098801632026,null,89125,7943265625,null,16.148497198336827,-9.5119101820661403,null,19.128088528841719,-93.4689910163018,null,0,0]
[89644,89.644000000000005,16.240324671840739,1.5091822262893637,1.0011454111163347,4.7839708995040281E-2,1,0,169439.74819388703,1.5707904249919804,14.224584498928563,1.5004374675716516,1.0046068366939693,9.5804176893539414E-2,1.007415437391459,0.17106594443253079,-3.5459390303933329,-103.05021794831677,76.949782051683229,null,89644,8036046736,null,16.147787656037707,-9.520102543051296,null,19.077223731825097,-93.530115405265462,null,0,0]
[90163,90.162999999999997,16.333993658569142,1.5095360027068361,1.0011587046824548,4.8116254158972652E-2,1,0,170420.73107405272,1.5707904589641832,14.306532847096438,1.5008411463318421,1.0046602102159863,9.6355424648272028E-2,1.0075015394577018,0.17205135238107092,-3.5972273953571117,-103.1195597168584,76.880440283141596,null,90163,8129366569,null,16.147079801102873,-9.5285595700990644,null,19.026643221796149,-93.59100014675937,null,0,0]
[90682,90.682000000000002,16.427664666310246,1.5098857446814244,1.0011720748123805,4.8392791957821063E-2,1,0,171401.71395421863,1.5707904925475198,14.388483500051283,1.5012402267930454,1.0047138889957175,9.6906613667530186E-2,1.007588138329558,0.17303667445678708,-3.6482331489519289,-103.18892590623776,76.811074093762244,null,90682,8223225124,null,16.146373536548722,-9.537276672696839,null,18.976343732755485,-93.651649233540908,null,0,0]
[91201,91.200999999999993,16.521337660688445,1.5102315207505155,1.0011855215030441,4.8669322349586007E-2,1,0,172382.6968343847,1.5707905257486294,14.470436418634891,1.5016347869540696,1.0047678729842384,9.7457743625841795E-2,1.0076752340027886,0.1740219101809555,-3.6989595962904387,-103.25831593106496,76.741684068935044,null,91201,8317622401,null,16.145668768158302,-9.5462493635743222,null,18.926322053807393,-93.712066567490623,null,0,0]
[91732,91.731999999999999,16.617178525677588,1.5105812569929176,1.0011993583331216,4.8952238797882811E-2,1,0,173386.36139964149,1.5707905593285749,14.554286507284061,1.5020338711216197,1.0048234209818079,9.8021555009053282E-2,1.00776485760864,0.17502983605339015,-3.7505732293018079,-103.32933442010628,76.670665579893722,null,91732,8414759824,null,16.144949157541522,-9.5556894618026096,null,18.875428031412802,-93.773644958303692,null,0,0]
[92263,92.263000000000005,16.713021399892892,1.5109269820663176,1.0012132752986955,4.9235147403689214E-2,1,0,174390.02596489852,1.570790592521996,14.638138887411337,1.5024283831639731,1.0048792883605653,9.8585303880015976E-2,1.0078550012458791,0.17603767052200472,-3.8019013104280082,-103.40037665802437,76.599623341975629,null,92263,8512461169,null,16.144230922017723,-9.5653879196741176,null,18.824818185810408,-93.834988738350262,null,0,0]
[92794,92.793999999999997,16.808866248964996,1.5112687645029084,1.0012272723964248,4.9518048122046736E-2,1,0,175393.69053015576,1.5707906253355284,14.721993519861849,1.5028184010840233,1.0049354750672443,9.9148989890852413E-2,1.0079456649098926,0.17704541307495769,-3.8529471997947935,-103.4714420558858,76.528557944114198,null,92794,8610726436,null,16.143513969079958,-9.5753402484005505,null,18.774489249381382,-93.896101807485266,null,0,0]
[93325,93.325000000000003,16.904713039303292,1.5116066712843521,1.0012413496229482,4.9800940908004417E-2,1,0,176397.35509541311,1.5707906577756561,14.805850366366727,1.5032040011230448,1.0049919810482868,9.9712612693922509E-2,1.0080368485960427,0.1780530632007013,-3.9037141997228746,-103.54253003687312,76.457469963126883,null,93325,8709555625,null,16.142798208864306,-9.5855420601318517,null,18.724438009668955,-93.956987976741289,null,0,0]
[93868.5,93.868499999999997,17.002818086103886,1.5119485873034435,1.0012558412111521,5.0090484867055265E-2,1,0,177424.64641597334,1.5707906905993612,14.891683497908053,1.5035941810487474,1.005050147788223,0.10028943763397163,1.0081307173145324,0.17908433765370196,-3.9553908525646704,-103.61531426088662,76.38468573911338,null,93868.5,8811295292.25,null,16.14206674336009,-9.5962379123930504,null,18.673492822331372,-94.019076348493556,null,0,0]
[94412,94.412000000000006,17.100925097838736,1.5122865802570784,1.0012704167379105,5.0380020420576856E-2,1,0,178451.93773653379,1.5707907230451548,14.977518870579889,1.5039798888313578,1.0051086488967216,0.10086619561913761,1.0082251308165726,0.18011551419321362,-4.0067821518718612,-103.688120958418,76.311879041582003,null,94412,8913625744,null,16.141336344990481,-9.6071861416941609,null,18.622831921393793,-94.080934816723826,null,0,0]
[94955.5,94.955500000000001,17.199034040882609,1.5126207172027288,1.0012850761995582,5.0669547520393321E-2,1,0,179479.2290570944,1.5707907551195264,15.063356446070403,1.5043612008077853,1.0051674843154008,0.10144288627742765,1.0083200890971105,0.18114659227167146,-4.0578914590709827,-103.76094954823996,76.239050451760036,null,94955.5,9016546980.25,null,16.140606925428525,-9.6183823533106256,null,18.572452033756626,-94.14256719492937,null,0,0]
[95499,95.498999999999995,17.297144882372507,1.5129510636799335,1.0012998195924081,5.0959066118337261E-2,1,0,180506.52037765522,1.5707907868288171,15.149196186935107,1.5047381915899318,1.0052266539855603,0.10201950923711496,1.0084155921510667,0.18217757134184004,-4.1087220777530353,-103.83379946101493,76.166200538985066,null,95499,9120059001,null,16.139878398876306,-9.6298222513603253,null,18.522349941626793,-94.203977209654639,null,0,0]
[96611.5,96.611500000000007,17.497975527680566,1.5136157036058546,1.0013302598255358,5.1551660268711795E-2,1,0,182609.30159959485,1.5707908506225918,15.324909707635307,1.5054966906771943,1.0053488115355937,0.10319959655024891,1.0086127778807568,0.18428759003797671,-4.2119127296467234,-103.9829814271872,76.017018572812802,null,96611.5,9333781932.25,null,16.138389601392443,-9.6539811325368294,null,18.420648087216975,-94.329000294650385,null,0,0]
[97724,97.724000000000004,17.698813727232462,1.5142652597417889,1.0013610516721843,5.2144218182629487E-2,1,0,184712.08282153521,1.5707909129638968,15.50063184518163,1.5062379928089991,1.0054723687991511,0.10437939547647364,1.0088122460767559,0.18639718692471227,-4.3139763899018995,-104.1322457705469,75.867754229453098,null,97724,9549980176,null,16.136903514357918,-9.6791087201094772,null,18.320070513996317,-94.453137050437419,null,0,0]
[98862,98.861999999999995,17.904262960037187,1.5149146268532345,1.0013929130707291,5.2750320400706437E-2,1,0,186863.06262429382,1.5707909752824791,15.680390384403248,1.5069790957641094,1.0056002058300526,0.10558593529419169,1.0090186478479513,0.18855469731434843,-4.4172407696654634,-104.28501204454334,75.714987955456664,null,98862,9773695044,null,16.135385495492717,-9.7057798585889401,null,18.218324153097953,-94.579232185954382,null,0,0]
[100000,100,18.109719571366561,1.5155492599553397,1.0014251423173857,5.335638382857797E-2,1,0,189014.04242705312,1.5707910361826904,15.860157340598489,1.5077033990463977,1.0057295063783303,0.1067921666324663,1.0092274378241175,0.19071175643595997,-4.5193804178593728,-104.43785528326423,75.562144716735773,null,100000,10000000000,null,16.133868985053141,-9.7333957915825327,null,18.117701015343627,-94.704459491681675,null,0,0]
[101165,101.16500000000001,18.320058196322876,1.516184204773203,1.0014585172356432,5.3976785974684083E-2,1,0,191216.056021267,1.5707910971085366,16.044197841400841,1.5084280735451727,1.005863390114808,0.10802669373170228,1.0094436553362396,0.1929195209143518,-4.6228056580116696,-104.59439999690244,75.405600003097561,null,101165,10234357225,null,16.132317414657638,-9.7626116845899489,null,18.015827345586828,-94.831788312312455,null,0,0]
[102330,102.33,18.530404039426173,1.516804734824013,1.0014922775883275,5.4597146531980729E-2,1,0,193418.0696154816,1.5707911566471333,16.228246576754703,1.5091363109676088,1.0059988064351855,0.10926089035501253,1.0096623756180383,0.19512680186776021,-4.7251067092931649,-104.75101624489072,75.248983755109279,null,102330,10471428900,null,16.13076615810656,-9.7927503383408609,null,17.915077550856406,-94.95826590654984,null,0,0]
[103520,103.52,18.745270941313795,1.5174242029726421,1.001527160301428,5.523077611841315E-2,1,0,195667.33672030232,1.5707912160798598,16.416253069307722,1.5098433507925932,1.0061387103105783,0.11052122692470578,1.0098883733197626,0.19738094460619657,-4.8284696619389074,-104.91106269332265,75.088937306677352,null,103520,10716390400,null,16.129181326539513,-9.8244553119116258,null,17.813299429777715,-95.086607381411,null,0,0]
[104710,104.71,18.96014487348733,1.5180296305749807,1.0015624450860126,5.5864361313995345E-2,1,0,197916.60382512375,1.5707912741617134,16.604267582588076,1.5105343789586689,1.0062802119393854,0.11178121104203897,1.0101169822454306,0.19963457157769895,-4.9307139562607727,-105.07117479889641,74.928825201103592,null,104710,10964184100,null,16.127595619903431,-9.8570574145298533,null,17.712640842091925,-95.214117384366546,null,0,0]
[105930,105.93,19.180442846571694,1.5186362386377708,1.0015990367621299,5.6513872634424096E-2,1,0,200222.57514267243,1.5707913323530895,16.797030002172775,1.5112267679583098,1.0064269388109808,0.11307258954096887,1.0103540651579594,0.20194447129258219,-5.0344017856061782,-105.23538703265743,74.764612967342572,null,105930,11221164900,null,16.125968446675962,-9.8913803189712493,null,17.610580185973994,-95.344006713686184,null,0,0]
[107150,107.15,19.400747717259691,1.5192290702588953,1.0016360509468041,5.7163336225094619E-2,1,0,202528.54646022178,1.5707913892193426,16.989800291569324,1.5119034452577933,1.0065753435680014,0.11436358940271703,1.0105938924879623,0.20425381682377328,-5.1369683303703537,-105.39965936065298,74.600340639347024,null,107150,11481122500,null,16.124339203522283,-9.9265816672852036,null,17.509642884363497,-95.473077693367813,null,0,0]
[108400,108.4,19.626476832055506,1.5198226756370219,1.0016744134879947,5.7828720159859077E-2,1,0,204891.22199049839,1.5707914461563299,17.187318719556675,1.5125810183598096,1.0067291371282745,0.11568593812108667,1.0108424636201878,0.20661936836547914,-5.2409213990669601,-105.56802905585,74.431970944149995,null,108400,11750560000,null,16.122667192910413,-9.9635278511264804,null,17.407361826278766,-95.604501204723505,null,0,0]
[109650,109.65,19.852212705309171,1.5204027816597201,1.0017132194722065,5.849405283573661E-2,1,0,207253.89752077567,1.5707915017951646,17.384844859028338,1.5132431946254001,1.0068846905217299,0.11700788057169799,1.0110939156641066,0.20898432517155616,-5.3437520531633274,-105.73645297796972,74.263547022030281,null,109650,12023122500,null,16.120991909432632,-10.001332856907229,null,17.306206455660174,-95.735120121062508,null,0,0]
[110925,110.925,20.082470022239004,1.5209810544591287,1.0017532583576554,5.9172638753564447E-2,1,0,209663.82656165914,1.5707915572549316,17.586329196187151,1.5139032900370637,1.0070451671174239,0.11835583873914561,1.0113533645913173,0.2113959616303667,-5.447510254556299,-105.90829686106186,74.091703138938144,null,110925,12304355625,null,16.119279220517726,-10.040747667353513,null,17.204160943182107,-95.867549193708328,null,0,0]
[112200,112.2,20.312733902483942,1.5215462169154472,1.001793758492294,5.9851170116597151E-2,1,0,212073.75560254324,1.5707916114542493,17.787821022569101,1.5145484312419386,1.0072074729203313,0.11970336492267174,1.011615810670736,0.2138069655841828,-5.5501549644021564,-106.08018845258078,73.919811547419215,null,112200,12588840000,null,16.117562087315488,-10.080994467661755,null,17.103233366538493,-95.999193984919046,null,0,0]
[113510,113.51,20.549325356127635,1.5221137013764463,1.0018358507521252,6.0548270359329213E-2,1,0,214549.83955827577,1.5707916658732102,17.994851533124642,1.5151962340446621,1.0073761384639792,0.12108742716383285,1.011888582766022,0.2162834878971546,-5.6544849506489081,-106.25684396836026,73.743156031639742,null,113510,12884520100,null,16.115792683811769,-10.123182144135898,null,17.000672783795455,-96.133661824224376,null,0,0]
[114820,114.82,20.7859232767977,1.5226682671115701,1.0018784298117884,6.1245311688319683E-2,1,0,217025.92351400893,1.5707917190504217,18.201889423406652,1.515829300206557,1.0075467331176067,0.12247102336454815,1.01216451865797,0.21875932770059836,-5.7576941894329252,-106.43354114028979,73.56645885971021,null,114820,13183632400,null,16.11401759153911,-10.166187394637012,null,16.8992386372841,-96.267353745652784,null,0,0]
[116155,116.155,21.027042852270224,1.5232205764302829,1.0019223222082529,6.1955594028356584E-2,1,0,219549.26098034831,1.5707917720084421,18.412885753049423,1.516459800771111,1.0077225670638648,0.12388053936863951,1.0124489753543831,0.22128170643762182,-5.8617472862313154,-106.61364894019388,73.386351059806117,null,116155,13491984025,null,16.112202292618576,-10.210824725820107,null,16.797000839406245,-96.402824214373766,null,0,0]
[117490,117.49,21.268168696511047,1.5237603624015847,1.0019667200310995,6.2665813780492255E-2,1,0,222072.59844668824,1.5707918237629737,18.623889236528179,1.5170760147840698,1.0079004023873184,0.12528956077740716,1.0127367175778874,0.22380336069209317,-5.9646906954564249,-106.79379143330674,73.206208566693263,null,117490,13803900100,null,16.11038014553322,-10.256252208934844,null,16.695879577266489,-96.537539224371869,null,0,0]
[118860,118.86,21.51562248850799,1.5243017211745424,1.0020128072477463,6.3394587712755565E-2,1,0,224662.0908278767,1.5707918756656638,18.840431832088239,1.5176940338558431,1.0080849797200266,0.12673500301529156,1.0130354193720155,0.22639036423535003,-6.0692065415259631,-106.97868854958163,73.021311450418366,null,118860,14127699600,null,16.108502652348623,-10.303663038083632,null,16.593241224381543,-96.675025511497992,null,0,0]
[120230,120.23,{"$f":"SQRT(1+(A589/pole1)^2)","v":21.763082442679739},{"$f":"ATAN(A589/pole1)","v":1.52483076891921},{"$f":"SQRT(1+(A589/Zero1)^2)","v":1.0020594265957452},{"$f":"ATAN(A589/Zero1)","v":6.412329422173256E-2},{"$f":"IF(VIN_nom>Vout, 1, SQRT(1+(A589/z_RHP)^2))","v":1},{"$f":"IF(VIN_nom>Vout, 0, -ATAN(A589/z_RHP))","v":0},{"$f":"SQRT(1+(A589/Pole2)^2)","v":227251.58320906572},{"$f":"ATAN(A589/Pole2)","v":1.5707919263855095},19.056981460167762,1.5182980077186452,{"$f":"SQRT(1+(A589/pole4)^2)","v":1.0082716624742727},{"$f":"ATAN(A589/pole4)","v":0.12817991302024268},{"$f":"SQRT((1-(V589/pterm2))^2+(A589/pterm1)^2)","v":1.0133375810313709},{"$f":"IF((ATAN((A589/pterm1)/(1-A589^2/pterm2))>0),ATAN((A589/pterm1)/(1-A589^2/pterm2)),PI()+ATAN((A589/pterm1)/(1-A589^2/pterm2)))","v":0.22897658799032802},{"$f":"20*LOG10(((E589*K589*G589)/(C589*I589*O589*M589))*Adc)","v":-6.1726082549484023},{"$f":"((F589+L589+H589)-(D589+J589+P589+N589))*radconv","v":-107.16361364911016},{"$f":"IF(R589>0,R589,R589+180)","v":72.836386350889839},null,120230,14455252900,null,{"$f":"20*LOG10((K589/(I589*M589))*AEA)","v":16.106617049400871},{"$f":"(L589-(J589+N589))*radconv","v":-10.351848035956941},null,{"$f":"20*LOG10((E589*G589/(C589*O589))*Acs*Am)","v":16.491725113906863},{"$f":"(F589+H589-(D589+P589))*radconv","v":-96.811765613153241},null,0,0]
[126030,{"$f":"A590/1000","v":126.03},22.81078677486779,1.5269433639171512,1.0022626866035345,6.7207564548071946E-2,1,0,238214.39766958012,1.57079212889582,19.973833550988758,1.5207098860302684,1.0090852957254435,0.13429102220095682,1.0146551329294031,0.2399167304526561,-6.5986116773844188,-107.94672666422359,72.05327333577641,null,{"$f":"IF(Q590<0,A590,1000000000)","v":126030},{"$f":"A590^2","v":15883560900},null,16.09853524088081,-10.563809955428662,null,16.073803499990905,-97.382916708794937,null,{"$f":"SUM((Q591<0)*(Q590>0))*A590","v":0},0]
[131830,131.83000000000001,23.858583971440606,1.5288704092698664,1.0024754769398962,7.0290554827341173E-2,1,0,249177.21213010343,1.5707923135868209,20.890791633621596,1.5229100474025503,1.0099365523880683,0.14039205703555738,1.0160346869602506,0.25084210355905551,-7.0069184803517528,-108.72998783590023,71.270012164099768,null,131830,17379148900,null,16.090274082686268,-10.787324123504378,null,15.673757855218115,-97.942663712395841,null,0,0]
[144540,144.54,26.154975267729164,1.5325533621039746,1.0029750765350647,7.7041797899637582E-2,1,0,273200.89692206925,1.5707926664848051,22.900503029026723,1.5271152742319387,1.0119330687460186,0.15372442596891275,1.0192745796877889,0.27472899772677639,-7.8472643860991989,-110.44577291951602,69.554227080483983,null,144540,20891811600,null,16.071446659193068,-11.310291065240506,null,14.852239372963869,-99.135481854275525,null,0,0]
[158490,158.49,28.675744514661741,1.5359165769620635,1.0035759834546447,8.4443584603633659E-2,1,0,299568.35584011301,1.5707929886586065,25.106671716196452,1.5309557375790521,1.0143305402804543,0.16829420845480328,1.0231731386695295,0.30085334437898331,-8.696376658428651,-112.32595776824172,67.674042231758278,null,158490,25119080100,null,16.049498528051942,-11.925054228842937,null,14.025075231775544,-100.40090353939883,null,0,0]
[173780,173.78,31.438962138510238,1.5389832951281293,1.0042976886287389,9.2545697820948306E-2,1,0,328468.60292665818,1.5707932823638884,27.525113016329698,1.5344578705682876,1.0172043889393447,0.18418087617584977,1.0278578578254887,0.32936556050855159,-9.5546148435664229,-114.38067893420013,65.619321065799866,null,173780,30199488400,null,16.0237648438479,-12.634652629092784,null,13.19257073084181,-101.74602630510732,null,0,0]
[190550,190.55,34.469929058075707,1.5417814622011332,1.0051649413066677,0.10141802928168685,1,0,360166.25784109737,1.5707935502993804,30.177971004665906,1.5376535055713438,1.0206498270632096,0.20149755338679359,1.0334908944951264,0.36047886728959833,-10.42436862036266,-116.62440759093876,63.375592409061241,null,190550,36309302500,null,15.993429342178047,-13.443744102428242,null,12.353152455715426,-103.18066348851052,null,0,0]
[208930,208.93,37.792141148413585,1.544332710295651,1.0062061695199525,0.11112372810489139,1,0,394907.03883858141,1.5707937945533774,33.085810503399166,1.5405672860015165,1.02477504205126,0.22033667614307212,1.0402590748031408,0.39437242702795616,-11.307132762808827,-119.06891458523648,60.931085414763515,null,208930,43651744900,null,15.957591671138271,-14.356213000780969,null,11.50622598430904,-104.71270158445553,null,0,0]
[229090,229.09,41.436326176564833,1.5466605698876794,1.00745699071298,0.12174518269224215,1,0,433012.26979123062,1.5707940173915154,36.275526691123183,1.5432260393517117,1.0297143957510113,0.24081858147149085,1.0483970758362917,0.43127945790841882,-12.20605511961524,-121.72954785552068,58.270452144479322,null,229090,52482228100,null,15.915159195436351,-15.377417155605144,null,10.649736103204541,-106.35213069991555,null,0,0]
[251190,251.19,45.431406319264255,1.5487833439820806,1.008958418175516,0.13335702271834615,1,0,474784.37316692312,1.5707942205756178,39.772434872717646,1.5456506349286969,1.0356202932732934,0.26303660662948014,1.0581763095578727,0.47138938507009004,-13.123494041597466,-124.61808559102674,55.381914408973259,null,251190,63096416100,null,15.864928621320761,-16.511508775573496,null,9.7825277553379095,-108.10657681545327,null,0,0]
[275420,275.42,49.811728358660922,1.5507193847430381,1.0107603949632566,0.14604646043061897,1,0,520582.4756462645,1.5707944058696892,{"$f":"SQRT(1+(A599/Zero2)^2)","v":43.606598905429216},{"$f":"ATAN(A599/Zero2)","v":1.5478620073497269},1.0426757426065199,0.28709354018317046,1.0699286905734298,0.51491448869996748,-14.062875873942914,-127.74743514528961,52.252564854710386,null,275420,75856176400,null,15.805492417696982,-17.763177847568461,null,8.9025821266162382,-109.98425729772111,null,0,0]
[302000,302,54.617064224594124,1.5524860075869977,1.0129236199214038,0.15991219146600119,1,0,570822.40812258748,1.5707945749365502,47.812831819057038,1.5498799141557222,1.0510995088648838,0.31309547095611495,1.0840597082432113,0.5620802023570961,-15.028484069497718,-131.13079668005537,48.869203319944631,null,302000,91204000000,null,15.735216799727356,-19.13737088500309,null,8.0072495490310587,-111.99342579505229,null,0,0]
[331130,331.13,59.88357145528304,1.5540964797746797,1.0155170148799471,0.17503707133619897,1,0,625882.19868074043,1.5707947290501418,52.422783235766737,1.5517194942594268,1.0611336703828833,0.34109676461499111,1.1010335007143526,0.61302645837432057,-16.023652180521513,-134.77444821477133,45.225551785228674,null,331130,109647076900,null,15.652372003065347,-20.636335488315812,null,7.0949262346692743,-114.13811272645553,null,0,0]
[363080,363.08,65.660064196776261,1.5555657802690728,1.0186271380471992,0.19153338503998391,1,0,686272.18523526844,1.5707948696471037,57.479181820446691,1.55339784579188,1.0730766880598503,0.37118039903036681,1.1214367527977436,0.66795466748668753,-17.053927839850694,-138.68812922268773,41.311870777312265,null,363080,131827086400,null,15.554892805004119,-22.263846370854694,null,6.1621297734013183,-116.42428285183303,null,0,{"$f":"IF(AD602>0,S602,0)","v":0}]
[398110,398.11,71.993549958018193,1.5569057468840282,1.0223535588989809,0.20949915929841897,1,0,752483.80429647432,1.5707949978626401,63.023175172238211,1.5549284819386231,1.0872607685335502,0.40337221365494952,1.1459518911502586,0.72697281991529727,-18.124168461150706,-142.87379513520858,37.126204864791418,null,398110,158491572100,null,15.440612496813678,-24.020609840748758,null,5.2061694602917497,-118.85318529445983,null,0,0]
[436520,436.52,78.93826926251792,1.558127861192846,1.0268158512611039,0.22904152187718127,1,0,825084.09799163102,1.5707951147972319,69.102242534006677,1.5563245112682895,1.1040727686146026,0.43768001413157664,1.1754078327017066,0.79016706284942473,-19.240127130229439,-147.33059792733135,32.669402072668646,null,436520,190549710400,null,15.30714892439514,-25.906322125783383,null,4.2236743636315515,-121.42427580154802,null,0,0]
[478630,478.63,86.552079688470329,1.5592423323319411,1.0321544224221229,0.25026318379262552,1,0,904677.91125649586,1.5707952214291221,75.767029595559535,1.5575975906115238,1.1239496179574286,0.47406576296731534,1.2107925051401349,0.85755053316618202,-20.407641795328423,-152.05114310038701,27.948856899612991,null,478630,229086676900,null,15.152013013135106,-27.918136006997749,null,3.2112956097926091,-124.13300709338924,null,0,0]
[524810,524.80999999999995,94.901880077412372,1.5602589327460512,1.0385374606275988,0.27327358566818283,1,0,991964.5960480388,1.5707953186944019,83.076096596387359,1.5587588793051523,1.147394709451609,0.51246262620135852,1.2533088883487538,0.92909365558041568,-21.633253369885047,-157.02355691620315,22.976443083796852,null,524810,275425536100,null,14.972565749471114,-30.051582851236123,null,2.1651312988999778,-126.97197406496703,null,0,0]
[575440,575.44000000000005,104.05637819565884,1.5611860039049674,1.046159198726784,0.29816397103013542,1,0,1087662.4057274722,1.570795407391969,91.089587453409493,1.5598179030708328,1.174959858712638,0.5527328671754278,1.3043777382880883,1.0046433062701698,-22.922833687937683,-162.22587862098604,17.774121379013962,null,575440,331131193600,null,14.766256156570876,-32.29822519141095,null,1.0818605737475779,-129.92765342957503,null,0,0]
[630960,630.96,114.09513120750687,1.5620315986865094,1.0552505331587749,0.32502651409915478,1,0,1192603.0020814629,1.5707954882928987,99.87714340865638,1.5607838587334451,1.2072705751629891,0.59470336380929634,1.3657284644003722,1.083984545687952,-24.282585214496223,-167.63052722826117,12.369472771738828,null,630960,398110521600,null,14.530536373589083,-34.647616967901605,null,-4.217116982916902E-2,-132.98291026035955,null,0,0]
[691830,691.83,125.10131322003164,1.5628027204612505,1.0660769333587758,0.35392788412773207,1,0,1307655.8497051629,1.5707955620676939,109.51157202372347,1.5616647448142258,1.2450030121151907,0.63813033934050822,1.4394131505784933,1.1667683094575816,-25.717632087667305,-173.19965859651271,6.8003414034872947,null,691830,478628748900,null,14.26314740393622,-37.085332557967284,null,-1.2098290733473891,-136.11432603854541,null,0,0]
[758580,758.58,137.17075594978468,1.5635060785850365,1.0789507329628187,0.3849255829278217,1,0,1433822.7230234216,1.5707956293586069,120.076761048444,1.5624682244134682,1.2889106240810562,0.68273670915894458,1.5279284589743458,1.2525743393813549,-27.232824033472806,-178.88996870605661,1.1100312939433934,null,758580,575443616400,null,13.962038451256944,-39.595057156355075,null,-2.4239120664736165,-139.29491154970157,null,0,0]
[831760,831.76,150.40290798735882,1.5641474701916427,1.0942258643750185,0.41803579504577781,1,0,1572143.1992695725,1.5707956907205234,131.65976447379188,1.5632009188956166,1.339788742036131,0.72818081418896552,1.6342324869396856,1.3408426249532914,-28.831148300228083,-184.64882119594498,-4.6488211959449757,null,831760,691824697600,null,13.625717366166135,-42.156835795530974,null,-3.6859152481380835,-142.49198540041405,null,0,0]
[912010,912.01,164.91349189756502,1.5647325043820455,1.1123150842869289,0.45325656340467341,1,0,1723826.968315132,1.57079574669027,144.36188213851847,1.5638692350815973,1.3985163059925609,0.77410999172991402,1.7619350127895841,1.4309675696251043,-30.514917652427194,-190.4213783124911,-10.4213783124911,null,912010,831762240100,null,13.253051010324166,-44.75009533809088,null,-4.9970182444952247,-145.67128297440019,null,0,0]
[1000000,1000,180.82365524276327,1.5652660487126129,1.1336805398963297,0.49053126416542941,1,0,1890140.4242443426,1.5707957977336759,158.28916288506304,1.5644787328813075,1.4660095497642571,0.82013322183749404,1.9153270153546273,1.5222369588882312,-32.284122808548069,-196.14763404241793,-16.147634042417934,null,1000000,1000000000000,null,12.843630651518623,-47.352113458813704,null,-6.3568030418105561,-148.7955205836042,null,0,0]
[]
[]
["Pole/Zero Locations for Chart"]
[{"$f":"Q4*1000","v":59913},null,{"$f":"SQRT(1+(A617/pole1)^2)","v":10.879577136650324},{"$f":"ATAN(A617/pole1)","v":1.4787510717976633},{"$f":"SQRT(1+(A617/Zero1)^2)","v":1.0005117980218452},{"$f":"ATAN(A617/Zero1)","v":3.1986867183924114E-2},{"$f":"IF(VIN_nom>Vout, 1, SQRT(1+(A617/z_RHP)^2))","v":1},{"$f":"IF(VIN_nom>Vout, 0, -ATAN(A617/z_RHP))","v":0},{"$f":"SQRT(1+(A617/Pole2)^2)","v":113243.9832421507},{"$f":"ATAN(A617/Pole2)","v":1.5707874963036741},{"$f":"SQRT(1+(A617/Zero2)^2)","v":9.5359673760457326},{"$f":"ATAN(A617/Zero2)","v":1.4657370383386972},{"$f":"SQRT(1+(A617/pole4)^2)","v":1.0020604141553611},{"$f":"ATAN(A617/pole4)","v":6.4138640599367344E-2},{"$f":"SQRT((1-(A617^2/(pole3^2)))^2+(A617/(Q*pole3))^2)","v":1.0033125808837469},{"$f":"ATAN((A617/(Q*pole3))/(1-A617^2/pole3^2))","v":0.11448924559259434},{"$f":"20*LOG10(((E617*K617*G617)/(C617*I617*O617*M617))*Adc)","v":1.2213757286085324E-2},{"$f":"((F617+L617+H617)-(D617+J617+P617+N617))*radconv","v":-99.147054847712994},{"$f":"IF(R617>0,R617,R617+180)","v":80.852945152287006},"crossover",null,null,null,{"$f":"20*LOG10((K617/(I617*M617))*AEA)","v":16.196338678189875},{"$f":"(L617-(J617+N617))*radconv","v":-9.6938212984366281},null,{"$f":"20*LOG10((E617*G617/(C617*O617))*Acs*Am)","v":22.586825497352343},{"$f":"(F617+H617-(D617+P617))*radconv","v":-89.453233549276348}]
[{"$f":"A617","v":59913},null,null,null,null,null,null,null,null,null,null,null,null,null,null,null,null,-180]
[{"$f":"A618","v":59913}]
[1000000,null,null,null,null,null,null,null,null,null,null,null,null,null,null,null,null,{"$f":"R617","v":-99.147054847712994}]
[]
[{"$f":"pole1","v":5530.3344622701316},null,1.4142135623730951,0.78539816339744828,1.0000043618370673,2.9535812880883095E-3,{"$f":"IF(VIN_nom>Vout, 1, SQRT(1+(A622/z_RHP)^2))","v":1},{"$f":"IF(VIN_nom>Vout, 0, -ATAN(A622/z_RHP))","v":0},10453.108774559572,1.5707006614743597,1.3290148949361182,0.71904209093890137,1.0000175735116463,5.9284490878148723E-3,1.0000282261323257,1.0579811698196424E-2,{"$f":"20*LOG10(((E622*K622*G622)/(C622*I622*O622*M622))*Adc)","v":21.354648367685641},{"$f":"((F622+L622+H622)-(D622+J622+P622+N622))*radconv","v":-94.573067713775458},85.426932286224542,"p1",null,null,null,19.792759333560578,-49.136116845762665,null,{"$f":"20*LOG10((E622*G622/(C622*O622))*Acs*Am)","v":40.332839452381194},{"$f":"(F622+H622-(D622+P622))*radconv","v":-45.436950868012801}]
[{"$f":"Zero1","v":1872411.0973383102},null,338.57251803932223,1.5678427455068082,1.4142135623730951,0.78539816339744828,1,0,3539119.905882495,1.5707960442387734,296.3781576269397,1.5674222525871158,2.2425322699180885,1.1085894923999946,4.1932555421603812,-1.0240897365080464,-46.309895716892171,-49.865555719814253,130.13444428018573,"z1",null,null,null,9.1514687191201638,-63.710803222466595,null,-16.690414017756201,13.845247502652372]
[{"$f":"Pole2","v":0.52906122062329253},null,1.0000000045759267,9.5665320536898605E-5,1.00000000000004,2.8255612315872045E-7,1,0,1.4142135623730951,0.78539816339744828,1.0000000035064438,8.3742986329118476E-5,1.0000000000001608,5.6715362850810878E-7,1.0000000000002585,1.012130766725535E-6,99.269320704720116,-45.000757447910082,134.99924255208992,"p2",null,null,{"$f":"Pole2","v":0.52906122062329253},94.696924474445609,-44.995234427243318,null,43.343346648530627,-5.5230206667575988E-3]
[{"$f":"Zero2","v":6317.6779641853109},null,1.518224290609252,0.85175423585599519,1.0000056922153808,3.3740742077807899E-3,1,0,11941.298549334182,1.5707125838085676,1.4142135623730951,0.78539816339744828,1.0000229334590458,6.7724472339249515E-3,1.0000368352383175,1.2086004668707698E-2,20.121701092360315,-94.684314375752663,85.315685624247337,"z2",null,null,{"$f":"Zero2","v":6317.6779641853109},19.176294032983737,-45.383234575656381,null,39.716357477632712,-49.301079800096282]
[{"$f":"pole3","v":1050000},null,189.86456807584574,1.5655293902959697,1.1465024213275548,0.51107756707353902,1,0,1984647.4454565342,1.5707958229270675,166.20331267233078,1.5647795632447565,1.5056478207070869,0.84441873481633545,2.0087227406497168,{"$error":"#DIV/0!"},-33.255500115662933,{"$error":"#DIV/0!"},{"$error":"#DIV/0!"},"p3",null,null,null,12.611882526244738,-48.72633599068179,null,-7.0964322236515365,{"$error":"#DIV/0!"}]
[{"$f":"Fp2_u","v":932835.82089552248},null,{"$f":"SQRT(1+(A627/pole1)^2)","v":168.67916768161638},{"$f":"ATAN(A627/pole1)","v":1.5648678777070817},{"$f":"SQRT(1+(A627/Zero1)^2)","v":1.1172303100892},{"$f":"ATAN(A627/Zero1)","v":0.46220683439490207},1,0,{"$f":"SQRT(1+(A627/Pole2)^2)","v":1763190.6942578193},{"$f":"ATAN(A627/Pole2)","v":1.5707957596412681},{"$f":"SQRT(1+(A627/Zero2)^2)","v":147.65824078655979},{"$f":"ATAN(A627/Zero2)","v":1.5640238795609718},{"$f":"SQRT(1+(A627/pole4)^2)","v":1.4142135623730951},{"$f":"ATAN(A627/pole4)","v":0.78539816339744828},{"$f":"SQRT((1-(A627^2/(pole3^2)))^2+(A627/(Q*pole3))^2)","v":1.7969770517751911},{"$f":"ATAN((A627/(Q*pole3))/(1-A627^2/pole3^2))","v":1.4532630518340701},-30.940736608312921,-191.83166377484329,{"$f":"IF(R627>0,R627,R627+180)","v":-11.831663774843292},"p4",null,null,null,null,null,null,-5.3258787306364503,-146.44366357501025]
[{"$f":"z_RHP","v":0},null,{"$f":"SQRT(1+(A628/pole1)^2)","v":1},{"$f":"ATAN(A628/pole1)","v":0},{"$f":"SQRT(1+(A628/Zero1)^2)","v":1},{"$f":"ATAN(A628/Zero1)","v":0},1,0,{"$f":"SQRT(1+(A628/Pole2)^2)","v":1},{"$f":"ATAN(A628/Pole2)","v":0},{"$f":"SQRT(1+(A628/Zero2)^2)","v":1},{"$f":"ATAN(A628/Zero2)","v":0},{"$f":"SQRT(1+(A628/pole4)^2)","v":1},{"$f":"ATAN(A628/pole4)","v":0},{"$f":"SQRT((1-(A628^2/(pole3^2)))^2+(A628/(Q*pole3))^2)","v":1},{"$f":"ATAN((A628/(Q*pole3))/(1-A628^2/pole3^2))","v":0},102.27962067065262,0,{"$f":"IF(R628>0,R628,R628+180)","v":180},"z_RHP",null,null,null,null,null,null,43.343346688278515,0]
[{"$f":"Fp2_u","v":932835.82089552248},null,null,null,null,null,null,null,null,null,null,null,null,null,null,null,-25]
[]
[null,null,null,"System","Plant"]
["p1","p-dom",{"$f":"pole1","v":5530.3344622701316},{"$f":"Q622","v":21.354648367685641},{"$f":"AA622","v":40.332839452381194}]
["z1","ESR zero",{"$f":"Zero1","v":1872411.0973383102},{"$f":"Q623","v":-46.309895716892171},{"$f":"AA623","v":-16.690414017756201}]
["p2","EA pole",{"$f":"Pole2","v":0.52906122062329253},{"$f":"Q624","v":99.269320704720116},{"$f":"AA624","v":43.343346648530627}]
["z2","EA zero",{"$f":"Zero2","v":6317.6779641853109},{"$f":"Q625","v":20.121701092360315},{"$f":"AA625","v":39.716357477632712}]
["p3","p_sampling",{"$f":"pole3","v":1050000},{"$f":"Q626","v":-33.255500115662933},{"$f":"AA626","v":-7.0964322236515365}]
[]
[]
[{"$f":"Q4*1000","v":59913}]
[{"$f":"Q4*1000","v":59913}]
[]
[]
[]
[]
[]
[]
[]
[]
[]
[]
[]
[]
[]
[]
[]
[]
[]
[]
[]
[]
[]
[]
[]
[]
[]
[]
[]
[]
[]
[]
[]
[]
[]
[]
[]
[]
[]
[]
[]
[]
[]
[]
[]
[]
[]
[]
[null,null,null,null,null,null,null,null,null,null,null,null,null,null,null,null,null,null,null,null,null,null,null,null,null,null,null,null,null,"phase margin",{"$f":"SUM(AE689:AE1306)","v":0}]

{"sheet":"Bode Plot Management","index":5,"n_rows":6,"n_cols":14,"rows_kept":6,"cut":false,"hidden":true,"merged":[]}
[null,null,null,null,null,null,null,null,null,"Single or dual output (MODE)",null,null,null,"3.3V or 5V fixed (FB1/2)"]
[{"$f":"CHOOSE(BODE_PLOT_TYPE, \"BODE_PLOT_Ch1\", \"BODE_PLOT_Ch2\")","v":"BODE_PLOT_Ch1"},null,null,null,null,null,null,null,null,"With/without dither (DITH)",null,null,null,"With/without VOUT connected to VCCX"]
[null,null,null,null,null,null,null,null,null,"FPWM or DEM (DEMB)"]
[null,null,null,null,null,null,null,null,null,"Shunt or inductor DCR current sensing"]
[]
[null,null,null,null,null,{"$f":"INDIRECT(A2)","v":0}]

{"sheet":"Efficiency Calculations","index":6,"n_rows":109,"n_cols":57,"rows_kept":109,"cut":false,"hidden":true,"merged":[[6,51,6,56],[6,27,6,32],[6,33,6,36],[6,40,6,44],[6,45,6,49],[6,24,6,26],[0,0,3,3],[5,0,6,3],[6,6,6,13],[6,17,6,20],[6,21,6,23]]}
["BUCK CONTROLLER POWER DESIGN TOOL"]
[null,null,null,null,null,null,null,{"$f":"AV19","v":0.87412021847710475},"10% load"]
[null,null,null,null,null,null,null,{"$f":"AV59","v":0.93097940123546352},"50% load",null,null,null,null,null,null,null,null,null,null,null,null,null,null,null,null,null,null,null,null,null,null,null,null,null,null,null,null,null,null,null,null,{"$f":"IF(MODE=1, (Qg_Q1+Qg_Q2)*Fsw*Vin, (Qg_Q1+Qg_Q2+Qg_Q3+Qg_Q4)*Fsw*Vin)","v":0.48195000000000005}]
[null,null,null,null,null,null,null,{"$f":"AV109","v":0.9288533792467043},"100% load",null,null,null,null,null,null,null,null,null,null,null,null,null,null,null,null,null,null,null,null,null,null,null,null,null,null,null,null,null,null,null,"I_VCC",{"$f":"(Qg_Q1+Qg_Q2)*Fsw*1000","v":35.700000000000003},"mA",{"$f":"AP4*5/1000","v":0.17849999999999999}]
[]
["Enter the values of your design and MOSFET datasheet specifications below. Note that thermal resistance (θJA) will change when components are placed on the PCB"]
[null,null,null,null,null,null,"Operating Point Condtions",null,null,null,null,null,null,null,null,null,null,"Filter Inductor",null,null,null,"Cout",null,null,"Cin",null,null,"High-side BUCK \"Control\" MOSFET Losses ",null,null,null,null,null,"Low-side BUCK \"Sync\" MOSFET Losses ",null,null,null,"External Diode","Diode/FET","Sense Rs","Controller IC Losses",null,null,null,null,"RESULTS",null,null,null,null,null,"Consolidated Buck/Boost Efficiency & Losses"]
["Input Parameters",null,null,null,null,null,"Step","Vin","Mode","Iout","Iout/ phase","Iin","Duty Cycle BUCK Leg","Ripple Current pk-pk","Peak Inductor Current","Valley Inductor Current","SW node voltage at Q1 turn-on","Irms Lf","DCR    Loss","Core Loss","Total Inductor Loss","Irms Cout","Cout ESR Loss","Total Cout Loss","Irms Cin","Cin ESR Loss","Total Cin Loss","Irms","RDS(on) Loss","Transition Loss (not including capacitive loss)","MOSFET Output Capacitance Loss","Dead Time Loss ","Total Control MOSFET Loss","Irms","RDS(on) Loss","Deadtime Loss","Total Sync MOSFET Loss","Deadtime Loss","Reverse Recovery Loss","Isense Shunt Loss","IQ Loss","Switching Current Loss","Switching Current Diss","LDO Loss Saved from Gate Drive Current (ext VCC)","Total IC Loss","Total Loss","Pout","EFF, h",{"$f":"IF(Vin>Vout, \"Buck ''CONTROL'' MOSFET Temp Rise\", \"Boost ''CONTROL'' MOSFET Temp Rise\")","v":"Buck ''CONTROL'' MOSFET Temp Rise"},{"$f":"IF(Vin>Vout, \"Buck ''SYNC'' MOSFET Temp Rise\", \"Boost ''SYNC'' MOSFET Temp Rise\")","v":"Buck ''SYNC'' MOSFET Temp Rise"},null,"h","Inductor Cu & Core Loss","Total MOSFET Loss","Control MOSFET Loss","SYNC MOSFET Loss","Shunt Loss"]
["Design","Input Value","Units","Description",null,null,0,{"$f":"Vin","v":13.5},{"$f":"MODE","v":1},0,{"$f":"Iout*G9/100/Number_of_Phases","v":0},{"$f":"Vout*K9/(Vin*Efficiency)","v":0},{"$f":"(Vout+(Rdson2+Rs+Rdcr)*K9)/(Vin+(Rs+Rdson2-Rdson1)*K9)","v":0.37037037037037035},{"$f":"(Vin-(Rdson1+Rdcr)*K9-Vout)*M9/(Fsw*Lf)","v":2.7256693923360586},{"$f":"K9+N9/2","v":1.3628346961680293},{"$f":"K9-N9/2","v":-1.3628346961680293},{"$f":"IF(MIN(Vin, -P9/(Coss_Q1+Coss_Q2)*0.00000002)<0, 0, MIN(Vin, -P9/(Coss_Q1+Coss_Q2)*0.00000002))","v":13.5},{"$f":"SQRT(K9^2+(N9^2)/12)","v":0.7868329786935736},{"$f":"R9^2*Rdcr","v":1.7954077954434246E-3},{"$f":"Core_Loss_Ch1","v":0.25},{"$f":"(T9+S9*(1+Ltc*(Ta-25)))/(1-S9*Ltc*ThetaCa)","v":0.25183157902585318},{"$f":"N9/SQRT(12)","v":0.7868329786935736},{"$f":"RCoutEsr*V9^2","v":6.1910613635980162E-4},{"$f":"W9","v":6.1910613635980162E-4},{"$f":"SQRT(M9*(1-M9))*SQRT(K9^2+(N9^2)/12)","v":0.37996469979199332},{"$f":"RCinEsr*Y9^2","v":1.4437317308801961E-4},{"$f":"Z9","v":1.4437317308801961E-4},{"$f":"SQRT(M9)*SQRT(K9^2+(N9^2)/12)","v":0.47885130157716893},{"$f":"Rdson1*AB9^2","v":1.0318435605996695E-3},{"$f":"(Vin*K9/2)*Fsw*(Tr_buck+Tf_buck)","v":0},{"$f":"(0.5*Coss_Q1*(Vin-Q9)^2-0.5*Coss_Q2*(Vin-Q9)^2+(Qoss_Q2*(Vin-Q9)/Vin)*Vin)*Fsw","v":0},{"$f":"IF(K9>N9/2,0,ABS(K9-N9/2)*Vsd_Q1*Deadtime*Fsw)","v":3.205387205387205E-2},{"$f":"(AF9+AE9+AD9+AC9*(1+RdsonTopTc*Ta-RdsonTopTc*25))/(1-AC9*RdsonTopTc*ThetaJA_Q1)","v":3.3092544880339449E-2},{"$f":"SQRT((1-M9))*SQRT(K9^2+(N9^2)/12)","v":0.62434571139525963},{"$f":"Rdson2*AH9^2","v":1.4227976207824328E-3},{"$f":"IF(K9<N9/2,Deadtime*Fsw*IF(VfdSky_Q2>0,0,Vsd_Q2)*(K9+N9/2),2*Deadtime*Fsw*IF(VfdSky_Q2>0,0,Vsd_Q2)*K9)","v":3.205387205387205E-2},{"$f":"(AJ9+AI9*(1+RdsonBotTc*Ta-RdsonBotTc*25))/(1-AI9*RdsonBotTc*ThetaJA_Q2)","v":3.3486198491363001E-2},{"$f":"2*Deadtime*Fsw*IF(VfdSky_Q2>0,VfdSky_Q2,Vsd_Q2)*K9","v":0},{"$f":"IF(QrrSky_Q2>0,QrrSky_Q2,Qrr_Q2*K9/(Iout/Number_of_Phases))*Fsw*Vin","v":0},{"$f":"Rs*R9^2","v":2.4764245454392065E-3},{"$f":"Iq*Vin","v":4.7249999999999994E-4},{"$f":"IF(Ext_VCC=1,  (Qg_Q1+Qg_Q2)*Fsw*VCC, (Qg_Q1+Qg_Q2)*Fsw*Vin)","v":0.17850000000000002},{"$f":"(Vin-VCC)*Fsw*(Qg_Q1+Qg_Q2)+(RdsonDRT+RdsonDRT2)*Fsw*Qg_Q1*VCC/(RdsonDRT+2*Rgate1+RdsonDRT2)+(RdsonDRB+RdsonDRB2)*Fsw*Qg_Q2*VCC/(RdsonDRB+2*Rgate2+RdsonDRB2)","v":0.48194999999999999},{"$f":"(Qg_Q1+Qg_Q2)*Fsw*(Vin-VCC)","v":0.30345},{"$f":"SUM(AO9:AP9)","v":0.17897250000000001},{"$f":" SUM(U9,X9,AA9,AG9,AK9,AL9,AM9,AS9,AN9)","v":0.50062272625244264},{"$f":"Vout*K9","v":0},{"$f":"AU9/(AU9+AT9)","v":0},{"$f":"ThetaJA_Q1*BC9","v":1.6546272440169725},{"$f":"ThetaJA_Q2*BD9","v":1.6743099245681501},null,{"$f":"AV9*100","v":0},{"$f":"U9","v":0.25183157902585318},{"$f":"AG9+AK9+AM9","v":6.6578743371702442E-2},{"$f":"AG9+AM9*0.66","v":3.3092544880339449E-2},{"$f":"AK9+AM9*0.33","v":3.3486198491363001E-2},{"$f":"AN9","v":2.4764245454392065E-3}]
[null,null,null,null,null,null,1,13.5,1,{"$f":"Iout*G10/100","v":0.12},0.12,4.9382716049382713E-2,0.3704537754424358,2.7259983794875424,{"$f":"K10+N10/2","v":1.4829991897437713},{"$f":"K10-N10/2","v":-1.2429991897437711},13.5,{"$f":"SQRT(K10^2+(N10^2)/12)","v":0.79602487214956141},1.8376012315341041E-3,0.25,0.25187462884178624,{"$f":"N10/SQRT(12)","v":0.78692794910380814},6.1925559708072566E-4,{"$f":"W10","v":6.1925559708072566E-4},{"$f":"SQRT(M10*(1-M10))*SQRT(K10^2+(N10^2)/12)","v":0.38442131693344983},1.4777974891284787E-4,{"$f":"Z10","v":1.4777974891284787E-4},{"$f":"SQRT(M10)*SQRT(K10^2+(N10^2)/12)","v":0.48449985373453486},1.0563304872095354E-3,5.8939571764473975E-3,0,2.9235340942773497E-2,3.6193275018397211E-2,0.63159756871914885,1.4560415341635807E-3,3.4880140942773502E-2,3.6346766957401591E-2,5.6447999999999993E-3,3.6854999999999995E-3,2.5346223883229023E-3,4.7249999999999994E-4,0.17850000000000002,0.48194999999999999,0.30345,0.17897250000000001,0.51601912855190146,0.6,{"$f":"AU10/(AU10+AT10)","v":0.53762519355607663},1.9312852509198606,1.8781490978700794,null,{"$f":"AV10*100","v":53.762519355607665},0.25187462884178624,7.6225541975798797E-2,3.8625705018397211E-2,3.7562981957401591E-2,2.5346223883229023E-3]
["Vin",{"$f":"Vin","v":13.5},"V","Vin",null,null,2,13.5,1,0.24,0.24,9.8765432098765427E-2,0.37053717584407869,2.7263272040262945,1.6031636020131472,-1.1231636020131472,13.5,0.82280313681411832,1.9633145056583427E-3,0.25,0.25200289538085585,0.78702287257179049,6.1940500195115285E-4,6.1940500195115285E-4,0.3973716459315591,1.5790422499035637E-4,1.5790422499035637E-4,0.50085479078800388,1.1288498465488281E-3,1.1787914352894795E-2,0,2.6416807919349222E-2,3.9342454463529644E-2,0.6528012565060346,1.5554456038098803E-3,3.7706407919349219E-2,3.9274071259455944E-2,1.1289599999999999E-2,7.3709999999999991E-3,2.7080200078046109E-3,4.7249999999999994E-4,0.17850000000000002,0.48194999999999999,0.30345,0.17897250000000001,0.53173785033858756,1.2,0.69294552854254321,2.2103657231764822,2.0853250629727973,null,69.29455285425432,0.25200289538085585,8.5987525722985583E-2,4.4207314463529643E-2,4.1706501259455943E-2,2.7080200078046109E-3]
["Vout",{"$f":"Vout","v":5},"V","Vout",null,null,3,13.5,1,0.36,0.36,0.14814814814814814,0.37062057157569134,2.7266558659659732,1.7233279329829867,-1.0033279329829865,13.5,0.86553703037510432,2.1725476177566071E-3,0.25,0.25221638378605687,0.78711774910146348,6.1955435095055445E-4,6.1955435095055445E-4,0.41802926418301423,1.7474846571339232E-4,1.7474846571339232E-4,0.52692695295240921,1.249434061864697E-3,1.7681871529342193E-2,0,2.3598272983759844E-2,4.254020881214448E-2,0.68666027786878991,1.7209835307903799E-3,4.0532672983759843E-2,4.2268205091517935E-2,1.6934399999999999E-2,1.10565E-2,2.996617403802217E-3,4.7249999999999994E-4,0.17850000000000002,0.48194999999999999,0.30345,0.17897250000000001,0.54777911791018552,1.7999999999999998,0.76668200439665857,2.4918749406072238,2.2958425045758966,null,76.668200439665853,0.25221638378605687,9.5864913903662419E-2,4.9837498812144478E-2,4.5916850091517934E-2,2.996617403802217E-3]
["Fsw",{"$f":"Fsw/1000","v":2100},"kHz","Switching Frequency",null,null,4,13.5,1,0.48,0.48,0.19753086419753085,0.37070396263766608,2.7269843653202361,1.8434921826601181,-0.88349218266011809,13.5,0.92201065289855388,2.465300567769411E-3,0.25,0.25251510261783772,0.78721257869676964,6.1970364405841769E-4,6.1970364405841769E-4,0.44532497444304064,1.9831433286269482E-4,1.9831433286269482E-4,0.56137045656605,1.4181155527732893E-3,2.357582870578959E-2,0,2.0779736136165981E-2,4.5786666551518133E-2,0.73141428380449491,1.9526290191193342E-3,4.3358936136165975E-2,4.5329267403874954E-2,2.2579199999999997E-2,1.4741999999999998E-2,3.4004145762336706E-3,4.7249999999999994E-4,0.17850000000000002,0.48194999999999999,0.30345,0.17897250000000001,0.56414316912638562,2.4,0.80967748960228048,2.7758193275759067,2.5097063701937476,null,80.96774896022805,0.25251510261783772,0.10585793395539309,5.5516386551518131E-2,5.0194127403874952E-2,3.4004145762336706E-3]
["Iout",{"$f":"Iout","v":12},"A","Max Output Current",null,null,5,13.5,1,0.6,0.6,0.24691358024691357,0.37078734903039501,2.7273127021027381,1.9636563510513692,-0.76365635105136909,13.5,0.98987518468453628,2.84157335563731E-3,0.25,0.25289906385495853,0.7873073613616508,6.1985288125424498E-4,6.1985288125424498E-4,0.47812517775954499,2.2860368560759651E-4,2.2860368560759651E-4,0.60275787201832198,1.6349267352602512E-3,2.9469785882236994E-2,0,1.7961197376728202E-2,4.9081959075647788E-2,0.78519795527891501,2.2503557757557898E-3,4.6185197376728201E-2,4.8457362413561043E-2,2.8223999999999999E-2,1.8427500000000003E-2,3.9194115250169798E-3,4.7249999999999994E-4,0.17850000000000002,0.48194999999999999,0.30345,0.17897250000000001,0.58083025343604622,3,0.83779453022697725,3.0622054537823895,2.7269218706780523,null,83.779453022697723,0.25289906385495853,0.11596682148920882,6.1244109075647792E-2,5.4538437413561042E-2,3.9194115250169798E-3]
["Ta",{"$f":"Ta","v":25},"°C","Ambient Temperature",null,null,6,13.5,1,0.72,0.72,0.29629629629629628,0.37087073075427035,2.7276408763271331,2.0838204381635665,-0.6438204381635666,13.5,1.0669592600083446,3.3013659813009074E-3,0.25,0.2533682828956923,0.7874020971000486,6.2000206251755442E-4,6.2000206251755442E-4,0.51538178131044354,2.6561838050672586E-4,2.6561838050672586E-4,0.64976919349724016,1.8999000216812425E-3,3.5363743058684387E-2,0,1.5142656705607088E-2,5.2426220701542223E-2,0.84628721938801621,2.6141375106031759E-3,4.9011456705607082E-2,5.1652599615845445E-2,3.3868799999999998E-2,2.2113000000000001E-2,4.5536082500702178E-3,4.7249999999999994E-4,0.17850000000000002,0.48194999999999999,0.30345,0.17897250000000001,0.59784063190617442,3.5999999999999996,0.85758377119840679,3.3510400350771108,2.9474944807922721,null,85.758377119840674,0.2533682828956923,0.12619182031738765,6.7020800701542219E-2,5.8949889615845442E-2,4.5536082500702178E-3]
["Vcc",{"$f":"VCC","v":5},"V","Subregulated VCC Voltage",null,null,7,13.5,1,0.84,0.84,0.34567901234567899,0.37095410780968407,2.7279688880070729,2.2039844440035363,-0.5239844440035365,13.5,1.1514126922298011,3.844678444700848E-3,0.25,0.25392277855936846,0.78749678591590389,6.2015118782787889E-4,6.2015118782787889E-4,0.55620164644552073,3.0936027150870805E-4,3.0936027150870805E-4,0.70127943721338337,2.2130678207624385E-3,4.125770023513179E-2,0,1.2324114122963178E-2,5.5819588685955226E-2,0.91321319458796646,3.0439479365088904E-3,5.1837714122963174E-2,5.4915093796761232E-2,3.9513599999999996E-2,2.5798499999999999E-2,5.3030047513115148E-3,4.7249999999999994E-4,0.17850000000000002,0.48194999999999999,0.30345,0.17897250000000001,0.61517457725273295,4.2,0.87224251844183043,3.6423299342977611,3.1714299398380614,null,87.224251844183044,0.25392277855936846,0.13653318248271645,7.2846598685955222E-2,6.3428598796761229E-2,5.3030047513115148E-3]
["Components","Input Value","Units","Description",null,null,8,13.5,1,0.96,0.96,0.39506172839506171,0.37103748019702848,2.7282967371562097,2.324148368578105,-0.40414836857810488,13.5,1.2417327639894054,4.4715107457778272E-3,0.25,0.2545625730882608,0.78759142781315772,6.2030025716476849E-4,6.2030025716476849E-4,0.59985932513620899,3.598312099528681E-4,3.598312099528681E-4,0.75637476566419493,2.5744625376010457E-3,4.715165741157918E-2,0,9.5055696289570273E-3,5.9262203242565988E-2,0.98478295630621193,3.539760769263889E-3,5.4663969628957025E-2,5.824496504667679E-2,4.5158399999999994E-2,2.9483999999999996E-2,6.1676010286590725E-3,4.7249999999999994E-4,0.17850000000000002,0.48194999999999999,0.30345,0.17897250000000001,0.63283237387328029,4.8,0.8835170440898199,3.9360821621282995,3.3987342523338397,null,88.351704408981988,0.2545625730882608,0.14699116828924277,7.8721643242565989E-2,6.7974685046676794E-2,6.1676010286590725E-3]
["L",{"$f":"Lf*1000000","v":0.55000000000000004},"uH","Filter Inductance",null,null,9,13.5,1,1.08,1.08,0.44444444444444448,0.37112084791669536,2.7286244237881907,2.4443122118940952,-0.28431221189409528,9.6540649200032362,1.336730814527662,5.1818628844725809E-3,0.25,0.25528769214981767,0.78768602279574973,6.2044927050778633E-4,6.2044927050778633E-4,0.64578095711311445,4.1703304456993019E-4,4.1703304456993019E-4,0.81433225182979108,2.9841165736658021E-3,5.3045614588026591E-2,9.5814878815440013E-2,6.6870232237491211E-3,0.15862630507808209,1.060052948742471,4.1015497276022687E-3,5.7490223223749116E-2,6.1642338774913583E-2,5.08032E-2,3.3169500000000005E-2,7.1473970820311464E-3,4.7249999999999994E-4,0.17850000000000002,0.48194999999999999,0.30345,0.17897250000000001,0.7466864153999222,5.4,0.87852212315091072,9.0259087539041047,3.6294136887456792,null,87.852212315091066,0.25528769214981767,0.25343814385299568,0.1805181750780821,7.2588273774913586E-2,7.1473970820311464E-3]
["Rdcr",{"$f":"Rdcr*1000","v":2.9},"mW","Inductor DCR at 25°C",null,null,10,13.5,1,1.2,1.2,0.49382716049382713,0.3712042109690768,2.7289519479166642,2.564475973958332,-0.16447597395833213,5.5849227150537226,1.4354783968546907,5.9757348607258872E-3,0.25,0.2560981648392377,0.78778057086761988,6.2059822783651309E-4,6.2059822783651309E-4,0.69351829210390725,4.8096762148272043E-4,4.8096762148272043E-4,0.87458718221131659,3.442062326797488E-3,5.8939571764473987E-2,0.19478950575043774,3.8684749074999721E-3,0.26121944146891063,1.1382862067811339,4.7292885332008662E-3,6.0316474907499966E-2,6.5107345725414101E-2,5.6447999999999998E-2,3.6855000000000006E-2,8.2423929113460519E-3,4.7249999999999994E-4,0.17850000000000002,0.48194999999999999,0.30345,0.17897250000000001,0.86404441079422778,6,0.87412021847710475,14.277187073445532,3.8634747862707051,null,87.412021847710477,0.2560981648392377,0.36318178719432476,0.28554374146891065,7.7269495725414097E-2,8.2423929113460519E-3]
["LTc",{"$f":"Ltc*1000000","v":4000},"ppm","Inductor Series Resistance Temp Co",null,null,11,13.5,1,1.32,1.32,0.54320987654320996,0.37128756935456469,2.729279309555277,2.6846396547776386,-4.4639654777638427E-2,1.5157777513629351,1.5372531116021668,6.8531266744785773E-3,0.25,0.25699402368238894,0.78787507203270757,6.207471291305442E-4,6.207471291305442E-4,0.74272254860537745,5.5163678420686729E-4,5.5163678420686729E-4,0.93670014070784535,3.9483321912094377E-3,6.4833528940921384E-2,0.29129541166010658,1.0499246803700559E-3,0.36141259286755295,1.2189093385188443,5.4229509106788303E-3,6.3142724680370063E-2,6.8640121993463615E-2,6.2092800000000004E-2,4.0540500000000007E-2,9.4525885165221771E-3,4.7249999999999994E-4,0.17850000000000002,0.48194999999999999,0.30345,0.17897250000000001,0.9792775109732651,6.6000000000000005,0.87079540107147824,19.408466143377648,4.1009243496731811,null,87.079540107147821,0.25699402368238894,0.47059321486101657,0.38816932286755296,8.2018486993463618E-2,9.4525885165221771E-3]
["ThetaCa",{"$f":"ThetaCa","v":20},"°C/W","Core to Ambient Thermal Resistance",null,null,12,13.5,1,1.44,1.44,0.59259259259259256,0.37137092307355096,2.729606508717672,2.8048032543588359,7.5196745641163965E-2,0,1.6414919964378412,7.8140383256715181E-3,0.25,0.25797530463907364,0.78796952629495132,6.2089597436948993E-4,6.2089597436948993E-4,0.79312191600755966,6.2904237365150255E-4,6.2904237365150255E-4,1.0003286745962872,4.5029585574880406E-3,7.0727486117368774E-2,0.3266132625,0,0.40220593050218229,1.3014755153862578,6.1825105875972283E-3,6.7737599999999995E-2,7.4011626120015675E-2,6.7737599999999995E-2,4.4226000000000001E-2,1.0777983897477958E-2,4.7249999999999994E-4,0.17850000000000002,0.48194999999999999,0.30345,0.17897250000000001,1.0371568835067706,7.1999999999999993,0.87408800170074863,21.569754525109115,4.4303103060007833,null,87.408800170074869,0.25797530463907364,0.52044355662219799,0.43139509050218228,8.8606206120015671E-2,1.0777983897477958E-2]
["Cin",{"$f":"Cin*1000000","v":30},"μF","Input Capacitance",null,null,13,13.5,1,1.56,1.56,0.64197530864197538,0.37145427212642751,2.7299335454174942,2.9249667727087472,0.19503322729125294,0,1.747754205697408,8.8584698142456335E-3,0.25,0.25904204710663881,0.78806393365828997,6.2104476353297769E-4,6.2104476353297769E-4,0.84450353943601775,7.131862281199616E-4,7.131862281199616E-4,1.0652046034649612,5.1059738125932529E-3,7.6621443293816191E-2,0.3266132625,0,0.40875810123853129,1.3856348423340228,7.0079412944586182E-3,7.33824E-2,8.0503173597376215E-2,7.33824E-2,4.7911500000000003E-2,1.2218579054131909E-2,4.7249999999999994E-4,0.17850000000000002,0.48194999999999999,0.30345,0.17897250000000001,1.062122531988331,7.8000000000000007,0.88015032198499399,22.018984561926562,4.815698429868811,null,88.015032198499398,0.25904204710663881,0.53717277483590753,0.44037969123853127,9.6313968597376218E-2,1.2218579054131909E-2]
["RCinEsr",{"$f":"RCinEsr*1000","v":1},"mW","Input Capacitor ESR",null,null,14,13.5,1,1.68,1.68,0.69135802469135799,0.37153761651358591,2.7302604196683835,3.0451302098341917,0.31486979016580818,0,1.8556921879990356,9.9864211401418795E-3,0.25,0.26019429392393278,0.78815829412666094,6.2119349660064822E-4,6.2119349660064822E-4,0.89669960594977627,8.0407018331048413E-4,8.0407018331048413E-4,1.1311164926605437,5.7574103398591037E-3,8.2515400470263581E-2,0.3266132625,0,0.41536435791994208,1.4711114766162208,7.8992167647066458E-3,7.9027199999999992E-2,8.7063964189812645E-2,7.9027199999999992E-2,5.1596999999999997E-2,1.3774373986402593E-2,4.7249999999999994E-4,0.17850000000000002,0.48194999999999999,0.30345,0.17897250000000001,1.0874189537000014,8.4,0.88538305739350542,22.470918895997105,5.2045487094906324,null,88.538305739350548,0.26019429392393278,0.55402532210975475,0.4494183779199421,0.10409097418981264,1.3774373986402593E-2]
["Cout",{"$f":"Cout*1000000","v":85},"μF","Output Capcitance",null,null,15,13.5,1,1.8,1.8,0.7407407407407407,0.37162095623541813,2.7305871314839809,3.1652935657419903,0.43470643425800959,0,1.9650298149270304,1.1197892303301262E-2,0.25,0.2614320913756093,0.78825260770400229,6.2134217355215972E-4,6.2134217355215972E-4,0.94957678589828365,9.0169607231691483E-4,9.0169607231691483E-4,1.197896352314173,6.4573005189942053E-3,8.8409357646710984E-2,0.3266132625,0,0.42202494905021126,1.5576862658008377,8.8563107347256372E-3,8.4671999999999997E-2,9.3694267844744758E-2,8.4671999999999997E-2,5.5282500000000005E-2,1.5445368694208638E-2,4.7249999999999994E-4,0.17850000000000002,0.48194999999999999,0.30345,0.17897250000000001,1.1130467152106431,9,0.88993952598512649,22.925569952510564,5.5968746422372382,null,88.993952598512649,0.2614320913756093,0.57100171689495605,0.45851139905021127,0.11193749284474476,1.5445368694208638E-2]
["RCoutEsr",{"$f":"Cout_ESR*1000","v":1},"mW","Output Capacitor ESR",null,null,16,13.5,1,1.92,1.92,0.79012345679012341,0.37170429129231586,2.7309136808779253,3.2854568404389628,0.55454315956103728,0,2.0755459027367196,1.2492883303664833E-2,0.25,0.26275548919677943,0.788346874394251,6.2149079436718492E-4,6.2149079436718492E-4,1.0030282775821444,1.0060657256294036E-3,1.0060657256294036E-3,1.2654096153755692,7.2056767260822562E-3,9.430331482315836E-2,0.3266132625,0,0.42874012659959587,1.6451836674615508,9.8791969438401708E-3,9.0316799999999989E-2,0.10039436007488627,9.0316799999999989E-2,5.8967999999999993E-2,1.7231563177468736E-2,4.7249999999999994E-4,0.17850000000000002,0.48194999999999999,0.30345,0.17897250000000001,1.1390063955687268,9.6,0.89393745067153341,23.382950329979792,5.9926900037443129,null,89.393745067153347,0.26275548919677943,0.58810248667448217,0.46765900659959586,0.11985380007488626,1.7231563177468736E-2]
["Top Driver","Input Value","Units","Description",null,null,17,13.5,1,2.04,2.04,0.83950617283950613,0.37178762168467072,2.731240067863852,3.405620033931926,0.67437996606807404,0,2.1870618096033341,1.3871394141173689E-2,0.25,0.26416454057801203,0.78844109420134334,6.2163935902541162E-4,6.2163935902541162E-4,1.0569678193469771,1.1171809711351041E-3,1.1171809711351041E-3,1.33354759391653,8.0025713335825487E-3,0.10019727199960578,0.3266132625,0,0.43551014603521748,1.7334619043361883,1.0967849134314683E-2,9.5961599999999994E-2,0.10716452199627589,9.5961599999999994E-2,6.2653500000000001E-2,1.913295743610164E-2,4.7249999999999994E-4,0.17850000000000002,0.48194999999999999,0.30345,0.17897250000000001,1.1652985863757677,10.199999999999999,0.8974687222232175,23.843072801760872,6.392008849813795,null,89.746872222321755,0.26416454057801203,0.60532816803149336,0.47686145603521746,0.12784017699627589,1.913295743610164E-2]
["RdsonDRT",0.7,"W","Drain to Source Resistance of pullup Top FET Driver",null,null,18,13.5,1,2.16,2.16,0.88888888888888895,0.3718709474128743,2.7315662924553976,3.5257831462276989,0.79421685377230133,0,2.2994320749929851,1.5333424815768978E-2,0.25,0.26565930217068451,0.78853526712921596,6.2178786750654398E-4,6.2178786750654398E-4,1.1113251702894504,1.235043634118876E-3,1.235043634118876E-3,1.402221785463696,8.8480167103304787E-3,0.10609122917605318,0.3266132625,0,0.44233526635203391,1.822405534418053,1.2122241051353056E-2,0.1016064,0.11400504036743371,0.1016064,6.6339000000000009E-2,2.114955147002618E-2,4.7249999999999994E-4,0.17850000000000002,0.48194999999999999,0.30345,0.17897250000000001,1.1919238918618038,10.8,0.90060611603191632,24.305950317601695,6.7948455183716856,null,90.060611603191632,0.26565930217068451,0.6226793067194677,0.48611900635203392,0.1358969103674337,2.114955147002618E-2]
["RdsonDRT2",{"$f":"RdsonDRT2","v":0.5},"W","Drain to Source Resistance of pulldown Top FET Driver",null,null,19,13.5,1,2.2799999999999998,2.2799999999999998,0.93827160493827144,0.37195426847731816,2.7318923546661953,3.6459461773330974,0.91405382266690216,0,2.4125373198751352,1.6878975327391868E-2,0.25,0.26723983409268359,0.78862939318180425,6.2193631979030081E-4,6.2193631979030081E-4,1.1660426824366168,1.3596555372639807E-3,1.3596555372639807E-3,1.4713595543304727,9.7420452215380531E-3,0.11198518635250056,0.3266132625,0,0.44921575010438741,1.9119198157011537,1.3342346443098176E-2,0.10725119999999999,0.12091620762965426,0.10725119999999999,7.0024500000000003E-2,2.32813452791612E-2,4.7249999999999994E-4,0.17850000000000002,0.48194999999999999,0.30345,0.17897250000000001,1.2188829289629406,11.399999999999999,0.90340801671395543,24.771596005219372,7.2012146314827135,null,90.340801671395539,0.26723983409268359,0.64015645773404173,0.49543192010438741,0.14402429262965427,2.32813452791612E-2]
["Bottom Driver","Input Value","Units","Description",null,null,20,13.5,1,2.4,2.4,0.98765432098765427,0.372037584878394,2.7322182545098777,3.7661091272549387,1.0338908727450611,0,2.5262788278130377,1.8508045675983603E-2,0.25,0.26890619993445902,0.78872347236304374,6.2208471585641697E-4,6.2208471585641697E-4,1.2210726844266013,1.4910185006527864E-3,1.4910185006527864E-3,1.5409008352832223,1.0684689228794394E-2,0.11787914352894797,0.3266132625,0,0.45615186343813674,2.0019264051607601,1.4628139060631576E-2,0.112896,0.12789832194844825,0.112896,7.3710000000000012E-2,2.5528338863425665E-2,4.7249999999999994E-4,0.17850000000000002,0.48194999999999999,0.30345,0.17897250000000001,1.2461763274009789,12,0.90592180742580453,25.240023171906838,7.6111310974224118,null,90.592180742580453,0.26890619993445902,0.65776018538658498,0.50480046343813678,0.15222262194844824,2.5528338863425665E-2]
["RdsonDRB",0.7,"W","Drain to Source Resistance of pullup Bottom FET Driver",null,null,21,13.5,1,2.52,2.52,1.037037037037037,0.37212089661649322,2.732543992000076,3.8862719960000378,1.153728003999962,0,2.6405743798811354,2.0220635861485464E-2,0.25,0.27065846676542882,0.78881750467686929,6.2223305568464269E-4,6.2223305568464269E-4,1.27637547052874,1.6291343417674624E-3,1.6291343417674624E-3,1.6107955998385295,1.1675981090066255E-2,0.12377310070539536,0.3266132625,0,0.46314387612338093,2.0923600529606454,1.5979592657972986E-2,0.1185408,0.13495168725614487,0.1185408,7.7395500000000006E-2,2.7890532222738573E-2,4.7249999999999994E-4,0.17850000000000002,0.48194999999999999,0.30345,0.17897250000000001,1.2738047297651454,12.6,0.90818634436793699,25.711245306169044,8.0246101128072436,null,90.818634436793701,0.27065846676542882,0.67549106337952569,0.5142249061233809,0.16049220225614488,2.7890532222738573E-2]
["RdsonDRB2",0.5,"W","Drain to Source Resistance of pulldown Bottom FET Driver",null,null,22,13.5,1,2.64,2.64,1.0864197530864199,0.37220420369200719,2.7328695671504186,4.0064347835752097,1.2735652164247908,0,2.7553550296204561,2.201674588383876E-2,0.25,0.27249670514074015,0.78891149012721518,6.223813392547432E-4,6.223813392547432E-4,1.3319177435152219,1.7740048754906804E-3,1.7740048754906804E-3,1.6810018943540457,1.2715953159698505E-2,0.12966705788184277,0.3266132625,0,0.47019206158778371,2.1831660427995057,1.7396680992079912E-2,0.12418560000000001,0.1420766132956679,0.12418560000000001,8.1081000000000014E-2,3.0367925357018981E-2,4.7249999999999994E-4,0.17850000000000002,0.48194999999999999,0.30345,0.17897250000000001,1.3017687915959562,13.200000000000001,0.91023379214607569,26.185276079389187,8.4416671647833947,null,91.023379214607573,0.27249670514074015,0.69334967488345156,0.52370552158778372,0.1688333432956679,3.0367925357018981E-2]
["Deadtime",0.5,"Units","Description",null,null,23,13.5,1,2.76,2.76,1.1358024691358024,0.37228750610532746,2.733194979974535,4.1265974899872671,1.3934025100127323,0,2.8705625871153719,2.3896375742984838E-2,0.25,0.27442098910838453,0.78900542871801582,6.2252956654649996E-4,6.2252956654649996E-4,1.3876713999021206,1.9256319141063112E-3,1.9256319141063112E-3,1.7514843094685058,1.3804637788414658E-2,0.13556101505829016,0.3266132625,0,0.47729669695050653,2.2742981950993428,1.8879377822847269E-2,0.12983039999999998,0.14927341566549843,0.12983039999999998,8.4766500000000009E-2,3.2960518266185984E-2,4.7249999999999994E-4,0.17850000000000002,0.48194999999999999,0.30345,0.17897250000000001,1.3300691814712282,13.799999999999999,0.91209100463994741,26.662129347525326,8.8623180332749207,null,91.209100463994744,0.27442098910838453,0.71133661261600489,0.53324258695050653,0.17724636066549843,3.2960518266185984E-2]
["Deadtime",{"$f":"Deadtime*1000000000","v":14},"ns","Total Deadtime",null,null,24,13.5,1,2.88,2.88,1.1851851851851851,0.37237080385684523,2.7335202304860498,4.246760115243025,1.513239884756975,0,2.9861476416178268,2.5859525438865154E-2,0.25,0.27643139621667046,0.78909932045320441,6.2267773753970897E-4,6.2267773753970897E-4,1.4436125752085047,2.0840172673001309E-3,2.0840172673001309E-3,1.8222127771425707,1.4942067323317378E-2,0.14145497223473755,0.3266132625,0,0.48445806305675859,2.3657172976410497,2.042765691310696E-2,0.13547519999999999,0.1565424158658382,0.13547519999999999,8.8452000000000003E-2,3.5668310950158835E-2,4.7249999999999994E-4,0.17850000000000002,0.48194999999999999,0.30345,0.17897250000000001,1.3587065810942658,14.399999999999999,0.91378057747935304,27.141819152837932,9.2865787932919091,null,91.378057747935301,0.27643139621667046,0.72945247892259679,0.54283638305675863,0.18573157586583819,3.5668310950158835E-2]
["IQ","Input Value","Units","Description",null,null,25,13.5,1,3,3,1.2345679012345678,0.37245409694695197,2.7338453186985885,4.366922659349294,1.6330773406507058,0,3.1020679960655575,2.7906194971421133E-2,0.25,0.27852800752205403,0.78919316533671424,6.2282585221418239E-4,6.2282585221418239E-4,1.499720888085682,2.249162742160507E-3,2.249162742160507E-3,1.8931616182630098,1.612827410788898E-2,0.14734892941118496,0.3266132625,0,0.49167644451297338,2.4573898631169548,2.2041492028627378E-2,0.14112,0.16388394134598688,0.14112,9.2137500000000011E-2,3.8491303408856738E-2,4.7249999999999994E-4,0.17850000000000002,0.48194999999999999,0.30345,0.17897250000000001,1.3876816853842457,15,0.91532165976705038,27.624359725648667,9.7144658172993452,null,91.532165976705045,0.27852800752205403,0.74769788585896024,0.55248719451297335,0.1942893163459869,3.8491303408856738E-2]
["IQ ",{"$f":"Iq*1000","v":3.4999999999999996E-2},"mA","Quiescent Current Of Controller (Not Switching!)",null,null,26,13.5,1,3.12,3.12,1.2839506172839508,0.37253738537603881,2.7341702446257732,4.4870851223128865,1.7529148776871135,0,3.2182874188844206,3.0036384340594264E-2,0.25,0.28071090759732947,0.78928696337247761,6.2297391054974679E-4,6.2297391054974679E-4,1.5559788376385801,2.421070143179107E-3,2.421070143179107E-3,1.9643087832614812,1.7363290481991901E-2,0.15324288658763238,0.3266132625,0,0.49895212972262082,2.5492871385058895,2.3720856938113145E-2,0.1467648,0.17129832555294913,0.1467648,9.5823000000000005E-2,4.1429495642198985E-2,4.7249999999999994E-4,0.17850000000000002,0.48194999999999999,0.30345,0.17897250000000001,1.4169952025688273,15.600000000000001,0.91673058693964238,28.109765486131046,10.145995777647457,null,91.673058693964236,0.28071090759732947,0.76607345527556991,0.56219530972262088,0.20291991555294914,4.1429495642198985E-2]
["High-side FET","Input Value","Units","Description",null,null,27,13.5,1,3.24,3.24,1.3333333333333335,0.37262066914449715,2.7344950082812272,4.6072475041406138,1.8727524958593866,0,3.334774641940029,3.2250093546326124E-2,0.25,0.28298018454018031,0.78938071456442727,6.2312191252624589E-4,6.2312191252624589E-4,1.6123713195947125,2.5997412722515946E-3,2.5997412722515946E-3,2.0356352424772477,1.8647148781869315E-2,0.15913684376407977,0.3266132625,0,0.5062854109226621,2.6413843098100749,2.5465725413204587E-2,0.15240960000000001,0.17878590798128496,0.15240960000000001,9.95085E-2,4.4482887650105003E-2,4.7249999999999994E-4,0.17850000000000002,0.48194999999999999,0.30345,0.17897250000000001,1.4466478542790102,16.200000000000003,0.91802137911828829,28.598051046133104,10.581185649064247,null,91.802137911828822,0.28298018454018031,0.78457981890394701,0.5719610209226621,0.21162371298128496,4.4482887650105003E-2]
["RdsonTop",{"$f":"Rdson1*1000","v":4.5},"mW","Drain-Source Resistance of Top FET ",null,null,28,13.5,1,3.36,3.36,1.382716049382716,0.37270394825271802,2.7348196096785689,4.7274098048392847,1.9925901951607154,0,3.4515025507919788,3.4547322588558249E-2,0.25,0.28533592998209406,0.7894744189164945,6.2326985812353661E-4,6.2326985812353661E-4,1.6688852353227652,2.7851779286783215E-3,2.7851779286783215E-3,2.1071244935084965,1.9979881340145469E-2,0.16503080094052716,0.3266132625,0,0.51367658422066065,2.7336598594155963,2.7276071228477354E-2,0.15805439999999998,0.18634703422422041,0.15805439999999998,0.10319399999999999,4.7651479432494141E-2,4.7249999999999994E-4,0.17850000000000002,0.48194999999999999,0.30345,0.17897250000000001,1.4766403756462709,16.8,0.91920613716217225,29.089231211033034,11.02005271121102,null,91.920613716217218,0.28533592998209406,0.80321761844488104,0.58178462422066068,0.22040105422422041,4.7651479432494141E-2]
["RdsonTopTc",{"$f":"RdsonTopTc*1000000","v":4000},"ppm","Drain to Source Resistance Temp Co",null,null,29,13.5,1,3.48,3.48,1.4320987654320987,0.37278722270109266,2.7351440488314189,4.8475720244157099,2.1124279755842905,0,3.5684475262110125,3.6928071467232329E-2,0.25,0.28777823909764128,0.7895680764326114,6.234177473214941E-4,6.234177473214941E-4,1.7255091738860846,2.9773819091650383E-3,2.9773819091650383E-3,2.1787621605870302,2.1361520485826384E-2,0.17092475811697455,0.3266132625,0,0.52112594963255521,2.826095043503603,2.9151868161442055E-2,0.16369919999999999,0.19398205602603333,0.16369919999999999,0.1068795,5.0935270989285977E-2,4.7249999999999994E-4,0.17850000000000002,0.48194999999999999,0.30345,0.17897250000000001,1.5069735154020023,17.399999999999999,0.92029536011279689,29.583320981627757,11.462614551301668,null,92.029536011279689,0.28777823909764128,0.82198750565858858,0.59166641963255517,0.22925229102603334,5.0935270989285977E-2]
["QgTop",{"$f":"Qg_Q1*1000000000","v":8},"nC","Gate Charge Of Top FET",null,null,30,13.5,1,3.6,3.6,1.4814814814814814,0.37287049249001208,2.7354683257533927,4.9677341628766962,2.232265837123304,0,3.6855889054668056,3.9392340182290014E-2,0.25,0.29030721061412063,0.78966168711670814,6.2356558010000587E-4,6.2356558010000587E-4,1.7822331519258574,3.1763550078235765E-3,3.1763550078235765E-3,2.250535666818517,2.2792098544300202E-2,0.17681871529342197,0.3266132625,0,0.52863381112110641,2.9186734645173549,3.1093089992543753E-2,0.16934399999999999,0.20169133133573133,0.16934399999999999,0.11056500000000001,5.433426232040002E-2,4.7249999999999994E-4,0.17850000000000002,0.48194999999999999,0.30345,0.17897250000000001,1.5376480359792819,18,0.92129820164905996,30.080335556055321,11.908889066786568,null,92.129820164905993,0.29030721061412063,0.8408901424568378,0.60160671112110642,0.23817778133573134,5.433426232040002E-2]
["QgdTop",{"$f":"Qgd_Q1*1000000000","v":3.1},"nC","Gate to Drain Charge",null,null,31,13.5,1,3.72,3.72,1.5308641975308643,0.37295375761986743,2.7357924404581064,5.0878962202290534,2.352103779770947,0,3.8029085390578325,4.1940128733673032E-2,0.25,0.29292294682157249,0.78975525097271548,6.2371335643897688E-4,6.2371335643897688E-4,1.8390483996275242,3.382099016172558E-3,3.382099016172558E-3,2.3224339644882024,2.4271647837337748E-2,0.18271267246986939,0.3266132625,0,0.53620047663502668,3.0113807193761781,3.3099710505161646E-2,0.1749888,0.20947522436203911,0.1749888,0.1142505,5.7848453425755918E-2,4.7249999999999994E-4,0.17850000000000002,0.48194999999999999,0.30345,0.17897250000000001,1.5686647136170055,18.600000000000001,0.92222267879945918,30.580290331751335,12.358894468101955,null,92.222267879945917,0.29292294682157249,0.85992620099706585,0.61160580663502673,0.2471778893620391,5.7848453425755918E-2]
["QgsTop",{"$f":"Qgs_Q1*1000000000","v":2.9},"nC",null,null,null,32,{"$f":"Vin","v":13.5},{"$f":"MODE","v":1},3.84,{"$f":"Iout*G41/100/Number_of_Phases","v":3.84},{"$f":"Vout*K41/(Vin*Efficiency)","v":1.5802469135802468},{"$f":"(Vout+(Rdson2+Rs+Rdcr)*K41)/(Vin+(Rs+Rdson2-Rdson1)*K41)","v":0.37303701809104967},{"$f":"(Vin-(Rdson1+Rdcr)*K41-Vout)*M41/(Fsw*Lf)","v":2.7361163929591745},5.2080581964795876,2.4719418035204126,{"$f":"IF(MIN(Vin, -P41/(Coss_Q1+Coss_Q2)*0.00000002)<0, 0, MIN(Vin, -P41/(Coss_Q1+Coss_Q2)*0.00000002))","v":0},3.9203904239652365,{"$f":"R41^2*Rdcr","v":4.4571437121323144E-2},{"$f":"Core_Loss_Ch1","v":0.25},{"$f":"(T41+S41*(1+Ltc*(Ta-25)))/(1-S41*Ltc*ThetaCa)","v":0.29562555358316223},0.78984876800456372,6.2386107631832706E-4,6.2386107631832706E-4,1.8959471836362125,3.5946157231380861E-3,3.5946157231380861E-3,2.394447311923201,{"$f":"Rdson1*AB41^2","v":2.5800200683093095E-2},{"$f":"(Vin*K41/2)*Fsw*(Tr_buck+Tf_buck)","v":0.18860662964631672},{"$f":"(0.5*Coss_Q1*(Vin-Q41)^2-0.5*Coss_Q2*(Vin-Q41)^2+(Qoss_Q2*(Vin-Q41)/Vin)*Vin)*Fsw","v":0.3266132625},{"$f":"IF(K41>N41/2,0,ABS(K41-N41/2)*Vsd_Q1*Deadtime*Fsw)","v":0},{"$f":"(AF41+AE41+AD41+AC41*(1+RdsonTopTc*Ta-RdsonTopTc*25))/(1-AC41*RdsonTopTc*ThetaJA_Q1)","v":0.5438262581488047},{"$f":"SQRT((1-M41))*SQRT(K41^2+(N41^2)/12)","v":3.1042041084216878},{"$f":"Rdson2*AH41^2","v":3.5171703485608614E-2},{"$f":"IF(K41<N41/2,Deadtime*Fsw*IF(VfdSky_Q2>0,0,Vsd_Q2)*(K41+N41/2),2*Deadtime*Fsw*IF(VfdSky_Q2>0,0,Vsd_Q2)*K41)","v":0.18063359999999998},{"$f":"(AJ41+AI41*(1+RdsonBotTc*Ta-RdsonBotTc*25))/(1-AI41*RdsonBotTc*ThetaJA_Q2)","v":0.21733410562971223},{"$f":"2*Deadtime*Fsw*IF(VfdSky_Q2>0,VfdSky_Q2,Vsd_Q2)*K41","v":0.18063359999999998},{"$f":"IF(QrrSky_Q2>0,QrrSky_Q2,Qrr_Q2*K41/(Iout/Number_of_Phases))*Fsw*Vin","v":0.11793599999999999},{"$f":"Rs*R41^2","v":6.147784430527331E-2},{"$f":"Iq*Vin","v":4.7249999999999994E-4},{"$f":"IF(Ext_VCC=1,  (Qg_Q1+Qg_Q2)*Fsw*VCC, (Qg_Q1+Qg_Q2)*Fsw*Vin)","v":0.17850000000000002},0.48194999999999999,{"$f":"(Qg_Q1+Qg_Q2)*Fsw*(Vin-VCC)","v":0.30345},{"$f":"SUM(AO41:AP41)","v":0.17897250000000001},{"$f":" SUM(U41,X41,AA41,AG41,AK41,AL41,AM41,AS41,AN41)","v":1.6000243384664088},{"$f":"Vout*K41","v":19.2},0.92307584296873091,{"$f":"ThetaJA_Q1*BC41","v":31.083200907440233},{"$f":"ThetaJA_Q2*BD41","v":12.81264928148561},null,92.307584296873088,{"$f":"U41","v":0.29562555358316223},{"$f":"AG41+AK41+AM41","v":0.87909636377851696},{"$f":"AG41+AM41*0.66","v":0.62166401814880468},{"$f":"AK41+AM41*0.33","v":0.25625298562971222},{"$f":"AN41","v":6.147784430527331E-2}]
["RGateTop",{"$f":"Rgate1","v":0},"W","Gate Resistance",null,null,33,13.5,1,{"$f":"Iout*G42/100","v":3.96},3.96,1.6296296296296295,0.37312027390394981,2.7364401832702097,5.3282200916351048,2.5917799083648951,0,4.0380203986257905,4.7286265345182169E-2,0.25,0.29841514034593558,0.78994223821618226,6.2400873971799162E-4,6.2400873971799162E-4,1.9529226597728964,3.8139069150544443E-3,3.8139069150544443E-3,2.4665670879046071,2.7377789396103962E-2,0.19450058682276417,0.3266132625,0,0.55151147170323345,3.197132393346227,3.7309042723130771E-2,0.18627839999999998,0.22526835203719575,0.18627839999999998,0.12162149999999999,6.5222434958871964E-2,4.7249999999999994E-4,0.17850000000000002,0.48194999999999999,0.30345,0.17897250000000001,1.6317277147000093,19.8,0.92386392098566983,31.589083085161672,13.270172351859788,null,92.386392098566986,0.29841514034593558,0.89840132374042914,0.63178166170323347,0.26540344703719576,6.5222434958871964E-2]
["GfsTop",{"$f":"Gfs_Q1","v":71},"S","Transconductance of Top FET",null,null,34,13.5,1,4.08,4.08,1.6790123456790123,0.37320352505895865,2.7367638114048209,5.4483819057024103,2.7116180942975898,0,4.1557858879660676,5.0084613405191949E-2,0.25,0.3012918201519485,0.79003566161149985,6.241563466179203E-4,6.241563466179203E-4,2.0099687499224452,4.039974375664797E-3,4.039974375664797E-3,2.5387856365371175,2.9004446287292294E-2,0.20039454399921156,0.3266132625,0,0.55925643744665254,3.2901555948512127,3.9511702009907196E-2,0.19192319999999999,0.23327834691564614,0.19192319999999999,0.125307,6.9082225386471671E-2,4.7249999999999994E-4,0.17850000000000002,0.48194999999999999,0.30345,0.17897250000000001,1.6637756606230014,20.399999999999999,0.92459243212881614,32.097952872332627,13.731482845782306,null,92.459243212881617,0.3012918201519485,0.9178417843622988,0.64195905744665249,0.27462965691564611,6.9082225386471671E-2]
["VthTop",{"$f":"Vth_Q1","v":3.2},"V","Threshold Voltage of Top FET",null,null,35,13.5,1,4.2,4.2,1.728395061728395,0.37328677155646728,2.7370872773766211,5.5685436386883111,2.8314563613116897,0,4.273675689263059,5.2966481301294437E-2,0.25,0.30425570964977261,0.79012903819444602,6.2430389699808029E-4,6.2430389699808029E-4,2.0670800386346637,4.2728198861218831E-3,4.2728198861218831E-3,2.6110961369579284,3.0680203663964775E-2,0.20628850117565894,0.3266132625,0,0.56706147967691911,3.383264822706237,4.1779655141049345E-2,0.19756799999999999,0.24136448008933556,0.19756799999999999,0.12899250000000001,7.305721558799233E-2,4.7249999999999994E-4,0.17850000000000002,0.48194999999999999,0.30345,0.17897250000000001,1.6961690087871395,21,0.92526628577138081,32.609826483845957,14.196600254466778,null,92.526628577138084,0.30425570964977261,0.93741845976625471,0.6521965296769191,0.28393200508933558,7.305721558799233E-2]
["VspTop",{"$f":"Vsp_Q1","v":3.3690140845070422},"V",null,null,null,36,13.5,1,4.32,4.32,1.7777777777777779,0.37337001339686632,2.7374105811992147,5.6887052905996072,2.951294709400393,0,4.3916797914736971,5.5931869033431524E-2,0.25,0.30730692910637902,0.79022236796894829,6.2445139083845192E-4,6.2445139083845192E-4,2.12425168588581,4.5124452249887068E-3,4.5124452249887068E-3,2.6834924934086777,3.2405093829813249E-2,0.21218245835210636,0.3266132625,0,0.57492692688411284,3.4764521323696851,4.4112875914600717E-2,0.2032128,0.24952714793745859,0.2032128,0.13267800000000002,7.7147405563353824E-2,4.7249999999999994E-4,0.17850000000000002,0.48194999999999999,0.30345,0.17897250000000001,1.7289086061071315,21.6,0.92588986328942402,33.124720344205642,14.665544396872928,null,92.588986328942397,0.30730692910637902,0.95713207482157148,0.66249440688411287,0.29331088793745858,7.7147405563353824E-2]
["VsdTop",{"$f":"Vsd_Q1","v":0.8},"V",null,null,null,37,13.5,1,4.4400000000000004,4.4400000000000004,1.8271604938271606,0.37345325058054674,2.73773372288621,5.8088668614431054,3.0711331385568954,0,4.5097892221387728,5.8980776601545201E-2,0.25,0.31044560241940372,0.79031565093893485,6.245988281190323E-4,6.245988281190323E-4,2.1814793531544692,4.7588521682392412E-3,4.7588521682392412E-3,2.7559692420842654,3.4179149084915338E-2,0.21807641552855378,0.3266132625,0,0.5828531117939918,3.56971040349277,4.6511338131536482E-2,0.2088576,0.25776675345736122,0.2088576,0.1363635,8.1352795312476148E-2,4.7249999999999994E-4,0.17850000000000002,0.48194999999999999,0.30345,0.17897250000000001,1.7619953139795912,22.200000000000003,0.92646708711475168,33.642651089699591,15.13833542286806,null,92.646708711475171,0.31044560241940372,0.97698336525135299,0.67285302179399176,0.3027667084573612,8.1352795312476148E-2]
["θJATop",{"$f":"ThetaJA_Q1","v":50},"°C/W","Junction to Ambient Resistance",null,null,38,13.5,1,4.5599999999999996,4.5599999999999996,1.8765432098765429,0.37353648310789911,2.7380567024512112,5.9290283512256057,3.190971648774394,0,4.6279959171135649,6.2113204005577495E-2,0.25,0.3136718571297944,0.79040888710833301,6.2474620881983352E-4,6.2474620881983352E-4,2.2387591405193925,5.0120424892591293E-3,5.0120424892591293E-3,2.8285214718700584,3.6002401725734823E-2,0.22397037270500111,0.3266132625,0,0.5908403714122088,3.6630332365390657,4.8975015595762998E-2,0.21450239999999998,0.2660837063292133,0.21450239999999998,0.14004900000000001,8.5673384835279309E-2,4.7249999999999994E-4,0.17850000000000002,0.48194999999999999,0.30345,0.17897250000000001,1.7954300084045747,22.799999999999997,0.92700147922638254,34.163635570610438,15.614993816460665,null,92.700147922638251,0.3136718571297944,0.99697307774142208,0.6832727114122088,0.3122998763292133,8.5673384835279309E-2]
["Low-side FET","Input Value","Units","Description",null,null,39,13.5,1,4.68,4.68,1.9259259259259258,0.37361971097931429,2.7383795199078231,6.0491897599539115,3.3108102400460879,0,4.7462926092815723,6.5329151245470535E-2,0.25,0.31698582443484447,0.79050207648106996,6.2489353292088338E-4,6.2489353292088338E-4,2.2960875329234236,5.2720179588463742E-3,5.2720179588463742E-3,2.9011447566290229,3.7874884045122327E-2,0.22986432988144853,0.3266132625,0,0.59888904706929957,3.7564148644691526,5.1503882114117529E-2,0.22014719999999999,0.27447842298214581,0.22014719999999999,0.14373449999999999,9.0109174131683498E-2,4.7249999999999994E-4,0.17850000000000002,0.48194999999999999,0.30345,0.17897250000000001,1.8292135801097407,23.4,0.92749621091828804,34.687690853464979,16.095540399107293,null,92.7496210918288,0.31698582443484447,1.0171019700514452,0.69375381706929962,0.32191080798214583,9.0109174131683498E-2]
["RdsonBot",{"$f":"Rdson2*1000","v":3.65},"mW","Drain-Source Resistance of Low-side FET",null,null,40,13.5,1,4.8,4.8,1.9753086419753085,0.37370293419518286,2.7387021752696463,6.1693510876348228,3.4306489123651769,0,4.8646727331242152,6.8628618321166429E-2,0.25,0.32038763920161334,0.790595219061072,6.2504080040222442E-4,6.2504080040222442E-4,2.3534613540935889,5.5387803452120292E-3,5.5387803452120292E-3,2.9738350971361927,3.979662833231562E-2,0.23575828705789595,0.3266132625,0,0.60699948446645524,3.8498500770086093,5.4097911496367661E-2,0.22579199999999999,0.28295132666187445,0.22579199999999999,0.14742000000000002,9.4660163201608888E-2,4.7249999999999994E-4,0.17850000000000002,0.48194999999999999,0.30345,0.17897250000000001,1.8633469346771663,24,0.92795414532452403,35.214834223322761,16.579996333093721,null,92.795414532452398,0.32038763920161334,1.0373708111283297,0.70429668446645521,0.33159992666187443,9.4660163201608888E-2]
["RdsonBotTc",{"$f":"RdsonBotTc*1000000","v":4000},"ppm","Drain To Source Resitance Temp Co",null,null,41,13.5,1,4.92,4.92,2.0246913580246915,0.3737861527558955,2.7390246685502815,6.2895123342751411,3.5504876657248592,0,4.9831303425902789,7.2011605232607329E-2,0.25,0.32387743998073854,0.79068831485226532,6.2518801124391513E-4,6.2518801124391513E-4,2.4108777268830748,5.8123314139809012E-3,5.8123314139809012E-3,3.0465888711052367,4.1767666872940264E-2,0.24165224423434334,0.3266132625,0,0.6151720337220945,3.943334155470676,5.675707755521095E-2,0.2314368,0.29150284749983357,0.2314368,0.1511055,9.9326352044975641E-2,4.7249999999999994E-4,0.17850000000000002,0.48194999999999999,0.30345,0.17897250000000001,1.8978309926728671,24.6,0.92837787390229598,35.745083186104729,17.06838312499168,null,92.837787390229593,0.32387743998073854,1.057780381221928,0.71490166372209452,0.34136766249983358,9.9326352044975641E-2]
["QgBot",{"$f":"Qg_Q2*1000000000","v":9},"nC","Gate Charge Of Top FET",null,null,42,13.5,1,5.04,5.04,2.074074074074074,0.37386936666184267,2.7393469997633271,6.4096734998816638,3.6703265001183363,0,5.1016600401659487,7.5478111979735474E-2,0.25,0.32745536902063987,0.79078136385857534,6.2533516542602854E-4,6.2533516542602854E-4,2.4683340390215114,6.0926729281922483E-3,6.0926729281922483E-3,3.1194027900299557,4.3788031949010014E-2,0.24754620141079073,0.3266132625,0,0.62340704941924241,4.0368628164676785,5.9481354106274656E-2,0.2370816,0.30013342258384218,0.2370816,0.15479100000000001,0.10410774066170411,4.7249999999999994E-4,0.17850000000000002,0.48194999999999999,0.30345,0.17897250000000001,1.9326666897790468,25.2,0.92876974785132016,36.278455470962122,17.56072262919211,null,92.87697478513202,0.32745536902063987,1.0783314720030845,0.72556910941924246,0.35121445258384221,0.10410774066170411]
["RGateBot",{"$f":"Rgate2","v":0},"W","Gate Resistance",null,null,43,13.5,1,5.16,5.16,2.1234567901234569,0.37395257591341508,2.7396691689223811,6.5298345844611907,3.7901654155388096,0,5.2202569154140921,7.9028138562493078E-2,0.25,0.33112157228212041,0.79087436608392758,6.2548226292865434E-4,6.2548226292865434E-4,2.5258279134375847,6.3798066483004637E-3,6.3798066483004637E-3,3.1922738617873225,4.5857755838927455E-2,0.25344015858723812,0.3266132625,0,0.63170489065373669,4.1304321631371828,6.2270714968115093E-2,0.24272640000000001,0.30884349603032724,0.24272640000000001,0.15847649999999999,0.1090043290517146,4.7249999999999994E-4,0.17850000000000002,0.48194999999999999,0.30345,0.17897250000000001,1.967854976929128,25.8,0.92913190527089262,36.814969032686832,18.05703705151636,null,92.913190527089256,0.33112157228212041,1.099024886684064,0.73629938065373668,0.36114074103032723,0.1090043290517146]
["VsdBot",{"$f":"Vsd_Q2","v":0.8},"V","Diode Forward Voltage of Bottom FET Body Diode",null,null,44,13.5,1,5.28,5.28,2.1728395061728398,0.37403578051100306,2.7399911760410385,6.6499955880205199,3.910004411979481,0,5.3389164915488143,8.2661684980822506E-2,0.25,0.33487619945336561,0.79096732153224647,6.2562930373189624E-4,6.2562930373189624E-4,2.5833571824615715,6.6737343321757901E-3,6.6737343321757901E-3,3.2651993581295868,4.7976870817484391E-2,0.25933411576368554,0.3266132625,0,0.6400659210832671,4.2240386427448833,6.5125133962217419E-2,0.24837120000000001,0.31763351905812764,0.24837120000000001,0.16216200000000003,0.1140161172149276,4.7249999999999994E-4,0.17850000000000002,0.48194999999999999,0.30345,0.17897250000000001,2.0033968204455954,26.400000000000002,0.92946629471431774,37.354642054163357,18.557348952906384,null,92.946629471431777,0.33487619945336561,1.1198614401413947,0.74709284108326712,0.37114697905812766,0.1140161172149276]
["QrrBot",{"$f":"Qrr_Q2*1000000000","v":13},"nC","Reverse Recovery Charge of Body Diode",null,null,45,13.5,1,5.4,5.4,2.2222222222222223,0.37411898045499703,2.7403130211328941,6.7701565105664478,4.0298434894335529,0,5.4576346788527239,8.6378751234666026E-2,0.25,0.33871940396534417,0.79106023020745653,6.257762878158742E-4,6.257762878158742E-4,2.6409198653319623,6.9744577351049906E-3,6.9744577351049906E-3,3.3381767863398579,5.0145409155862353E-2,0.26522807294013295,0.3266132625,0,0.6484905089772669,4.3176790097177875,6.8044584912995143E-2,0.25401600000000002,0.32650395006390553,0.25401600000000002,0.16584750000000001,0.1191431051512635,4.7249999999999994E-4,0.17850000000000002,0.48194999999999999,0.30345,0.17897250000000001,2.0392932021807009,27,0.92977469568620352,37.897492948863345,19.061681253195278,null,92.97746956862035,0.33871940396534417,1.1408419590411725,0.75794985897726685,0.38123362506390557,0.1191431051512635]
["TrrBot",{"$f":"Trr_Q2*1000000000","v":40},"ns","Reverse Recovery Time of Body Diode",null,null,46,13.5,1,5.52,5.52,2.2716049382716048,0.37420217574578757,2.7406347042115411,6.8903173521057699,4.1496826478942292,0,5.576407733941334,9.0179337323966088E-2,0.25,0.34265134300761357,0.79115309211348184,6.2592321516072346E-4,6.2592321516072346E-4,2.6985141485254567,7.2819786097920707E-3,7.2819786097920707E-3,3.4112038644454232,5.2363403121633248E-2,0.27112203011658031,0.3266132625,0,0.65697902726766855,4.4113502933176072,7.1029041647789684E-2,0.25966079999999997,0.33545525469918935,0.25966079999999997,0.16953300000000002,0.1243852928606429,4.7249999999999994E-4,0.17850000000000002,0.48194999999999999,0.30345,0.17897250000000001,2.0755451196600672,27.599999999999998,0.9300587365357269,38.443540363383427,19.570057234959467,null,93.005873653572692,0.34265134300761357,1.1619672819668578,0.76887080726766854,0.39140114469918935,0.1243852928606429]
["θJABot",{"$f":"ThetaJA_Q2","v":50},"°C/W","Junction to Ambient Resistance",null,null,47,13.5,1,5.64,5.64,2.3209876543209877,0.37428536638376492,2.7409562252905704,7.0104781126452851,4.2695218873547143,0,5.6952322240402626,9.4063443248665113E-2,0.25,0.34667217754453322,0.79124590725424571,6.2607008574659445E-4,6.2607008574659445E-4,2.7561383685074574,7.5962987063589492E-3,7.5962987063589492E-3,3.484278499481146,5.4630884978759633E-2,0.27701598729302773,0.3266132625,0,0.66553185360053779,4.505049769292234,7.4078477996870049E-2,0.26530559999999997,0.34448790594907736,0.26530559999999997,0.1732185,0.12974268034298639,4.7249999999999994E-4,0.17850000000000002,0.48194999999999999,0.30345,0.17897250000000001,2.11215358622924,28.2,0.93031991012381288,38.99280318002689,20.082500547453868,null,93.031991012381283,0.34667217754453322,1.1832382595496151,0.77985606360053783,0.40165001094907737,0.12974268034298639]
["Bottom Schottky","Input Value","Units","Std Units",null,null,48,13.5,1,5.76,5.76,2.3703703703703702,0.37436855236931937,2.7412775843835715,7.1306387921917853,4.3893612078082143,0,5.8141049955735795,9.803106900870559E-2,0.25,0.35078207233188835,0.79133867563367111,6.2621689955365256E-4,6.2621689955365256E-4,2.8137909965642733,7.9174197723461664E-3,7.9174197723461664E-3,3.5573987683760495,5.6947886987595453E-2,0.28290994446947509,0.3266132625,0,0.67414937038860034,4.5987749349484606,7.719286779343229E-2,0.27095039999999998,0.35360238421262585,0.27095039999999998,0.17690400000000001,0.13521526759821462,4.7249999999999994E-4,0.17850000000000002,0.48194999999999999,0.30345,0.17897250000000001,2.1491196312032295,28.799999999999997,0.93055958758075741,39.545300519430015,20.599035210631293,null,93.055958758075747,0.35078207233188835,1.2046557546012262,0.79090601038860031,0.41198070421262584,0.13521526759821462]
["VfdSky",{"$f":"VfdSky_Q2","v":0},"V","Diode Forward Voltage",null,null,49,13.5,1,5.88,5.88,2.4197530864197527,0.37445173370284113,2.7415987815041309,7.2507993907520651,4.5092006092479346,0,5.9330231464711201,0.10208221460402998,0.25,0.3549811959339278,0.79143139725568001,6.2636365656207804E-4,6.2636365656207804E-4,2.871470625431082,8.2453435527135698E-3,8.2453435527135698E-3,3.6305629011027514,5.9314441404886308E-2,0.28880390164592251,0.3266132625,0,0.68283196486467868,4.692523487176004,8.0372184873599331E-2,0.27659519999999999,0.36279917738495399,0.27659519999999999,0.18058950000000001,0.14080305462624826,4.7249999999999994E-4,0.17850000000000002,0.48194999999999999,0.30345,0.17897250000000001,2.1864443000190845,29.4,0.93077903042040844,40.101051743233931,21.119685619247701,null,93.077903042040845,0.3549811959339278,1.2262206422496327,0.80202103486467868,0.42239371238495399,0.14080305462624826]
["QrrSky",{"$f":"QrrSky_Q2*1000000000","v":0},"nC","Diode Reverse Recovery Charge",null,null,50,13.5,1,6,6,2.4691358024691357,0.37453491038472064,2.7419198166658392,7.3709599083329191,4.6290400916670809,0,6.0519840016933353,0.10621688003458102,0.25,0.35926972074081981,0.79152407212419584,6.2651035675206923E-4,6.2651035675206923E-4,2.9291759574735394,8.5800717898410275E-3,8.5800717898410275E-3,3.7037692657846795,6.1730580483770323E-2,0.29469785882236993,0.3266132625,0,0.69158002913605043,4.7862933030248884,8.3616403076420265E-2,0.28223999999999999,0.37207878094109093,0.28223999999999999,0.18427500000000002,0.14650604142700832,4.7249999999999994E-4,0.17850000000000002,0.48194999999999999,0.30345,0.17897250000000001,2.224128654391563,30,0.93097940123546352,40.660076456802521,21.644476547054548,null,93.097940123546351,0.35926972074081981,1.2479338100771413,0.81320152913605048,0.43288953094109095,0.14650604142700832]
["Ireverse",{"$f":"Ireverse","v":0},"mA","Reverse Leakage Current",null,null,51,13.5,1,6.12,6.12,2.5185185185185186,0.37461808241534794,2.7422406898822782,7.4911203449411392,4.748879655058861,0,6.1709850915476885,0.1104350653003011,0.25,0.36364782298652748,0.79161670024313924,6.2665700010383618E-4,6.2665700010383618E-4,2.9869057942173338,8.9216062235290827E-3,8.9216062235290827E-3,3.7770163555018477,6.4196336473778065E-2,0.30059181599881735,0.3266132625,0,0.70039396023974598,4.8800824224981456,8.6925496243870096E-2,0.2878848,0.38144169802159644,0.2878848,0.18796050000000003,0.15232422800041534,4.7249999999999994E-4,0.17850000000000002,0.48194999999999999,0.30345,0.17897250000000001,2.2621737724719182,30.6,0.93116177316404725,41.222394511987297,22.17343315107982,null,93.11617731640473,0.36364782298652748,1.2697961582613424,0.82444789023974596,0.44346866302159643,0.15232422800041534]
["Controller","Input Value","Units","Std Units",null,null,52,13.5,1,6.24,6.24,2.5679012345679015,0.37470124979511316,2.7425614011670327,7.6112807005835164,4.8687192994164841,0,6.2900241324336434,0.11473677040113305,0.25,0.36811568276710954,0.79170928161643184,6.2680358659760664E-4,6.2680358659760664E-4,3.0446590270504346,9.2699485909996989E-3,9.2699485909996989E-3,3.8503027765743805,6.6711741620833723E-2,0.30648577317526476,0.3266132625,0,0.70927416019880174,4.9738890332717745,9.0299438220849473E-2,0.2935296,0.39088843951998531,0.2935296,0.19164600000000001,0.15825761434639044,4.7249999999999994E-4,0.17850000000000002,0.48194999999999999,0.30345,0.17897250000000001,2.3005807490098849,31.200000000000003,0.93132713828915115,41.78802600994009,22.706580975999266,null,93.132713828915115,0.36811568276710954,1.2918085997187871,0.83576052019880176,0.45413161951998532,0.15825761434639044]
["θJA",30,"°C/W","Junction to Ambient Resistance",null,null,53,13.5,1,6.36,6.36,2.617283950617284,0.37478441252440631,2.7428819505336834,7.7314409752668425,4.9885590247331582,0,6.4090990097059368,0.11912199533701948,0.25,0.37267348405944833,0.79180181624799395,6.2695011621362198E-4,6.2695011621362198E-4,3.1024346289481937,9.6251006268969173E-3,9.6251006268969173E-3,3.9236272381349444,6.9276828167255028E-2,0.31237973035171213,0.3266132625,0,0.71822103607948451,5.0677114570957142,9.3738202855183958E-2,0.29917440000000001,0.40041952417198595,0.29917440000000001,0.19533150000000002,0.16430620046485447,4.7249999999999994E-4,0.17850000000000002,0.48194999999999999,0.30345,0.17897250000000001,2.3393506955188839,31.8,0.9314764151086814,42.356991303974226,23.243945958599298,null,93.147641510868141,0.37267348405944833,1.3139720602514704,0.84713982607948446,0.46487891917198598,0.16430620046485447]
["Theta Ja",2,"°C/W","Junction to Ambient Resistance",null,null,54,13.5,1,6.48,6.48,2.666666666666667,0.37486757060361769,2.7432023379958146,7.8516011689979077,5.1083988310020931,0,6.5282077623902373,0.12359074010790322,0.25,0.37732141474040948,0.79189430414174722,6.2709658893214204E-4,6.2709658893214204E-4,3.1602316470929082,9.9870640632875544E-3,9.9870640632875544E-3,3.9969885428283325,7.1891628351754305E-2,0.31827368752815954,0.3266132625,0,0.72723500004950326,5.1615481376648216,9.7241763997623826E-2,0.30481920000000001,0.41003547864666617,0.30481920000000001,0.199017,0.1704699863557286,4.7249999999999994E-4,0.17850000000000002,0.48194999999999999,0.30345,0.17897250000000001,2.3784847404445268,32.400000000000006,0.93161045519391061,42.92931100247516,23.78555443233331,null,93.161045519391067,0.37732141474040948,1.3362874786961694,0.85858622004950325,0.47571108864666617,0.1704699863557286]
[null,null,null,null,null,null,55,13.5,1,6.6,6.6,2.7160493827160495,0.37495072403313712,2.7435225635670015,7.9717612817835004,5.2282387182164989,0,6.6473485695225456,0.12814300471372694,0.25,0.38205966660643687,0.79198674530161028,6.272430047334378E-4,6.272430047334378E-4,3.2180491962774456,1.0355840629661913E-2,1.0355840629661913E-2,4.0703855784990415,7.4556174409438403E-2,0.32416764470460691,0.3266132625,0,0.73631646943722606,5.2553976297784031,0.10081009550184367,0.31046399999999996,0.41973683763945879,0.31046399999999996,0.20270250000000001,0.17674897201893372,4.7249999999999994E-4,0.17850000000000002,0.48194999999999999,0.30345,0.17897250000000001,2.4179840293364507,33,0.93173004913736324,43.505005971861301,24.33143313197294,null,93.173004913736321,0.38205966660643687,1.358755807076685,0.87010011943722609,0.48662866263945881,0.17674897201893372]
[null,null,null,null,null,null,56,13.5,1,6.72,6.72,2.7654320987654319,0.3750338728133546,2.7438426272608236,8.0919213136304116,5.3480786863695879,0,6.7665197379153339,0.13277878915443361,0.25,0.38688843539358675,0.79207913973150335,6.2738936359779836E-4,6.2738936359779836E-4,3.2758864529977925,1.0731432052934458E-2,1.0731432052934458E-2,4.1438173107470098,7.7270498571809607E-2,0.33006160188105432,0.3266132625,0,0.7454658667919194,5.3492585896319511,0.10444317122444192,0.31610879999999997,0.42952414396711985,0.31610879999999997,0.20638799999999999,0.18314315745439119,4.7249999999999994E-4,0.17850000000000002,0.48194999999999999,0.30345,0.17897250000000001,2.4578497250235491,33.6,0.93183593187705138,44.084097339595971,24.881609198355992,null,93.183593187705142,0.38688843539358675,1.3813780107590392,0.88168194679191936,0.49763218396711983,0.18314315745439119]
["Outputs",null,null,null,null,null,57,13.5,1,6.84,6.84,2.8148148148148149,0.37511701694465999,2.7441625290908562,8.2120812645454286,5.467918735454572,0,6.8857196911801113,0.13749809342996602,0.25,0.39180792079800481,0.79217148743534505,6.2753566550552713E-4,6.2753566550552713E-4,3.3337426501523053,1.1113840057444516E-2,1.1113840057444516E-2,4.2172827762478651,8.0034633066766045E-2,0.33595555905750174,0.3266132625,0,0.75468361994502764,5.443129766105951,0.10814096502494049,0.32175359999999997,0.43939794866465548,0.32175359999999997,0.21007350000000002,0.18965254266202211,4.7249999999999994E-4,0.17850000000000002,0.48194999999999999,0.30345,0.17897250000000001,2.4980830077926601,34.200000000000003,0.93192878747202679,44.666606497251379,25.436110183232774,null,93.192878747202684,0.39180792079800481,1.4041550686096831,0.89333212994502764,0.50872220366465548,0.18965254266202211]
["Design","Value","Units",null,null,null,58,13.5,1,6.96,6.96,2.8641975308641974,0.37520015642744331,2.7444822690706747,8.3322411345353373,5.5877588654646626,0,7.0049469598589358,0.14230091754026714,0.25,0.39681832649685073,0.79226378841705458,6.2768191043694344E-4,6.2768191043694344E-4,3.3916170722764343,1.1503066364956972E-2,1.1503066364956972E-2,4.2907810767479448,8.2848610118602131E-2,0.3418495162339491,0.3266132625,0,0.76397016207250934,5.5370099929346965,0.11190345076578422,0.32739839999999998,0.44935881108425174,0.32739839999999998,0.213759,0.19627712764174779,4.7249999999999994E-4,0.17850000000000002,0.48194999999999999,0.30345,0.17897250000000001,2.5386850755707533,34.799999999999997,0.93200925339409668,45.252555103625468,25.994964054212588,null,93.200925339409665,0.39681832649685073,1.4270879731567612,0.90505110207250938,0.51989928108425176,0.19627712764174779]
["Dmax",{"$f":"D1_Vinmin","v":0.625},"index",null,null,null,59,13.5,1,7.08,7.08,2.9135802469135799,0.37528329126209431,2.7448018472138509,8.4524009236069251,5.7075990763930751,0,7.1242001725367308,0.14718726148527991,0.25,0.40191986016967357,0.79235604268054949,6.2782809837238075E-4,6.2782809837238075E-4,3.449509051251054,1.1899112694662947E-2,1.1899112694662947E-2,4.3643113736561299,8.5712461948009147E-2,0.34774347341039652,0.3266132625,0,0.77332593175825337,5.6308981816534507,0.1157306023123407,0.33304319999999998,0.45940729899624483,0.33304319999999998,0.21744449999999999,0.20301691239348954,4.7249999999999994E-4,0.17850000000000002,0.48194999999999999,0.30345,0.17897250000000001,2.5796571441106964,35.4,0.93207792439193438,45.841965087912669,26.558199199812243,null,93.20779243919344,0.40191986016967357,1.4501777307544983,0.91683930175825334,0.53116398399624487,0.20301691239348954]
["Dprime",{"$f":"1-B68","v":0.375},"index",null,null,null,60,13.5,1,7.2,7.2,2.9629629629629628,0.37536642144900273,2.7451212635339566,8.5725606317669794,5.8274393682330219,0,7.2434780478228964,0.15215712526494735,0.25,0.40711273352024291,0.79244825022974774,6.2797422929218897E-4,6.2797422929218897E-4,3.5074179624305559,1.2301980763180512E-2,1.2301980763180512E-2,4.4378728831646264,8.8626220772075603E-2,0.35363743058684394,0.3266132625,0,0.78275137305858666,5.7247933152354324,0.11962239353289968,0.33868799999999999,0.46954398869216807,0.33868799999999999,0.22113000000000002,0.20987189691716879,4.7249999999999994E-4,0.17850000000000002,0.48194999999999999,0.30345,0.17897250000000001,2.6210004471806387,36,0.93213535597646657,46.434858652929336,27.125844434608403,null,93.213535597646654,0.40711273352024291,1.4734253617507549,0.92869717305858668,0.54251688869216808,0.20987189691716879]
["Ipp",{"$f":"Iripple_Vinnom","v":2.7609896254714674},"A",null,null,null,61,13.5,1,7.32,7.32,3.0123456790123457,0.37544954698855831,2.7454405180445618,8.6927202590222805,5.9472797409777192,0,7.3627793871048954,0.15721050887921253,0.25,0.41239716229884005,0.79254041106856676,6.2812030317673277E-4,6.2812030317673277E-4,3.5653432211437046,1.2711672284555367E-2,1.2711672284555367E-2,4.511464871839495,9.1589918804287865E-2,0.35953138776329135,0.3266132625,0,0.79224693556790116,5.8186944423414246,0.12357879829867269,0.34433279999999999,0.47976946508991436,0.34433279999999999,0.2248155,0.21684208121270698,4.7249999999999994E-4,0.17850000000000002,0.48194999999999999,0.30345,0.17897250000000001,2.6627162367570949,36.6,0.93218206757014177,47.031258278395057,27.69792900449572,null,93.218206757014173,0.41239716229884005,1.4968319006578157,0.94062516556790121,0.55395858008991439,0.21684208121270698]
["Top FET","Value","Units",null,null,null,62,13.5,1,7.44,7.44,3.0617283950617287,0.37553266788115092,2.7457596107592361,8.8128798053796178,6.0671201946203821,0,7.4821030679887324,0.16234741232801855,0.25,0.41777336632501305,0.79263252520092353,6.2826632000639274E-4,6.2826632000639274E-4,3.6232842795261786,1.3128188970261538E-2,1.3128188970261538E-2,4.5850866526291467,9.4603588254530774E-2,0.36542534493973877,0.3266132625,0,0.80181307448541306,5.9126006721144675,0.12759979048379286,0.3499776,0.49008432184105494,0.3499776,0.22850100000000001,0.22392746528002561,4.7249999999999994E-4,0.17850000000000002,0.48194999999999999,0.30345,0.17897250000000001,2.7048057832217749,37.200000000000003,0.93221854535728566,47.631186724270655,28.274482592052745,null,93.221854535728568,0.41777336632501305,1.520398396326468,0.95262373448541304,0.56548965184105493,0.22392746528002561]
["Tr",{"$f":"(Qgd_Q1+Qgs_Q1/2)*(RdsonDRT+Rgate1)/(VCC-Vsp_Q1)*1000000000","v":2.7897236614853198},"ns","Turn on of MOSFET -> Rise time of current",null,null,63,13.5,1,7.56,7.56,3.1111111111111107,0.37561578412717006,2.7460785416915456,8.9330392708457715,6.1869607291542268,0,7.6014480383517427,0.1675678356113085,0.25,0.42324156951080116,0.79272459263073447,6.2841227976156392E-4,6.2841227976156392E-4,3.6812406236487805,1.3551532529202062E-2,1.3551532529202062E-2,4.6587375812454175,9.7667261329087804E-2,0.37131930211618608,0.3266132625,0,0.81145025068307741,6.0065111694604498,0.13168534396531398,0.35562239999999995,0.50048916144035072,0.35562239999999995,0.23218650000000005,0.23112804911904625,4.7249999999999994E-4,0.17850000000000002,0.48194999999999999,0.30345,0.17897250000000001,2.7472703755622394,37.799999999999997,0.93224524486812277,48.234667034153873,28.855535322017534,null,93.224524486812271,0.42324156951080116,1.5441259121234281,0.96469334068307744,0.57711070644035067,0.23112804911904625]
["Tf",{"$f":"(Qgd_Q1+Qgs_Q1/2)*(RdsonDRT2+Rgate1)/(Vsp_Q1)*1000000000","v":0.67527173913043481},"ns","Turn off of MOSFET -> Fall time of current",null,null,64,{"$f":"Vin","v":13.5},{"$f":"MODE","v":1},7.68,{"$f":"Iout*G73/100/Number_of_Phases","v":7.68},{"$f":"Vout*K73/(Vin*Efficiency)","v":3.1604938271604937},{"$f":"(Vout+(Rdson2+Rs+Rdcr)*K73)/(Vin+(Rs+Rdson2-Rdson1)*K73)","v":0.37569889572700538},{"$f":"(Vin-(Rdson1+Rdcr)*K73-Vout)*M73/(Fsw*Lf)","v":2.746397310855055},9.0531986554275274,6.306801344572472,{"$f":"IF(MIN(Vin, -P73/(Coss_Q1+Coss_Q2)*0.00000002)<0, 0, MIN(Vin, -P73/(Coss_Q1+Coss_Q2)*0.00000002))","v":0},7.7208133109422263,{"$f":"R73^2*Rdcr","v":0.1728717787290257},{"$f":"Core_Loss_Ch1","v":0.25},{"$f":"(T73+S73*(1+Ltc*(Ta-25)))/(1-S73*Ltc*ThetaCa)","v":0.42880199988443252},0.79281661336191522,6.2855818242265661E-4,6.2855818242265661E-4,3.739211770909705,1.3981704667709692E-2,1.3981704667709692E-2,4.7324170528774081,{"$f":"Rdson1*AB73^2","v":0.100780970230642},{"$f":"(Vin*K73/2)*Fsw*(Tr_buck+Tf_buck)","v":0.37721325929263344},{"$f":"(0.5*Coss_Q1*(Vin-Q73)^2-0.5*Coss_Q2*(Vin-Q73)^2+(Qoss_Q2*(Vin-Q73)/Vin)*Vin)*Fsw","v":0.3266132625},{"$f":"IF(K73>N73/2,0,ABS(K73-N73/2)*Vsd_Q1*Deadtime*Fsw)","v":0},{"$f":"(AF73+AE73+AD73+AC73*(1+RdsonTopTc*Ta-RdsonTopTc*25))/(1-AC73*RdsonTopTc*ThetaJA_Q1)","v":0.82115893077468127},{"$f":"SQRT((1-M73))*SQRT(K73^2+(N73^2)/12)","v":6.100425150762673},{"$f":"Rdson2*AH73^2","v":0.13583543262321091},{"$f":"IF(K73<N73/2,Deadtime*Fsw*IF(VfdSky_Q2>0,0,Vsd_Q2)*(K73+N73/2),2*Deadtime*Fsw*IF(VfdSky_Q2>0,0,Vsd_Q2)*K73)","v":0.36126719999999996},{"$f":"(AJ73+AI73*(1+RdsonBotTc*Ta-RdsonBotTc*25))/(1-AI73*RdsonBotTc*ThetaJA_Q2)","v":0.51098459533750407},{"$f":"2*Deadtime*Fsw*IF(VfdSky_Q2>0,VfdSky_Q2,Vsd_Q2)*K73","v":0.36126719999999996},{"$f":"IF(QrrSky_Q2>0,QrrSky_Q2,Qrr_Q2*K73/(Iout/Number_of_Phases))*Fsw*Vin","v":0.23587199999999997},{"$f":"Rs*R73^2","v":0.23844383272969066},{"$f":"Iq*Vin","v":4.7249999999999994E-4},{"$f":"IF(Ext_VCC=1,  (Qg_Q1+Qg_Q2)*Fsw*VCC, (Qg_Q1+Qg_Q2)*Fsw*Vin)","v":0.17850000000000002},{"$f":"(Vin-VCC)*Fsw*(Qg_Q1+Qg_Q2)+(RdsonDRT+RdsonDRT2)*Fsw*Qg_Q1*VCC/(RdsonDRT+2*Rgate1+RdsonDRT2)+(RdsonDRB+RdsonDRB2)*Fsw*Qg_Q2*VCC/(RdsonDRB+2*Rgate2+RdsonDRB2)","v":0.48194999999999999},{"$f":"(Qg_Q1+Qg_Q2)*Fsw*(Vin-VCC)","v":0.30345},0.17897250000000001,{"$f":" SUM(U73,X73,AA73,AG73,AK73,AL73,AM73,AS73,AN73)","v":2.790111321576441},{"$f":"Vout*K73","v":38.4},0.93226259332504136,{"$f":"ThetaJA_Q1*BC73","v":48.841722538734061},{"$f":"ThetaJA_Q2*BD73","v":29.441117766875202},null,93.226259332504142,{"$f":"U73","v":0.42880199988443252},1.5680155261121853,0.97683445077468123,0.58882235533750404,0.23844383272969066]
["Part Power","Value","Units",null,null,null,65,13.5,1,{"$f":"Iout*G74/100","v":7.8},7.8,3.2098765432098766,0.37578200268104645,2.7467159182633289,{"$f":"K74+N74/2","v":9.1733579591316641},{"$f":"K74-N74/2","v":6.4266420408683356},0,{"$f":"SQRT(K74^2+(N74^2)/12)","v":7.8401979584682744},0.17825924168111326,0.25,0.43445488961449985,{"$f":"N74/SQRT(12)","v":0.79290858739838155},{"$f":"RCoutEsr*V74^2","v":6.2870402797009684E-4},{"$f":"W74","v":6.2870402797009684E-4},{"$f":"SQRT(M74*(1-M74))*SQRT(K74^2+(N74^2)/12)","v":3.7971972676630275},{"$f":"RCinEsr*Y74^2","v":1.4418707089547561E-2},{"$f":"Z74","v":1.4418707089547561E-2},{"$f":"SQRT(M74)*SQRT(K74^2+(N74^2)/12)","v":4.8061244992029817},0.10394474715827599,0.38310721646908091,0.3266132625,0,0.83093958718612981,6.1943418799845871,0.14005003034037811,0.36691199999999996,0.5215712440511856,0.36691199999999996,0.23955750000000006,0.24587481611188039,4.7249999999999994E-4,0.17850000000000002,0.48194999999999999,0.30345,0.17897250000000001,2.8333299480812135,39,{"$f":"AU74/(AU74+AT74)","v":0.93227099177623152},49.45237685930649,30.031260952559279,null,{"$f":"AV74*100","v":93.227099177623145},0.43445488961449985,{"$f":"AG74+AK74+AM74","v":1.5920683312373156},{"$f":"AG74+AM74*0.66","v":0.98904753718612981},{"$f":"AK74+AM74*0.33","v":0.6006252190511856},{"$f":"AN74","v":0.24587481611188039}]
["Power Dis",{"$f":"AS9","v":0.17897250000000001},"W",null,null,null,66,13.5,1,7.92,7.92,3.2592592592592591,0.37586510498968273,2.7470343639299291,9.2935171819649653,6.5464828180350354,0,7.9596011091250247,0.18373022446751452,0.25,0.4402004750346199,0.79300051474404853,6.2884981638432593E-4,6.2884981638432593E-4,3.8551966870589003,1.4862541495909921E-2,1.4862541495909921E-2,4.879859385667058,0.10715862430747294,0.38900117364552833,0.3266132625,0,0.84079269822695502,6.2882606651204789,0.14432911100263029,0.37255679999999997,0.53224973728538694,0.37255679999999997,0.24324299999999999,0.25342099926553729,4.7249999999999994E-4,0.17850000000000002,0.48194999999999999,0.30345,{"$f":"SUM(AO75:AP75)","v":0.17897250000000001},2.8769276011247933,39.6,0.93227081703883385,50.06665391134775,30.625996364269348,null,93.227081703883385,0.4402004750346199,1.6162854355123422,1.0013330782269549,0.61251992728538696,0.25342099926553729]
["Temp rise",{"$f":"B75*B62","v":5.3691750000000003},"°C",null,null,null,67,13.5,1,8.0399999999999991,8.0399999999999991,3.3086419753086416,0.37594820265330386,2.7473526478684174,9.4136763239342081,6.6663236760657902,0,8.0790219425154302,0.18928472708817279,0.25,0.44603899666858032,0.79309239540283094,6.2899554764580038E-4,6.2899554764580038E-4,3.9132096270737637,1.5313209585422784E-2,1.5313209585422784E-2,4.9536212089993494,0.11042263387011678,0.39489513082197564,0.3266132625,0,0.85071874816306325,6.3821808549584071,0.14867264849870132,0.37820159999999997,0.54302071404813979,0.37820159999999997,0.24692849999999997,0.26108238219058322,4.7249999999999994E-4,0.17850000000000002,0.48194999999999999,0.30345,0.17897250000000001,2.9209056462034351,40.199999999999996,0.93226242347114041,50.684577908153159,31.225355952406993,null,93.226242347114038,0.44603899666858032,1.640667962211203,1.0136915581630632,0.62450711904813982,0.26108238219058322]
["Current (switching)",{"$f":"(Qg_Q1+Qg_Q2)*Fsw+Iq","v":3.5735000000000003E-2},"A",null,null,null,68,13.5,1,8.16,8.16,3.3580246913580245,0.37603129567229926,2.7476707700923533,9.5338353850461761,6.7861646149538233,0,8.1984596859248509,0.19492274954303151,0.25,0.45197069925598049,0.7931842293786433,6.2914122173499218E-4,6.2914122173499218E-4,3.9712357087114158,1.577071305414466E-2,1.577071305414466E-2,5.0274094949474044,0.11373680803449292,0.40078908799842311,0.3266132625,0,0.86071822729074732,6.4761018361239255,0.15308061672024403,0.38384639999999998,0.55388482277264806,0.38384639999999998,0.250614,0.26885896488694006,4.7249999999999994E-4,0.17850000000000002,0.48194999999999999,0.30345,0.17897250000000001,2.9652654684821957,40.799999999999997,0.93224614459113364,51.306173364537365,31.829372138632404,null,93.224614459113369,0.45197069925598049,1.6652170500633954,1.0261234672907473,0.63658744277264812,0.26885896488694006]
["Qrr Current",{"$f":"Qrr_Q2*Fsw","v":2.7300000000000001E-2},"A",null,null,null,69,13.5,1,8.2799999999999994,8.2799999999999994,3.407407407407407,0.37611438404705816,2.7479887306152926,9.6539943653076463,6.9060056346923533,0,8.3179136109142409,0.20064429183203392,0.25,0.45799583177836944,0.7932760166753986,6.2928683863238734E-4,6.2928683863238734E-4,4.0292745743579186,1.6235053595567189E-2,1.6235053595567189E-2,5.1012237962035121,0.11710117898528836,0.40668304517487047,0.3266132625,0,0.87079163201198417,6.5700230303766372,0.15755298956182986,0.38949119999999998,0.56484272144087999,0.38949119999999998,0.25429950000000001,0.27675074735452954,4.7249999999999994E-4,0.17850000000000002,0.48194999999999999,0.30345,0.17897250000000001,3.0100084730199632,41.4,0.93222229455667383,51.931465100599205,32.438077822044001,null,93.222229455667389,0.45799583177836944,1.6899338534528643,1.0386293020119841,0.64876155644087996,0.27675074735452954]
["Diode Current",{"$f":"Deadtime*Fsw*(Iripple_Vinnom/2)*(Vsd_Q2)/Vin","v":2.4051287404107005E-3},null,null,null,null,70,13.5,1,8.4,8.4,3.4567901234567899,0.37619746777796997,2.7483065294507933,9.7741532647253972,7.0258467352746035,0,8.4373830302006851,0.20644935395512365,0.25,0.46411464748588938,0.79336775729701092,6.2943239831848884E-4,6.2943239831848884E-4,4.0873258862752655,1.6706232900615885E-2,1.6706232900615885E-2,5.1750636905064651,0.12051577890359277,0.41257700235131789,0.3266132625,0,0.88093946491104436,6.6639438921347542,0.16208974092094836,0.39513599999999999,0.5758950777096703,0.39513599999999999,0.25798500000000002,0.284757729593274,4.7249999999999994E-4,0.17850000000000002,0.48194999999999999,0.30345,0.17897250000000001,3.0551360849988125,42,0.93219116952093661,52.560478245552225,33.051506385483513,null,93.219116952093657,0.46411464748588938,1.7148195426207149,1.0512095649110444,0.66103012770967029,0.284757729593274]
["Total",{"$f":"SUM(B77:B79)","v":6.5440128740410705E-2},"A",null,null,null,71,13.5,1,8.52,8.52,3.5061728395061724,0.37628054686542411,2.74862416661241,9.8943120833062039,7.1456879166937943,0,8.5568672947974243,0.21233793591224395,0.25,0.47032740392442607,0.79345945124739292,6.2957790077381392E-4,6.2957790077381392E-4,4.1453893252203473,1.7184252657650806E-2,1.7184252657650806E-2,5.2489287789012176,0.12398063996689841,0.41847095952776531,0.3266132625,0,0.89116223483243517,6.7578639062055963,0.16669084469800671,0.40078079999999999,0.58704256903937913,0.40078079999999999,0.26167049999999997,0.29287991160309512,4.7249999999999994E-4,0.17850000000000002,0.48194999999999999,0.30345,0.17897250000000001,3.1006497499577605,42.599999999999994,0.93215304887518302,53.193238241621756,33.669691701968958,null,93.2153048875183,0.47032740392442607,1.7398753038718142,1.0638647648324351,0.67339383403937914,0.29287991160309512]
[null,null,null,null,null,null,72,13.5,1,8.64,8.64,3.5555555555555558,0.37636362130980983,2.7489416421136963,10.014470821056848,7.2655291789431526,0,8.6763657913886334,0.21831003770333882,0.25,0.47663436296327633,0.79355109853045724,6.2972334597889549E-4,6.2972334597889549E-4,4.2034645891772744,1.766911455246727E-2,1.766911455246727E-2,5.3228186841413958,0.12749579434910133,0.42436491670421272,0.3266132625,0,0.90146045696020294,6.851782585702364,0.17135627479632973,0.4064256,0.59828588282516026,0.4064256,0.26535600000000004,0.30111729338391563,4.7249999999999994E-4,0.17850000000000002,0.48194999999999999,0.30345,0.17897250000000001,3.1465509340310014,43.2,0.93210819638963527,53.829770848010149,34.292668141258012,null,93.210819638963528,0.47663436296327633,1.7651023397853631,1.076595416960203,0.6858533628251603,0.30111729338391563]
[null,null,null,null,null,null,73,13.5,1,8.76,8.76,3.6049382716049378,0.37644669111151624,2.7492589559682035,10.134629477984102,7.3853705220158981,0,8.7958779399167586,0.2243656593283514,0.25,0.48303579082333292,0.79364269915011587,6.2986873391428135E-4,6.2986873391428135E-4,4.2615513921923407,1.8160820268296476E-2,1.8160820268296476E-2,5.3967330492211421,0.13106127422050076,0.43025887388066003,0.3266132625,0,0.91183465289862109,6.9456994701295969,0.17608600512215875,0.4120704,0.60962571653089026,0.4120704,0.26904149999999999,0.30946987493565714,4.7249999999999994E-4,0.17850000000000002,0.48194999999999999,0.30345,0.17897250000000001,3.1928411241907129,43.8,0.93205686126206311,54.470102144931055,34.920470576544517,null,93.205686126206317,0.48303579082333292,1.7905018694295112,1.0894020428986211,0.69840941153089031,0.30946987493565714]
[null,null,null,null,null,null,74,13.5,1,8.8800000000000008,8.8800000000000008,3.6543209876543212,0.37652975627093255,2.7495761081894816,10.254788054094742,7.50521194590526,0,8.915403191362719,0.2305048007872256,0.25,0.48953195810579819,0.79373425311028045,6.3001406456053479E-4,6.3001406456053479E-4,4.3196494633021185,1.8659371485806278E-2,1.8659371485806278E-2,5.4706715360243363,0.13467711174780092,0.43615283105710756,0.3266132625,0,0.92228535075428741,7.0396141236216696,0.18088000958465195,0.41771520000000001,0.62106277782581265,0.41771520000000001,0.272727,0.31793765625824222,4.7249999999999994E-4,0.17850000000000002,0.48194999999999999,0.30345,0.17897250000000001,3.2395218284945075,44.400000000000006,0.93199927908266988,55.114258537714363,35.553134391290634,null,93.199927908266986,0.48953195810579819,1.8160751285801,1.1022851707542873,0.71106268782581261,0.31793765625824222]
[null,null,null,null,null,null,75,13.5,1,9,9,3.7037037037037037,0.37661281678844799,2.7498930987910803,10.37494654939554,7.6250534506044598,0,9.0349410257011762,0.23672746207990483,0.25,0.49612313982142808,0.79382576041486219,6.3015933789823417E-4,6.3015933789823417E-4,4.3777585455460901,1.9164769883101819E-2,1.9164769883101819E-2,5.5446338240803321,0.13834333909411059,0.44204678823355487,0.3266132625,0,0.93281308521965878,7.1335261333202213,0.18573826209588329,0.42335999999999996,0.63259778472394967,0.42335999999999996,0.27641250000000001,0.32652063735159287,4.7249999999999994E-4,0.17850000000000002,0.48194999999999999,0.30345,0.17897250000000001,3.2865945763376292,45,0.93193567272295919,55.762266760982939,36.190695486197484,null,93.193567272295923,0.49612313982142808,1.8418233699436084,1.1152453352196587,0.72381390972394966,0.32652063735159287]
[null,null,null,null,null,null,76,13.5,1,9.1199999999999992,9.1199999999999992,3.7530864197530858,0.37669587266445154,2.7502099277865444,10.495104963893272,7.744895036106727,0,9.1544909500150773,0.24303364320633306,0.25,0.50280961542031499,0.79391722106777141,6.3030455390797259E-4,6.3030455390797259E-4,4.435878395056184,1.9677017135726227E-2,1.9677017135726227E-2,5.618619609416613,0.14205998841894402,0.44794074541000223,0.3266132625,0,0.94341839765805036,7.2274351078779713,0.19066073657084279,0.42900479999999996,0.64423146572634238,0.42900479999999996,0.28009800000000001,0.33521881821563182,4.7249999999999994E-4,0.17850000000000002,0.48194999999999999,0.30345,0.17897250000000001,3.3340609187099739,45.599999999999994,0.93186625315547456,56.414153882902518,36.833190286317119,null,93.18662531554746,0.50280961542031499,1.8677478633843927,1.1282830776580504,0.73666380572634238,0.33521881821563182]
[null,null,null,null,null,null,77,13.5,1,9.24,9.24,3.8024691358024691,0.37677892389933232,2.7505265951894229,10.615263297594712,7.8647367024052883,0,9.2740524967551465,0.24942334416645406,0.25,0.50959166882221407,0.79400863507291908,6.3044971257035997E-4,6.3044971257035997E-4,4.4940087802163173,2.0196114916661352E-2,2.0196114916661352E-2,5.6926286034996645,0.14582709187822143,0.45383470258644976,0.3266132625,0,0.95410183619012656,7.3213406760775595,0.19564740692743551,0.43464959999999997,0.65596455996617109,0.43464959999999997,0.28378350000000008,0.34403219885028147,4.7249999999999994E-4,0.17850000000000002,0.48194999999999999,0.30345,0.17897250000000001,3.3819224284580254,46.2,0.93179122021059557,57.069947309506333,37.480655748308557,null,93.179122021059555,0.50959166882221407,1.893849896156298,1.1413989461901266,0.74961311496617111,0.34403219885028147]
[null,null,null,null,null,null,78,13.5,1,9.36,9.36,3.8518518518518516,0.37686197049347925,2.7508431010132579,10.735421550506629,7.9845784494933705,0,9.3936252221315506,0.25589656496021146,0.25,0.51646958844742008,0.79410000243421475,6.3059481386601988E-4,6.3059481386601988E-4,4.5521494808857481,2.0722064896328388E-2,2.0722064896328388E-2,5.7666605322562585,0.14964468162426917,0.45972865976289706,0.3266132625,0,0.96486395578190964,7.4152424855552761,0.20069824708648157,0.44029439999999997,0.66779781735681998,0.44029439999999997,0.28746899999999997,0.3529607792554641,4.7249999999999994E-4,0.17850000000000002,0.48194999999999999,0.30345,0.17897250000000001,3.4301807005518081,46.8,0.93171076327594959,57.729674789095483,38.133129367841001,null,93.17107632759496,0.51646958844742008,1.9201307731387296,1.1545934957819097,0.76266258735682002,0.3529607792554641]
[null,null,null,null,null,null,79,13.5,1,9.48,9.48,3.901234567901235,0.3769450124472814,2.7511594452715928,10.855579722635797,8.1044202773642038,0,9.5132087046261944,0.2624533055875492,0.25,0.52344366724820202,0.79419132315556784,6.3073985777559161E-4,6.3073985777559161E-4,4.6103002876806851,2.1254868742588608E-2,2.1254868742588608E-2,5.840715135168157,0.1535127898058207,0.46562261693934448,0.3266132625,0,0.97570531833434149,7.5091402016205038,0.20581323097171525,0.44593919999999998,0.67973199874294465,0.44593919999999998,0.29115449999999998,0.36200455943110238,4.7249999999999994E-4,0.17850000000000002,0.48194999999999999,0.30345,0.17897250000000001,3.4788373523569547,47.400000000000006,0.93162506194344474,58.393364416717077,38.790649187147231,null,93.162506194344473,0.52344366724820202,1.9465918170772862,1.1678672883343415,0.77581298374294461,0.36200455943110238]
[null,null,null,null,null,null,80,13.5,1,9.6,9.6,3.9506172839506171,0.37702804976112769,2.7514756279779693,10.975737813988985,8.2242621860110141,0,9.6328025436152132,0.26909356604841117,0.25,0.5305142027407993,0.79428259724088768,6.3088484427973029E-4,6.3088484427973029E-4,4.6684610013091064,2.1794528120744023E-2,2.1794528120744023E-2,5.9147921644338588,0.15743144856801677,0.4715165741157919,0.3266132625,0,0.98662649277442049,7.6030335061626264,0.21099233250978519,0.45158399999999999,0.69176787605460544,0.45158399999999999,0.29484000000000005,0.37116353937711888,4.7249999999999994E-4,0.17850000000000002,0.48194999999999999,0.30345,0.17897250000000001,3.5278940239119683,48,0.9315342866084374,59.061044638721029,39.453253802730273,null,93.153428660843744,0.5305142027407993,1.9732343688290259,1.1812208927744205,0.78906507605460541,0.37116353937711888]
[null,null,null,null,null,null,81,13.5,1,9.7200000000000006,9.7200000000000006,4,0.37711108243540686,2.7517916491459258,11.095895824572963,8.344104175427038,0,9.7524063580922995,0.27581734634274141,0.25,0.53768149703799017,0.79437382469408224,6.3102977335910448E-4,6.3102977335910448E-4,4.7266314319542744,2.2341044693538117E-2,2.2341044693538117E-2,5.9888913841917164,0.16140069005240595,0.47741053129223926,0.3266132625,0,0.99762805514794894,7.6969220966379366,0.21623552563025367,0.45722879999999999,0.70390623246452955,0.45722879999999999,0.2985255,0.38043771909343643,4.7249999999999994E-4,0.17850000000000002,0.48194999999999999,0.30345,0.17897250000000001,3.5773523782108025,48.6,0.93143859902510684,59.732744257397449,40.120982373226475,null,93.143859902510684,0.53768149703799017,2.0000597876124786,1.194654885147949,0.80241964746452954,0.38043771909343643]
[null,null,null,null,null,null,82,13.5,1,9.84,9.84,4.0493827160493829,0.37719411047050783,2.7521075087890008,11.216053754394501,8.4639462456054986,0,9.8720197854843459,0.28262464647048374,0.25,0.54494585688223551,0.79446500551906007,6.3117464499440009E-4,6.3117464499440009E-4,4.784811398702824,2.2894420121156476E-2,2.2894420121156476E-2,6.0630125697992243,0.16542054639694526,0.48330448846868668,0.3266132625,0,1.0087105887139203,7.7908056851298113,0.22154278426559609,0.4628736,0.71614786254856921,0.4628736,0.30221100000000001,0.3898270985799776,4.7249999999999994E-4,0.17850000000000002,0.48194999999999999,0.30345,0.17897250000000001,3.627214101490853,49.2,0.93133815282171983,60.408492435696019,40.793874627428458,null,93.13381528217198,0.54494585688223551,2.0270694512624896,1.2081698487139203,0.81587749254856923,0.3898270985799776]
[null,null,null,null,null,null,83,13.5,1,9.9600000000000009,9.9600000000000009,4.0987654320987659,0.37727713386681944,2.7524232069207319,11.336211603460367,8.5837883965396351,0,9.9916424805517501,0.28951546643158232,0.25,0.55230759367940618,0.79455613971972883,6.3131945916631725E-4,6.3131945916631725E-4,4.8430007290137311,2.3454656061227531E-2,2.3454656061227531E-2,6.1371555071638282,0.16949104973600085,0.48919844564513409,0.3266132625,0,1.0198746840405768,7.8846839974760572,0.22691408235120081,0.4685184,0.72849357244942248,0.4685184,0.30589650000000002,0.39933167783666534,4.7249999999999994E-4,0.17850000000000002,0.48194999999999999,0.30345,0.17897250000000001,3.6774809035264653,49.800000000000004,0.93123309397911525,61.088318702028843,41.471970872471125,null,93.123309397911527,0.55230759367940618,2.0542647564899994,1.2217663740405769,0.82943941744942251,0.39933167783666534]
[null,null,null,null,null,null,84,13.5,1,10.08,10.08,4.1481481481481479,0.37736015262473033,2.7527387435546529,11.456369371777326,8.7036306282226743,0,10.111274114366378,0.29648980622598115,0.25,0.55976702353310304,0.7946472272999956,6.3146421585557092E-4,6.3146421585557092E-4,4.9011992582247865,2.4021754168823198E-2,2.4021754168823198E-2,6.2113199921209752,0.17361223220034769,0.49509240282158146,0.3266132625,0,1.0311209391031733,7.9785567724579032,0.23234939382536862,0.47416320000000001,0.74094418004368567,0.47416320000000001,0.30958200000000002,0.40895145686342227,4.7249999999999994E-4,0.17850000000000002,0.48194999999999999,0.30345,0.17897250000000001,3.7281545179280631,50.4,0.93112356127543128,61.77225295515867,42.155312002184289,null,93.112356127543123,0.55976702353310304,2.0816471191468588,1.2354450591031734,0.84310624004368573,0.40895145686342227]
[null,null,null,null,null,null,85,13.5,1,10.199999999999999,10.199999999999999,4.1975308641975309,0.37744316674462924,2.7530541187042976,11.576527059352149,8.82347294064785,0,10.23091437336091,0.3035476658536243,0.25,0.56732446727957353,0.79473826826376714,6.3160891504289148E-4,6.3160891504289148E-4,4.9594068290935356,2.4595716096459597E-2,2.4595716096459597E-2,6.2855058298556328,0.17778412591717113,0.50098635999802887,0.3266132625,0,1.0424499593834762,8.0724237610456075,0.23784869262931205,0.47980799999999996,0.75350051511230709,0.47980799999999996,0.31326750000000003,0.4186864356601715,4.7249999999999994E-4,0.17850000000000002,0.48194999999999999,0.30345,0.17897250000000001,3.7792367024470304,51,0.9310096866998111,62.460325469173817,42.84393950561536,null,93.100968669981114,0.56732446727957353,2.1092179744957833,1.2492065093834763,0.85687879011230716,0.4186864356601715]
[null,null,null,null,null,null,86,13.5,1,10.32,10.32,4.2469135802469138,0.37752617622690493,2.7533693323831994,11.696684666191601,8.9433153338083997,0,10.350562958443808,0.31068904531445618,0.25,0.57498025052323465,0.79482926261495024,6.3175355670902554E-4,6.3175355670902554E-4,5.0176232913699046,2.5176543494097755E-2,2.5176543494097755E-2,6.3597128343637044,0.18200676301006688,0.50688031717447624,0.3266132625,0,1.053862357971036,8.1662847256961726,0.24341195270715593,0.48545280000000002,0.76616341951452016,0.48545280000000002,0.31695299999999998,0.42853661422683614,4.7249999999999994E-4,0.17850000000000002,0.48194999999999999,0.30345,0.17897250000000001,3.8307292392864336,51.6,0.93089159583757719,63.152566898551797,43.53789547572601,null,93.08915958375772,0.57498025052323465,2.136978777485556,1.263051337971036,0.87075790951452015,0.42853661422683614]
[null,null,null,null,null,null,87,13.5,1,10.44,10.44,4.2962962962962958,0.3776091810719458,2.7536843846048873,11.816842192302444,9.0631578076975554,0,10.470219584174666,0.31791394460842065,0.25,0.582734703672808,0.79492021035745042,6.3189814083473319E-4,6.3189814083473319E-4,5.0758485013979904,2.5764238009144225E-2,2.5764238009144225E-2,6.4339408279502166,0.1862801755990412,0.51277427435092371,0.3266132625,0,1.0653587556662625,8.2601394396989445,0.24903914800593546,0.49109759999999997,0.7789337473653215,0.49109759999999997,0.32063849999999999,0.43850199256333888,4.7249999999999994E-4,0.17850000000000002,0.48194999999999999,0.30345,0.17897250000000001,3.8826339354177097,52.199999999999996,0.93076940822913601,63.849008283313125,44.237222618266074,null,93.076940822913599,0.582734703672808,2.164931003031584,1.2769801656662625,0.88474445236532151,0.43850199256333888]
[null,null,null,null,null,null,88,13.5,1,10.56,10.56,4.3456790123456797,0.37769218128014054,2.753999275382891,11.936999637691446,9.1830003623085545,0,10.589883977995264,0.32522236373546226,0.25,0.59058816197807773,0.79501111149517323,6.3204266740079075E-4,6.3204266740079075E-4,5.1340823217447413,2.6358801286451877E-2,2.6358801286451877E-2,6.5081896407613842,0.19060439580051206,0.51866823152737107,0.3266132625,0,1.0769397810853447,8.3539876865654392,0.25473025247559744,0.49674240000000003,0.79181236521658138,0.49674240000000003,0.32432400000000006,0.44858257066960316,4.7249999999999994E-4,0.17850000000000002,0.48194999999999999,0.30345,0.17897250000000001,3.9349526229034599,52.800000000000004,0.93064323770467117,64.549681054267239,44.941964260829067,null,93.064323770467112,0.59058816197807773,2.1930761463019262,1.2909936210853448,0.89883928521658141,0.44858257066960316]
[null,null,null,null,null,null,89,13.5,1,10.68,10.68,4.3950617283950617,0.37777517685187773,2.7543140047307384,12.057157002365368,9.302842997634631,0,10.709555879511903,0.33261430269552511,0.25,0.59854096556727421,0.79510196603202399,6.3218713638798986E-4,6.3218713638798986E-4,5.1923246208534071,2.6960234968320479E-2,2.6960234968320479E-2,6.5824591103478998,0.19497945572730926,0.52456218870381843,0.3266132625,0,1.0886060707670486,8.4478292594598461,0.26048524006899854,0.50238719999999992,0.80480015224185564,0.50238719999999992,0.32800949999999995,0.45877834854555194,4.7249999999999994E-4,0.17850000000000002,0.48194999999999999,0.30345,0.17897250000000001,3.9876871592264389,53.4,0.93051319269650468,65.254617038352421,45.652164362092783,null,93.051319269650463,0.59854096556727421,2.2214157230089042,1.3050923407670485,0.91304328724185568,0.45877834854555194]
[null,null,null,null,null,null,90,13.5,1,10.8,10.8,4.4444444444444446,0.37785816778754577,2.7546285726619555,12.177314286330979,9.4226857136690221,0,10.829235039825166,0.3400897614885538,0.25,0.60659345948509824,0.79519277397190735,6.3233154777713699E-4,6.3233154777713699E-4,5.2505752727198844,2.756854069449749E-2,2.756854069449749E-2,6.6567490812570576,0.19940538748867503,0.53045614588026591,0.3266132625,0,1.1003582692814269,8.5416639606671776,0.26630408474190581,0.50803200000000004,0.81789800042498806,0.50803200000000004,0.33169500000000002,0.46908932619110871,4.7249999999999994E-4,0.17850000000000002,0.48194999999999999,0.30345,0.17897250000000001,4.0408394276248965,54,0.9303793765308358,65.963848464071347,46.367867521249408,null,93.037937653083574,0.60659345948509824,2.2499512697064148,1.319276969281427,0.92735735042498812,0.46908932619110871]
[null,null,null,null,null,null,91,13.5,1,10.92,10.92,4.4938271604938276,0.37794115408753309,2.7549429791900661,12.297471489595033,9.5425285104049671,0,10.948921220903411,0.34764874011449221,0.25,0.61474599373138394,0.7952835353187272,6.3247590154905326E-4,6.3247590154905326E-4,5.3088341565901844,2.8183720102178615E-2,2.8183720102178615E-2,6.7310594046515151,0.20388222319026422,0.53635010305671327,0.3266132625,0,1.1121970293404866,8.6354916010961098,0.27218676045299534,0.51367679999999993,0.83110681475257775,0.51367679999999993,0.33538050000000003,0.47951550360619621,4.7249999999999994E-4,0.17850000000000002,0.48194999999999999,0.30345,0.17897250000000001,4.094411337434372,54.6,0.93024188770042193,66.677407967024322,47.089118987628886,null,93.024188770042187,0.61474599373138394,2.2786843440930644,1.3335481593404865,0.94178237975257773,0.47951550360619621]
[null,null,null,null,null,null,92,13.5,1,11.04,11.04,4.5432098765432096,0.37802413575222815,2.7552572243285929,12.417628612164295,9.6623713878357034,0,11.068614194996796,0.35529123857328521,0.25,0.62299892330042361,0.79537425007638718,6.3262019768457539E-4,6.3262019768457539E-4,5.36710115667747,2.8805774826008639E-2,2.8805774826008639E-2,6.8053899379527021,0.20840999493414547,0.54224406023316063,0.3266132625,0,1.1241230119108454,8.7293119998139979,0.2781332411638528,0.51932159999999994,0.84442751341040645,0.51932159999999994,0.33906600000000003,0.49005688079073828,4.7249999999999994E-4,0.17850000000000002,0.48194999999999999,0.30345,0.17897250000000001,4.1484048244361071,55.199999999999996,0.93010082011963291,67.395328595542267,47.815964670520323,null,93.010082011963291,0.62299892330042361,2.3076165253212517,1.3479065719108454,0.95631929341040645,0.49005688079073828]
[null,null,null,null,null,null,93,13.5,1,11.16,11.16,4.5925925925925926,0.37810711278201931,2.7555713080910591,12.53778565404553,9.7822143459544701,0,11.18831374408872,0.36301725686487718,0.25,0.63135260822094541,0.79546491824879118,6.3276443616455604E-4,6.3276443616455604E-4,5.4253761618971659,2.9434706498082022E-2,2.9434706498082022E-2,6.8797405445070083,0.21298873481880112,0.5481380174096081,0.3266132625,0,1.1361368863284218,8.8231249836115868,0.28414350083897305,0.52496639999999994,0.85786102798390651,0.52496639999999994,0.34275149999999999,0.50071345774465825,4.7249999999999994E-4,0.17850000000000002,0.48194999999999999,0.30345,0.17897250000000001,4.2028218512121782,55.8,0.9299562633631826,68.117643816421094,48.54845114919533,null,92.995626336318253,0.63135260822094541,2.3367494143123282,1.3623528763284218,0.97096902298390653,0.50071345774465825]
[null,null,null,null,null,null,94,13.5,1,11.28,11.28,4.6419753086419755,0.37819008517729485,2.7558852304909842,12.657942615245492,9.9020573847545066,0,11.308019659382001,0.37082679498921245,0.25,0.63980741359676652,0.79555553983984184,6.329086169698622E-4,6.329086169698622E-4,5.4836590656188307,3.0070516747943588E-2,3.0070516747943588E-2,6.9541110932730996,0.21761847493912792,0.55403197458605546,0.3266132625,0,1.1482393304151997,8.9169303865952578,0.29021751344575841,0.53061119999999995,0.87140830366275668,0.53061119999999995,0.34643699999999999,0.5114852344678793,4.7249999999999994E-4,0.17850000000000002,0.48194999999999999,0.30345,0.17897250000000001,4.2576644075075158,56.4,0.92980830288974092,68.84438752075998,49.286625683137835,null,92.98083028897409,0.63980741359676652,2.3660846340779562,1.3768877504151997,0.98573251366275672,0.5114852344678793]
[null,null,null,null,null,null,95,13.5,1,11.4,11.4,4.6913580246913575,0.37827305293844299,2.7561989915418859,12.778099495770944,10.021900504229057,0,11.427731740817221,0.378719852946236,0.25,0.64836370964812506,0.7956461148534415,6.3305274008137579E-4,6.3305274008137579E-4,5.5419497654335741,3.0713207202589247E-2,3.0713207202589247E-2,7.0285014585288152,0.22229924738643755,0.55992593176250283,0.3266132625,0,1.1604310305981058,9.0107280498048379,0.29635525295451987,0.53625599999999995,0.88507029944971005,0.53625599999999995,0.35012250000000006,0.5223722109603256,4.7249999999999994E-4,0.17850000000000002,0.48194999999999999,0.30345,0.17897250000000001,4.3129345105989367,57,0.92965702025152008,69.57559402990529,50.030536222485502,null,92.965702025152012,0.64836370964812506,2.3956238300478159,1.3915118805981059,1.00061072444971,0.5223722109603256]
[null,null,null,null,null,null,96,13.5,1,11.52,11.52,{"$f":"Vout*K105/(Vin*Efficiency)","v":4.7407407407407405},0.37835601606585201,{"$f":"(Vin-(Rdson1+Rdcr)*K105-Vout)*M105/(Fsw*Lf)","v":2.7565125912572817},12.89825629562864,10.141743704371359,{"$f":"IF(MIN(Vin, -P105/(Coss_Q1+Coss_Q2)*0.00000002)<0, 0, MIN(Vin, -P105/(Coss_Q1+Coss_Q2)*0.00000002))","v":0},11.547449796620898,{"$f":"R105^2*Rdcr","v":0.38669643073589205},0.25,{"$f":"(T105+S105*(1+Ltc*(Ta-25)))/(1-S105*Ltc*ThetaCa)","v":0.65702187175369753},0.79573664329349225,6.3319680547999459E-4,6.3319680547999459E-4,5.6002481629358787,3.1362779486466687E-2,3.1362779486466687E-2,7.10291151959622,{"$f":"Rdson1*AB105^2","v":0.22703108424845705},0.56581988893895019,0.3266132625,0,{"$f":"(AF105+AE105+AD105+AC105*(1+RdsonTopTc*Ta-RdsonTopTc*25))/(1-AC105*RdsonTopTc*ThetaJA_Q1)","v":1.1727126820300466},9.1045178208550581,{"$f":"Rdson2*AH105^2","v":0.30255669333847579},0.54190079999999996,{"$f":"(AJ105+AI105*(1+RdsonBotTc*Ta-RdsonBotTc*25))/(1-AI105*RdsonBotTc*ThetaJA_Q2)","v":0.89884798837373536},0.54190079999999996,0.35380800000000001,0.5333743872219201,4.7249999999999994E-4,0.17850000000000002,0.48194999999999999,0.30345,0.17897250000000001,{"$f":" SUM(U105,X105,AA105,AG105,AK105,AL105,AM105,AS105,AN105)","v":4.3686342056713467},57.599999999999994,0.92950249329084722,70.311298101502331,50.780231418686775,null,92.950249329084727,0.65702187175369753,2.425368670403782,1.4062259620300466,1.0156046283737354,0.5333743872219201]
[null,null,null,null,null,null,97,13.5,1,11.64,11.64,4.7901234567901234,0.3784389745599101,2.756826029650687,13.018413014825343,10.261586985174658,0,11.667173642881409,0.39475652835812525,0.25,0.665782280493317,0.79582712516389575,6.3334081314663101E-4,6.3334081314663101E-4,5.6585541635188017,3.201923522147597E-2,3.201923522147597E-2,7.1773411605835307,0.23181401760932943,0.57171384611539777,0.3266132625,0,1.1850849887131474,9.1982995535990284,0.3088218085737513,0.54754559999999997,0.91274235770757595,0.54754559999999997,0.35749350000000002,0.54449176325258652,4.7249999999999994E-4,0.17850000000000002,0.48194999999999999,0.30345,0.17897250000000001,4.4247655662012493,58.2,0.92934479632464595,71.051534935657372,51.5357606353788,null,92.934479632464601,0.665782280493317,2.4553208464207232,1.4210306987131474,1.030715212707576,0.54449176325258652]
[null,null,null,null,null,null,98,13.5,1,11.76,11.76,4.8395061728395055,0.3785219284210054,2.757139306735616,13.138569653367808,10.381430346632191,0,11.786903103150641,0.40290014581288031,0.25,0.67464532169139546,0.79591756046855311,6.3348476306221294E-4,6.3348476306221294E-4,5.7168676761816322,3.2682576026970375E-2,3.2682576026970375E-2,7.2517902701427088,0.23664807954961406,0.57760780329184502,0.3266132625,0,1.1975486636242354,9.2920731078121506,0.31515057263937901,0.55319039999999997,0.92675440918982765,0.55319039999999997,0.36117900000000003,0.55572433905224872,4.7249999999999994E-4,0.17850000000000002,0.48194999999999999,0.30345,0.17897250000000001,4.48133069434774,58.8,0.92918400031767967,71.796340181211775,52.297173959491381,null,92.918400031767973,0.67464532169139546,2.485482072814063,1.4359268036242354,1.0459434791898277,0.55572433905224872]
[null,null,null,null,null,null,99,13.5,1,11.88,11.88,4.8888888888888893,0.37860487764952588,2.7574524225255801,13.258726211262791,10.50127378873721,0,11.906638008069605,0.41112728310010238,0.25,0.6836113864610649,0.79600794921136475,6.3362865520768261E-4,6.3362865520768261E-4,5.7751886133490862,3.3352803519756939E-2,3.3352803519756939E-2,7.32625874124163,0.24153330214628727,0.58350176046829261,0.3266132625,0,1.210104428842621,9.3858383488950157,0.32154295951729739,0.55883519999999998,0.94088515925163207,0.55883519999999998,0.36486450000000009,0.56707211462083096,4.7249999999999994E-4,0.17850000000000002,0.48194999999999999,0.30345,0.17897250000000001,4.5383317213511134,59.400000000000006,0.92902017304534057,72.545749942131053,53.064522212581608,null,92.902017304534056,0.6836113864610649,2.5158540880942533,1.4509149988426211,1.0612904442516322,0.56707211462083096]
[null,null,null,null,null,null,100,13.5,1,12,12,4.9382716049382713,0.37868782224585973,2.7577653770340915,13.378882688517045,10.621117311482955,0,12.026378195016321,0.41943794021973563,0.25,0.69268087124904043,0.79609829139623134,6.3377248956399893E-4,6.3377248956399893E-4,5.8335168907012855,3.4029919314097191E-2,3.4029919314097191E-2,7.400746470949815,0.24646971747274263,0.58939571764473986,0.3266132625,0,1.2227530156802118,9.4795951475940097,0.32799894319235079,0.56447999999999998,0.95513563924809597,0.56447999999999998,0.36855000000000004,0.57853508995825609,4.7249999999999994E-4,0.17850000000000002,0.48194999999999999,0.30345,0.17897250000000001,4.5957708079392656,60,0.9288533792467043,73.2998007840106,53.837856962404793,null,92.885337924670424,0.69268087124904043,2.5464386549283078,1.4659960156802119,1.0767571392480959,0.57853508995825609]

{"sheet":"Efficiency Plot Management","index":7,"n_rows":2,"n_cols":1,"rows_kept":2,"cut":false,"hidden":true,"merged":[]}
[]
[{"$f":"IF(PLOT_TYPE=1, \"EFF_Ch1\", \"EFF_Ch2\")","v":"EFF_Ch1"}]

{"sheet":"Schematic Management","index":8,"n_rows":17,"n_cols":14,"rows_kept":17,"cut":false,"hidden":true,"merged":[]}
[null,null,null,null,null,null,null,null,null,null,null,null,null,"3.3V or 5V fixed (FB1/2)"]
[{"$f":"IF(DITHER=1, CHOOSE(SCH_SETTING, \"SCH_ADJ_VOUT\", \"SCH_5V_FIXED\", \"SCH_3V3_FIXED\", \"SCH_ADJ_VOUT_NO_RT\", \"SCH_5V_FIXED_NO_RT\", \"SCH_3V3_FIXED_NO_RT\"), CHOOSE(SCH_SETTING, \"SCH_ADJ_VOUT_NO_DITH\", \"SCH_5V_FIXED_NO_DITH\", \"SCH_3V3_FIXED_NO_DITH\", \"SCH_ADJ_VOUT_NO_RT_NO_DITH\", \"SCH_5V_FIXED_NO_RT_NO_DITH\", \"SCH_3V3_FIXED_NO_RT_NO_DITH\"))","v":"SCH_5V_FIXED"},null,null,null,null,null,null,null,null,"With/without dither (DITH)",null,null,null,"With/without VOUT connected to VCCX"]
[null,null,null,null,null,null,null,null,null,"FPWM or DEM (DEMB)"]
[null,null,null,null,null,null,null,null,null,"Shunt or inductor DCR current sensing"]
[]
[]
[]
[]
[]
[]
[]
[]
[]
[]
[]
[]
[null," "]

{"sheet":"Standard Value Calculator","index":9,"n_rows":159,"n_cols":16,"rows_kept":159,"cut":false,"hidden":true,"merged":[]}
[]
["Capacitors","Css","Cc1ea","Cc2ea","Cout","Cin","Cres","Cdither","Cc3ea","Cc4ea"]
["Inputs",{"$f":"Css","v":5.4999999999999996E-8},{"$f":"Cc1ea","v":4.96672469970051E-9},{"$f":"Cc2ea","v":-3.4497046564626401E-12},{"$f":"Cout","v":8.5000000000000006E-5},{"$f":"Cin","v":3.0000000000000001E-5},{"$f":"Cres","v":3.3333333333333335E-7},{"$f":"Cdither_init","v":1.0416666666666666E-8},{"$f":"Cc3ea","v":0},{"$f":"Cc4ea","v":0},null,null,"Resistors","inputs","Standard Result"]
["Standard Result",{"$f":"SUM(B6:B158)/1000000000000","v":5.5999999999999999E-8},{"$f":"IF(C3=\"OPEN\",\"OPEN\",SUM(C6:C158)/1000000000000)","v":4.6999999999999999E-9},{"$f":"SUM(D6:D158)/1000000000000","v":0},{"$f":"SUM(E6:E158)/1000000000000","v":8.2000000000000001E-5},{"$f":"SUM(F6:F158)/1000000000000","v":3.3000000000000003E-5},{"$f":"SUM(G6:G158)/1000000000000","v":3.3000000000000002E-7},{"$f":"IF(H3=\"OPEN\",\"OPEN\",SUM(H6:H158)/1000000000000)","v":1E-8},0,0,null,null,"Rt",{"$f":"Rfadj","v":52.3},{"$f":"IF(N4>(INT(0.5+100*POWER(10,IF(96*(LOG(N4)-INT(LOG(N4)))-ROUND(96*(LOG(N4)-INT(LOG(N4))),0)<0,ROUND(96*(LOG(N4)-INT(LOG(N4))),0)-1,ROUND(96*(LOG(N4)-INT(LOG(N4))),0))/96))*POWER(10,INT(LOG(N4))-2)+INT(0.5+100*POWER(10,(IF(96*(LOG(N4)-INT(LOG(N4)))-ROUND(96*(LOG(N4)-INT(LOG(N4))),0)<0,ROUND(96*(LOG(N4)-INT(LOG(N4))),0)-1,ROUND(96*(LOG(N4)-INT(LOG(N4))),0))+1)/96))*POWER(10,INT(LOG(N4))-2))/2,INT(0.5+100*POWER(10,(IF(96*(LOG(N4)-INT(LOG(N4)))-ROUND(96*(LOG(N4)-INT(LOG(N4))),0)<0,ROUND(96*(LOG(N4)-INT(LOG(N4))),0)-1,ROUND(96*(LOG(N4)-INT(LOG(N4))),0))+1)/96))*POWER(10,INT(LOG(N4))-2),INT(0.5+100*POWER(10,IF(96*(LOG(N4)-INT(LOG(N4)))-ROUND(96*(LOG(N4)-INT(LOG(N4))),0)<0,ROUND(96*(LOG(N4)-INT(LOG(N4))),0)-1,ROUND(96*(LOG(N4)-INT(LOG(N4))),0))/96))*POWER(10,INT(LOG(N4))-2))","v":52.300000000000004},"Ω"]
["(pF)"]
[0.47,{"$f":"IF(IF((B$3*10^12-$A7)*(B$3*10^12-$A6)*-1<0,0,1)*IF(ABS(B$3*10^12-$A7)>(B$3*10^12-$A6),$A6,$A7)=B7,0,IF((B$3*10^12-$A7)*(B$3*10^12-$A6)*-1<0,0,1)*IF(ABS(B$3*10^12-$A7)>(B$3*10^12-$A6),$A6,$A7))","v":0},0,0,0,0,0,0,0,0]
[0.56000000000000005,{"$f":"IF(IF((B$3*10^12-$A8)*(B$3*10^12-$A7)*-1<0,0,1)*IF(ABS(B$3*10^12-$A8)>(B$3*10^12-$A7),$A7,$A8)=B8,0,IF((B$3*10^12-$A8)*(B$3*10^12-$A7)*-1<0,0,1)*IF(ABS(B$3*10^12-$A8)>(B$3*10^12-$A7),$A7,$A8))","v":0},{"$f":"IF(IF((C$3*10^12-$A8)*(C$3*10^12-$A7)*-1<0,0,1)*IF(ABS(C$3*10^12-$A8)>(C$3*10^12-$A7),$A7,$A8)=C8,0,IF((C$3*10^12-$A8)*(C$3*10^12-$A7)*-1<0,0,1)*IF(ABS(C$3*10^12-$A8)>(C$3*10^12-$A7),$A7,$A8))","v":0},{"$f":"IF(IF((D$3*10^12-$A8)*(D$3*10^12-$A7)*-1<0,0,1)*IF(ABS(D$3*10^12-$A8)>(D$3*10^12-$A7),$A7,$A8)=D8,0,IF((D$3*10^12-$A8)*(D$3*10^12-$A7)*-1<0,0,1)*IF(ABS(D$3*10^12-$A8)>(D$3*10^12-$A7),$A7,$A8))","v":0},{"$f":"IF(IF((E$3*10^12-$A8)*(E$3*10^12-$A7)*-1<0,0,1)*IF(ABS(E$3*10^12-$A8)>(E$3*10^12-$A7),$A7,$A8)=E8,0,IF((E$3*10^12-$A8)*(E$3*10^12-$A7)*-1<0,0,1)*IF(ABS(E$3*10^12-$A8)>(E$3*10^12-$A7),$A7,$A8))","v":0},{"$f":"IF(IF((F$3*10^12-$A8)*(F$3*10^12-$A7)*-1<0,0,1)*IF(ABS(F$3*10^12-$A8)>(F$3*10^12-$A7),$A7,$A8)=F8,0,IF((F$3*10^12-$A8)*(F$3*10^12-$A7)*-1<0,0,1)*IF(ABS(F$3*10^12-$A8)>(F$3*10^12-$A7),$A7,$A8))","v":0},{"$f":"IF(IF((G$3*10^12-$A8)*(G$3*10^12-$A7)*-1<0,0,1)*IF(ABS(G$3*10^12-$A8)>(G$3*10^12-$A7),$A7,$A8)=G8,0,IF((G$3*10^12-$A8)*(G$3*10^12-$A7)*-1<0,0,1)*IF(ABS(G$3*10^12-$A8)>(G$3*10^12-$A7),$A7,$A8))","v":0},0,0,0,null,null,"Rc1ea",{"$f":"Rcea1","v":5340.7075050000021},5360,"Ω"]
[0.68,0,0,0,0,0,0,0,0,0,null,null,"Rc1ea",{"$f":"Rcea2","v":0},{"$f":"IF(N8>(INT(0.5+100*POWER(10,IF(96*(LOG(N8)-INT(LOG(N8)))-ROUND(96*(LOG(N8)-INT(LOG(N8))),0)<0,ROUND(96*(LOG(N8)-INT(LOG(N8))),0)-1,ROUND(96*(LOG(N8)-INT(LOG(N8))),0))/96))*POWER(10,INT(LOG(N8))-2)+INT(0.5+100*POWER(10,(IF(96*(LOG(N8)-INT(LOG(N8)))-ROUND(96*(LOG(N8)-INT(LOG(N8))),0)<0,ROUND(96*(LOG(N8)-INT(LOG(N8))),0)-1,ROUND(96*(LOG(N8)-INT(LOG(N8))),0))+1)/96))*POWER(10,INT(LOG(N8))-2))/2,INT(0.5+100*POWER(10,(IF(96*(LOG(N8)-INT(LOG(N8)))-ROUND(96*(LOG(N8)-INT(LOG(N8))),0)<0,ROUND(96*(LOG(N8)-INT(LOG(N8))),0)-1,ROUND(96*(LOG(N8)-INT(LOG(N8))),0))+1)/96))*POWER(10,INT(LOG(N8))-2),INT(0.5+100*POWER(10,IF(96*(LOG(N8)-INT(LOG(N8)))-ROUND(96*(LOG(N8)-INT(LOG(N8))),0)<0,ROUND(96*(LOG(N8)-INT(LOG(N8))),0)-1,ROUND(96*(LOG(N8)-INT(LOG(N8))),0))/96))*POWER(10,INT(LOG(N8))-2))","v":{"$error":"#NUM!"}},"Ω"]
[0.82,0,0,0,0,0,0,0,0,0]
[1,0,0,0,0,0,0,0,0,0,null,null,"Rfb1",{"$f":"Rfb1_","v":49900},{"$f":"IF(N10>(INT(0.5+100*POWER(10,IF(96*(LOG(N10)-INT(LOG(N10)))-ROUND(96*(LOG(N10)-INT(LOG(N10))),0)<0,ROUND(96*(LOG(N10)-INT(LOG(N10))),0)-1,ROUND(96*(LOG(N10)-INT(LOG(N10))),0))/96))*POWER(10,INT(LOG(N10))-2)+INT(0.5+100*POWER(10,(IF(96*(LOG(N10)-INT(LOG(N10)))-ROUND(96*(LOG(N10)-INT(LOG(N10))),0)<0,ROUND(96*(LOG(N10)-INT(LOG(N10))),0)-1,ROUND(96*(LOG(N10)-INT(LOG(N10))),0))+1)/96))*POWER(10,INT(LOG(N10))-2))/2,INT(0.5+100*POWER(10,(IF(96*(LOG(N10)-INT(LOG(N10)))-ROUND(96*(LOG(N10)-INT(LOG(N10))),0)<0,ROUND(96*(LOG(N10)-INT(LOG(N10))),0)-1,ROUND(96*(LOG(N10)-INT(LOG(N10))),0))+1)/96))*POWER(10,INT(LOG(N10))-2),INT(0.5+100*POWER(10,IF(96*(LOG(N10)-INT(LOG(N10)))-ROUND(96*(LOG(N10)-INT(LOG(N10))),0)<0,ROUND(96*(LOG(N10)-INT(LOG(N10))),0)-1,ROUND(96*(LOG(N10)-INT(LOG(N10))),0))/96))*POWER(10,INT(LOG(N10))-2))","v":49900},"Ω"]
[1.2,0,0,0,0,0,0,0,0,0,null,null,"Rfb2",{"$f":"Rfb2_","v":15757.894736842107},{"$f":"IF(N11=\"OPEN\",\"OPEN\",IF(N11>(INT(0.5+100*POWER(10,IF(96*(LOG(N11)-INT(LOG(N11)))-ROUND(96*(LOG(N11)-INT(LOG(N11))),0)<0,ROUND(96*(LOG(N11)-INT(LOG(N11))),0)-1,ROUND(96*(LOG(N11)-INT(LOG(N11))),0))/96))*POWER(10,INT(LOG(N11))-2)+INT(0.5+100*POWER(10,(IF(96*(LOG(N11)-INT(LOG(N11)))-ROUND(96*(LOG(N11)-INT(LOG(N11))),0)<0,ROUND(96*(LOG(N11)-INT(LOG(N11))),0)-1,ROUND(96*(LOG(N11)-INT(LOG(N11))),0))+1)/96))*POWER(10,INT(LOG(N11))-2))/2,INT(0.5+100*POWER(10,(IF(96*(LOG(N11)-INT(LOG(N11)))-ROUND(96*(LOG(N11)-INT(LOG(N11))),0)<0,ROUND(96*(LOG(N11)-INT(LOG(N11))),0)-1,ROUND(96*(LOG(N11)-INT(LOG(N11))),0))+1)/96))*POWER(10,INT(LOG(N11))-2),INT(0.5+100*POWER(10,IF(96*(LOG(N11)-INT(LOG(N11)))-ROUND(96*(LOG(N11)-INT(LOG(N11))),0)<0,ROUND(96*(LOG(N11)-INT(LOG(N11))),0)-1,ROUND(96*(LOG(N11)-INT(LOG(N11))),0))/96))*POWER(10,INT(LOG(N11))-2)))","v":15800},"Ω"]
[1.5,0,0,0,0,0,0,0,0,0,null,null,"Rt1",{"$f":"'Variable Management'!B27*1000","v":52859.357696566993},{"$f":"IF(N12>(INT(0.5+100*POWER(10,IF(96*(LOG(N12)-INT(LOG(N12)))-ROUND(96*(LOG(N12)-INT(LOG(N12))),0)<0,ROUND(96*(LOG(N12)-INT(LOG(N12))),0)-1,ROUND(96*(LOG(N12)-INT(LOG(N12))),0))/96))*POWER(10,INT(LOG(N12))-2)+INT(0.5+100*POWER(10,(IF(96*(LOG(N12)-INT(LOG(N12)))-ROUND(96*(LOG(N12)-INT(LOG(N12))),0)<0,ROUND(96*(LOG(N12)-INT(LOG(N12))),0)-1,ROUND(96*(LOG(N12)-INT(LOG(N12))),0))+1)/96))*POWER(10,INT(LOG(N12))-2))/2,INT(0.5+100*POWER(10,(IF(96*(LOG(N12)-INT(LOG(N12)))-ROUND(96*(LOG(N12)-INT(LOG(N12))),0)<0,ROUND(96*(LOG(N12)-INT(LOG(N12))),0)-1,ROUND(96*(LOG(N12)-INT(LOG(N12))),0))+1)/96))*POWER(10,INT(LOG(N12))-2),INT(0.5+100*POWER(10,IF(96*(LOG(N12)-INT(LOG(N12)))-ROUND(96*(LOG(N12)-INT(LOG(N12))),0)<0,ROUND(96*(LOG(N12)-INT(LOG(N12))),0)-1,ROUND(96*(LOG(N12)-INT(LOG(N12))),0))/96))*POWER(10,INT(LOG(N12))-2))","v":52300},"Ω"]
[1.8,0,0,0,0,0,0,0,0,0,null,null,"Rt2",{"$f":"'Variable Management'!B28*1000","v":10275.343915343914},{"$f":"IF(N13=\"OPEN\",\"OPEN\",IF(N13>(INT(0.5+100*POWER(10,IF(96*(LOG(N13)-INT(LOG(N13)))-ROUND(96*(LOG(N13)-INT(LOG(N13))),0)<0,ROUND(96*(LOG(N13)-INT(LOG(N13))),0)-1,ROUND(96*(LOG(N13)-INT(LOG(N13))),0))/96))*POWER(10,INT(LOG(N13))-2)+INT(0.5+100*POWER(10,(IF(96*(LOG(N13)-INT(LOG(N13)))-ROUND(96*(LOG(N13)-INT(LOG(N13))),0)<0,ROUND(96*(LOG(N13)-INT(LOG(N13))),0)-1,ROUND(96*(LOG(N13)-INT(LOG(N13))),0))+1)/96))*POWER(10,INT(LOG(N13))-2))/2,INT(0.5+100*POWER(10,(IF(96*(LOG(N13)-INT(LOG(N13)))-ROUND(96*(LOG(N13)-INT(LOG(N13))),0)<0,ROUND(96*(LOG(N13)-INT(LOG(N13))),0)-1,ROUND(96*(LOG(N13)-INT(LOG(N13))),0))+1)/96))*POWER(10,INT(LOG(N13))-2),INT(0.5+100*POWER(10,IF(96*(LOG(N13)-INT(LOG(N13)))-ROUND(96*(LOG(N13)-INT(LOG(N13))),0)<0,ROUND(96*(LOG(N13)-INT(LOG(N13))),0)-1,ROUND(96*(LOG(N13)-INT(LOG(N13))),0))/96))*POWER(10,INT(LOG(N13))-2)))","v":10200},"Ω"]
[2.2000000000000002,{"$f":"IF(IF((B$3*10^12-$A15)*(B$3*10^12-$A14)*-1<0,0,1)*IF(ABS(B$3*10^12-$A15)>(B$3*10^12-$A14),$A14,$A15)=B15,0,IF((B$3*10^12-$A15)*(B$3*10^12-$A14)*-1<0,0,1)*IF(ABS(B$3*10^12-$A15)>(B$3*10^12-$A14),$A14,$A15))","v":0},0,0,0,0,0,0,0,0]
[2.7,0,0,0,0,0,0,0,0,0]
[3.3,0,0,0,0,0,0,0,0,0,null,null,"Rs",{"$f":"Rs_ideal*1000","v":3.8698702342065263},{"$f":"IF(N16=0,0,IF(N16>(INT(0.5+100*POWER(10,IF(96*(LOG(N16)-INT(LOG(N16)))-ROUND(96*(LOG(N16)-INT(LOG(N16))),0)<0,ROUND(96*(LOG(N16)-INT(LOG(N16))),0)-1,ROUND(96*(LOG(N16)-INT(LOG(N16))),0))/96))*POWER(10,INT(LOG(N16))-2)+INT(0.5+100*POWER(10,(IF(96*(LOG(N16)-INT(LOG(N16)))-ROUND(96*(LOG(N16)-INT(LOG(N16))),0)<0,ROUND(96*(LOG(N16)-INT(LOG(N16))),0)-1,ROUND(96*(LOG(N16)-INT(LOG(N16))),0))+1)/96))*POWER(10,INT(LOG(N16))-2))/2,INT(0.5+100*POWER(10,(IF(96*(LOG(N16)-INT(LOG(N16)))-ROUND(96*(LOG(N16)-INT(LOG(N16))),0)<0,ROUND(96*(LOG(N16)-INT(LOG(N16))),0)-1,ROUND(96*(LOG(N16)-INT(LOG(N16))),0))+1)/96))*POWER(10,INT(LOG(N16))-2),INT(0.5+100*POWER(10,IF(96*(LOG(N16)-INT(LOG(N16)))-ROUND(96*(LOG(N16)-INT(LOG(N16))),0)<0,ROUND(96*(LOG(N16)-INT(LOG(N16))),0)-1,ROUND(96*(LOG(N16)-INT(LOG(N16))),0))/96))*POWER(10,INT(LOG(N16))-2)))","v":3.83},"mΩ"]
[3.9,0,0,0,0,0,0,0,0,0,null,null,"Cres",{"$f":"Cres","v":3.3333333333333335E-7},{"$f":"G4*1000000000000","v":330000},"pF"]
[4.7,0,0,0,0,0,0,0,0,0]
[5.6,0,0,0,0,0,0,0,0,0]
[6.8,0,0,0,0,0,0,0,0,0]
[8.1999999999999993,0,0,0,0,0,0,0,0,0]
[10,0,0,0,0,0,0,0,0,0,null,null,"Cdither",{"$f":"Cdither_init","v":1.0416666666666666E-8},{"$f":"H4","v":1E-8}]
[12,0,0,0,0,0,0,0,0,0]
[15,0,0,0,0,0,0,0,0,0]
[18,0,0,0,0,0,0,0,0,0]
[22,0,0,0,0,0,0,0,0,0]
[27,0,0,0,0,0,0,0,0,0]
[33,0,0,0,0,0,0,0,0,0]
[39,0,0,0,0,0,0,0,0,0]
[47,0,0,0,0,0,0,0,0,0,null,null,"Rc1",{"$f":"O7/1000&\" kΩ\"","v":"5.36 kΩ"},{"$f":"O7/1000","v":5.36},"kΩ"]
[56,0,0,0,0,0,0,0,0,0,null,null,"Cc1",{"$f":"C4*1000000000&\" nF\"","v":"4.7 nF"},{"$f":"C4*1000000000","v":4.7},"nF"]
[68,0,0,0,0,0,0,0,0,0,null,null,"Cc2",{"$f":"D4*1000000000000&\" pF\"","v":"0 pF"},{"$f":"D4*1000000000000","v":0},"pF"]
[82,0,0,0,0,0,0,0,0,0]
[{"$f":"A22*10","v":100},0,0,0,0,0,0,0,0,0,null,null,"Rc2",{"$f":"O8/1000&\" kΩ\"","v":{"$error":"#NUM!"}},{"$f":"O8/1000","v":{"$error":"#NUM!"}},"kΩ"]
[{"$f":"A23*10","v":120},0,0,0,0,0,0,0,0,0,null,null,"Cc3",{"$f":"I4*1000000000&\" nF\"","v":"0 nF"},{"$f":"I4*1000000000","v":0},"nF"]
[150,0,0,0,0,0,0,0,0,0,null,null,"Cc4",{"$f":"J4*1000000000000&\" pF\"","v":"0 pF"},{"$f":"J4*1000000000000","v":0},"pF"]
[180,0,0,0,0,0,0,0,0,0]
[220,0,0,0,0,0,0,0,0,0]
[270,0,{"$f":"IF(IF((C$3*10^12-$A40)*(C$3*10^12-$A39)*-1<0,0,1)*IF(ABS(C$3*10^12-$A40)>(C$3*10^12-$A39),$A39,$A40)=C40,0,IF((C$3*10^12-$A40)*(C$3*10^12-$A39)*-1<0,0,1)*IF(ABS(C$3*10^12-$A40)>(C$3*10^12-$A39),$A39,$A40))","v":0},0,0,0,0,0,0,0]
[330,0,0,0,0,0,0,0,0,0]
[390,0,0,0,0,0,0,0,0,0]
[470,0,0,0,0,0,0,0,0,0]
[560,0,0,0,0,0,0,0,0,0]
[680,0,0,0,0,0,0,0,0,0]
[{"$f":"A33*10","v":820},0,0,0,0,0,0,0,0,0]
[1000,0,0,0,0,0,0,0,0,0]
[1200,0,0,0,0,0,0,0,0,0]
[1500,0,0,0,0,0,0,0,0,0]
[1800,0,0,0,0,0,0,0,0,0]
[2200,0,0,0,0,0,0,0,0,0]
[2700,0,0,0,0,0,0,0,0,0]
[3300,0,0,0,0,0,0,0,0,0]
[3900,0,0,0,0,0,0,0,0,0]
[4700,0,4700,0,0,0,0,0,0,0]
[5600,0,0,0,0,0,0,0,0,0]
[6800,0,0,0,0,0,0,0,0,0]
[8200,0,0,0,0,0,0,0,0,0]
[10000,0,0,0,0,0,0,10000,0,0]
[12000,0,0,0,0,0,0,0,0,0]
[15000,0,0,0,0,0,0,0,0,0]
[18000,0,0,0,0,0,0,0,0,0]
[22000,0,0,0,0,0,0,0,0,0]
[27000,0,0,0,0,0,0,0,0,0]
[33000,0,0,0,0,0,0,0,0,0]
[39000,0,0,0,0,0,0,0,0,0]
[47000,56000,0,0,0,0,0,0,0,0]
[56000,0,0,0,0,0,0,0,0,0]
[68000,0,0,0,0,0,0,0,0,0]
[82000,0,0,0,0,0,0,0,0,{"$f":"IF(IF((J$3*10^12-$A70)*(J$3*10^12-$A69)*-1<0,0,1)*IF(ABS(J$3*10^12-$A70)>(J$3*10^12-$A69),$A69,$A70)=J70,0,IF((J$3*10^12-$A70)*(J$3*10^12-$A69)*-1<0,0,1)*IF(ABS(J$3*10^12-$A70)>(J$3*10^12-$A69),$A69,$A70))","v":0}]
[100000,0,0,{"$f":"IF(IF((D$3*10^12-$A71)*(D$3*10^12-$A70)*-1<0,0,1)*IF(ABS(D$3*10^12-$A71)>(D$3*10^12-$A70),$A70,$A71)=D71,0,IF((D$3*10^12-$A71)*(D$3*10^12-$A70)*-1<0,0,1)*IF(ABS(D$3*10^12-$A71)>(D$3*10^12-$A70),$A70,$A71))","v":0},0,0,0,0,0,0]
[120000,{"$f":"IF(IF((B$3*10^12-$A72)*(B$3*10^12-$A71)*-1<0,0,1)*IF(ABS(B$3*10^12-$A72)>(B$3*10^12-$A71),$A71,$A72)=B72,0,IF((B$3*10^12-$A72)*(B$3*10^12-$A71)*-1<0,0,1)*IF(ABS(B$3*10^12-$A72)>(B$3*10^12-$A71),$A71,$A72))","v":0},{"$f":"IF(IF((C$3*10^12-$A72)*(C$3*10^12-$A71)*-1<0,0,1)*IF(ABS(C$3*10^12-$A72)>(C$3*10^12-$A71),$A71,$A72)=C72,0,IF((C$3*10^12-$A72)*(C$3*10^12-$A71)*-1<0,0,1)*IF(ABS(C$3*10^12-$A72)>(C$3*10^12-$A71),$A71,$A72))","v":0},0,0,{"$f":"IF(IF((F$3*10^12-$A72)*(F$3*10^12-$A71)*-1<0,0,1)*IF(ABS(F$3*10^12-$A72)>(F$3*10^12-$A71),$A71,$A72)=F72,0,IF((F$3*10^12-$A72)*(F$3*10^12-$A71)*-1<0,0,1)*IF(ABS(F$3*10^12-$A72)>(F$3*10^12-$A71),$A71,$A72))","v":0},{"$f":"IF(IF((G$3*10^12-$A72)*(G$3*10^12-$A71)*-1<0,0,1)*IF(ABS(G$3*10^12-$A72)>(G$3*10^12-$A71),$A71,$A72)=G72,0,IF((G$3*10^12-$A72)*(G$3*10^12-$A71)*-1<0,0,1)*IF(ABS(G$3*10^12-$A72)>(G$3*10^12-$A71),$A71,$A72))","v":0},{"$f":"IF(IF((H$3*10^12-$A72)*(H$3*10^12-$A71)*-1<0,0,1)*IF(ABS(H$3*10^12-$A72)>(H$3*10^12-$A71),$A71,$A72)=H72,0,IF((H$3*10^12-$A72)*(H$3*10^12-$A71)*-1<0,0,1)*IF(ABS(H$3*10^12-$A72)>(H$3*10^12-$A71),$A71,$A72))","v":0},{"$f":"IF(IF((I$3*10^12-$A72)*(I$3*10^12-$A71)*-1<0,0,1)*IF(ABS(I$3*10^12-$A72)>(I$3*10^12-$A71),$A71,$A72)=I72,0,IF((I$3*10^12-$A72)*(I$3*10^12-$A71)*-1<0,0,1)*IF(ABS(I$3*10^12-$A72)>(I$3*10^12-$A71),$A71,$A72))","v":0},0]
[150000,0,0,0,0,0,0,0,0,0]
[180000,0,0,0,0,0,0,0,0,0]
[220000,0,0,0,0,0,0,0,0,0]
[270000,0,0,0,0,0,0,0,0,0]
[330000,0,0,0,0,0,330000,0,0,0]
[390000,0,0,0,0,0,0,0,0,0]
[470000,0,0,0,0,0,0,0,0,0]
[560000,0,0,0,0,0,0,0,0,0]
[680000,0,0,0,0,0,0,0,0,0]
[820000,0,0,0,0,0,0,0,0,0]
[1000000,0,0,0,0,0,0,0,0,0]
[1200000,0,0,0,0,0,0,0,0,0]
[1500000,0,0,0,0,0,0,0,0,0]
[1800000,0,0,0,0,0,0,0,0,0]
[2200000,0,0,0,0,0,0,0,0,0]
[2700000,0,0,0,0,0,0,0,0,0]
[3300000,0,0,0,0,0,0,0,0,0]
[3900000,0,0,0,0,0,0,0,0,0]
[4700000,0,0,0,0,0,0,0,0,0]
[5600000,0,0,0,0,0,0,0,0,0]
[6800000,0,0,0,0,0,0,0,0,0]
[8200000,0,0,0,0,0,0,0,0,0]
[10000000,0,0,0,0,0,0,0,0,0]
[12000000,0,0,0,0,0,0,0,0,0]
[15000000,0,0,0,0,0,0,0,0,0]
[18000000,0,0,0,0,0,0,0,0,0]
[22000000,0,0,0,0,0,0,0,0,0]
[{"$f":"A87*10","v":27000000},0,0,0,0,33000000,0,0,0,0]
[33000000,0,0,0,0,0,0,0,0,0]
[39000000,0,0,0,0,0,0,0,0,0]
[47000000,0,0,0,0,0,0,0,0,0]
[56000000,0,0,0,0,{"$f":"IF(IF((F$3*10^12-$A104)*(F$3*10^12-$A103)*-1<0,0,1)*IF(ABS(F$3*10^12-$A104)>(F$3*10^12-$A103),$A103,$A104)=F104,0,IF((F$3*10^12-$A104)*(F$3*10^12-$A103)*-1<0,0,1)*IF(ABS(F$3*10^12-$A104)>(F$3*10^12-$A103),$A103,$A104))","v":0},{"$f":"IF(IF((G$3*10^12-$A104)*(G$3*10^12-$A103)*-1<0,0,1)*IF(ABS(G$3*10^12-$A104)>(G$3*10^12-$A103),$A103,$A104)=G104,0,IF((G$3*10^12-$A104)*(G$3*10^12-$A103)*-1<0,0,1)*IF(ABS(G$3*10^12-$A104)>(G$3*10^12-$A103),$A103,$A104))","v":0},{"$f":"IF(IF((H$3*10^12-$A104)*(H$3*10^12-$A103)*-1<0,0,1)*IF(ABS(H$3*10^12-$A104)>(H$3*10^12-$A103),$A103,$A104)=H104,0,IF((H$3*10^12-$A104)*(H$3*10^12-$A103)*-1<0,0,1)*IF(ABS(H$3*10^12-$A104)>(H$3*10^12-$A103),$A103,$A104))","v":0},{"$f":"IF(IF((I$3*10^12-$A104)*(I$3*10^12-$A103)*-1<0,0,1)*IF(ABS(I$3*10^12-$A104)>(I$3*10^12-$A103),$A103,$A104)=I104,0,IF((I$3*10^12-$A104)*(I$3*10^12-$A103)*-1<0,0,1)*IF(ABS(I$3*10^12-$A104)>(I$3*10^12-$A103),$A103,$A104))","v":0},0]
[68000000,0,0,0,0,0,0,0,0,0]
[82000000,0,0,0,82000000,0,0,0,0,0]
[100000000,0,0,0,0,0,0,0,0,0]
[120000000,0,0,0,0,0,0,0,0,0]
[150000000,0,0,0,0,0,0,0,0,0]
[180000000,0,0,0,0,0,0,0,0,0]
[220000000,0,0,0,0,0,0,0,0,0]
[270000000,0,0,0,0,0,0,0,0,0]
[330000000,0,0,0,0,0,0,0,0,0]
[390000000,0,0,0,0,0,0,0,0,0]
[470000000,0,0,0,0,0,0,0,0,0]
[560000000,0,0,0,0,0,0,0,0,0]
[680000000,0,0,0,0,0,0,0,0,0]
[820000000,0,0,0,0,0,0,0,0,0]
[1000000000,0,0,0,0,0,0,0,0,0]
[1200000000,0,0,0,0,0,0,0,0,0]
[1500000000,0,0,0,0,0,0,0,0,0]
[1800000000,0,0,0,0,0,0,0,0,0]
[2200000000,0,0,0,0,0,0,0,0,0]
[2700000000,0,0,0,0,0,0,0,0,0]
[3300000000,0,0,0,0,0,0,0,0,0]
[3900000000,0,0,0,0,0,0,0,0,0]
[4700000000,0,0,0,0,0,0,0,0,0]
[5600000000,0,0,0,0,0,0,0,0,0]
[6800000000,0,0,0,0,0,0,0,0,0]
[8200000000,0,0,0,0,0,0,0,0,0]
[10000000000,0,0,0,0,0,0,0,0,0]
[12000000000,0,0,0,0,0,0,0,0,0]
[15000000000,0,0,0,0,0,0,0,0,0]
[18000000000,0,0,0,0,0,0,0,0,{"$f":"IF(IF((J$3*10^12-$A134)*(J$3*10^12-$A133)*-1<0,0,1)*IF(ABS(J$3*10^12-$A134)>(J$3*10^12-$A133),$A133,$A134)=J134,0,IF((J$3*10^12-$A134)*(J$3*10^12-$A133)*-1<0,0,1)*IF(ABS(J$3*10^12-$A134)>(J$3*10^12-$A133),$A133,$A134))","v":0}]
[22000000000,0,0,0,{"$f":"IF(IF((E$3*10^12-$A135)*(E$3*10^12-$A134)*-1<0,0,1)*IF(ABS(E$3*10^12-$A135)>(E$3*10^12-$A134),$A134,$A135)=E135,0,IF((E$3*10^12-$A135)*(E$3*10^12-$A134)*-1<0,0,1)*IF(ABS(E$3*10^12-$A135)>(E$3*10^12-$A134),$A134,$A135))","v":0},0,0,0,0,{"$f":"IF(IF((J$3*10^12-$A135)*(J$3*10^12-$A134)*-1<0,0,1)*IF(ABS(J$3*10^12-$A135)>(J$3*10^12-$A134),$A134,$A135)=J135,0,IF((J$3*10^12-$A135)*(J$3*10^12-$A134)*-1<0,0,1)*IF(ABS(J$3*10^12-$A135)>(J$3*10^12-$A134),$A134,$A135))","v":0}]
[27000000000,{"$f":"IF(IF((B$3*10^12-$A136)*(B$3*10^12-$A135)*-1<0,0,1)*IF(ABS(B$3*10^12-$A136)>(B$3*10^12-$A135),$A135,$A136)=B136,0,IF((B$3*10^12-$A136)*(B$3*10^12-$A135)*-1<0,0,1)*IF(ABS(B$3*10^12-$A136)>(B$3*10^12-$A135),$A135,$A136))","v":0},{"$f":"IF(IF((C$3*10^12-$A136)*(C$3*10^12-$A135)*-1<0,0,1)*IF(ABS(C$3*10^12-$A136)>(C$3*10^12-$A135),$A135,$A136)=C136,0,IF((C$3*10^12-$A136)*(C$3*10^12-$A135)*-1<0,0,1)*IF(ABS(C$3*10^12-$A136)>(C$3*10^12-$A135),$A135,$A136))","v":0},0,0,0,0,0,0,0]
[33000000000,0,0,0,0,0,0,0,0,0]
[39000000000,0,0,0,0,0,0,0,0,0]
[47000000000,0,0,0,0,0,0,0,0,0]
[56000000000,0,0,0,0,0,0,0,0,0]
[68000000000,0,0,0,0,0,0,0,0,0]
[82000000000,0,0,0,0,0,0,0,0,0]
[100000000000,0,0,0,0,0,0,0,0,0]
[120000000000,0,0,0,0,0,0,0,0,0]
[150000000000,0,0,0,0,0,0,0,0,0]
[180000000000,0,0,0,0,0,0,0,0,0]
[220000000000,0,0,0,0,0,0,0,0,0]
[270000000000,0,0,0,0,0,0,0,0,0]
[330000000000,0,0,0,0,0,0,0,0,0]
[390000000000,0,0,0,0,0,0,0,0,0]
[470000000000,0,0,0,0,0,0,0,0,0]
[560000000000,0,0,0,0,0,0,0,0,0]
[680000000000,0,0,0,0,0,0,0,0,0]
[820000000000,0,0,0,0,0,0,0,0,0]
[1000000000000,0,0,0,0,0,0,0,0,0]
[1200000000000,0,0,0,0,0,0,0,0,0]
[1500000000000,0,0,0,0,0,0,0,0,0]
[1800000000000,0,0,0,0,0,0,0,0,0]
[2200000000000,0,0,0,0,0,0,0,0,0]
[2700000000000,2700000000000,2700000000000,0,2700000000000,2700000000000,2700000000000,2700000000000,2700000000000,2700000000000]

{"sheet":"Snubber","index":10,"n_rows":6,"n_cols":5,"rows_kept":6,"cut":false,"hidden":true,"merged":[]}
[null,null,"UNITS","STD UNITS"]
["Frequency of Ringing",85,"MHz",{"$f":"B2*1000000","v":85000000},"Hz"]
["SW capacitance",3000,"pF",{"$f":"B3*0.000000000001","v":3E-9},"F"]
["Lpar",{"$f":"1000000000*1/((D2*2*3.14159)^2*D3)","v":1.1686430773614742},"nH",{"$f":"B4/1000000000","v":1.1686430773614743E-9},"H"]
["Csnub",{"$f":"4*B3","v":12000},"pF",{"$f":"B5*0.000000000001","v":1.2E-8},"F"]
["Rsnub",{"$f":"SQRT(D4/D3)","v":0.62413755891936573},"Ω",{"$f":"B6","v":0.62413755891936573},"Ω"]

{"sheet":"Parallel Output Caps","index":11,"n_rows":17,"n_cols":5,"rows_kept":17,"cut":false,"hidden":true,"merged":[]}
[]
[]
[]
["Fsw",{"$f":"Fsw","v":2100000}]
[]
["C1",20,"uF",{"$f":"B6/1000000","v":2.0000000000000002E-5},"F"]
["R1",0.5,"mOhms",{"$f":"B7/1000","v":5.0000000000000001E-4},"Ohms"]
[]
["C2",68,"uF",{"$f":"B9/1000000","v":6.7999999999999999E-5},"F"]
["R2",20,"mOhms",{"$f":"B10/1000","v":0.02},"Ohms"]
[]
[]
["I1 ",{"$f":"(D6/(D6+D9))*SQRT((D10*D9*B4)^2+1)/SQRT((((D7+D10)*D6*D9/(D9+D6))*B4)^2+1)","v":0.57258166681452327},"%"]
["I2 ",{"$f":"1-B13","v":0.42741833318547673},"%"]
[]
["I1 ",{"$f":"B13*(Iripple1/(2*SQRT(3)))","v":{"$error":"#NAME?"}},"A"]
["I2 ",{"$f":"B14*(Iripple1/(2*SQRT(3)))","v":{"$error":"#NAME?"}},"A"]