{"text_format":"1","workbook":"xlsx","n_sheets":11,"sheets":["Instructions","Subsystem Inputs","Power Estimation Output","Lists","Power Data Pull","Power Data","Application Menus","Operation Modes","External Data Aquisition","Drop Down Lists","Working Sheet"],"not_rendered":{"charts":2,"images":0,"macros":1,"external_links":1,"defined_names":51,"comments":3,"pivot_tables":0},"unopened":[],"bounds":{"document_bytes":16777216,"sheet_cells":100000,"rows_first":2000,"rows_last":500,"rows_between":2000,"halvings":0,"cell_chars":16384,"cell_head_chars":4096},"cells_cut":0,"cells_raw":0,"read":"whole","date_system":"1900"}

{"sheet":"Instructions","index":0,"n_rows":24,"n_cols":2,"rows_kept":24,"cut":false,"hidden":false,"merged":[[0,0,0,8],[4,0,4,8],[5,0,5,8],[8,0,8,8],[10,0,10,8],[23,0,23,8],[24,0,24,8],[17,0,17,8],[19,0,19,8],[20,0,20,8],[21,0,21,8],[22,0,22,8]]}
["MSPM0 Power Estimator Spreadsheet"]
["Revision: 1.7"]
["2024-10-10"]
[]
["Summary"]
["This spreadsheet can help estimate the power consumption of your design based on used peripherals, operation temperature, and operation power domain"]
[]
["Instructions"]
["1. On the subsystems input tab, start by selecting the operation mode in B2, the operation temp in B3, the Execute from... in B4, and manually enter in the Supply voltage for the M0 in B5\n2. Based on the mode selected B6 and B7 will auto-populate with availible options for MCLK source and frequency, select from the choices in each box\n3. Click on \"Update Form\" which will populate the core current consumption and automatically enable any clocks that are selected in B6\n3. Peripherals and clocks that are enabled or optional will automatically populate with drop down lists for selecting operational parameters of each item\n4. Go through the peripherals and select the options that best match the mode for a particular duration\n5. Once all peripherals are added, add a time duration for the mode/operation\n6. Click on \"Add to Total\" button and the power consumption will be calculated based on the time period as a part of the complete duration, and the chart will populate with graphical data based on the timeline\n7. to remove the last operation from the list click the \"Remove\" button\n8. To reset sheet, click the \"Update/Reset View\" button next to the run mode drop down\n9. Once all the modes and times are added the Power estimation output will be populated with each mode with current consumption data for all active peripherals\n10. Add the desired location for the PDF report output and the name you want to use for the report. Click generate report and next go to the location you typed in and you should see a PDF version of the Power Estimation Output"]
[]
{"$rows_left_out":15}
{"sheet":"Subsystem Inputs","index":1,"n_rows":54,"n_cols":17,"rows_kept":54,"cut":false,"hidden":false,"merged":[[52,7,52,8],[51,7,51,8],[48,7,48,8],[49,7,50,8],[49,9,50,10],[0,0,0,1],[8,0,8,15],[7,0,7,15],[9,7,9,15],[20,7,20,15],[9,0,9,6],[15,0,15,6],[18,0,18,6],[11,2,11,3],[44,7,45,15],[46,7,47,8],[49,11,50,12],[42,7,42,10],[43,7,43,10],[49,14,50,15],[49,13,50,13],[25,7,25,15],[42,0,42,6],[23,0,23,6],[32,0,32,6],[33,7,33,15],[53,7,53,8],[54,7,54,8],[55,7,55,8],[56,7,56,8],[57,7,57,8],[58,7,58,8],[59,7,59,8],[60,7,60,8],[61,7,61,8],[62,7,62,8]]}
["Device Initialization Parameters"]
["Operation Mode","Run 0"]
["Temperature","25C"]
["Mem Exec SRC","Flash"]
["Supply Voltage",3.3]
["MCLK Source","Enter CLK Source"]
["MCLK Frequency","Select Frequency"]
["MSPM0G Power Estimation Tool"]
["Peripheral Definition"]
["CORE FUNCTIONS",null,null,null,null,null,null,"COMMUNICATION"]
{"$rows_left_out":45}
{"sheet":"Power Estimation Output","index":2,"n_rows":1,"n_cols":1,"rows_kept":1,"cut":false,"hidden":true,"merged":[[0,0,1,3]]}
["POWER ESTIMATION REPORT"]

{"sheet":"Lists","index":3,"n_rows":238,"n_cols":23,"rows_kept":238,"cut":false,"hidden":true,"merged":[]}
["Peripheral","Option 0","Option 1","Option 2","Option 3","Option 4","Option 5","Option 6","Option 7","Option 8"]
["CPU"]
[]
["DMA","--Select Option--"]
[null,"EN"]
[null,"DIS"]
[]
["Flash"]
["SRAM",null,null,null,null,null,null,null,null,null,null,null,null,null,null,null,null,null,null,null,null,"Unused Pin Configuration"]
["Core regulator",null,null,null,null,null,null,null,null,null,null,null,null,null,null,null,null,null,null,null,null,"Direction","Configure Output"]
{"$rows_left_out":229}
{"sheet":"Power Data Pull","index":4,"n_rows":220,"n_cols":27,"rows_kept":220,"cut":false,"hidden":true,"merged":[]}
["Operation Mode","Temp","Execute From…","Freq.","Current","Units",null,"Peripheral","Condition 1","Condition 2","Notes","Consumption ","Units",null,"x Range","Min","Duration","Current","Max x","Max Y",null,null,null,"X Range Min","Y Value","Max X","Max Y"]
["Run 0","-40C","Flash","80 MHz",7.5,"mA",null,"SPI0","Controller Mode","16MHz",null,0.30600000000000005,"mA",null,0,0,0,0,{"$f":"MAX(S3:S9)","v":0},{"$f":"1.1*MAX(R2:R9)","v":0},null,null,null,{"$f":"Q2","v":0},{"$f":"'Subsystem Inputs'!J52","v":0},{"$f":"MAX(X2:X23)+10","v":10},{"$f":"IF(Y2<>0,CEILING(MAX(Y2:Y23),10),10)","v":10}]
["Run 0","25C","Flash","80 MHz",7.6,"mA",null,"SPI0","Controller Mode","8MHz",null,0.30200000000000005,"mA",null,{"$f":"'Subsystem Inputs'!J52","v":0},{"$f":"'Subsystem Inputs'!M52","v":0},{"$f":"SUM(P2:P3)-P2","v":0},{"$f":"'Subsystem Inputs'!O52","v":0},null,null,null,null,null,{"$f":"'Subsystem Inputs'!M52","v":0},{"$f":"Y2","v":0}]
["Run 0","85C","Flash","80 MHz",8,"mA",null,"SPI0","Controller Mode","4MHz",null,0.30299999999999994,"mA",null,{"$f":"'Subsystem Inputs'!J53","v":0},{"$f":"'Subsystem Inputs'!M53","v":0},{"$f":"P4+Q3","v":0},"",{"$f":"SUM(P3:P4)","v":0},null,null,null,null,{"$f":"X3","v":0},{"$f":"'Subsystem Inputs'!J53","v":0}]
["Run 0","105C","Flash","80 MHz",8,"mA",null,"SPI0","Controller Mode","2MHz",null,0.30299999999999994,"mA",null,{"$f":"'Subsystem Inputs'!J54","v":0},{"$f":"'Subsystem Inputs'!M54","v":0},{"$f":"Q4+P5","v":0},"",{"$f":"SUM(P3:P5)","v":0},null,null,null,null,{"$f":"'Subsystem Inputs'!M53+X4","v":0},{"$f":"Y4","v":0}]
["Run 0","125C","Flash","80 MHz",8.6,"mA",null,"SPI0","Controller Mode","1MHz",null,0.30299999999999994,"mA",null,{"$f":"'Subsystem Inputs'!J55","v":0},{"$f":"'Subsystem Inputs'!M55","v":0},{"$f":"Q5+P6","v":0},"",{"$f":"SUM(P3:P6)","v":0},null,null,null,null,{"$f":"X5","v":0},{"$f":"'Subsystem Inputs'!J54","v":0}]
["Run 0","-40C","Flash","48 MHz",4.8,"mA",null,"SPI1","Controller Mode","16MHz",null,0.30600000000000005,"mA",null,{"$f":"'Subsystem Inputs'!J56","v":0},{"$f":"'Subsystem Inputs'!M56","v":0},{"$f":"P7+Q6","v":0},"",{"$f":"SUM(P3:P7)","v":0},null,null,null,null,{"$f":"'Subsystem Inputs'!M54+X6","v":0},{"$f":"Y6","v":0}]
["Run 0","25C","Flash","48 MHz",4.9000000000000004,"mA",null,"SPI1","Controller Mode","8MHz",null,0.30200000000000005,"mA",null,{"$f":"'Subsystem Inputs'!J57","v":0},{"$f":"'Subsystem Inputs'!M57","v":0},{"$f":"P8+Q7","v":0},"",{"$f":"SUM(P3:P8)","v":0},null,null,null,null,{"$f":"X7","v":0},{"$f":"'Subsystem Inputs'!J55","v":0}]
["Run 0","85C","Flash","48 MHz",5.0999999999999996,"mA",null,"SPI1","Controller Mode","4MHz",null,0.30299999999999994,"mA",null,{"$f":"'Subsystem Inputs'!J58","v":0},{"$f":"'Subsystem Inputs'!M58","v":0},{"$f":"P9+Q8","v":0},"",{"$f":"SUM(P3:P9)","v":0},null,null,null,null,{"$f":"'Subsystem Inputs'!M55+X8","v":0},{"$f":"Y8","v":0}]
["Run 0","105C","Flash","48 MHz",5.2,"mA",null,"SPI1","Controller Mode","2MHz",null,0.30299999999999994,"mA",null,{"$f":"'Subsystem Inputs'!J59","v":0},{"$f":"'Subsystem Inputs'!M59","v":0},null,null,null,null,null,null,null,{"$f":"X9","v":0},{"$f":"'Subsystem Inputs'!J56","v":0}]
{"$rows_left_out":211}
{"sheet":"Power Data","index":5,"n_rows":226,"n_cols":15,"rows_kept":226,"cut":false,"hidden":true,"merged":[[99,0,99,3],[144,0,144,3],[84,5,84,9],[139,5,139,14],[128,5,128,8],[133,5,133,8],[84,0,84,3],[90,0,90,3],[100,5,100,7],[72,2,72,3],[146,5,146,14],[148,9,152,9],[148,14,152,14],[106,0,109,0],[92,0,95,0],[134,0,136,0],[132,0,132,3],[106,4,106,5],[104,0,104,3],[101,0,102,0],[126,0,126,3],[118,0,120,0],[121,0,124,0],[116,0,116,3],[111,0,111,3],[77,0,80,0],[44,0,44,3],[46,0,46,3],[48,0,48,3],[52,0,56,0],[51,0,51,3],[75,0,75,3],[73,2,73,3],[69,0,69,5],[64,0,64,1],[64,2,64,3],[71,0,72,0],[70,0,70,1],[71,1,72,1],[70,2,70,3],[71,2,71,3],[14,0,14,8],[21,8,24,8],[27,2,30,2],[65,2,65,3],[66,2,66,3],[63,0,63,5],[60,5,61,5],[60,1,61,1],[60,2,60,3],[61,2,61,3],[60,0,61,0],[41,0,41,3],[42,0,42,3],[1,8,9,8],[10,0,10,8],[11,0,13,0],[11,8,13,8],[1,0,9,0],[2,1,3,1],[4,1,5,1],[6,1,7,1],[8,1,9,1],[0,0,0,8],[59,2,59,3],[59,0,59,1],[58,0,58,5],[15,8,19,8],[16,1,17,1],[18,1,19,1],[35,0,35,3],[28,0,30,0],[15,0,19,0],[21,0,22,0],[22,2,23,2],[26,8,30,8],[32,8,33,8],[31,0,31,8],[49,0,50,0],[163,5,164,5],[147,0,147,3],[149,0,152,0],[154,5,155,5],[157,5,158,5],[160,5,161,5]]}
["Supply Current Characteristics"]
["IDD(RUN)","Parameter","MCLK","-40C","25C","85C","105C","125C","mA"]
[null,"MCLK=SYSPLL,\nSYSPLLREF=SYSOSC, CoreMark,\nexecute from flash","80 MHz",7.5,7.6,8,8,8.6]
[null,null,"48 MHz",4.8,4.9000000000000004,5.0999999999999996,5.2,5.7]
[null,"MCLK=SYSOSC, CoreMark, execute from flash","32 MHz",3.3,3.4,3.7,3.7,4.0999999999999996]
[null,null,"4 MHz",0.6,0.7,0.8,1,1.4]
[null,"MCLK=SYSPLL,\nSYSPLLREF=SYSOSC, CoreMark,\nexecute from SRAM","80 MHz",5.9,6,6.3,6.4,6.8]
[null,null,"48 MHz",3.7,3.8,3.8,4.5,5]
[null,"MCLK=SYSOSC, CoreMark,\nexecute from SRAM","32 MHz",2.5,2.6,2.7,3,3.4]
[null,null,"4 MHz",0.6,0.6,0.8,0.9,1]
{"$rows_left_out":217}
{"sheet":"Application Menus","index":6,"n_rows":35,"n_cols":18,"rows_kept":35,"cut":false,"hidden":true,"merged":[[1,11,5,11],[27,11,28,11],[29,11,30,11],[22,11,23,11],[10,11,11,11],[12,11,17,11],[18,11,21,11],[6,11,9,11]]}
["Target Device","Port","Baud Rate","Measurement","Acquisition Frequency","Operation Mode","Add a Peripheral",null,"MCLK Source","MCLK Frequency",null,"Mode DD","MCLK DD","MCLK Freq DD"]
["DMM1",1,9600,"Voltage","Single Shot","Run 0","GPIOA",null,"SYSPLL","80 MHz",null,"Run 0","SYSPLL","80 MHz",null,"SYSPLL","80 MHz","Run 0"]
["DMM2",2,115200,"Current","Continuous","Run 1","GPIOB",null,null,"48 MHz",null,null,"SYSOSC","48 MHz",null,null,"48 MHz"]
[null,3,null,"Voltage (Mean)",null,"Run 2","ADC0",null,"SYSOSC","32 MHz",null,null,"LFOSC","32 MHz",null,"SYSOSC","32 MHz"]
[null,4,null,"Current (Mean)",null,"Sleep 0","ADC1",null,null,"4 MHz",null,null,"LFXT","4 MHz",null,null,"4 MHz"]
[null,null,null,null,null,"Sleep 1","DAC0",null,"ULPCLK","4 MHz",null,null,null,"32 kHz",null,"SYSOSC","32 MHz","Run 1"]
[null,null,null,null,null,"Sleep 2","OPA0",null,"LFOSC","32 kHz",null,"Run 1","SYSOSC","32 MHz",null,null,"4 MHz"]
[null,null,null,null,null,"Stop 0","OPA1",null,"LFXT","32 kHz",null,null,"LFOSC","4 MHz",null,"LFOSC & LFXT","32 kHz"]
[null,null,null,null,null,"Stop 1","GPAMP",null,"LFCLK","32 kHz",null,null,"LFXT","32 kHz",null,"LFOSC & LFXT","32 kHz","Run 2"]
[null,null,null,null,null,"Stop 2","COMP0",null,null,null,null,null,null,"32 kHz",null,"SYSPLL","80 MHz","Sleep 0"]
{"$rows_left_out":26}
{"sheet":"Operation Modes","index":7,"n_rows":64,"n_cols":20,"rows_kept":64,"cut":false,"hidden":true,"merged":[[49,0,58,0],[59,0,59,1],[60,0,60,1],[0,2,0,4],[2,0,5,0],[6,0,16,0],[17,0,19,0],[20,0,23,0],[0,0,1,1],[0,16,0,17],[0,5,0,7],[0,8,0,10],[0,11,0,12],[37,0,48,0]]}
["OPERATING MODE",null,"Run",null,null,"Sleep",null,null,"Stop",null,null,"Standby",null,null,null,null,"Population Values",null,null,"Mode Status"]
[null,null,"Run 0","Run 1","Run 2","Sleep 0","Sleep 1","Sleep 2","Stop 0","Stop 1","Stop 2","Standby 0","Standby 1","Shutdown",null,{"$f":"CELL(\"col\",INDEX('Operation Modes'!C2:N2,MATCH('Subsystem Inputs'!B2,'Operation Modes'!C2:N2,0)))","v":3},"SYSOSC",{"$f":"_xlfn.SWITCH('Subsystem Inputs'!$B$2,'Operation Modes'!$C$2,'Operation Modes'!C3,'Operation Modes'!$D$2,'Operation Modes'!D3,'Operation Modes'!$E$2,'Operation Modes'!E3,'Operation Modes'!$F$2,'Operation Modes'!F3,'Operation Modes'!$G$2,'Operation Modes'!G3,'Operation Modes'!$H$2,'Operation Modes'!H3,'Operation Modes'!$I$2,'Operation Modes'!I3,'Operation Modes'!$J$2,'Operation Modes'!J3,'Operation Modes'!$K$2,'Operation Modes'!K3,'Operation Modes'!$L$2,'Operation Modes'!L3,'Operation Modes'!$M$2,'Operation Modes'!M3,'Operation Modes'!$N$2,'Operation Modes'!N3)","v":"EN"},null,"EN"]
["Oscillators","SYSOSC","EN","EN","DIS","EN","EN","DIS","OPT","EN","DIS","DIS","DIS","OFF",null,null,"LFOSC or LFXT",{"$f":"_xlfn.SWITCH('Subsystem Inputs'!$B$2,'Operation Modes'!$C$2,'Operation Modes'!C4,'Operation Modes'!$D$2,'Operation Modes'!D4,'Operation Modes'!$E$2,'Operation Modes'!E4,'Operation Modes'!$F$2,'Operation Modes'!F4,'Operation Modes'!$G$2,'Operation Modes'!G4,'Operation Modes'!$H$2,'Operation Modes'!H4,'Operation Modes'!$I$2,'Operation Modes'!I4,'Operation Modes'!$J$2,'Operation Modes'!J4,'Operation Modes'!$K$2,'Operation Modes'!K4,'Operation Modes'!$L$2,'Operation Modes'!L4,'Operation Modes'!$M$2,'Operation Modes'!M4,'Operation Modes'!$N$2,'Operation Modes'!N4)","v":"EN (LFOSC or LFXT)"},null,"DIS"]
[null,"LFOSC or LFXT","EN (LFOSC or LFXT)","EN (LFOSC or LFXT)","EN (LFOSC or LFXT)","EN (LFOSC or LFXT)","EN (LFOSC or LFXT)","EN (LFOSC or LFXT)","EN (LFOSC or LFXT)","EN (LFOSC or LFXT)","EN (LFOSC or LFXT)","EN (LFOSC or LFXT)","EN (LFOSC or LFXT)","OFF",null,null,"HFXT",{"$f":"_xlfn.SWITCH('Subsystem Inputs'!$B$2,'Operation Modes'!$C$2,'Operation Modes'!C5,'Operation Modes'!$D$2,'Operation Modes'!D5,'Operation Modes'!$E$2,'Operation Modes'!E5,'Operation Modes'!$F$2,'Operation Modes'!F5,'Operation Modes'!$G$2,'Operation Modes'!G5,'Operation Modes'!$H$2,'Operation Modes'!H5,'Operation Modes'!$I$2,'Operation Modes'!I5,'Operation Modes'!$J$2,'Operation Modes'!J5,'Operation Modes'!$K$2,'Operation Modes'!K5,'Operation Modes'!$L$2,'Operation Modes'!L5,'Operation Modes'!$M$2,'Operation Modes'!M5,'Operation Modes'!$N$2,'Operation Modes'!N5)","v":"OPT"},null,"OPT"]
[null,"HFXT","OPT","DIS","DIS","OPT","DIS","DIS","DIS","DIS","DIS","DIS","DIS","OFF",null,null,"SYSPLL",{"$f":"_xlfn.SWITCH('Subsystem Inputs'!$B$2,'Operation Modes'!$C$2,'Operation Modes'!C6,'Operation Modes'!$D$2,'Operation Modes'!D6,'Operation Modes'!$E$2,'Operation Modes'!E6,'Operation Modes'!$F$2,'Operation Modes'!F6,'Operation Modes'!$G$2,'Operation Modes'!G6,'Operation Modes'!$H$2,'Operation Modes'!H6,'Operation Modes'!$I$2,'Operation Modes'!I6,'Operation Modes'!$J$2,'Operation Modes'!J6,'Operation Modes'!$K$2,'Operation Modes'!K6,'Operation Modes'!$L$2,'Operation Modes'!L6,'Operation Modes'!$M$2,'Operation Modes'!M6,'Operation Modes'!$N$2,'Operation Modes'!N6)","v":"OPT"},null,"OFF"]
[null,"SYSPLL","OPT","DIS","DIS","OPT","DIS","DIS","DIS","DIS","DIS","DIS","DIS","OFF",null,null,"CPUCLK",{"$f":"_xlfn.SWITCH('Subsystem Inputs'!$B$2,'Operation Modes'!$C$2,'Operation Modes'!C7,'Operation Modes'!$D$2,'Operation Modes'!D7,'Operation Modes'!$E$2,'Operation Modes'!E7,'Operation Modes'!$F$2,'Operation Modes'!F7,'Operation Modes'!$G$2,'Operation Modes'!G7,'Operation Modes'!$H$2,'Operation Modes'!H7,'Operation Modes'!$I$2,'Operation Modes'!I7,'Operation Modes'!$J$2,'Operation Modes'!J7,'Operation Modes'!$K$2,'Operation Modes'!K7,'Operation Modes'!$L$2,'Operation Modes'!L7,'Operation Modes'!$M$2,'Operation Modes'!M7,'Operation Modes'!$N$2,'Operation Modes'!N7)","v":"80 MHz"},null,"EN (LFOSC or LFXT)"]
["Clocks","CPUCLK","80 MHz","32 kHz","32 kHz","DIS","DIS","DIS","DIS","DIS","DIS","DIS","DIS","OFF",null,null,"MCLK to PD1",{"$f":"_xlfn.SWITCH('Subsystem Inputs'!$B$2,'Operation Modes'!$C$2,'Operation Modes'!C8,'Operation Modes'!$D$2,'Operation Modes'!D8,'Operation Modes'!$E$2,'Operation Modes'!E8,'Operation Modes'!$F$2,'Operation Modes'!F8,'Operation Modes'!$G$2,'Operation Modes'!G8,'Operation Modes'!$H$2,'Operation Modes'!H8,'Operation Modes'!$I$2,'Operation Modes'!I8,'Operation Modes'!$J$2,'Operation Modes'!J8,'Operation Modes'!$K$2,'Operation Modes'!K8,'Operation Modes'!$L$2,'Operation Modes'!L8,'Operation Modes'!$M$2,'Operation Modes'!M8,'Operation Modes'!$N$2,'Operation Modes'!N8)","v":"80 MHz"}]
[null,"MCLK to PD1","80 MHz","32 kHz","32 kHz","80 MHz","32 kHz","32 kHz","DIS","DIS","DIS","DIS","DIS","OFF",null,null,"ULPCLK to PD0",{"$f":"_xlfn.SWITCH('Subsystem Inputs'!$B$2,'Operation Modes'!$C$2,'Operation Modes'!C9,'Operation Modes'!$D$2,'Operation Modes'!D9,'Operation Modes'!$E$2,'Operation Modes'!E9,'Operation Modes'!$F$2,'Operation Modes'!F9,'Operation Modes'!$G$2,'Operation Modes'!G9,'Operation Modes'!$H$2,'Operation Modes'!H9,'Operation Modes'!$I$2,'Operation Modes'!I9,'Operation Modes'!$J$2,'Operation Modes'!J9,'Operation Modes'!$K$2,'Operation Modes'!K9,'Operation Modes'!$L$2,'Operation Modes'!L9,'Operation Modes'!$M$2,'Operation Modes'!M9,'Operation Modes'!$N$2,'Operation Modes'!N9)","v":"40 MHz"}]
[null,"ULPCLK to PD0","40 MHz","32 kHz","32 kHz","40 MHz","32 kHz","32 kHz","4 MHz","4 MHz","32 kHz","32 kHz","DIS","OFF",null,null,"ULPCLK to TIMG0/8",{"$f":"_xlfn.SWITCH('Subsystem Inputs'!$B$2,'Operation Modes'!$C$2,'Operation Modes'!C10,'Operation Modes'!$D$2,'Operation Modes'!D10,'Operation Modes'!$E$2,'Operation Modes'!E10,'Operation Modes'!$F$2,'Operation Modes'!F10,'Operation Modes'!$G$2,'Operation Modes'!G10,'Operation Modes'!$H$2,'Operation Modes'!H10,'Operation Modes'!$I$2,'Operation Modes'!I10,'Operation Modes'!$J$2,'Operation Modes'!J10,'Operation Modes'!$K$2,'Operation Modes'!K10,'Operation Modes'!$L$2,'Operation Modes'!L10,'Operation Modes'!$M$2,'Operation Modes'!M10,'Operation Modes'!$N$2,'Operation Modes'!N10)","v":"40 MHz"}]
[null,"ULPCLK to TIMG0/8","40 MHz","32 kHz","32 kHz","40 MHz","32 kHz","32 kHz","4 MHz","4 MHz","32 kHz","32 kHz","32 kHz","OFF",null,null,"RTCCLK",{"$f":"_xlfn.SWITCH('Subsystem Inputs'!$B$2,'Operation Modes'!$C$2,'Operation Modes'!C11,'Operation Modes'!$D$2,'Operation Modes'!D11,'Operation Modes'!$E$2,'Operation Modes'!E11,'Operation Modes'!$F$2,'Operation Modes'!F11,'Operation Modes'!$G$2,'Operation Modes'!G11,'Operation Modes'!$H$2,'Operation Modes'!H11,'Operation Modes'!$I$2,'Operation Modes'!I11,'Operation Modes'!$J$2,'Operation Modes'!J11,'Operation Modes'!$K$2,'Operation Modes'!K11,'Operation Modes'!$L$2,'Operation Modes'!L11,'Operation Modes'!$M$2,'Operation Modes'!M11,'Operation Modes'!$N$2,'Operation Modes'!N11)","v":"32 kHz"}]
{"$rows_left_out":55}
{"sheet":"External Data Aquisition","index":8,"n_rows":32,"n_cols":7,"rows_kept":32,"cut":false,"hidden":true,"merged":[[27,0,28,6]]}
[]
[]
[]
[]
[]
[]
[]
[]
[]
[]
{"$rows_left_out":23}
{"sheet":"Drop Down Lists","index":9,"n_rows":92,"n_cols":15,"rows_kept":92,"cut":false,"hidden":true,"merged":[[70,1,70,2],[41,10,46,10],[47,10,51,10],[52,10,54,10],[15,0,15,12],[36,6,36,7],[41,6,41,7],[31,0,31,14],[36,3,36,5],[56,0,56,9],[61,4,61,5],[20,2,20,3],[61,1,61,2],[65,1,65,2],[61,7,61,9],[27,2,27,3],[1,13,1,14],[0,0,0,14],[56,11,56,12],[36,13,36,14]]}
["Clocks and Scenario Options"]
["Ambient Temperature","Operation Mode","Mem Exec. Source","SYSPLL","MCLK Frequency","SYSOSC","HFXT","MFCLK","MFPCLK","LFCLK Monitor","ULPCLK Freq","LFOSC/ LFXT","DMA","Unused Pin Configuration"]
["-40C","Run 0","Flash","--Select Option--","80 MHz","--Select Option--","--Select Option--","--Select Option--","--Select Option--","--Select Option--","4MHz","--Select Option--","--Select Option--","Direction","Configure Output"]
["25C","Run 1","SRAM","EN","48 MHz","EN","EN","EN","EN","EN","32kHz","LFOSC","EN","--Select Option--","--Select Option--"]
["85C","Run 2",null,"DIS","32 MHz","DIS","DIS","DIS","DIS","DIS",null,"LFXT","DIS","Output","Low"]
["105C","Sleep 0","EN","SYSPLL FREQ","4 MHz","SYSOSC FREQ","HFXT Freq Source",null,null,null,null,null,null,"Input","High"]
["125C","Sleep 1","DIS","--Select Frequency--","MCLK Monitor","--Select Frequency--","--Select Frequency--",null,null,null,null,null,null,null,"--Select Option--"]
[null,"Sleep 2",null,"48 MHz","--Select Option--","32MHz","4MHz",null,null,null,null,null,null,null,"No Resistor"]
[null,"Stop 0","tPROG (WORD, 64)","80 MHz","EN","4MHz","48MHz",null,null,null,null,null,null,null,"Pull-Up Resistor"]
[null,"Stop 1","tPROG (SEC, 64)",null,"DIS",null,null,null,null,null,null,null,null,null,"Pull-Down Resistor"]
{"$rows_left_out":83}
{"sheet":"Working Sheet","index":10,"n_rows":61,"n_cols":12,"rows_kept":61,"cut":false,"hidden":true,"merged":[[0,2,0,10],[14,3,14,5]]}
["Peripheral Testing Needs","Owner","ADC"]
["TIMG, TIMA","Diego","Conversion Mode","ADC Clock Source","Sample Clock Divider","Supplied Operational Voltage","Reference Voltage","Averaging Mode","Burn Out Current Source","Window Comparator mode","Sampling Resolution","DMA or CPU transfer"]
["UART 0,1,2,3","Diego","Single","SYSOSC",1,1.62,"Internal 2.5V","On","Enable","Enabled ",14]
["GPIO A",null,"Sequence","ULPCLK",2,"…","Internal 1.4V","Off","Disable","Disabled",12]
["GPIO B",null,"Simultaneous","HFCLK",4,"…","External ",null,null,null,10]
["WWDT 0","Dennis",null,null,8,"3.6V",null,"Hardware Averaging Numerator",null,null,8]
["WWDT 1","Dennis","SYSOSC","32 MHz",16,null,null,2]
["MATHACL","Brian ","ULPCLK","32 MHz",24,null,null,4]
["AES","Rakesh's team","HFCLK",null,32,null,null,8]
["MCAN0","Rakesh's team",null,null,48,null,null,16]
{"$rows_left_out":51}