{"text_format":"1","workbook":"xlsx","n_sheets":13,"sheets":["Design the Power Module","Schematic & BOM","Variable Management","Sheet1","MOSFET Parameters","Schematic Management","Stability Calculations","Bode Plot Management","Efficiency Calculations","Efficiency Plot Management","Standard Value Calculator","Snubber","Parallel Output Caps"],"not_rendered":{"charts":8,"images":22,"macros":1,"external_links":1,"defined_names":238,"comments":1,"pivot_tables":0},"unopened":[],"bounds":{"document_bytes":16777216,"sheet_cells":100000,"rows_first":2000,"rows_last":500,"rows_between":2000,"halvings":0,"cell_chars":16384,"cell_head_chars":4096},"cells_cut":0,"cells_raw":0,"read":"whole","date_system":"1900"}

{"sheet":"Design the Power Module","index":0,"n_rows":56,"n_cols":17,"rows_kept":56,"cut":false,"hidden":false,"merged":[[2,14,2,15],[0,0,0,16],[81,5,81,6],[39,11,40,16],[41,11,42,16]]}
["                      TPSM63610/E  3V‒36VIN, 1V‒20VOUT Power Module Design Tool"]
[null,null,null,null,null,null,null,null,null,null,null,null,null,null,"http://www.ti.com/product/lm5175"]
["About",null,"xx",null,null,"= Input Box",null,null,null,null,null,null,null,null,"TERMS OF USE",null,"                "]
[]
["Step 1: Operating Specifications"]
[null,null,null,"Input Voltage – Min, VIN(min) ",12,"V"]
[null,null,null,"Input Voltage – Nom, VIN(nom)",24,"V"]
[null,null,null,"Input Voltage – Max, VIN(max)",36,"V"]
[null,null,null,"Output Voltage, VOUT ",5,"V"]
[null,null,null,"Full Load Output Current, IOUT ",8,"A"]
[null,null,null,"Switching Frequency, FSW",1000,"kHz"]
[null,null,null,"Frequency Set Resistor, RT ",{"$f":"'Variable Management'!C341","v":15.8},{"$f":"'Variable Management'!E341","v":"kΩ"}]
[null,null,null,"Ambient Temperature, TA",25,"°C"]
[]
["Step 2: Buck Inductor"]
[null,null,null,"Inductor Pk-Pk Ripple Current at VIN(nom)",{"$f":"'Variable Management'!B60","v":2.4421750148918102},"Apk-pk"]
[null,null,null,"DIL as a % of Full Load at VIN(nom)",{"$f":"'Variable Management'!D60*100","v":30.527187686147627},"%"]
[null,null,null,"Peak Inductor Current at VIN(max) and Full Load",{"$f":"'Variable Management'!B99","v":9.3345228489105097},"Apk"]
[null,null,null,"Peak Inductor Current Limit",{"$f":"Ipk_OCP","v":13.8},"Apk"]
[]
["Step 3: Output Capacitors"]
[null,null,null,"Desired Output Voltage Ripple",50,"mVpk-pk"]
[null,null,null,"Effective COUT Value to Meet Ripple Spec",{"$f":"'Variable Management'!B113","v":6.105437537229526},"µF"]
[null,null,null,"Desired Crossover Frequency",50,{"$f":"\"     kHz \"","v":"     kHz "}]
[null,null,null,"Effective COUT Value to Meet Crossover Spec",{"$f":"'Variable Management'!B206","v":83.765759617766506},"µF"]
[null,null,null,"Output Capacitance (derated), COUT ",72,"µF"]
[null,null,null,"Output Cap ESR (Max) to Meet Ripple Spec",{"$f":"'Variable Management'!B117","v":20.399811207844387},"mΩ"]
[null,null,null,"Output Capacitor ESR",2,"mΩ"]
[null,null,null,"Resulting Output Voltage Ripple (max) ",{"$f":"'Variable Management'!B119*1000","v":6.4678836183849207},"mVpk-pk"]
[null,null,null,"Output Capacitor RMS Current (max) ",{"$f":"'Variable Management'!B106","v":0.77048712605818936},"A (rms)"]
[]
["Step 4: Input Capacitors"]
[null,null,null,"Input Voltage Ripple Spec",150,"mVpk-pk"]
[null,null,null,"Minimum Input Capacitance",{"$f":"'Variable Management'!B136","v":13.333333333333334},"µF"]
[null,null,null,"Input Capacitance (derated), CIN ",25,"µF"]
[null,null,null,"Maximum Permitted ESR",{"$f":"'Variable Management'!B141","v":7.499044261075448},"mΩ"]
[null,null,null,"Input Capacitor ESR",1,"mΩ"]
[null,null,null,"Resulting Input Voltage Ripple (max)",{"$f":"'Variable Management'!B146*1000","v":89.33452284891051},"mVpk-pk"]
[null,null,null,"Input Capacitor RMS Current (max)",{"$f":"'Variable Management'!B129","v":3.9817299943751312},"A (rms)"]
[null,null,null,null,null,null,null,null,null,null,null,{"$f":"CHOOSE(SCH_MODE, \"\", \"** For Single-Output Operation in 2-Phase Mode, tie MODE to VDDA and use FB1 to set VOUT **\", \"** For Single-Output Operation in 3-Phase Mode, tie both MODE pins to VDDA. Use FB1 of master IC to set VOUT. Connect FB2 of master IC to AGND. Connect FB2 of slave IC to VDDA to configure it as a slave **\", \"** For Single-Output Operation in 4-Phase Mode, tie both MODE pins to VDDA. Use FB1 of master IC to set VOUT. Connect FB2 of master IC to AGND. Connect FB2 of slave IC to VDDA to configure it as a slave **\")","v":""}]
["Step 5: Feedback Network"]
[null,null,null,"Upper Feedback Resistance RFBT",100,"kΩ",null,null,null,null,null,{"$f":"CHOOSE(SCH_MODE, \"\", \"** For Single-Output Operation in 2-Phase Mode, tie MODE to VDDA and use FB1 to set VOUT **\", \"** For Single-Output Operation in 3-Phase Mode, tie both MODE pins to VDDA. Use FB1 of master IC to set VOUT. Connect FB2 of master IC to AGND. Connect FB2 of slave IC to VDDA to configure it as a slave **\", \"** For Single-Output Operation in 4-Phase Mode, tie both MODE pins to VDDA. Use FB1 of master IC to set VOUT. Connect FB2 of master IC to AGND. Connect FB2 of slave IC to VDDA to configure it as a slave **\")","v":""}]
[null,null,null,"Lower Feedback Resistance, RFBB",{"$f":"IF(Vout=Vref,\"SHORT\",Rfb2_u/1000)","v":24.9},{"$f":"IF(Vout=Vref,\"\",\"kΩ\")","v":"kΩ"}]
[null,null,null,"Feedforward Capacitance, CFF",10,"pF"]
[]
["Step 6: VIN UVLO"]
[null,null,null,"Desired VIN UVLO Turn-On Threshold",6,"V"]
[null,null,null,"UVLO Divider Upper Resistance, RENT",187,"kΩ"]
[null,null,null,"UVLO Divider Lower Resistance (E96), RENB",{"$f":"Renb_u/1000","v":49.9},{"$f":"IF(Vout=Vref,\"\",\"kΩ\")","v":"kΩ"}]
[null,null,null,"Actual VIN UVLO Turn-On Threshold",{"$f":"1.263/E49*(E48+E49)","v":5.9960861723446888},"V",null,null,null,null,null,null,null,null,null,null," "]
[null,null,null,"Actual VIN UVLO Turn-Off Threshold",{"$f":"E50*0.72","v":4.3171820440881756},"V"]
[]
["Step 7: Power Loss & Thermals"]
[null,null,null,"Total Power Dissipation",{"$f":"'Efficiency Calculations'!AT109","v":3.5813332386009749},"W"]
[null,null,null,"Junction Temperature (estimate)",{"$f":"'Variable Management'!B285","v":89.463998294817543},"°C"]
[null,null,null,null,{"$f":"CHOOSE(Ext_VCC, \"\", \"* Tie VLDOIN to GND\")","v":""}]

{"sheet":"Schematic & BOM","index":1,"n_rows":53,"n_cols":10,"rows_kept":53,"cut":false,"hidden":false,"merged":[[38,3,38,5],[36,3,36,5],[45,3,45,6],[46,3,46,6],[35,3,35,6],[37,3,37,5],[40,3,40,5],[39,3,39,5],[47,3,47,6],[43,3,43,6],[44,3,44,6],[42,3,42,6],[41,3,41,6],[48,0,49,0],[48,9,49,9],[48,3,49,6],[48,2,49,2],[48,1,49,1],[48,7,49,7],[48,8,49,8]]}
[]
[]
[]
[]
[]
[]
[]
[]
[]
[]
[]
[]
[]
[]
[]
[]
[]
[]
[]
[]
[]
[]
[]
[]
[]
[]
[]
[]
[]
[]
[]
[]
[]
[{"$f":"\"VIN = \"&VIN_min&\" V to \"&VIN_max&\" V, VOUT = \"&Vout&\" V, IOUT = \"&Iout&\" A,  Fsw = \"&Fsw/1000&\" kHz\"","v":"VIN = 12 V to 36 V, VOUT = 5 V, IOUT = 8 A,  Fsw = 1000 kHz"}]
["High-Efficiency Synchronous Buck Power Module BOM"]
["Count","Ref Des","Value","Description",null,null,null,"Size","Part Number","MFR"]
[{"$f":"ROUNDUP('Design the Power Module'!E35/10,0)","v":3},"CIN1, CIN2",10,{"$f":"C37","v":10},null,null,null,1210,"Std","Std"]
[2,"COUT",22,{"$f":"C38","v":22},null,null,null,1210,"Std","Std"]
[1,"CVCC",1,{"$f":"C39","v":1},null,null,null,"0402","Std","Std"]
[1,"CSYNC",1,{"$f":"C40","v":1},null,null,null,"0402","Std","Std"]
[1,"CFF",{"$f":"'Variable Management'!D299","v":10},{"$f":"C41","v":10},null,null,null,"0402","Std","Std"]
[1,"LO",{"$f":"'Design the Power Module'!#REF!","v":{"$error":"#REF!"}},{"$f":"\"Buck Inductor, \"&Lf*1000000&\" µH, \"&Rdcr*1000&\" mΩ, >\"&ROUNDUP(Ipk_OCP*1.05,0)&\" A\"","v":"Buck Inductor, 1.6689 µH, 13.2 mΩ, >15 A"},null,null,null,"--","--","Various"]
[1,"RRT",{"$f":"'Design the Power Module'!E12","v":15.8},{"$f":"C43","v":15.8},null,null,null,"0402","Std","Std"]
[1,"RFBT",{"$f":"'Design the Power Module'!E42","v":100},100,null,null,null,"0402","Std","Std"]
[1,"RFBB",{"$f":"'Design the Power Module'!E43","v":24.9},24.9,null,null,null,"0402","Std","Std"]
[1,"RENT",{"$f":"'Variable Management'!D302","v":187},187,null,null,null,"0402","Std","Std"]
[1,"RENB",{"$f":"'Variable Management'!D303","v":49.9},49.9,null,null,null,"0402","Std","Std"]
[1,"RPGOOD",100,100,null,null,null,"0402","Std","Std"]
[1,"U1",{"$f":"'Variable Management'!N19","v":"TPSM63610"},{"$f":"CHOOSE(GPN, \"IC, TPSM63610 Synchronous Buck Power Module, 3V–36V Input, 10A Output\", \"IC, TPSM63604 Synchronous Buck Power Module, 3V–36V Input, 4A Output\", \"IC, TPSM63603 Synchronous Buck Power Module, 3V–36V Input, 3A Output\", \"IC, TPSM63602 Synchronous Buck Power Module, 3V–36V Input, 2A Output\")","v":"IC, TPSM63610 Synchronous Buck Power Module, 3V–36V Input, 10A Output"},null,null,null,{"$f":"CHOOSE(GPN, \"B3QFN\", \"B3QFN\", \"B0QFN\", \"B0QFN\")","v":"B3QFN"},{"$f":"CHOOSE(VARIANT, \"TPSM63610RDLR\", \"TPSM63604RDLR\", \"TPSM63603RDHR\", \"TPSM63602RDHR\", \"TPSM63603V5RDHR\", \"TPSM63603V3RDHR\")","v":"TPSM63610RDLR"},"TI"]
[]
[]
["NOTES:"]
["** Effective input and output capacitances should be appropriately derated for applied voltage and temperature, particularly with ceramics **"]

{"sheet":"Variable Management","index":2,"n_rows":348,"n_cols":27,"rows_kept":348,"cut":false,"hidden":false,"merged":[[4,4,4,7],[0,0,0,8]]}
["EXCEL Variables Names/Calculations"]
[null,"Input from user ="]
[null,"Output ="]
[null,"Constant"]
["Variable Name","Value","STD Units",null,"Notes",null,null,null,"Iteration"]
["Step 1: Operational Specs"]
["VIN_min",{"$f":"'Design the Power Module'!E6","v":12},"V","Minimum input voltage",null,null,null,null,1]
["VIN_nom",{"$f":"'Design the Power Module'!E7","v":24},"V","Nominal input voltage",null,null,null,null,null,null,"Use CFF",1,null,"TPSM63606 3.3Vout",{"$f":"IF(Vout = 3.3, 1, 0)","v":0},null,null,null,null,"Dual  Outputs",1,null,"FPWM",1,null,{"$f":"CHOOSE(SCH_MODE, \"Bode Plot (Ch1)\", \"Bode Plot - 2 Ph\", \"Bode Plot - 3 Ph\", \"Bode Plot - 4 Ph\")","v":"Bode Plot (Ch1)"},1]
["VIN_max",{"$f":"'Design the Power Module'!E8","v":36},"V","Maximum input voltage",null,null,null,null,null,null,"No CFF",2,null,"TPSM63603 5Vout",{"$f":"IF(Vout = 5, 1, 0)","v":1},null,null,null,null,"Single Output – 2  Phases",2,null,"DEM",2,null,{"$f":"IF(MODE=1, \"Bode Plot (Ch2)\", \"N/A - Do Not Use\")","v":"Bode Plot (Ch2)"},2]
[null,null,null,null,null,null,null,null,null,null,null,2,null,"TPSM63603 Fixed Vout",{"$f":"IF(AND(GPN=3,Vout=3.3),3,IF(AND(GPN=3,Vout=5),2,1))","v":1},"1 = No, 2 = 5V, 3 = 3.3V",null,null,null,"Single Output – 3  Phases",3,null,"FPWM/DEM",2,null,"BODE_PLOT_TYPE",1]
["Vout",{"$f":"'Design the Power Module'!E9","v":5},"V","Output voltage",null,null,null,null,null,null,"NO_FF_CAP",{"$f":"IF(L10=2, TRUE, FALSE)","v":true},null,null,{"$f":"AND(GPN=3, OR(O8,O9))","v":false},null,null,null,null,"Single Output – 4  Phases",4]
["Iout",{"$f":"'Design the Power Module'!E10","v":8},"A","Output current",null,"Iout-max",8,"A",1,null,null,null,null,null,null,null,null,null,null,"Single/Dual Yes/No",1]
[null,null,null,null,null,null,null,null,1,null,null,null,null,null,null,null,null,null,null,"MODE (Single/Dual), DUAL = 1, SINGLE = 2",{"$f":"IF(U12=1, 1, 2)","v":1},null,"External BIAS",1]
["Rout",{"$f":"Vout/Iout","v":0.625},"W","Load resistance",null,null,null,null,null,null,null,null,null,null,null,null,null,null,null,"SINGLE OUTPUT (1 = YES)",{"$f":"IF(U12=1, 2, 1)","v":2},null,"No External BIAS",2]
["Pout",{"$f":"Vout*Iout","v":40},"W","Output power",null,null,null,null,null,null,null,null,null,"TPSM63610 10A module",1,null,null,null,null,"Number of Phases",{"$f":"SCH_MODE","v":1},null,"Ext_VCC",1]
[null,null,null,null,null,null,null,null,null,null,null,null,null,"TPSM63608 8A module",2]
["Efficiency",0.9,null,"Estimate of efficiency",null,null,null,null,null,null,null,{"$f":"Vout","v":5},null,"TPSM63603 3A module",3]
["Pin",{"$f":"Pout/Efficiency","v":44.444444444444443},"W","Calculate input power assuming finite efficiency",null,null,null,null,null,null,null,null,null,"TPSM63602 2A module",4]
[null,null,null,null,null,null,null,null,null,null,null,"GPN",null,{"$f":"CHOOSE(GPN, \"TPSM63610\", \"TPSM63608\")","v":"TPSM63610"},1,null,null,null,null,null,null,null,"2.2 MHz Fsw Setting",1]
["Iin_Vinmin",{"$f":"Pin/VIN_min","v":3.7037037037037037},"A",null,null,null,null,null,null,null,null,null,null,null,null,null,null,null,null,null,null,null,"440 kHz Fsw Setting",2]
["Iin_Vinnom",{"$f":"Pin/VIN_nom","v":1.8518518518518519},"A","Input currents at min, nom, max Vin",null,null,null,{"$f":"AND(OSC=1, OR(Fsw/1000>2530, Fsw/1000<1800))","v":false},null,null,"Variant","VARIANT",null,{"$f":"CHOOSE(VARIANT, \"TPSM63610\", \"TPSM63608\")","v":"TPSM63610"},{"$f":"IF(AND(GPN=3,Vout=5),5,IF(AND(GPN=3,Vout=3.3),6,GPN))","v":1},null,null,null,null,null,null,null,"OSC",2]
["Iin_Vinmax",{"$f":"Pin/VIN_max","v":1.2345679012345678},"A",null,null,null,null,{"$f":"AND(OSC=2, OR(Fsw/1000>500, Fsw/1000<300))","v":true}]
[null,null,null,null,null,null,null,{"$f":"OR(H21,H22)","v":true}]
["Fsw",{"$f":"'Design the Power Module'!E11*1000","v":1000000},"Hz","Nominal switching frequency - determines RT resistor"]
["RT resistor to AGND",{"$f":"16.4/(Fsw/1000000)-0.633","v":15.766999999999999},"kΩ",null,null,null,null,null,1]
["Tsw",{"$f":"1/Fsw","v":9.9999999999999995E-7},"sec","Switching period"]
["Max crossover frequency = 20% Fsw",{"$f":"Fsw*0.2/1000","v":200},"kHz",null,null,"Min Crossover",10,null,null,null,"Adjustable",1]
["Vref",1,"V","Reference voltage",null,null,null,null,null,null,"5V",2]
["Rt",{"$f":"'Standard Value Calculator'!O12/1000","v":15.8},"kΩ","Frequency set resistor",null,{"$f":"IF(OR((Fsw=440000),(Fsw=2200000)),\"N/A\",Rfadj/1000)","v":1.5800000000000002E-2},null,null,null,null,"3.3V",3]
[null,null,null,null,null,null,null,null,null,null,"Adjustable_NoRT",4,null,null,"TPSM63603V5"]
[null,null,null,null,null,null,null,null,null,null,"5V_NoRT",5,null,null,"TPSM63603V3"]
[null,null,null,null,null,null,null,null,null,null,"3.3V_NoRT",6]
["Step 2: Buck Inductor","Channel 1",null,null,null,null,null,null,null,null,"Schematic setting",{"$f":"IF(No_RT, IF(Vout=3.3, 6, IF(Vout=5, 5, 4)),IF(Vout=3.3, 3, IF(Vout=5, 2, 1)))","v":5}]
["Don1",{"$f":"Vout/VIN_nom","v":0.20833333333333334},null,null,null,"Ideal Duty Cycle at VIN(nom)"]
["Doff1",{"$f":"1-34:34","v":0.79166666666666663},null,null,null,"Ideal 1- Duty Cycle at VIN(nom)"]
[]
["D_Vinmin",{"$f":"Vout/VIN_min","v":0.41666666666666669}]
["D_Vinnom",{"$f":"Vout/VIN_nom","v":0.20833333333333334}]
["D_Vinmax",{"$f":"Vout/VIN_max","v":0.1388888888888889},null,null,null,null,null,null,null,null,"Maylayer inductor for TPSM63610"]
[]
["L_Vinnom",{"$f":"(VIN_nom-Vout)*D1_Vinnom/(Fsw*Iout*0.35)","v":1.4136904761904762E-6},"H",null,null,"Calculated inductance for 35% ripple at VIN(nom)",null,null,null,null,"Current (A)","L (uH)"]
["L_slopecomp",null,"H",null,null,"Calculated inductance based on one times inductor downslope",null,null,null,null,0,2.2000000000000002]
[null,null,null,null,null,null,null,null,null,null,1,2.1800000000000002]
["Lopt",{"$f":"B41","v":1.4136904761904762E-6},"H",null,null,"min of calculated inductances at VIN(min) and VIN(nom)",null,null,null,null,2,2.15]
[null,null,null,null,null,null,null,null,null,null,3,2.1]
["L_actual_TPSM63610",{"$f":"-0.0031*Iout^2-0.0448*Iout+2.2257","v":1.6688999999999998},"uH",null,null,"Calculate MagLayers inductance based on entered load current value (8A)",null,null,null,null,4,2]
[null,null,null,null,null,null,null,null,null,null,5,1.9]
["Lo",{"$f":"B46*0.000001","v":1.6688999999999998E-6},"H",null,null,"Chosen inductance",null,null,null,null,6,1.8]
["Rdcr",1.32E-2,"W",null,null,"Chosen inductor DCR",null,null,null,null,7,1.75]
[null,null,null,null,null,null,null,null,null,null,8,1.7]
["Don2",{"$f":"(Vout+Iout*(Rdcr+Rdson2))/(Vin+Iout*(Rdson2-Rdson1))","v":0.21764705882352942}]
["Doff2",{"$f":"1-_Don2","v":0.78235294117647058}]
[]
["D_Vinmin_2",{"$f":"(Vout+Iout*(Rdcr+Rdson2))/(VIN_min+Iout*(Rdson2-Rdson1))","v":0.43646112600536191},null,{"$f":"Vout/VIN_min","v":0.41666666666666669},null,"Duty cycles adjusted for DCR/Rdson voltage drops"]
["D_Vinnom_2",{"$f":"(Vout+Iout*(Rdcr+Rdson2))/(VIN_nom+Iout*(Rdson2-Rdson1))","v":0.21764705882352942},null,{"$f":"Vout/VIN_nom","v":0.20833333333333334}]
["D_Vinmax_2",{"$f":"(Vout+Iout*(Rdcr+Rdson2))/(VIN_max+Iout*(Rdson2-Rdson1))","v":0.14496883348174533},null,{"$f":"Vout/VIN_max","v":0.1388888888888889},null,{"$f":"(Ts-0.000000085)/Ts","v":0.91499999999999992},"Dmax = [Ts-toff(min)]/Ts"]
[]
[]
["Iripple_Vinmin",{"$f":"(VIN_min-Vout-Iout*(Rdcr+Rdson1))*D1_Vinmin_2/(Fsw*Lf)","v":1.7591300365285318},"A",{"$f":"B59/Iout","v":0.21989125456606648},null,"Ripple calculations include DCR and Rdson"]
["Iripple_Vinnom",{"$f":"(VIN_nom-Vout-Iout*(Rdcr+Rdson1))*D1_Vinnom_2/(Fsw*Lf)","v":2.4421750148918102},"A",{"$f":"B60/Iout","v":0.30527187686147628},null,"% ripple current at Vin-nom"]
["Iripple_Vinmax",{"$f":"(VIN_max-Vout-Iout*(Rdcr+Rdson1))*D1_Vinmax_2/(Fsw*Lf)","v":2.6690456978210202},"A",{"$f":"B61/Iout","v":0.33363071222762752},null,"Max inductor ripple current - it's at Vin-max"]
[]
["Iinductor_rms_Vinmin",{"$f":"SQRT(Iout^2+(Iripple_Vinmin^2)/12)","v":8.0161011849351098},"A"]
["Iinductor_rms_Vinnom",{"$f":"SQRT(Iout^2+(Iripple_Vinnom^2)/12)","v":8.0310035632922911},"A"]
["Iinudctor_rms_Vinmax",{"$f":"SQRT(Iout^2+(Iripple_Vinmax^2)/12)","v":8.0370175072237711},"A"]
[null,null,null,null,"TPSM63604/06","TPSM63602/03","=> Result based on GPN"]
["Core loss estimate - Vin(min)",{"$f":"kcore*Iripple_Vinmin^kcore1*(Fsw/1000)^kcore2","v":0.17433962625626659},"W","kcore",5.9999999999999995E-8,{"$f":"0.000000042*0.5","v":2.0999999999999999E-8},{"$f":"CHOOSE(GPN, E67, E67, F67, F67)","v":5.9999999999999995E-8},"Core loss constant"]
["Core loss estimate - Vin(nom)",{"$f":"CHOOSE(GPN, kcore*Iripple_Vinnom^kcore1*(Fsw/1000)^kcore2, kcore*Iripple_Vinnom^kcore1*(Fsw/1000)^kcore2, 0.5*kcore*Iripple_Vinnom^kcore1*(Fsw/1000)^kcore2, 0.5*kcore*Iripple_Vinnom^kcore1*(Fsw/1000)^kcore2)","v":0.39590702674761175},"W","kcore1",2.5,2.5,{"$f":"CHOOSE(GPN, E68, E68, F68, F68)","v":2.5},"Ripple current exponent"]
["Core loss estimate - Vin(max)",{"$f":"kcore*Iripple_Vinmax^kcore1*(Fsw/1000)^kcore2","v":0.49435766736511144},"W","kcore2",1.95,1.95,{"$f":"CHOOSE(GPN, E69, E69, F69, F69)","v":1.95},"Fsw exponent"]
[null,null,null,"Pcore = kcore*(deltaI)^kcore1*(Fsw)^kcore2"]
[null,null,null,"Note: ** core loss for 2A/3A versions scaled by 50% for smaller 2520 core size**"]
[]
[]
[]
["Inductor copper temperature",125,"°C"]
["Inductor DCR at hot",{"$f":"Rdcr*(1+Ltc*(B75-25))*1000","v":18.387599999999999},"mW"]
[]
[]
["Step 2b: Sense Resistors, Slope Comp, Current Limit"]
[]
["Ilimit_inductor_Vinmin",{"$f":"Ipk_OCP","v":13.8},"A",null,null,"Peak inductor current at current limit inception"]
["Ilimit_inductor_Vinnom",{"$f":"Ipk_OCP","v":13.8},"A"]
["Ilimit_inductor_Vinmax",{"$f":"Ipk_OCP","v":13.8},"A"]
[]
["CS threshold_min",6.8000000000000005E-2,"V","not applicable here"]
["CS threshold",7.4999999999999997E-2,"V"]
["CS threshold_max",8.2000000000000003E-2,"V"]
[]
["Rs",2.1000000000000001E-2,"W",null,null,"Current sense resistance Rs = high-side MOSFET Rdson"]
[]
["Current limit setpoint - peak",13.8,"A",null,null,"Peak current limit (trimmed at ATE) = min inductor sat current at hot"]
[]
["Iout_OCP_Vinmin",{"$f":"Ipk_OCP-Iripple_Vinmin/2","v":12.920434981735735},"A",null,null,"Current limit setpoints (i.e. IOUT) assuming no CS delay"]
["Iout_OCP_Vinnom",{"$f":"Ipk_OCP-Iripple_Vinnom/2","v":12.578912492554096},"A"]
["Iout_OCP_Vinmax",{"$f":"Ipk_OCP-Iripple_Vinmax/2","v":12.465477151089491},"A"]
[]
["Ipk_full-load_Vinmin",{"$f":"Iout+Iripple_Vinmin/2","v":8.879565018264266},"A"]
["Ipk_full-load_Vinnom",{"$f":"Iout+Iripple_Vinnom/2","v":9.2210875074459047},"A"]
["Ipk_full-load_Vinmax",{"$f":"Iout+Iripple_Vinmax/2","v":9.3345228489105097},"A"]
[]
[]
["Step 3: Output Capacitor"]
["Icoutrms_VINmin",{"$f":"Iripple_Vinmin/SQRT(12)","v":0.50781710006465208},"A",null,null,"Output cap RMS current"]
["Icoutrms_VINnom",{"$f":"Iripple_Vinnom/SQRT(12)","v":0.70499520112798253},"A"]
["Icoutrms_VINmax",{"$f":"Iripple_Vinmax/SQRT(12)","v":0.77048712605818936},"A"]
["Max Cout rms current",{"$f":"MAX(B103:B105)","v":0.77048712605818936},"A"]
[]
["Vripple1",{"$f":"'Design the Power Module'!E22/1000","v":0.05},"V",null,null,"Output voltage ripple spec(pk-pk)"]
[]
["Output Ripple Spec (pk-pk)",{"$f":"Vo1_ripple*1000","v":50},"mV",null,null,"Vout ripple spec at Vin(nom)"]
[]
["Coutmin",{"$f":"Iripple_Vinnom/(Fsw*8*Vo1_ripple)","v":6.1054375372295257E-6},"F",null,null,"Minimum output capacitnace",null,{"$f":"Vo2_ripple","v":0},1]
["Reported Coutmin",{"$f":"IF(Cout_min*1000000<2, 2.2,Cout_min*1000000)","v":6.105437537229526},"uF"]
["Cout",{"$f":"'Design the Power Module'!E26/1000000","v":7.2000000000000002E-5},"F",null,null,"Chosen output capacitance",null,null,1]
["Resrmax",{"$f":"SQRT((Vo1_ripple/Iripple_Vinnom)^2-(1/(Fsw*Cout*8))^2)","v":2.0399811207844388E-2},"W",null,null,"Max ESR before ripple exceeds Vripple1",null,null,1]
[]
["Reported Cout ESR max",{"$f":"IF(OR(CoutEsrMax>0.3, CoutEsrMax<0, (ISERROR(CoutEsrMax))), \"N/A\", CoutEsrMax*1000)","v":20.399811207844387},"mΩ"]
["CoutEsr",{"$f":"'Design the Power Module'!E28/1000","v":2E-3},"W",null,null,"Chosen ESR",null,null,1,null,{"$f":"ISERROR(CoutEsrMax)","v":false},{"$f":"ISERROR(B117)","v":false}]
["Vripple",{"$f":"Iripple_Vinnom*SQRT(Cout_ESR^2+(1/(8*Fsw*Cout))^2)","v":6.4678836183849203E-3},"Vp-p",null,null,null,null,null,null,null,null,{"$f":"OR(CoutEsrMax>0.3,CoutEsrMax<0)","v":false}]
[null,null,null,null,null,null,null,null,null,null,{"$f":"OR(TRUE, FALSE, TRUE)","v":true}]
["Step 4: Input Capacitor"]
[]
["Icinrms_VINmin",{"$f":"SQRT(D1_Vinmin_2*(Iout^2*(1-D1_Vinmin_2)+Iripple_Vinmin^2/12))","v":3.9817299943751312},"A",null,null,"Calculate input cap rms current",null,null,null,null,null,null,null,"A"]
["Icinrms_VINnom",{"$f":"SQRT(D1_Vinnom_2*(Iout^2*(1-D1_Vinnom_2)+Iripple_Vinnom^2/12))","v":3.3175127459745228},"A"]
["Icinrms_VINmax",{"$f":"SQRT(D1_Vinmax_2*(Iout^2*(1-D1_Vinmax_2)+Iripple_Vinmax^2/12))","v":2.831791754152079},"A"]
["Max Cin rms current",{"$f":"MAX(B123:B125)","v":3.9817299943751312},"A"]
[]
["Icinrms - max at D = 0.5",{"$f":"Iout/2","v":4},"A"]
["Final result",{"$f":"IF(VIN_min<2*Vout, Iout/2, B123)","v":3.9817299943751312},"A","…report this"]
[]
["Vinripple1",{"$f":"'Design the Power Module'!E33/1000","v":0.15},"Vp-p",null,null,"Input voltage ripple spec (pk-pk)"]
[null,null,null,null,null,{"$f":"Number_of_Phases","v":1}]
["Cinmin_Vinmax",{"$f":"Iout*D1_Vinmax*(1-D1_Vinmax)/(Vinripple1*Fsw)","v":6.3786008230452683E-6},"F",null,null,"Calculate cap at Vinmax and 50% duty cycle (Vin = 2*Vout)"]
["Cinmin_50%D",{"$f":"Iout*0.5*(1-0.5)/(Vinripple1*Fsw)","v":1.3333333333333333E-5},"F",null,null,"Buck 50% typically worst case"]
["Cinmin",{"$f":"IF(VIN_max<2*Vout, B133,B134)","v":1.3333333333333333E-5},"F"]
["Reported Cinmin",{"$f":"IF(Cinmin*1000000<4.7, 4.7,Cinmin*1000000)","v":13.333333333333334},"uF",null,null,"…report this"]
["Cin",{"$f":"'Design the Power Module'!E35/1000000","v":2.5000000000000001E-5},"F",null,null,"Input capacitance"]
["CinEsrMax_Vinmax",{"$f":"-(Iout*D1_Vinmax*(1-D1_Vinmax)/(Cin*Fsw)-Vinripple1)/(Iout+Iripple_Vinmax/2)","v":1.1969373996954637E-2},"W"]
["CinEsrMax_50%D",{"$f":"-(Iout*0.5*(1-0.5)/(Cin*Fsw)-Vinripple1)/(Iout+Iripple_Vinmax/2)","v":7.4990442610754476E-3},"W",null,null,"Calculate ESR at Vinmax and 50% duty cycle (Vin = 2*Vout)"]
["CinEsrMax",{"$f":"IF(VIN_max<2*Vout, B138,B139)","v":7.4990442610754476E-3},"W"]
["Reported Cin ESR max",{"$f":"IF(OR(CinEsrMax>0.3, CinEsrMax<0), \"N/A\",CinEsrMax*1000)","v":7.499044261075448},"mΩ",null,null,"…report this"]
["RCinEsr",{"$f":"'Design the Power Module'!E37/1000","v":1E-3},"W",null,null,"Input capacitance series resistance (ESR)"]
[]
["Vinripple2_Vinmax",{"$f":"Iout*D1_Vinmax_2*(1-D1_Vinmax_2)/(Cin*Fsw)+(Iout +Iripple_Vinmax/2)*RCinEsr","v":4.8999441505130449E-2},"Vp-p"]
["Vinripple2_50%D",{"$f":"Iout*0.5*(1-0.5)/(Cin*Fsw)+(Iout +Iripple_Vinmax/2)*RCinEsr","v":8.9334522848910511E-2},"Vp-p",null,null,"Calculate ripple at Vinmax and 50% duty cycle (Vin = 2*Vout)"]
["Vinripple2",{"$f":"IF(VIN_max<2*Vout, B144,B145)","v":8.9334522848910511E-2},"Vp-p",null,null,"…report highest of these"]
[]
[null,{"$f":"Iout*D1_Vinmax_2*(1-D1_Vinmax_2)/(Cin*Fsw)","v":3.966491865621994E-2},"Vp-p"]
[]
["Step ?: Other Components - MODE"]
[]
["RPG1/2",100,"kΩ"]
["RFB1/2",null,"W",null,"Tie to VDDA or AGND for 3.3V/5V output, respectively. "]
["R_MODE",null,"W",null,"Tie to VDDA or AGND for Single/Dual operation, respectively. "]
["R_DEMB",null,"W",null,"Tie to VDDA or AGND for FPWM/DEM, respectively. "]
[]
[]
["Step 5: Feedback Network and Internal Compensation"]
["Pi",3.1415926500000002,null,"p"]
["CS Amp Gain (effective value)",3.4140000000000001,null,null,null,"Effective CS gain - depending on control architecture"]
["Ri",{"$f":"(6000)*(0.000019)","v":0.114},"W",null,null,"Current Sense effective resistance = shunt resistor Rs * CS amp gain = 6k * 19e-6"]
[]
["Se_ext",{"$f":"B167/Ri*1000","v":2791068.5805422645},"A/s",null,null,"Slope Comp Slope - referred to inductor current"]
["Sn",{"$f":"(Vin-Vout)/Lf","v":11384744.442447122},"A/s",null,null,"On-time Slope"]
["Sf",{"$f":"Vout/Lf","v":2995985.3795913481},"A/s",null,null,"Off-time Slope"]
[]
["Se_int",{"$f":"Fsw/220*70/1000","v":318.18181818181819},"mV/μs",null,null,"Slope Comp Slope - referred to IC"]
["Sn_int",{"$f":"Sn*Ri/1000","v":1297.8608664389722},"mV/μs",null,null,"Upslope"]
["Sf_int",{"$f":"Sf*Ri/1000","v":341.5423332734137},"mV/μs",null,null,"Downslope"]
[]
["mc_buck",{"$f":"1+Se_ext/Sn","v":1.2451586502140519},null,null,null,"mc = 1 + Se/Sn for peak current-mode buck"]
["k_buck",{"$f":"mc_buck*(1-D1_Vinnom_2)","v":0.97415353222628764},null,null,null,"mc*(1-d)"]
[]
["mc",{"$f":"1+Se_ext/Sn","v":1.2451586502140519}]
["k",{"$f":"mc_buck*(1-D1_Vinnom_2)","v":0.97415353222628764}]
["Q",{"$f":"1/Pi/(k-0.5)","v":0.67132239857616582},null,null,null,"1/(Pi*(k-0.5))",null,"Q = 2/Pi = 0.636 gives ideal one-cycle damping"]
[]
["Error Amp (EA)"]
["gm",{"$f":"0.000015","v":1.5E-5},"S",null,null,"Error Amp Transconductance"]
["GBW",6,"MHz",null,null,"EA gain-bandwidth product"]
["Cbw",{"$f":"gm/(2*Pi*GBW*1000000)","v":3.9788735818439092E-13},"F",null,null,"EA effective bandwidth limiting capacitance = gm/(2*Pi*GBW)"]
[]
["RoEA",{"$f":"1210/(0.00001023)","v":118279569.89247312},"W",null,null,"EA output resistance"]
["AEA",{"$f":"gm*RoEA","v":1774.1935483870968},"V/V",null,null,"EA DC gain = gm*RoEA"]
["Afb",{"$f":"Vref/Vout","v":0.2},"V/V",null,null,"Feedback gain from Vout to FB"]
["Acs",{"$f":"1/Ri","v":8.7719298245614024},null,null,null,"Acs = 1/Ri"]
["Am_buck",{"$f":"(Ro/Number_of_Phases)/Ri/((1+Ro/Number_of_Phases*(k-0.5)/(Fsw*Lf)))","v":4.6557383909403702}]
["Am",{"$f":"Ro/Ri/((1+Ro*(k-0.5)/(Fsw*Lf)))","v":4.6557383909403702},null,null,null,"Buck modulator gain"]
[]
["Scaling factor to calculate Rcomp - buck",{"$f":"2*Pi*Ri/gm","v":47752.208280000006},null,null,null,"2*Pi*Ri/gm -- scaling factor to calculate Rcomp given desired buck crossover frequency"]
["DC Gain is Adc = AEA*Afb*Am"]
[]
["Rout",{"$f":"Rout","v":0.625},"W",null,null,"Output Resistance (Load)"]
[]
["Fp_load_buck",{"$f":"1/(2*Pi*Ro*Cout)+(k-0.5)/(2*Pi*Fsw*Lf*Cout)","v":4164.8006192688572},"Hz",null,null,"Buck dominant pole frequency -- note slope comp influence"]
["Fp_dominant",{"$f":"Fload_u","v":4164.8006192688572},"Hz"]
["Cbw",{"$f":"Cbw","v":3.9788735818439092E-13},"F",null,null,"Cbw"]
["Fp_EA",{"$f":"1/(2*Pi*(RoEA+Rcea1_u)*Cc1ea_u)","v":72.280703527320554},"Hz",null,null,"Error Amp LF pole -- related to amplifier ouptut resistance and comp cap"]
["Fp_HF",{"$f":"1/(2*Pi*Rcea1_u*(Cc2ea_u+Cbw))","v":177254.91045511764},"Hz",null,null,"Error Amp HF pole cancels zero related to Output Cap ESR"]
["Fesr",{"$f":"1/(2*Pi*Cout*Cout_ESR)","v":1105242.6616233082},"Hz",null,null,"Cout ESR zero frequency"]
["F_mod",{"$f":"Fsw/2","v":500000},"Hz",null,null,"Zero-order sample-and-hold effects of current-mode control modeled as double pole at Fsw/2"]
["Fz_ff",{"$f":"IF(NO_FF_CAP=TRUE, 1000000000, 1/(2*Pi*Rfb2_u*Cff_u*0.000000000001))","v":1000000000},"Hz"]
["Fp_ff",{"$f":"IF(NO_FF_CAP=TRUE, 1000000000, 1/(2*Pi*Rfb4_u*Cff_u*0.000000000001))","v":1000000000},"Hz"]
[]
["Desired Crossover Frequency",{"$f":"'Design the Power Module'!E24*1000","v":50000},"Hz"]
["Cout - for the Fc spec",{"$f":"Rcea1_u/Fcross/(2*Pi*Ri/(gm*Afb))*1000000","v":83.765759617766506},"uF",null,null,"Output cap to meet the crossover frequeny spec"]
["Rcea1",{"$f":"Fcross*Cout*2*Pi*Ri/(gm*Afb)","v":859539.74904000026},"W",null,null,"This component will largely determine the crossover frequency",null,null,null,null,{"$f":"Fcross/Fp_dominant/(gm*Afb*Am)","v":859539.74904000002}]
["Cc1ea, Cc3ea",{"$f":"10/(Rcea1*Fcross*2*Pi)","v":3.7032596445135381E-11},"F",null,null,"This along with Rcea1 will set a zero at Fcrossover/5 to optimize phase margin"]
["Cc2ea, Cc4ea",{"$f":"MAX(1/(Rcea1*2*Pi*Fesr)-Cbw, 1/(Rcea1*2*Pi*(Fsw/2))-Cbw)","v":-2.7561393733037075E-14},"F",null,null,"This along with Rcea1 places a pole at the output cap ESR zero"]
[]
[]
["Rcea1_u",1000000,"W",null,null,{"$f":"1/(Rcea1*2*Pi*(Fsw/2))-Cbw","v":-2.7561393733037075E-14}]
["Cc1ea_u",1.846E-11,"F"]
["Cc2ea_u",4.9999999999999999E-13,"F"]
[]
["Resulting Pole/Zero Locations",null,null,null,null,{"$f":"Cout","v":7.2000000000000002E-5},{"$f":"Cout_ESR","v":2E-3}]
["Fz1",{"$f":"1/(2*Pi*Rcea1_u*Cc1ea_u)","v":8621.6112282641589},"Hz",null,null,"This zero is set at or close to the dominant load pole"]
["Fp2",{"$f":"1/(2*Pi*Rcea1_u*(Cc1ea_u*(Cc2ea_u+Cbw)/(Cc1ea_u+Cc2ea_u+Cbw)))","v":185876.52168338181},"Hz",null,null,"This pole cancels the zero from the Output Cap ESR"]
[]
["Rfb1",{"$f":"'Design the Power Module'!E42*1000","v":100000},"W",null,null,"Upper Feedback Resistance - chosen by user"]
["Rfb2",{"$f":"IF(Vout=Vref,0,(((Vref/Vout)*B220)/(1-(Vref/Vout))))","v":25000},"W",{"$f":"Rfb2_u","v":24900},null,"Lower Feedback Resistance"]
["Rfb2_u",{"$f":"IF(Vout=Vref,\"N/A\",'Standard Value Calculator'!O11)","v":24900},"W",null,null,"Std Value Upper Feedback Resistance"]
["Cff",{"$f":"1/(2*Pi*200000)/Rfb1_","v":7.9577471636878189E-12},"F",{"$f":"1/(1/Rfb1_+1/Rfb2_u)","v":19935.948759007206},"W","Based on a 200kHz zero frequency"]
["Cff_u",{"$f":"IF('Design the Power Module'!E44<0.1, 0.1, 'Design the Power Module'!E44)","v":10},"pF"]
[]
[]
["Step 6: UVLO Divider"]
["VIN UVLO turn-on voltage",{"$f":"'Design the Power Module'!E47","v":6},"V"]
["VIN UVLO turn-off voltage",{"$f":"'Design the Power Module'!E51","v":4.3171820440881756},"V"]
["Rent",{"$f":"'Design the Power Module'!E48*1000","v":187000},"W"]
["Renb",{"$f":"B230*(1.263/(B228-1.263))","v":49858.771374287513},"W"]
["Renb_u",{"$f":"'Standard Value Calculator'!O7","v":49900},"W"]
[]
["Step 7: Efficiency"]
["VAR",0]
["Design"]
["Ta",{"$f":"'Design the Power Module'!E13","v":25},"°C","Ambient Temperature"]
["Components"]
["LTc",{"$f":"3930/1000000","v":3.9300000000000003E-3},"%/°C","Inductor DCR Temp Co"]
["θCA",22,"°C/W","Inductor Core-to-Ambient Thermal Resistance"]
["RCinEsr",{"$f":"RCinEsr","v":1E-3},"W","Input Capacitor ESR"]
[]
["Controller Characteristics"]
["VCC",3.3,"V"]
["Top Driver"]
["RdsonDRT",0.5,"W","Drain-Source Resistance of Pullup High-side FET Driver"]
["RdsonDRT2",0.5,"W","Drain-Source Resistance of Pulldown High-side FET Driver"]
["Bottom Driver"]
["RdsonDRB",0.5,"W","Drain-Source Resistance of Pullup Low-side FET Driver"]
["RdsonDRB2",0.5,"W","Drain-Source Resistance of Pulldown Low-side FET Driver"]
["Deadtime"]
["Deadtime",8.0000000000000005E-9,"s","Total Deadtime",null,null,"8ns"]
["IQ"]
["IQ ",3.4999999999999997E-5,"A","Quiescent Current of LM5143-Q1 Controller (One channel disabled)"]
[]
["High- & low-side MOSFETs - Ch1","Q1: high-side",null,"Q2: low-side"]
["Rdson",{"$f":"'MOSFET Parameters'!E6/1000","v":2.1000000000000001E-2},"W",{"$f":"'MOSFET Parameters'!F6/1000","v":1.2999999999999999E-2},"W","Drain-Source Resistances of Channel 1 FETs"]
["RdsonTopTc",{"$f":"4000/1000000","v":4.0000000000000001E-3},"%/°C",4.0000000000000001E-3,"%/°C","Drain-Source Resistance Temp Co"]
["Qg",{"$f":"'MOSFET Parameters'!E7/1000000000","v":6E-9},"C",{"$f":"'MOSFET Parameters'!F7/1000000000","v":1.2E-8},"C","Gate Charge at VCC = 5V"]
["Qgd",{"$f":"'MOSFET Parameters'!E8/1000000000","v":2.0000000000000001E-9},"C",{"$f":"'MOSFET Parameters'!F8/1000000000","v":4.0000000000000002E-9},"C","Gate to Drain Charge"]
["Qgs",{"$f":"'MOSFET Parameters'!E9/1000000000","v":2.0000000000000001E-9},"C",{"$f":"'MOSFET Parameters'!F9/1000000000","v":4.0000000000000002E-9},"C","Gate to Source Charge"]
["Qoss",{"$f":"'MOSFET Parameters'!E10/1000000000","v":0},"C",{"$f":"'MOSFET Parameters'!F10/1000000000","v":4.0000000000000002E-9},"C","Output Charge"]
["Coss",{"$f":"'MOSFET Parameters'!E11/1000000000000","v":2.0000000000000001E-10},"F",{"$f":"'MOSFET Parameters'!F11/1000000000000","v":4.0000000000000001E-10},"F","Output Capacitance"]
["Rgate",{"$f":"'MOSFET Parameters'!E12","v":1},"W",{"$f":"'MOSFET Parameters'!F12","v":1},"W","Gate Resistance"]
["Gfs",{"$f":"'MOSFET Parameters'!E13","v":100},"S",{"$f":"'MOSFET Parameters'!F13","v":100},"S","Transconductance"]
["Vth",{"$f":"'MOSFET Parameters'!E14","v":1.5},"V",{"$f":"'MOSFET Parameters'!F14","v":1.5},"V","Threshold Voltage"]
["Vsp",{"$f":"Vth_Q1+(Iout/Number_of_Phases)/Gfs_Q1","v":1.58},"V",{"$f":"Vth_Q2+Iout/Gfs_Q2","v":1.58},"V","Switch Point Voltage of FETs"]
[]
["Vsd - Buck",{"$f":"'MOSFET Parameters'!E15","v":0.7},"V",{"$f":"'MOSFET Parameters'!F15","v":0.7},"V","Diode Forward Voltage of MOSFET Body diode"]
["QrrTop",null,"C",{"$f":"'MOSFET Parameters'!F16/1000000000","v":3E-9},"C","Reverse Recovery Charge of Body Diode"]
["TrrTop",4.0000000000000001E-8,"s",4.0000000000000001E-8,"s","Reverse Recovery Time of Body Diode"]
["θJA-MOSFET",{"$f":"'MOSFET Parameters'!E17","v":22},"°C/W",{"$f":"'MOSFET Parameters'!F17","v":22},"°C/W","Junction-to-Ambient Thermal Resistance"]
[]
[]
["Controller"]
["θJACtrl",18,"°C/W",null,null,"Junction-to-ambient thermal resistance of controller"]
["Outputs"]
["Top FET"]
["Tr",{"$f":"(Qgd_Q1+Qgs_Q1/2)*(RdsonDRT+Rgate1)/(VCC-Vsp_Q1)","v":2.6162790697674425E-9},"s"]
["Tf",{"$f":"(Qgd_Q1+Qgs_Q1/2)*(RdsonDRT2+Rgate1)/(Vsp_Q1)","v":2.8481012658227853E-9},"s"]
[]
["IC Power Disipation","Value","Units"]
["Power Dis",{"$f":"'Efficiency Calculations'!AT109","v":3.5813332386009749},"W"]
["Temp rise",{"$f":"B283*ThetaJaCtrl","v":64.463998294817543},"°C"]
["Junction temperature",{"$f":"B284 + Ta","v":89.463998294817543},"°C"]
[]
["Current (switching)",{"$f":"(Qg_Q1+Qg_Q2)*Fsw+Iq","v":1.8034999999999999E-2},"A"]
["Qrr Current",{"$f":"Qrr_Q2*Fsw","v":3.0000000000000001E-3},"A"]
[]
[]
[]
["Low-side MOSFET/Diode"]
["Part Power"]
["Power Dis"]
[]
["SCHEMATIC LABELS"]
[{"$f":"\"RFBT = \"&'Design the Power Module'!E43&\"kΩ\"","v":"RFBT = 24.9kΩ"},{"$f":"IF(VARIANT<5, 'Design the Power Module'!E43&\" kΩ\", \"\")","v":"24.9 kΩ"},null,{"$f":"'Design the Power Module'!E43&\"kΩ\"","v":"24.9kΩ"}]
[{"$f":"\"RFBB = \"&'Design the Power Module'!E42&\"kΩ\"","v":"RFBB = 100kΩ"},{"$f":"IF(VARIANT<5, 'Design the Power Module'!E42&\" kΩ\", \"\")","v":"100 kΩ"},null,{"$f":"'Design the Power Module'!E42&\"kΩ\"","v":"100kΩ"}]
[{"$f":"\"CFF = \"&'Design the Power Module'!E44&\"pF\"","v":"CFF = 10pF"},{"$f":"IF(VARIANT< 5, IF(NO_FF_CAP=TRUE,\"N/A\",IF(Cff_u>0.1,ROUND(Cff_u,1)&\" pF\",\"N/A\")), \"\")","v":"N/A"},null,{"$f":"IF(Cff_u>0, ROUND(Cff_u,1), \"N/A\")","v":10}]
[]
[{"$f":"\"RRT = \"&'Design the Power Module'!E12&\"kΩ\"","v":"RRT = 15.8kΩ"},{"$f":"'Design the Power Module'!E12&\" kΩ\"","v":"15.8 kΩ"},null,{"$f":"'Design the Power Module'!E12&\"kΩ\"","v":"15.8kΩ"}]
[{"$f":"\"RENT = \"&'Design the Power Module'!E48&\"kΩ\"","v":"RENT = 187kΩ"},{"$f":"'Design the Power Module'!E48&\" kΩ\"","v":"187 kΩ"},null,{"$f":"'Design the Power Module'!E48","v":187}]
[{"$f":"\"RENB = \"&Renb_u/1000&\"kΩ\"","v":"RENB = 49.9kΩ"},{"$f":"Renb_u/1000&\" kΩ\"","v":"49.9 kΩ"},null,{"$f":"Renb_u/1000","v":49.9}]
["RPG",{"$f":"CONCATENATE(100,\" kΩ\")","v":"100 kΩ"}]
[{"$f":"\"Lo = \"&'Design the Power Module'!#REF!&\"µH\"","v":{"$error":"#REF!"}},{"$f":"'Design the Power Module'!#REF!&\" µH\"","v":{"$error":"#REF!"}},null,{"$f":"IF(MODE = 1, 'Design the Power Module'!J31&\"µH\", 'Design the Power Module'!#REF!&\"µH\")","v":"µH"}]
[{"$f":"\"Rdcr = \"&Rdcr*1000&\"mΩ\"","v":"Rdcr = 13.2mΩ"},{"$f":"Rdcr*1000&\"mΩ\"","v":"13.2mΩ"},null,{"$f":"IF(MODE=1, Rdcr2*1000&\"mΩ\", Rdcr*1000&\"mΩ\")","v":"0mΩ"}]
[]
[{"$f":"\"VOUT = \"&'Design the Power Module'!E9&\" V\"","v":"VOUT = 5 V"},{"$f":"'Design the Power Module'!E9&\" V\"","v":"5 V"},null,{"$f":"IF(MODE=1, 'Design the Power Module'!J10&\"V\", \"\")","v":"V"}]
[]
[{"$f":"\"COUT = \"&'Design the Power Module'!$E$26&\" µF\"","v":"COUT = 72 µF"},{"$f":"ROUND('Design the Power Module'!$E$26, 0)&\" µF\"","v":"72 µF"},null,{"$f":"IF(MODE=1, 'Design the Power Module'!$J$40&\"µF\", ROUND('Design the Power Module'!$E$26/Number_of_Phases, 0)&\"µF\")","v":"µF"}]
["Capacitance per component (Cout)",{"$f":"\"22µF\"","v":"22µF"}]
["# of output caps",{"$f":"ROUNDUP(Cout*1000000/22,0)&\" x\"","v":"4 x"}]
[]
["CIN",{"$f":"Cin/2*1000000&\" µF\"","v":"12.5 µF"},{"$f":"Cin*1000000&\" µF\"","v":"25 µF"}]
["Capacitance per component (Cin)",{"$f":"\"10 µF\"","v":"10 µF"}]
["# of input caps",{"$f":"ROUNDUP(Cin*1000000/10,0)&\" x\"","v":"3 x"}]
[]
[{"$f":"\"CVCC = 1µF\"","v":"CVCC = 1µF"},{"$f":"CHOOSE(GPN, \"\", \"\", \"1 µF\", \"1 µF\")","v":""},null,{"$f":"IF(MODE=1, 'Design the Power Module'!$J$40&\"µF\", ROUND('Design the Power Module'!$E$26/Number_of_Phases, 0)&\"µF\")","v":"µF"}]
[]
[{"$f":"\"RC1 = \"&Rcea1_u/1000&\"kΩ\"","v":"RC1 = 1000kΩ"},{"$f":"ROUND(Rcea1_u/1000,2)&\" kΩ\"","v":"1000 kΩ"}]
[{"$f":"\"CC1 = \"&Cc1ea_u*10^9&\"nF\"","v":"CC1 = 0.01846nF"},{"$f":"Cc1ea_u*10^9&\" nF\"","v":"0.01846 nF"}]
[{"$f":"\"CC2 = \"&IF(Cc2ea_u>0, Cc2ea_u*10^12&\"pF\", \"OPEN\")","v":"CC2 = 0.5pF"},{"$f":"IF(Cc2ea_u>0, ROUND(Cc2ea_u*10^12,1)&\" pF\", \"N/A\")","v":"0.5 pF"}]
[]
[{"$f":"\"gm = \"&$B$179*1000&\"mS\"","v":"gm = 0.015mS"},{"$f":"$B$179*1000&\"mS\"","v":"0.015mS"}]
[{"$f":"\"RoEA = \"&RoEA/1000000&\"MΩ\"","v":"RoEA = 118.279569892473MΩ"},{"$f":"RoEA/1000000&\"MΩ\"","v":"118.279569892473MΩ"}]
[{"$f":"\"GBW = \"&GBW&\"MHz\"","v":"GBW = 6MHz"},{"$f":"GBW&\"MHz\"","v":"6MHz"}]
[]
[{"$f":"\"RPGOOD = 100 kΩ\"","v":"RPGOOD = 100 kΩ"},{"$f":"CHOOSE(GPN, \"100 kΩ\", \"100 kΩ\", \"\", \"\")","v":"100 kΩ"}]
[{"$f":"\"RFB2 = \"&'Design the Power Module'!E42&\"kΩ\"","v":"RFB2 = 100kΩ"},{"$f":"IF(VOUT_setting=1, 'Design the Power Module'!E42&\"kΩ\", \"\")","v":{"$error":"#NAME?"}},null,{"$f":"'Design the Power Module'!#REF!&\"kΩ\"","v":{"$error":"#REF!"}}]
[{"$f":"\"RFB1 = \"&IF(Vout=Vref,\"OPEN\",'Design the Power Module'!E43&\"kΩ\")","v":"RFB1 = 24.9kΩ"},{"$f":"IF(VOUT_setting=1, IF(Vout=Vref,\"OPEN\",Rfb2_u/1000&\"kΩ\"), \"\")","v":{"$error":"#NAME?"}},null,{"$f":"IF(Vout2=Vref,\"OPEN\",Rfb4_u/1000&\"kΩ\")","v":"19.9359487590072kΩ"}]
[{"$f":"CHOOSE(BODE_PLOT_TYPE, \"Crossover Frequency = \"&ROUND('Stability Calculations'!Q4,1)&\" kHz\",  \"Crossover Frequency = \"&ROUND(#REF!,1)&\" kHz\")","v":"Crossover Frequency = 55.3 kHz"},{"$f":"CHOOSE(BODE_PLOT_TYPE, ROUND('Stability Calculations'!Q4,1)&\" kHz\", ROUND(#REF!,1)&\" kHz\")","v":"55.3 kHz"},null,{"$f":"'Stability Calculations'!Q4","v":55.274000000000001}]
[{"$f":"CHOOSE(BODE_PLOT_TYPE, \"Phase Margin = \"&ROUND('Stability Calculations'!Q5,0)&\"°\", \"Phase Margin = \"&ROUND(#REF!,0)&\"°\")","v":"Phase Margin = 52°"},{"$f":"CHOOSE(BODE_PLOT_TYPE, ROUND('Stability Calculations'!Q5,0)&\"°\", ROUND(#REF!,0)&\"°\")","v":"52°"}]
[]
["Full-load/high line efficiency",{"$f":"ROUND('Efficiency Calculations'!AZ109,1)&\"%\"","v":"91.8%"}]
["Half-load/mid-line efficiency",{"$f":"ROUND('Efficiency Calculations'!AZ59,1)&\"%\"","v":"93.5%"}]
[]
[]
["Rpgood","100 kΩ"]
[]
[]
["Rt",{"$f":"IF(No_RT,\"\", Rfadj&\"kΩ\")","v":""},{"$f":"Rfadj","v":15.8},{"$f":"Fsw","v":1000000},{"$f":"'Design the Power Module'!K85&\"kΩ\"","v":"kΩ"},{"$f":"OR((Fsw=440000),(Fsw=2200000))","v":false},null,{"$f":"OR(OR(AND(OSC=1, OR(Fsw/1000>2530, Fsw/1000<1800)), AND(OSC=2, OR(Fsw/1000>500, Fsw/1000<300))), OR((Fsw=440000),(Fsw=2200000)))","v":true}]
[]
["Blank out",{"$f":"IF(B80=\"y\",\"\",\"|\")","v":"|"}]
["OUTPUT CURRENT",{"$f":"'Design the Power Module'!$E$10&\" A\"","v":"8 A"},null,{"$f":"IF(MODE=1,'Design the Power Module'!$J$11&\"A\",\"\")","v":"A"}]
["VIN",{"$f":"VIN_nom&\" V\"","v":"24 V"}]
["VIN range",{"$f":"VIN_min&\" V\"&\"...\"&VIN_max&\" V\"","v":"12 V...36 V"}]
["RMODE",49.9,{"$f":"B347&\" kΩ\"","v":"49.9 kΩ"}]
["RSPSP",{"$f":"ROUNDUP(14.17*(VIN_nom / Vout)/(((VIN_nom - Vout)/((Iout*(0.0000022)*Fsw)))+1.22),1)","v":29.6},{"$f":"B348&\" kΩ\"","v":"29.6 kΩ"}]

{"sheet":"Sheet1","index":3,"n_rows":0,"n_cols":0,"rows_kept":0,"cut":false,"hidden":false,"merged":[]}

{"sheet":"MOSFET Parameters","index":4,"n_rows":17,"n_cols":7,"rows_kept":17,"cut":false,"hidden":false,"merged":[]}
[]
[]
["MOSFET Parameters"]
[null,null,null,null,"Internal Power MOSFETs"]
[null,null,null,null,"High-side","  Low-side"]
[null,null,null,"On-State Resistance, RDS(on) ",21,13,"mΩ"]
[null,null,null,"Total Gate Charge, QG ",6,12,"nC"]
[null,null,null,"Gate-Drain Charge, QGD ",2,4,"nC"]
[null,null,null,"Gate-Source Charge, QGS ",2,4,"nC"]
[null,null,null,"Output Charge, QOSS ",null,4,"nC"]
[null,null,null,"Output Capacitance, COSS ",200,400,"pF"]
[null,null,null,"Gate Resistance, RGATE ",1,1,"Ω"]
[null,null,null,"Transconductance, gFS ",100,100,"S"]
[null,null,null,"Gate-Source Miller Plateau Voltage, VTH ",1.5,1.5,"V"]
[null,null,null,"Body Diode Forward Voltage, VBD ",0.7,0.7,"V"]
[null,null,null,"Body Diode Rev Recovery Charge, QRR ",null,3,"nC"]
[null,null,null,"Thermal Resistance, θJA ",22,22,"°C/W"]

{"sheet":"Schematic Management","index":5,"n_rows":15,"n_cols":14,"rows_kept":15,"cut":false,"hidden":false,"merged":[]}
[{"$f":"VARIANT","v":1},null,null,null,null,null,null,null,null,null,null,null,null,"3.3V or 5V fixed (FB1/2)"]
[{"$f":"CHOOSE(VARIANT, \"TPSM63606\", \"TPSM63604\", \"TPSM63603\", \"TPSM63602\", \"TPSM63603V5\", \"TPSM63603V3\")","v":"TPSM63606"},null,null,null,null,null,null,null,null,"With/without dither (DITH)",null,null,null,"With/without VOUT connected to VCCX"]
[null,null,null,null,null,null,null,null,null,"FPWM or DEM (DEMB)"]
[null,null,null,null,null,null,null,null,null,"Shunt or inductor DCR current sensing"]
[]
[]
[]
[]
[]
[]
[]
[]
[]
[]
[null," "]

{"sheet":"Stability Calculations","index":6,"n_rows":687,"n_cols":35,"rows_kept":687,"cut":false,"hidden":true,"merged":[[9,1,10,1],[1,0,1,3],[1,9,1,11],[1,12,1,14],[9,0,11,0],[10,6,10,7],[1,4,1,6],[9,2,9,7],[9,8,9,13],[10,2,10,3],[10,4,10,5],[10,8,10,9],[10,10,10,11],[10,12,10,13],[9,20,9,22],[10,14,10,15],[10,16,10,17],[9,27,9,28],[9,30,9,31],[10,18,10,19],[9,18,9,19]]}
[]
["Divider Network & EA Poles/Zeros",null,null,null,"Modulator",null,null,null,null,"Power Stage Poles/Zeros",null,null,"Complex Pole Pair",null,null,"Total System"]
[null,"Afb1",{"$f":"Afb","v":0.2},"V/V","Acs",{"$f":"Acs","v":8.7719298245614024},"A/V","gm",{"$f":"gm","v":1.5E-5},"z_ESR",{"$f":"Fesr","v":1105242.6616233082},"Hz","p3",{"$f":"Fsw/2","v":500000},"Hz","Adc",{"$f":"Am*Afb*AEA","v":1652.0362032369057},"V/V"]
[null,"EA zero, z1",{"$f":"Fz1_u","v":8621.6112282641589},"Hz","Am",{"$f":"Am","v":4.6557383909403702},"V/V",null,null,"p_dom",{"$f":"Fp_dominant","v":4164.8006192688572},"Hz","pterm1",{"$f":"Q*pole3","v":335661.19928808289},null,"Crossover",{"$f":"AI7","v":55.274000000000001},"kHz"]
[null,"EA pole, p1",{"$f":"Fp1_u","v":72.280703527320554},"Hz","Q",{"$f":"Q","v":0.67132239857616582},null,null,null,null,null,null,"pterm2",{"$f":"pole3^2","v":250000000000},null,"Phase Margin",{"$f":"AI9","v":52.135953238261948},"°"]
[null,"Aea",{"$f":"AEA","v":1774.1935483870968},"V/V","mc",{"$f":"mc","v":1.2451586502140519},null,"FF zero, z5",{"$f":"Fz_ff","v":1000000000},null,null,null,null,null,null,"radconv",{"$f":"180/Pi","v":57.295779578552292},null,null,null,null,null,null,null,null,null,null,null,null,null,null,null,null,"XOVER SEARCH"]
[null,"EA pole, p2",{"$f":"Fp2_u","v":177254.91045511764},"Hz","k",{"$f":"k","v":0.97415353222628764},null,"FF pole, p5",{"$f":"Fp_ff","v":1000000000},null,null,null,null,null,null,null,null,null,null,null,null,null,null,null,null,null,null,null,null,null,null,null,null,"xover",{"$f":"SUM(AH12:AH613)/1000","v":55.274000000000001}]
[]
[null,null,null,null,null,null,null,null,null,null,null,null,null,null,null,null,null,null,null,null,null,null,null,null,null,null,null,null,null,null,null,null,null,"phase margin",{"$f":"SUM(AI13:AI613)","v":52.135953238261948}]
["Freq (Hz)",null,"Power Stage",null,null,null,null,null,"Error Amplifier",null,null,null,null,null,null,"FF Network",null,null,"Sampling Double Pole",null,"System Response",null,null,null,null,null,null,"ERROR AMP Response",null,null,"PLANT Response"]
[null,null,"p_dom",null,"z_ESR",null,"z_RHP",null,"p1",null,"z1",null,"p2",null,"z3",null,"p3",null,"p3"]
[null,null,"Gain(V/V)","Phase(rad)","Gain(V/V)","Phase(rad)","Gain(V/V)","Phase(rad)","Gain(V/V)","Phase(rad)","Gain(V/V)","Phase(rad)","Gain(V/V)","Phase(rad)","Gain(V/V)","Phase(rad)","Gain(V/V)","Phase(rad)","Gain(V/V)","Phase(rad)","Gain (dB)","Phase (°)","Phase Margin (°)",null,null,"Fsquare",null,"Gain(dB)","Phase(Deg)",null,"Gain(dB)","Phase(Deg)"]
[1,{"$f":"A13/1000","v":1E-3},{"$f":"SQRT(1+(A13/pole1)^2)","v":1.0000000288258133},{"$f":"ATAN(A13/pole1)","v":2.401075278744903E-4},{"$f":"SQRT(1+(A13/Zero1)^2)","v":1.0000000000004095},{"$f":"ATAN(A13/Zero1)","v":9.047786831997531E-7},{"$f":"IF(VIN_nom>Vout, 1, SQRT(1+(A13/z_RHP)^2))","v":1},{"$f":"IF(VIN_nom>Vout, 0, -ATAN(A13/z_RHP))","v":0},{"$f":"SQRT(1+(A13/Pole2)^2)","v":1.0000956983571165},{"$f":"ATAN(A13/Pole2)","v":1.3834068521355995E-2},{"$f":"SQRT(1+(A13/Zero2)^2)","v":1.0000000067265618},{"$f":"ATAN(A13/Zero2)","v":1.1598760011786819E-4},{"$f":"SQRT(1+(A13/pole4)^2)","v":1.0000000000159139},{"$f":"ATAN(A13/pole4)","v":5.6415926499401475E-6},{"$f":"SQRT(1+(A13/Zero3)^2)","v":1},{"$f":"ATAN(A13/Zero3)","v":1.0000000000000001E-9},{"$f":"SQRT(1+(A13/pole5)^2)","v":1},{"$f":"ATAN(A13/pole5)","v":1.0000000000000001E-9},{"$f":"SQRT((1-(Z13/pterm2))^2+(A13/pterm1)^2)","v":1.0000000000004379},{"$f":"IF((ATAN((A13/pterm1)/(1-A13^2/pterm2))>0),ATAN((A13/pterm1)/(1-A13^2/pterm2)),PI()+ATAN((A13/pterm1)/(1-A13^2/pterm2)))","v":2.9791945036303897E-6},{"$f":"20*LOG10(((E13*K13*G13*O13)/(C13*I13*S13*M13*Q13))*Adc)","v":64.359559829381382},{"$f":"((F13+L13+H13+R13)-(D13+J13+T13+N13+T13))*radconv","v":-0.8003580213926178},{"$f":"IF(V13>0,V13,V13+180)","v":179.19964197860739},null,{"$f":"IF(U13<0,A13,1000000000)","v":1000000000},{"$f":"A13^2","v":1},null,{"$f":"20*LOG10((K13/(I13*M13))*AEA)","v":64.979188785889818},{"$f":"(L13-(J13+N13))*radconv","v":-0.78631138015294622},null,{"$f":"20*LOG10((E13*G13/(C13*S13))*Acs*Am)","v":32.221674103482485},{"$f":"(F13+H13-(D13+T13))*radconv","v":-1.3876003263849551E-2},null,{"$f":"SUM((U14<0)*(U13>0))*A13","v":0},{"$f":"IF(AH13>0,W11,0)","v":0}]
[1.0965,{"$f":"A14/1000","v":1.0965E-3},1.0000000346576281,2.6327790329078664E-4,1.0000000000004921,9.9208982612847451E-7,1,0,1.0001150581933655,1.5168860369762985E-2,1.0000000080874276,1.2718040341385884E-4,1.0000000000191334,6.186006340646095E-6,1,1.0965000000000001E-9,1,1.0965000000000001E-9,1.0000000000005262,3.2666867732314109E-6,64.3593916508364,-0.87758135395948322,179.12241864604053,null,1000000000,1.2023122500000001,null,64.979020657999385,-0.86217921189883062,null,32.221674052827936,-1.5215037520163576E-2,null,0,0]
[1.2022999999999999,1.2022999999999999E-3,1.0000000416684418,2.8868127829188216E-4,1.0000000000005915,1.0878154108109309E-6,1,0,1.000138331446816,1.6632227894894585E-2,1.000000009723415,1.3945189134310164E-4,1.0000000000230038,6.7828868429909788E-6,1,1.2022999999999999E-9,1,1.2022999999999999E-9,1.0000000000006328,3.5818855517164791E-6,64.35918948081455,-0.9622433659482289,179.03775663405176,null,1000000000,1.4455252899999997,null,64.978818548872752,-0.94535508932738466,null,32.221673991932718,-1.6683118582513166E-2,null,0,0]
[1.3183,1.3183000000000001E-3,1.0000000500968094,3.1653374950828185E-4,1.0000000000007114,1.1927697380619945E-6,1,0,1.0001663097283835,1.8236594120020211E-2,1.0000000116901917,1.529064527294049E-4,1.0000000000276568,7.4373115903578738E-6,1,1.3183000000000001E-9,1,1.3183000000000001E-9,1.0000000000007607,3.9274721141389612E-6,64.358946445394182,-1.0550627960070951,178.94493720399291,null,1000000000,1.7379148900000001,null,64.978575586660313,-1.0365451091180167,null,32.221673918724782,-1.8292734845551849E-2,null,0,0]
[1.4454,1.4454000000000001E-3,1.0000000602223449,3.4705141352564799E-4,1.0000000000008551,1.3077671086965344E-6,1,0,1.0001999207871142,1.9994373501618617E-2,1.0000000140530061,1.6764847639152186E-4,1.0000000000332467,8.1543580161292636E-6,1,1.4454E-9,1,1.4454E-9,1.0000000000009146,4.3061277355522507E-6,64.358654489421852,-1.1567578919410926,178.84324210805892,null,1000000000,2.0891811599999999,null,64.978283718637357,-1.1364548771094751,null,32.221673830775416,-2.0056374701363865E-2,null,0,0]
[1.5849,1.5849E-3,1.0000000724077893,3.8054640987163685E-4,1.0000000000010281,1.4339837350026971E-6,1,0,1.0002403680836245,2.192350091347995E-2,1.0000000168965042,1.8382874618045743E-4,1.0000000000399738,8.94136019074672E-6,1,1.5849E-9,1,1.5849E-9,1.0000000000010996,4.7217253688112396E-6,64.358303164790811,-1.2683662878774591,178.73163371212254,null,1000000000,2.51190801,null,64.977932499847824,-1.2461037668102013,null,32.221673724933893,-2.1992076939376645E-2,null,0,0]
[1.7378,1.7378000000000001E-3,1.0000000870524786,4.1725884574322886E-4,1.0000000000012361,1.5723243956636643E-6,1,0,1.0002889762175478,2.4037747204141244E-2,1.0000000203138721,2.0156324965902968E-4,1.0000000000480589,9.8039597068558919E-6,1,1.7377999999999999E-9,1,1.7377999999999999E-9,1.0000000000013221,5.1772442084197832E-6,64.357880974030635,-1.3906847195824781,178.60931528041752,null,1000000000,3.0199488400000001,null,64.977510436289933,-1.3662744673641987,null,32.221673597731623,-2.4113717543895224E-2,null,0,0]
[1.9055,1.9055000000000001E-3,1.0000001046645131,4.5752487123278091E-4,1.0000000000014861,1.7240557808358917E-6,1,0,1.0003474303321604,2.6356394750059596E-2,1.0000000244236762,2.2101436941705341E-4,1.0000000000577818,1.0750054794160896E-5,1,1.9055000000000001E-9,1,1.9055000000000001E-9,1.0000000000015896,5.6768551266832624E-6,64.357373292187276,-1.5248287998176857,178.4751712001823,null,1000000000,3.63093025,null,64.9770029074229,-1.4980629262608589,null,32.221673444755304,-2.6440722893896852E-2,null,0,0]
[2.0893000000000002,2.0893000000000001E-3,1.0000001258296982,5.0165662554641237E-4,1.0000000000017866,1.8903541028075086E-6,1,0,1.0004176727904575,2.8897317065285467E-2,1.0000000293626155,2.4233288926928849E-4,1.0000000000694664,1.1786979523099135E-5,1,2.0893000000000002E-9,1,2.0893000000000002E-9,1.0000000000019109,6.2244310764567893E-6,64.356763266217754,-1.6718326470398519,178.32816735296015,null,1000000000,4.3651744900000002,null,64.976393065292001,-1.6424850013565793,null,32.221673260916674,-2.8991131760386275E-2,null,0,0]
[2.2909000000000002,2.2909000000000002E-3,1.0000001512842809,5.5006229070114743E-4,1.0000000000021481,2.0727574853399119E-6,1,0,1.0005021442583435,3.16838831046563E-2,1.0000000353024943,2.6571598804796953E-4,1.000000000083519,1.2924324601165385E-5,1,2.2909E-9,1,2.2909E-9,1.0000000000022977,6.8250366883970577E-6,64.35602972402917,-1.8330483349718736,178.16695166502814,null,1000000000,5.2482228100000006,null,64.975659744199305,-1.8008688871288607,null,32.221673039820793,-3.1788533304200596E-2,null,0,0]
[2.5118999999999998,2.5118999999999996E-3,1.0000001818805364,6.0312603772707466E-4,1.0000000000025826,2.2727135743261672E-6,1,0,1.000603669020331,3.473803380865241E-2,1.0000000424421929,2.9134924579892493E-4,1.0000000001004103,1.4171116576586384E-5,1,2.5119E-9,1,2.5119E-9,1.0000000000027622,7.4834386737105584E-6,64.355148174564093,-2.0097453457008321,177.99025465429918,null,1000000000,6.309641609999999,null,64.974778460490128,-1.9744615910969274,null,32.221672774064878,-3.4855129072434848E-2,null,0,0]
[2.7542,2.7542000000000001E-3,1.000000218661576,6.6130406957914847E-4,1.0000000000031048,2.491941449264282E-6,1,0,1.0007257025589693,3.8085796838328412E-2,1.0000000510251241,3.1945303881042566E-4,1.0000000001207159,1.553807447537954E-5,1,2.7541999999999999E-9,1,2.7541999999999999E-9,1.0000000000033209,8.2052975019550984E-6,64.354088663690646,-2.203429630422292,177.79657036957769,null,1000000000,7.5856176399999997,null,64.973719269092982,-2.1647423759152242,null,32.221672454588571,-3.8217283394055258E-2,null,0,0]
[3.02,3.0200000000000001E-3,1.0000002629029157,7.2512462102425053E-4,1.000000000003733,2.7324316232571998E-6,1,0,1.0008724684587524,4.1757265147923321E-2,1.0000000613489319,3.5028253960045361E-4,1.0000000001451401,1.7037609801351443E-5,1,3.0199999999999999E-9,1,3.0199999999999999E-9,1.0000000000039928,8.9971674010398671E-6,64.352814594318616,-2.4158423817355548,177.58415761826444,null,1000000000,9.1204000000000001,null,64.972445583996659,-2.373421531675139,null,32.221672070312891,-4.1905523373428427E-2,null,0,0]
[3.3113000000000001,3.3113000000000001E-3,1.0000003160665698,7.9506790480020015E-4,1.000000000004488,2.995993653671196E-6,1,0,1.0010488047248798,4.5779665465452042E-2,1.0000000737547807,3.8406972310795737E-4,1.00000000017449,1.8681005739771905E-5,1,3.3112999999999999E-9,1,3.3112999999999999E-9,1.0000000000048004,9.8650067599736873E-6,64.351284072629639,-2.6485590246912052,177.3514409753088,null,1000000000,10.964707690000001,null,64.970915524081633,-2.602046390277585,null,32.221671608538934,-4.5947600884274561E-2,null,0,0]
[3.6307999999999998,3.6308E-3,1.0000003800022295,8.7178220810713828E-4,1.0000000000053957,3.2850704429507431E-6,1,0,1.0012608290789911,5.0189755151609422E-2,1.0000000886742997,4.2112775550097789E-4,1.0000000002097869,2.0483494590755226E-5,1,3.6307999999999999E-9,1,3.6307999999999999E-9,1.0000000000057714,1.0816859403918461E-5,64.349444150707541,-2.9037064563245711,177.09629354367542,null,1000000000,13.182708639999998,null,64.969076157497966,-2.8527059230055989,null,32.221671053200495,-5.0380980956349977E-2,null,0,0]
[3.9811000000000001,3.9811000000000004E-3,1.0000004568647467,9.5589180644853669E-4,1.0000000000064873,3.6020144156719418E-6,1,0,1.0015156622653101,5.5022729447541718E-2,1.000000106610329,4.6175820408114591E-4,1.00000000025222,2.2459744495138471E-5,1,3.9810999999999998E-9,1,3.9810999999999998E-9,1.0000000000069389,1.1860471238586367E-5,64.347233254121733,-3.1833212983375909,176.8166787016624,null,1000000000,15.849157210000001,null,64.966865928531888,-3.1274002305270314,null,32.221670385580772,-5.5241740965004227E-2,null,0,0]
[4.3651999999999997,4.3651999999999996E-3,1.0000005492748922,1.048117017016715E-3,1.0000000000077995,3.9495399078841034E-6,1,0,1.0018219569143179,6.0319067231422795E-2,1.0000001281744313,5.0630903104108315E-4,1.0000000003032365,2.4626680230801524E-5,1,4.3651999999999998E-9,1,4.3651999999999998E-9,1.0000000000083422,1.3004779847491916E-5,64.344576629152115,-3.4897459921797744,176.51025400782024,null,1000000000,19.054971039999998,null,64.964210106226986,-3.4284296146765723,null,32.221669582916064,-6.0571508611130122E-2,null,0,0]
[4.7862999999999998,4.7862999999999994E-3,1.0000006603607663,1.1492261768146935E-3,1.0000000000093769,4.3305422113730886E-6,1,0,1.0021900286497192,6.6121694629732441E-2,1.000000154096556,5.5515139590238101E-4,1.0000000003645635,2.7002354894132287E-5,1,4.7862999999999995E-9,1,4.7862999999999995E-9,1.0000000000100293,1.4259318653051491E-5,64.341385258768582,-3.8254647410701219,176.17453525892986,null,1000000000,22.908667689999998,null,64.96101970072344,-3.7582333298272617,null,32.221668618036048,-6.6414686699164158E-2,null,0,0]
[5.2481,5.2481000000000003E-3,1.0000007939362008,1.2601076742904953E-3,1.0000000000112736,4.7483690072662327E-6,1,0,1.0026324383851168,7.2480018640589297E-2,1.0000001852666704,6.0871445172528847E-4,1.0000000004383063,2.9607642377813529E-5,1,5.2480999999999997E-9,1,5.2480999999999997E-9,1.0000000000120581,1.5635110674934852E-5,64.337550889860097,-4.1933369368430009,175.806663063157,null,1000000000,27.542553609999999,null,64.957186492036755,-4.1196187957797541,null,32.221667457814263,-7.2822615902309762E-2,null,0,0]
[5.7544000000000004,5.7544000000000007E-3,1.0000009545121502,1.3816739057365736E-3,1.0000000000135536,5.2064584545590361E-6,1,0,1.0031640172470671,7.9444284946816865E-2,1.0000002227374174,6.6743895000222274E-4,1.0000000005269549,3.2463980733755306E-5,1,5.7544000000000007E-9,1,5.7544000000000007E-9,1.0000000000144968,1.7143476852264074E-5,64.332945927503488,-4.5962707967069782,175.40372920329301,null,1000000000,33.113119360000006,null,64.952582924425286,-4.5154408532114152,null,32.221666063069129,-7.9848024327460188E-2,null,0,0]
[6.3095999999999997,6.3095999999999994E-3,1.0000011475853094,1.5149813279437851E-3,1.0000000000162952,5.7087915794567027E-6,1,0,1.0038028039262457,8.7072289572085654E-2,1.000000267791465,7.3183523433270636E-4,1.0000000006335443,3.5596192969405486E-5,1,6.3095999999999998E-9,1,6.3095999999999998E-9,1.0000000000174292,1.8797525640866113E-5,64.327415470485789,-5.0376117748996867,174.96238822510031,null,1000000000,39.811052159999996,null,64.947054144419639,-4.9489831520741623,null,32.221664386057085,-8.7551965453234362E-2,null,0,0]
[6.9183000000000003,6.9183000000000005E-3,1.0000013796853573,1.6611344141213339E-3,1.000000000019591,6.2595303639008078E-6,1,0,1.0045701744150621,9.5423651295979961E-2,1.0000003219525317,8.0243684526282817E-4,1.0000000007616794,3.9030230410675989E-5,1,6.9183E-9,1,6.9183E-9,1.0000000000209543,2.0610961335472067E-5,64.320776415967899,-5.5208113064773405,174.47918869352267,null,1000000000,47.862874890000008,null,64.940417105896572,-5.4236325141017261,null,32.221662370062234,-9.59982676674275E-2,null,0,0]
[7.5857999999999999,7.5858000000000002E-3,1.0000016587616654,1.8214057057674839E-3,1.0000000000235536,6.8634701349107873E-6,1,0,1.0054920828837517,0.10456638381612052,1.0000003870756271,8.7985851387188609E-4,1.0000000009157484,4.2795993498243091E-5,1,7.5858E-9,1,7.5858E-9,1.000000000025193,2.2599573666970276E-5,64.312807046048704,-6.04980722651118,173.95019277348882,null,1000000000,57.544361639999998,null,64.932450160002134,-5.9432523287939425,null,32.221659946037505,-0.10526047216016939,null,0,0]
[8.3176000000000005,8.3176000000000014E-3,1.0000019942389877,1.9971157570773408E-3,1.0000000000283173,7.5255871752422516E-6,1,0,1.0065991908300944,0.11456965505402475,1.0000004653600467,9.6473816776623442E-4,1.0000000011009549,4.6924510991198831E-5,1,8.3176000000000003E-9,1,8.3176000000000003E-9,1.0000000000302882,2.4779748205155738E-5,64.303246378889611,-6.6286050466387412,173.37139495336126,null,1000000000,69.182469760000004,null,64.922892406759573,-6.5117708533934042,null,32.221657032120952,-0.11541489481753966,null,0,0]
[9.1201000000000008,9.1201000000000008E-3,1.0000023976194532,2.1898012068437044E-3,1.0000000000340452,8.2516720684650355E-6,1,0,1.0079287761148079,0.1255128696764744,1.0000005594898504,1.0578181220196293E-3,1.0000000013236483,5.1451889081862202E-5,1,9.1201000000000004E-9,1,9.1201000000000004E-9,1.0000000000364144,2.7170551794884879E-5,64.291778342220638,-7.2618037520314083,172.7381962479686,null,1000000000,83.176224010000013,null,64.91142787380457,-7.1336971773971376,null,32.221653528406982,-0.12655033923084277,null,0,0]
[10,0.01,1.0000028825772034,2.4010707107061818E-3,1.0000000000409313,9.0477868317531082E-6,1,0,1.0095249314607684,0.13747681484695717,1.0000006726559489,1.1598754862485812E-3,1.0000000015913784,5.6415926440147282E-5,1,1E-8,1,1E-8,1.0000000000437801,2.9791945039375602E-5,64.278031021146049,-7.9540838555878164,172.04591614441219,null,1000000000,100,null,64.897684765012528,-7.8136177049200732,null,32.221649316124441,-0.13875977090934583,null,0,0]
[10.965,1.0964999999999999E-2,1.0000034657568726,2.6327730107050498E-3,1.0000000000492122,9.9208982609625142E-6,1,0,1.0114410326419878,0.15055235685864587,1.0000008087424324,1.2718033552881292E-3,1.0000000019133337,6.1860063328344055E-5,1,1.0964999999999999E-8,1,1.0964999999999999E-8,1.0000000000526372,3.2666867736363641E-5,64.261556745373753,-8.7107110850060465,171.28928891499396,null,1000000000,120.23122499999999,null,64.881215554663413,-8.5566900094458447,null,32.221644250701267,-0.15215003015508108,null,0,0]
[12.023,1.2022999999999999E-2,1.0000041668355721,2.8868048438851863E-3,1.0000000000591671,1.0878154107684513E-5,1,0,1.0137397116233178,0.16482850418056597,1.0000009723410399,1.3945180185059699E-3,1.0000000023003777,6.7828868326928673E-5,1,1.2023E-8,1,1.2023E-8,1.0000000000632849,3.5818855522503279E-5,64.241834247779522,-9.5368462660102331,170.46315373398977,null,1000000000,144.55252899999999,null,64.861499146544176,-9.3679639546742788,null,32.221638161226281,-0.16683073095234063,null,0,0]
[13.183,1.3183E-2,1.0000050096685151,3.1653270293073507E-3,1.0000000000711351,1.1927697380059949E-5,1,0,1.0164962919604037,0.18040324821839002,1.0000011690184993,1.5290633475419074E-3,1.0000000027656801,7.4373115767821843E-5,1,1.3183E-8,1,1.3183E-8,1.0000000000760858,3.9274721148427172E-5,64.218241849044318,-10.438173403547786,169.56182659645222,null,1000000000,173.79148899999998,null,64.837914068536534,-10.25299713430093,null,32.221630840498705,-0.18292674881118948,null,0,0]
[14.454000000000001,1.4454E-2,1.0000060222165315,3.4705003411912576E-3,1.0000000000855127,1.3077671086227264E-5,1,0,1.019798094847681,0.19736708223052926,1.0000014052996207,1.6764832089809138E-3,1.0000000033246776,8.1543579982362607E-5,1,1.4453999999999998E-8,1,1.4453999999999998E-8,1.0000000000914644,4.3061277364798142E-5,64.19006715029883,-11.41994688809377,168.58005311190624,null,1000000000,208.91811600000003,null,64.809748164631557,-11.216917530118209,null,32.221622045658201,-0.20056295667249194,null,0,0]
[15.849,1.5848999999999999E-2,1.0000072407529881,3.8054459128883875E-3,1.0000000001028155,1.4339837349053894E-5,1,0,1.0237574880832092,0.2158540331054995,1.0000016896490067,1.8382854118070321E-3,1.000000003997396,8.9413601671568951E-5,1,1.5849000000000002E-8,1,1.5849000000000002E-8,1.0000000001099714,4.7217253700341231E-5,64.156401129303077,-12.489946296912406,167.51005370308761,null,1000000000,251.19080099999999,null,64.776092727649257,-12.267322128209562,null,32.221611461644748,-0.21991972742333141,null,0,0]
[17.378,1.7378000000000001E-2,1.0000087052103377,4.1725644842277709E-3,1.0000000001236102,1.5723243955353899E-5,1,0,1.0284957920356217,0.23594564234874069,1.0000020313851723,2.0156297942070314E-3,1.0000000048058812,9.8039596757588902E-5,1,1.7377999999999995E-8,1,1.7377999999999995E-8,1.0000000001322134,5.1772442100318334E-5,64.116282814017808,-13.652920839879593,166.34707916012042,null,1000000000,301.99488400000001,null,64.735987132390065,-13.408819691258323,null,32.221598741618671,-0.24113580187650754,null,0,0]
[19.055,1.9054999999999999E-2,1.0000104663970777,4.5752171075570877E-3,1.0000000001486185,1.7240557806667824E-5,1,0,1.0341654302942227,0.25776051101352371,1.0000024423646714,2.2101401315119322E-3,1.0000000057781839,1.0750054753164472E-4,1.0000000000000002,1.9054999999999998E-8,1.0000000000000002,1.9054999999999998E-8,1.0000000001589622,5.6768551288084948E-5,64.068521136565636,-14.915773973699807,165.0842260263002,null,1000000000,363.09302500000001,null,64.688240752280009,-14.648117048948983,null,32.22158344427654,-0.26440541812030621,null,0,{"$f":"IF(AH45>0,W43,0)","v":0}]
[20.893000000000001,2.0893000000000002E-2,1.0000125828914441,5.0165245947141812E-3,1.000000000178672,1.8903541025845914E-5,1,0,1.0409380400136505,0.28138425003095069,1.0000029362572651,2.4233241964613465E-3,1.0000000069466441,1.1786979469058366E-4,1.0000000000000002,2.0892999999999997E-8,1.0000000000000002,2.0892999999999997E-8,1.0000000001911071,6.2244310792582326E-5,64.011809764216096,-16.283511229268257,163.71648877073176,null,1000000000,436.51744900000006,null,64.631547763373263,-15.990037159417335,null,32.221565060833747,-0.28990893062044976,null,0,0]
[22.909000000000002,2.2909000000000002E-2,1.0000151283148011,5.5005679855952535E-3,1.0000000002148162,2.0727574850460388E-5,1,0,1.0490252935722393,0.30692917026705024,1.0000035302432502,2.6571536894174274E-3,1.0000000083519083,1.2924324529923155E-4,1.0000000000000002,2.2909E-8,1.0000000000000002,2.2909E-8,1.0000000002297673,6.8250366920902142E-5,63.944571199551049,-17.762698817917506,162.23730118208249,null,1000000000,524.82228100000009,null,64.564331307690111,-17.440907486248339,null,32.221542951851859,-0.31788218627893244,null,0,0]
[25.119,2.5118999999999999E-2,1.0000181878898804,6.0311879789057866E-3,1.0000000002582614,2.2727135739387772E-5,1,0,1.0586643687660511,0.33446388144429906,1.0000042442103849,2.913484296800216E-3,1.0000000100410271,1.4171116482673292E-4,1.0000000000000004,2.5118999999999992E-8,1.0000000000000004,2.5118999999999992E-8,1.0000000002762359,7.4834386785789617E-5,63.865104080360965,-19.357391323732386,160.64260867626763,null,1000000000,630.96416099999999,null,64.484890763215091,-19.0045579258083,null,32.221516377136808,-0.34854714260659914,null,0,0]
[27.542000000000002,2.7542000000000001E-2,1.0000218659209379,6.612945261114841E-3,1.0000000003104885,2.4919414487536273E-5,1,0,1.0701369894617669,0.36405741086863358,1.0000051024995296,3.1945196300837047E-3,1.000000012071588,1.5538074351583849E-4,1.0000000000000004,2.7541999999999996E-8,1.0000000000000004,2.7541999999999996E-8,1.0000000003320981,8.2052975083725982E-5,63.771457983204975,-21.071690412388403,158.92830958761161,null,1000000000,758.56176400000004,null,64.391276612422729,-20.684823335314277,null,32.221484430773174,-0.38216736594032497,null,0,0]
[30.2,3.0199999999999998E-2,1.0000262899494359,7.2511203935440444E-3,1.0000000003733092,2.7324316225839722E-5,1,0,1.0837757202814706,0.39576962807054578,1.000006134874561,3.5028112130655949E-3,1.0000000145140073,1.703760963814401E-4,1.0000000000000004,3.0199999999999992E-8,1.0000000000000004,3.0199999999999992E-8,1.000000000399291,8.9971674095004503E-5,63.661427672263919,-22.909196197758664,157.09080380224134,null,1000000000,912.04,null,64.281284727217724,-22.484994905910249,null,32.221446005037116,-0.41904802497369525,null,0,0]
[33.113,3.3112999999999997E-2,1.0000316061625072,7.9505131999995631E-3,1.0000000004487988,2.995993652783761E-5,1,0,1.0999413366680384,0.42958326890261306,1.0000073754511372,3.8406785354394898E-3,1.0000000174489987,1.868100552463511E-4,1.0000000000000004,3.3112999999999987E-8,1.0000000000000004,3.3112999999999987E-8,1.0000000004800347,9.8650067711262608E-5,63.532790124358357,-24.869073884386804,155.13092611561319,null,1000000000,1096.470769,null,64.152693354061171,-24.403957042627908,null,32.221399830288121,-0.45946650645905274,null,0,0]
[36.308,3.6308E-2,1.0000379995081909,8.7176034467832415E-3,1.0000000005395844,3.2850704417808445E-5,1,0,1.1190731811614807,0.46550141111166704,1.0000088673910559,4.2112529087542788E-3,1.0000000209786775,2.0483494307142259E-4,1.0000000000000007,3.6307999999999983E-8,1.0000000000000007,3.6307999999999983E-8,1.000000000577139,1.0816859418620801E-4,63.3829682340901,-26.951708210283076,153.04829178971693,null,1000000000,1318.2708640000001,null,64.002926993810206,-26.44171540389781,null,32.221344300270808,-0.5037972827506122,null,0,0]
[39.811,3.9810999999999999E-2,1.0000456854415321,9.5586298495336924E-3,1.0000000006487253,3.6020144141297081E-5,1,0,1.1416488848469353,0.50344434710036601,1.000010660976639,4.6175495506191547E-3,1.0000000252220058,2.2459744121261805E-4,1.0000000000000009,3.9810999999999978E-8,1.0000000000000009,3.9810999999999978E-8,1.0000000006938758,1.1860471257967924E-4,63.209435641893769,-29.152732890399395,150.84726710960061,null,1000000000,1584.9157210000001,null,63.829461158055373,-28.593538725771047,null,32.221277543829309,-0.5524008961616883,null,0,0]
[43.652000000000001,4.3652000000000003E-2,1.0000549259958624,1.0480790230338223E-2,1.0000000007799432,3.949539905851029E-5,1,0,1.1682137371060786,0.54329927703466352,1.0000128173617939,5.0630474797942419E-3,1.0000000303236685,2.4626679737932487E-4,1.0000000000000009,4.3651999999999973E-8,1.0000000000000009,4.3651999999999973E-8,1.0000000008342265,1.3004779873041972E-4,63.00957902799869,-31.465916424020801,148.5340835759792,null,1000000000,1905.497104,null,63.629684802637271,-30.852774417907028,null,32.221197285352339,-0.60569331717841379,null,0,0]
[47.863,4.7863000000000003E-2,1.0000660339181782,1.1491760931285467E-2,1.0000000009376797,4.3305422086930524E-5,1,0,1.1993687308298975,0.58489158906912264,1.0000154095380578,5.5514574991021486E-3,1.0000000364563579,2.7002354244423345E-4,1.0000000000000011,4.7862999999999957E-8,1.0000000000000011,4.7862999999999957E-8,1.0000000010029413,1.4259318686732044E-4,62.780896749913488,-33.881501105444585,146.11849889455542,null,1000000000,2290.8667689999997,null,63.401099000999885,-33.209215688814282,null,32.221100808904524,-0.66411817117405536,null,0,0]
[52.481000000000002,5.2481E-2,1.000079390500159,1.2600416512057452E-2,1.0000000011273504,4.7483690037332029E-5,1,0,1.2357915075806734,0.62801054278174362,1.000018526497148,6.0870700877382264E-3,1.0000000438306234,2.9607641521317416E-4,1.0000000000000013,5.2480999999999952E-8,1.0000000000000013,5.2480999999999952E-8,1.0000000012058128,1.5635110719335136E-4,62.520958065627013,-36.387697717472236,143.61230228252776,null,1000000000,2754.255361,null,63.141276322190095,-35.650554135227978,null,32.220984803427839,-0.72818833060945209,null,0,0]
[57.544000000000004,5.7544000000000005E-2,1.0000954467055319,1.3815868732889347E-2,1.0000000013553605,5.2064584499016619E-5,1,0,1.2782036418064942,0.67236964396508969,1.0000222734961597,6.6742913846509705E-3,1.0000000526955009,3.2463979604689566E-4,1.0000000000000018,5.7543999999999936E-8,1.0000000000000018,5.7543999999999936E-8,1.0000000014496921,1.7143476910794219E-4,62.227754199754841,-38.968384247218218,141.03161575278179,null,1000000000,3311.3119360000005,null,62.848211906693088,-38.1601346781122,null,32.220845353052667,-0.79843037739144462,null,0,0]
[63.095999999999997,6.3095999999999999E-2,1.0001147520127822,1.5148665981063776E-2,1.000000001629515,5.7087915733170124E-5,1,0,1.3274060859508146,0.71765644980872578,1.0000267787915205,7.3182230011931675E-3,1.0000000633544457,3.5596191480988688E-4,1.000000000000002,6.3095999999999919E-8,1.000000000000002,6.3095999999999919E-8,1.0000000017429276,1.8797525718024816E-4,61.899550494505405,-41.60599807778582,138.39400192221419,null,1000000000,3981.1052159999995,null,62.520175867756002,-40.719777584793384,null,32.220677686740324,-0.87545391922531812,null,0,0]
[69.183000000000007,6.9183000000000008E-2,1.0001379591145343,1.6609831775399663E-2,1.000000001959086,6.2595303558072552E-5,1,0,1.3842411395529457,0.76350414765332231,1.0000321947401016,8.0241979504785486E-3,1.0000000761679415,3.9030228448593576E-4,1.0000000000000024,6.9182999999999899E-8,1.0000000000000024,6.9182999999999899E-8,1.0000000020954365,2.0610961437185339E-4,61.535236918780747,-44.279876619549853,135.72012338045016,null,1000000000,4786.2874890000012,null,62.156063841088411,-43.308175347850813,null,32.220476137683264,-0.95989602455888723,null,0,0]
[75.858000000000004,7.5858000000000009E-2,1.0001658625489225,1.8212063411153518E-2,1.000000002355361,6.8634701242412601E-5,1,0,1.4496319788796497,0.8095417617676901,1.0000387068210896,8.7983603717831319E-3,1.0000000915748488,4.279599091167908E-4,1.0000000000000029,7.5857999999999858E-8,1.0000000000000029,7.5857999999999858E-8,1.0000000025192921,2.259957380105633E-4,61.13413084309088,-46.969172471781803,133.0308275282182,null,1000000000,5754.4361640000006,null,61.755200094977283,-45.903737721981322,null,32.220233808104517,-1.0524904941529896,null,0,0]
[83.176000000000002,8.3176E-2,1.0001994042166023,1.9968529600586076E-2,1.0000000028317231,7.5255871611774018E-5,1,0,1.524530451640784,0.85536947599813495,1.0000465349327419,9.6470853868174233E-3,1.0000001100954807,4.6924507581522538E-4,1.0000000000000036,8.3175999999999818E-8,1.0000000000000036,8.3175999999999818E-8,1.0000000030288085,2.4779748381911472E-4,60.696340535073389,-49.651400800607973,130.34859919939203,null,1000000000,6918.2469760000004,null,61.317701073272985,-48.483209439544581,null,32.219942521791324,-1.1539983766841364,null,0,0]
[91.201000000000008,9.1201000000000004E-2,1.0002397334966762,2.1894547860780565E-2,1.0000000034045045,8.2516720499237509E-5,1,0,1.60998191667778,0.90061897580014161,1.000055947435643,1.0577790633014854E-2,1.000000132364836,5.1451884586984861E-4,1.000000000000004,9.1200999999999759E-8,1.000000000000004,9.1200999999999759E-8,1.0000000036414551,2.7170552027896852E-4,60.222373984582873,-52.30595058169316,127.69404941830683,null,1000000000,8317.6224010000005,null,60.844084741907551,-51.025083319551108,null,32.219592302666243,-1.2653049079742573,null,0,0]
[100,0.1,1.0002882166013845,2.4006140647660434E-2,1.0000000040931223,9.0477868073108683E-5,1,0,1.707061429500089,0.94492705361782614,1.0000672633553294,1.1598239973941668E-2,1.0000001591378254,5.6415920514728767E-4,1.0000000000000049,9.9999999999999665E-8,1.0000000000000049,9.9999999999999665E-8,1.0000000043780002,2.979194534654605E-4,59.713487993667528,-54.91252579050915,125.08747420949085,null,1000000000,10000,null,60.335619759169845,-53.508125922317042,null,32.219171294488611,-1.3873360704321425,null,0,0]
[109.65,0.10965000000000001,1.0003465162510652,2.632171040732555E-2,1.000000004921211,9.9208982287394439E-5,1,0,1.8169469588265463,0.98798444791956508,1.0000808710058748,1.2717354768290091E-2,1.000000191333354,6.1860055516655462E-4,1.000000000000006,1.0964999999999957E-7,1.000000000000006,1.0964999999999957E-7,1.0000000052637235,3.2666868141317308E-4,59.171237682591041,-57.453997453162827,122.54600254683717,null,1000000000,12023.122500000001,null,59.793875672258778,-55.914131600466874,null,32.21866507032319,-1.5211553984127251,null,0,0]
[120.23,0.12023,1.0004165976485309,2.8860113372140863E-2,1.0000000059167118,1.0878154065204999E-4,1,0,1.9408297947560287,1.0295045473832212,1.0000972294244759,1.3944285364408789E-2,1.0000002300377431,6.7828858028818478E-4,1.0000000000000071,1.2022999999999943E-7,1.0000000000000071,1.2022999999999943E-7,1.0000000063285104,3.58188560563517E-4,58.597866907343715,-59.91454846251596,120.08545153748403,null,1000000000,14455.252900000001,null,59.221113384725086,-58.226179994353537,null,32.218056582609549,-1.6678526640204034,null,0,0]
[131.83000000000001,0.13183,1.000500842684654,3.1642810804094E-2,1.0000000071134982,1.1927697324060498E-4,1,0,2.0800171049597176,1.0692690650997561,1.0001168950860231,1.5289453888731465E-2,1.0000002765679803,7.4373102192137712E-4,1.0000000000000087,1.3182999999999924E-7,1.0000000000000087,1.3182999999999924E-7,1.0000000076085929,3.9274721852183278E-4,57.995716776049768,-62.282359541664874,117.71764045833513,null,1000000000,17379.148900000004,null,58.619694661729994,-60.431196132932854,null,32.217325174310702,-1.8286682039721285,null,0,0]
[144.54,0.14454,1.0006020422390784,3.4691219305644172E-2,1.0000000085512739,1.3077671012418969E-4,1,0,2.2358030828979469,1.107089477665302,1.0001405201878535,1.6763277417643583E-2,1.000000332467718,8.1543562089365538E-4,1.0000000000000104,1.4453999999999899E-7,1.0000000000000104,1.4453999999999899E-7,1.0000000091464374,4.3061278292361432E-4,57.367710059144088,-64.547314467451869,115.45268553254813,null,1000000000,20891.811599999997,null,57.992566469400124,-62.517810657705517,null,32.216446649734884,-2.0048397961842208,null,0,0]
[158.49,0.15849000000000002,1.0007238159654601,3.803628908451874E-2,1.0000000102815467,1.4339837251746331E-4,1,0,2.4099666887001225,1.142915628829851,1.0001689507712364,1.8380804536039543E-2,1.0000003997395304,8.9413578081755851E-4,1.0000000000000124,1.5848999999999869E-7,1.0000000000000124,1.5848999999999869E-7,1.000000010997137,4.7217254923224489E-4,56.715349587887687,-66.707530249383879,113.29246975061612,null,1000000000,25119.080100000003,null,57.341263011614913,-64.482329627755277,null,32.215389636263694,-2.1981562081328501,null,0,0]
[173.78,0.17377999999999999,1.0008701462455523,4.1701696647230335E-2,1.00000001236102,1.572324382707938E-4,1,0,2.6039123302250551,1.1766311594853371,1.0002031180950872,2.0153596217297485E-2,1.0000004805880143,9.8039565660607052E-4,1.0000000000000151,1.7377999999999826E-7,1.0000000000000151,1.7377999999999826E-7,1.0000000132213416,5.1772443712369326E-4,56.04206923745533,-68.757095443616294,111.24290455638371,null,1000000000,30199.488400000002,null,56.669252658942312,-66.317456085987544,null,32.214119638503945,-2.4099858892574701,null,0,0]
[190.55,0.19055000000000002,1.0010460980245066,4.5720605936312629E-2,1.0000000148618415,1.7240557637558378E-4,1,0,2.8195414027042562,1.2082377877185624,1.0002442069468811,2.2097839700207095E-2,1.0000005778182235,1.0750050653524968E-3,1.0000000000000182,1.9054999999999772E-7,1.0000000000000182,1.9054999999999772E-7,1.000000015896221,5.6768553413316441E-4,55.349856007377468,-70.697166965024579,109.30283303497542,null,1000000000,36309.302500000005,null,55.978566265219584,-68.022406264245419,null,32.212592802148798,-2.6422456332563158,null,0,0]
[208.93,0.20893,1.0012575063997085,5.0123647983801062E-2,1.0000000178671931,1.8903540802928795E-4,1,0,3.058627194469119,1.2377282150667197,1.0002935830620963,2.4228547386938588E-2,1.0000006946641902,1.1786974064985933E-3,1.0000000000000218,2.0892999999999696E-7,1.0000000000000218,2.0892999999999696E-7,1.0000000191107465,6.2244313594025306E-4,54.64148820731144,-72.528301178928373,107.47169882107163,null,1000000000,43651.744900000005,null,55.272032624206453,-69.595943864819759,null,32.210758643095907,-2.8967059201988405,null,0,0]
[229.09,0.22909000000000002,1.0015117003045106,5.4950857919429191E-2,1.0000000214816176,2.0727574556587578E-4,1,0,3.323463051612324,1.2651695518325006,1.0003529626568197,2.6565348453039678E-2,1.0000008351904832,1.2924317405707268E-3,1.0000000000000262,2.29089999999996E-7,1.0000000000000262,2.29089999999996E-7,1.0000000229767383,6.8250370614059022E-4,53.918511548210617,-74.255616561527049,105.74438343847295,null,1000000000,52482.2281,null,54.551260814667287,-71.040844306026003,null,32.208553793534257,-3.1756807994826137,null,0,0]
[251.19,0.25119000000000002,1.0018171545027521,6.0239639012523258E-2,1.0000000258261346,2.2727135351998095E-4,1,0,3.6162168863996715,1.2906127345097558,1.0004243319103709,2.912668593257587E-2,1.0000010041022211,1.417110709137525E-3,1.0000000000000315,2.5118999999999472E-7,1.0000000000000315,2.5118999999999472E-7,1.0000000276236389,7.4834391654191035E-4,53.183208711103411,-75.883215936958848,104.11678406304115,null,1000000000,63096.416100000002,null,53.818606713038974,-72.359021043526155,null,32.205905058055365,-3.481332337468428,null,0,0]
[275.42,0.27542,1.0021842305681274,6.6034267543494035E-2,1.0000000310488604,2.4919413976881469E-4,1,0,3.9394565134583468,1.3141459000243534,1.0005101211429499,3.1934444861973367E-2,1.0000012071580637,1.5538061972032639E-3,1.000000000000038,2.7541999999999303E-7,1.000000000000038,2.7541999999999303E-7,1.0000000332098755,8.2052981501224017E-4,52.437132917309484,-77.417548521193524,102.58245147880648,null,1000000000,75856.176400000011,null,53.0757129383951,-73.554331445461258,null,32.202723038905312,-3.8162199607172944,null,0,0]
[302,0.30199999999999999,1.0026255826594992,7.2385782641308558E-2,1.0000000373309121,2.7324315552612252E-4,1,0,4.2961588875601482,1.3358754202523364,1.0006133012687042,3.5013939622812622E-2,1.0000014513996858,1.7037593317429075E-3,1.0000000000000457,3.0199999999999082E-7,1.0000000000000457,3.0199999999999082E-7,1.000000039929172,8.9971682555584315E-4,51.681321681921219,-78.866317693246742,101.13368230675326,null,1000000000,91204,null,52.323726045246993,-74.631490875504809,null,32.198898696665154,-4.1832941441472009,null,0,0]
[331.13,0.33112999999999998,1.0031556870179135,7.933991013227347E-2,1.0000000448798889,2.9959935640402549E-4,1,0,4.6890398176073411,1.3558824598621126,1.0007372760455877,3.8388106241930002E-2,1.0000017448983554,1.8680984011000749E-3,1.0000000000000548,3.3112999999998785E-7,1.0000000000000548,3.3112999999998785E-7,1.0000000480035793,9.8650078863830003E-4,50.917732358947887,-80.235602150392452,99.764397849607548,null,1000000000,109647.0769,null,51.564727883541025,-75.593900235229697,null,32.194307535397783,-4.5851985557743751,null,0,0]
[363.08,0.36307999999999996,{"$f":"SQRT(1+(A77/pole1)^2)","v":1.0037928302366144},{"$f":"ATAN(A77/pole1)","v":8.6958391669846605E-2},{"$f":"SQRT(1+(A77/Zero1)^2)","v":1.0000000539584375},{"$f":"ATAN(A77/Zero1)","v":3.285070324791052E-4},{"$f":"IF(VIN_nom>Vout, 1, SQRT(1+(A77/z_RHP)^2))","v":1},{"$f":"IF(VIN_nom>Vout, 0, -ATAN(A77/z_RHP))","v":0},{"$f":"SQRT(1+(A77/Pole2)^2)","v":5.1217651722318926},{"$f":"ATAN(A77/Pole2)","v":1.3742888842624668},{"$f":"SQRT(1+(A77/Zero2)^2)","v":1.0008863502287442},{"$f":"ATAN(A77/Zero2)","v":4.2087909022066806E-2},{"$f":"SQRT(1+(A77/pole4)^2)","v":1.0000020978655533},{"$f":"ATAN(A77/pole4)","v":2.0483465945916927E-3},{"$f":"SQRT(1+(A77/Zero3)^2)","v":1.0000000000000659},{"$f":"ATAN(A77/Zero3)","v":3.6307999999998406E-7},{"$f":"SQRT(1+(A77/pole5)^2)","v":1.0000000000000659},{"$f":"ATAN(A77/pole5)","v":3.6307999999998406E-7},{"$f":"SQRT((1-(Z77/pterm2))^2+(A77/pterm1)^2)","v":1.0000000577140284},{"$f":"IF((ATAN((A77/pterm1)/(1-A77^2/pterm2))>0),ATAN((A77/pterm1)/(1-A77^2/pterm2)),PI()+ATAN((A77/pterm1)/(1-A77^2/pterm2)))","v":1.0816860888853965E-3},{"$f":"20*LOG10(((E77*K77*G77*O77)/(C77*I77*S77*M77*Q77))*Adc)","v":50.146793243856521},{"$f":"((F77+L77+H77+R77)-(D77+J77+T77+N77+T77))*radconv","v":-81.534313114280863},{"$f":"IF(V77>0,V77,V77+180)","v":98.465686885719137},null,{"$f":"IF(U77<0,A77,1000000000)","v":1000000000},{"$f":"A77^2","v":131827.0864},null,{"$f":"20*LOG10((K77/(I77*M77))*AEA)","v":50.799303769285309},{"$f":"(L77-(J77+N77))*radconv","v":-76.446855046690573},null,{"$f":"20*LOG10((E77*G77/(C77*S77))*Acs*Am)","v":32.188792534562133},{"$f":"(F77+H77-(D77+T77))*radconv","v":-5.0255028228199858},null,{"$f":"SUM((U78<0)*(U77>0))*A77","v":0},{"$f":"IF(AH77>0,W75,0)","v":0}]
[398.11,{"$f":"A78/1000","v":0.39811000000000002},1.0045582596456832,9.5299653233531553E-2,1.0000000648725371,3.6020142599063181E-4,1,0,5.5978761711228575,1.3911931184238779,1.0010655356635996,4.6143046811918734E-2,1.000002522197434,2.2459706733708382E-3,1.0000000000000793,3.9810999999997899E-7,1.0000000000000793,3.9810999999997899E-7,1.0000000693878002,1.1860473196122683E-3,49.369651134364517,-82.76989517147527,97.23010482852473,null,1000000000,158491.57210000002,null,50.02878245667916,-77.194377065836136,null,32.182171737676285,-5.5075854098676897,null,0,0]
[436.52,0.43651999999999996,1.0054777475702825,0.10443044700791379,1.0000000779943243,3.9495397025435204E-4,1,0,6.1214649844898243,1.4067012932256346,1.0012809240104577,5.05877099316802E-2,1.0000030323622995,2.4626630451207868E-3,1.0000000000000953,4.3651999999997225E-7,1.0000000000000953,4.3651999999997225E-7,1.0000000834229397,1.3004782428045953E-3,48.586927002091159,-83.95047864707152,96.04952135292848,null,1000000000,190549.71039999998,null,49.254005026990335,-77.840685150900612,null,32.174225035091752,-6.0353065921781814,null,0,0]
[478.63,0.47863,1.0065819488166174,0.11442070373599936,1.0000000937679749,4.3305419406893957E-4,1,0,6.6969049007173389,1.4209130572740629,1.0015397802169135,5.5458219232652893E-2,1.0000036456292056,2.7002289273813382E-3,1.0000000000001146,4.7862999999996352E-7,1.0000000000001146,4.7862999999996352E-7,1.0000001002945493,1.4259322054784363E-3,47.79925816666001,-85.083894760354156,94.916105239645844,null,1000000000,229086.67689999999,null,48.475869686751395,-78.389511146323329,null,32.164691539899536,-6.612711140170763,null,0,0]
[524.80999999999995,0.52481,1.0079080961660027,0.12535015324131063,1.0000001127350349,4.7483686504302508E-4,1,0,7.329260878209432,1.4339300154707533,1.0018509538612477,6.0796436380541011E-2,1.0000043830528329,2.9607555872156548E-3,1.0000000000001377,5.2480999999995172E-7,1.0000000000001377,5.2480999999995172E-7,1.0000001205818843,1.5635115159359086E-3,47.006793108035694,-86.178361433842184,93.821638566157816,null,1000000000,275425.53609999997,null,47.694840557298392,-78.844397678972484,null,32.15325561072823,-7.244411213082202,null,0,0]
[575.44000000000005,0.57544000000000006,1.0095000010469273,0.13729819653560149,1.0000001355360391,5.206457984164287E-4,1,0,8.0237432033146749,1.4458413007113469,1.0022248993328722,6.6645059863790088E-2,1.0000052695363451,3.2463866698829724E-3,1.0000000000001656,5.7543999999993655E-7,1.0000000000001656,5.7543999999993655E-7,1.000000144970085,1.7143482763801463E-3,46.20998222730541,-87.241321336211215,92.758678663788785,null,1000000000,331131.19360000006,null,46.911737489979927,-79.208128066233897,null,32.139547797316411,-7.9350013192963553,null,0,0]
[630.96,0.63096000000000008,1.0114107569918775,0.15035490447679026,1.0000001629514932,5.7087909593480496E-4,1,0,8.786392416795767,1.4567368232287279,1.0026743389627735,7.3053301891288294E-2,1.0000063354247062,3.5596042640439769E-3,1.000000000000199,6.3095999999991628E-7,1.000000000000199,6.3095999999991628E-7,1.0000001742940172,1.8797533433884081E-3,45.408770805406384,-88.280536564038869,91.719463435961131,null,1000000000,398110.52160000004,null,46.126950976397893,-79.483176346324541,null,32.123122888999411,-8.6896944358346051,null,0,0]
[691.83,0.69183000000000006,1.0137029772959087,0.16461050463868923,1.0000001959085827,6.2595295464521914E-4,1,0,9.6235312252355563,1.4666964497983279,1.0032143597808221,8.0072132993325454E-2,1.0000076167654297,3.9030032242145123E-3,1.0000000000002394,6.9182999999988975E-7,1.0000000000002394,6.9182999999988975E-7,1.0000002095454508,2.0610971608494575E-3,44.603296092210073,-89.303114252222585,90.696885747777415,null,1000000000,478628.74890000006,null,45.34113935760594,-79.671346826349051,null,32.103459794595054,-9.5137148961947133,null,0,0]
[758.58,0.75858000000000003,1.0164522914643028,0.18016574934550866,1.0000002355360837,6.8634690572888198E-4,1,0,10.542451679711549,1.4757989105987366,1.0038632944976764,8.7759874952321862E-2,1.0000091574433794,4.2795732258119742E-3,1.0000000000002878,7.5857999999985453E-7,1.0000000000002878,7.5857999999985453E-7,1.0000002519318012,2.25995872096336E-3,43.793230653727129,-90.316321128172973,89.683678871827027,null,1000000000,575443.61640000006,null,44.554599487573213,-79.773980117059665,null,32.079934226144843,-10.412898377812846,null,0,0]
[831.76,0.83175999999999994,1.0197474292807003,0.19711846875461034,1.0000002831722716,7.525585754692859E-4,1,0,11.550727673960861,1.4841131796408429,1.0046428236434981,9.6176206504089645E-2,1.0000110094880705,4.6924166618397996E-3,1.0000000000003459,8.3175999999980813E-7,1.0000000000003459,8.3175999999980813E-7,1.0000003028845978,2.4779766057441408E-3,42.978489856391249,-91.326632005349254,88.673367994650746,null,1000000000,691824.69759999996,null,43.767971116967992,-79.791786552513969,null,32.051821799414178,-11.392915507769388,null,0,0]
[912.01,0.91200999999999999,1.0236954852641418,0.21557763506014507,1.0000003404504016,8.2516701957960532E-4,1,0,12.657178880103803,1.4917073543079737,1.0055793355773408,0.10538992043162554,1.0000132363968728,5.1451435106388832E-3,1.0000000000004159,9.1200999999974713E-7,1.0000000000004159,9.1200999999974713E-7,1.0000003641509314,2.7170575329024042E-3,42.158448717471174,-92.340642803262313,87.659357196737687,null,1000000000,831762.24009999994,null,42.981493388482484,-79.72493312576907,null,32.018258388979611,-12.460086002309756,null,0,0]
[1000,1,1.0284219110646202,0.23564665419320438,1.0000004093121491,9.0477843630879927E-4,1,0,13.87104438781337,1.4986411069956271,1.0067040893439145,0.1154716273112156,1.000015913657192,5.6415327984190881E-3,1.0000000000005,9.9999999999966665E-7,1.0000000000005,9.9999999999966665E-7,1.0000004378078493,2.9791976063480012E-3,41.332679743132481,-93.364062021674243,86.635937978325757,null,1000000000,1000000,null,42.195735115565178,-79.573009647482309,null,31.97824768755823,-13.620414220597263,null,0,0]
[1096.5,1.0965,1.0340770075600088,0.25743595332368668,1.0000004921209904,9.9208950064342692E-4,1,0,15.202947908840034,1.5049720860192424,1.0080549861921864,0.12650127470113545,1.000019133154185,6.1859274365730424E-3,1.0000000000006013,1.0964999999995606E-6,1.0000000000006013,1.0964999999995606E-6,1.0000005263836631,3.2666908636508414E-3,40.500295380292343,-94.402410766050295,85.597589233949705,null,1000000000,1202312.25,null,41.410982020170486,-79.334987295645206,null,31.930616420112777,-14.880318695552374,null,0,0]
[1202.3,1.2022999999999999,1.0408347059289764,0.28104058000089149,1.0000005916710091,1.0878149817256432E-3,1,0,16.663793962398625,1.5107499061594403,1.0096765968622268,0.13855832971881976,1.0000230035123823,6.7827828246222978E-3,1.0000000000007228,1.2022999999994205E-6,1.0000000000007228,1.2022999999994205E-6,1.0000006328674089,3.5818909440915969E-3,39.660723799437626,-95.459908431179485,84.540091568820515,null,1000000000,1445525.2899999998,null,40.627988164407107,-79.009410932936731,null,31.874038695021444,-16.245339150951455,null,0,{"$f":"IF(AH90>0,W90,0)","v":0}]
[1318.3,1.3183,1.0489011494274754,0.30655552111518031,1.000000711349571,1.1927691724120141E-3,1,0,18.266009845954326,1.5160224482553479,1.0116226488423032,0.15173122623358093,1.0000276564194082,7.4371744668772308E-3,1.0000000000008691,1.3182999999992363E-6,1.0000000000008691,1.3182999999992363E-6,1.0000007608829169,3.9274792227353078E-3,38.812956465527208,-96.540225208331492,83.459774791668508,null,1000000000,1737914.89,null,39.847276828476275,-78.594247846854344,null,31.806982697041853,-17.721024910658176,null,0,0]
[1445.4,1.4454,1.0585106014119237,0.33404561753016865,1.0000008551270396,1.3077663631597155E-3,1,0,20.022026434644332,1.5208305443071528,1.0139556263284062,0.16610380091148372,1.0000332462246733,8.1541772861035648E-3,1.0000000000010445,1.4453999999989937E-6,1.0000000000010445,1.4453999999989937E-6,1.0000009146778965,4.3061371047995031E-3,37.956416061031405,-97.645163550566764,82.354836449433236,null,1000000000,2089181.1600000001,null,39.069949524656579,-78.087324823197264,null,31.72776959636575,-19.311198060297698,null,0,0]
[1584.9,1.5849000000000002,1.0699605525659466,0.36362440340347008,1.0000010281541476,1.4339827521001711E-3,1,0,21.949805103107941,1.5252220609572971,1.0167561205537887,0.18179903719677298,1.0000399731621057,8.9411219213584945E-3,1.0000000000012559,1.584899999998673E-6,1.0000000000012559,1.584899999998673E-6,1.0000010997630617,4.7217377210445081E-3,37.088410602308315,-98.777720987334689,81.222279012665311,null,1000000000,2511908.0100000002,null,38.295395257610842,-77.48475800092632,null,31.634318404688401,-21.022518150796728,null,0,0]
[1737.8,1.7378,1.0835612417207106,0.39529561284229531,1.0000012361012387,1.572323099964659E-3,1,0,24.063165675983026,1.5292270639579573,1.0201116334566123,0.19889823427316547,1.0000480576582007,9.8036456141731045E-3,1.0000000000015099,1.7377999999982506E-6,1.0000000000015099,1.7377999999982506E-6,1.0000013222055233,5.1772604915716397E-3,36.208802584017796,-99.935788518094142,80.064211481905858,null,1000000000,3019948.84,null,37.525501282208168,-76.783934910789156,null,31.524604361800556,-22.855317999964893,null,0,0]
[1905.5,1.9055,1.0996949745311191,0.42909398879199495,1.0000014861830633,1.7240540726643759E-3,1,0,26.381458870887872,1.5328818342767836,1.0241324880500213,0.21751764265849918,1.0000577801697692,1.0749640717995387E-2,1.0000000000018154,1.9054999999976938E-6,1.0000000000018154,1.9054999999976938E-6,1.0000015897252703,5.676876593369031E-3,35.315590348295494,-101.11763237465642,78.882367625343576,null,1000000000,3630930.25,null,36.760664761523607,-75.98072583360873,null,31.396228646762808,-24.811754648167362,null,0,0]
[2089.3000000000002,2.0893000000000002,1.118775854305162,0.46497206465561375,1.0000017867177209,1.8903518511264603E-3,1,0,28.92265602386135,1.5362144632020152,1.0289437455569197,0.23774964775203464,1.0000694640305197,1.1786433702781806E-2,1.0000000000021827,2.0892999999969601E-6,1.0000000000021827,2.0892999999969601E-6,1.0000019112237641,6.2244593733923109E-3,34.407994276429882,-102.31764530411863,77.682354695881372,null,1000000000,4365174.4900000012,null,36.002485759016515,-75.071866763979472,null,31.246811577404287,-26.8892629959579,null,0,0]
[2290.9,2.2909000000000002,1.1413012681510575,0.50289107621535811,1.0000021481594892,2.0727545169382366E-3,1,0,31.710261202696362,1.5392555641333339,1.0347004347286632,0.25971462467479073,1.0000835155957801,1.2923605055504101E-2,1.0000000000026241,2.2908999999959922E-6,1.0000000000026241,2.2908999999959922E-6,1.0000022978893692,6.8250739922773871E-3,33.483954776126104,-103.52950443574022,76.470495564259778,null,1000000000,5248222.8100000005,null,35.251590779399173,-74.052763655570843,null,31.073667056717852,-29.085824104001993,null,0,0]
[2511.9,2.5119000000000002,1.1678018263383121,0.54271494136307785,1.0000025826101606,2.2727096613150413E-3,1,0,34.766398389079846,1.5420289540840251,1.0415778357046461,0.2835015567816031,1.0001004052319218,1.4170168074701318E-2,1.0000000000031548,2.5118999999947171E-6,1.0000000000031548,2.5118999999947171E-6,1.0000027626754275,7.4834878483282007E-3,32.542775121453928,-104.7426587777373,75.257341222262696,null,1000000000,6309641.6100000003,null,34.5097883938829,-72.920199176007799,null,30.874289787561949,-31.393831252761679,null,0,0]
[2754.2,2.7542,1.1988841478403802,0.5842809090179224,1.0000031048812732,2.4919362911590909E-3,1,0,38.117342013090827,1.5445585386040539,1.0497858119388215,0.30920672073163019,1.0001207085939383,1.5536824196191554E-2,1.000000000003793,2.7541999999930355E-6,1.000000000003793,2.7541999999930355E-6,1.0000033214378041,8.2053623233514141E-3,31.583358370999211,-105.94480011390867,74.05519988609133,null,1000000000,7585617.6399999987,null,33.778533314255718,-71.670639913277967,null,30.646128116734417,-33.804185373625906,null,0,0]
[3020,3.02,1.2352351599311169,0.62738995595992719,1.0000037330843199,2.7324248230166711E-3,1,0,41.793517663822044,1.5468668875271963,1.059574380393115,0.33692651562688486,1.0001451295426076,1.7035961530103099E-2,1.0000000000045604,3.0199999999908185E-6,1.0000000000045604,3.0199999999908185E-6,1.0000039935680995,8.9972528585805858E-3,30.604586009634403,-107.12164196437355,72.878358035626448,null,1000000000,9120400,null,33.059209878192966,-70.300565548329303,null,30.386679191432357,-36.305744832700817,null,0,0]
[3311.3,3.3113000000000001,1.2775497014356061,0.67172642598469445,1.0000044879789154,2.9959846897374218E-3,1,0,45.822586582499994,1.5489712953493733,1.0712187296319411,0.36669841908766876,1.0001744747670431,1.8678833097876855E-2,1.0000000000054823,3.311299999987898E-6,1.0000000000054823,3.311299999987898E-6,1.0000048012986984,9.8651194076576493E-3,29.60728819226885,-108.2551660765356,71.744833923464398,null,1000000000,10964707.690000001,null,32.354475715972477,-68.809464423952164,null,30.094115536287291,-38.880661669001114,null,0,0]
[3630.8,3.6308000000000002,1.3266516511289861,0.71700475007642561,1.00000539582935,3.2850586258875189E-3,1,0,50.241893355533087,1.5508913038897059,1.0850569604502986,0.39858627624046578,1.000209764774753,2.0480630537075276E-2,1.0000000000065914,3.6307999999840453E-6,1.0000000000065914,3.6307999999840453E-6,1.0000057727627285,1.0817007905197412E-2,28.591158890753011,-109.32812445830767,70.67187554169233,null,1000000000,13182708.640000001,null,31.6659289083685,-67.195668564330504,null,29.766533042375428,-41.512895022858032,null,0,0]
[3981.1,3.9811000000000001,1.3833761969313947,0.76285068873947393,1.0000064872328833,3.6019988376873517E-3,1,0,55.087401125143941,1.5526423585653812,1.1014629677592174,0.43258894108301577,1.0002521882620186,2.2455969109431703E-2,1.0000000000079245,3.9810999999789672E-6,1.0000000000079245,3.9810999999789672E-6,1.0000069407456376,1.1860667000547295E-2,27.557743416740582,-110.32161578651581,69.678384213484193,null,1000000000,15849157.209999999,null,30.996182036347058,-65.460965980590601,null,29.402864440384441,-44.181311744035334,null,0,0]
[4365.2,4.3651999999999997,1.4486373203465615,0.80888732033510546,1.0000077994023266,3.9495193719829257E-3,1,0,60.400607245569141,1.5542394454082202,1.1208696974776255,0.46868212055860065,1.0003031907274091,2.4621703571254299E-2,1.0000000000095275,4.3651999999722742E-6,1.0000000000095275,4.3651999999722742E-6,1.0000083451351922,1.3005037910928564E-2,26.508836462802293,-111.21812918713498,68.781870812865023,null,1000000000,19054971.039999999,null,30.347663298444321,-63.608572905133734,null,29.002476224348896,-46.864672603982939,null,0,0]
[4786.3,4.7862999999999998,1.5233916004579886,0.85471964199265071,1.0000093767539606,4.3305151406252901E-3,1,0,66.225776891820544,1.5556958923145556,1.1437627095225447,0.50678965601853954,1.0003644971560031,2.699579505336137E-2,1.0000000000114544,4.7862999999634508E-6,1.0000000000114544,4.7862999999634508E-6,1.00001003356158,1.4259658832257497E-2,25.447166389241097,-112.00211590826876,67.997884091731237,null,1000000000,22908667.690000001,null,29.723031934063066,-61.644645636310585,null,28.565437515168952,-49.540726237429574,null,0,0]
[5248.1,5.2481,1.6086867413196384,0.89998072738323331,1.0000112734405695,4.7483333206130018E-3,1,0,72.614092999121951,1.5570244600660725,1.1706978155225116,0.54680261282136111,1.0004382102297398,2.9598995457664073E-2,1.0000000000137712,5.2480999999518189E-6,1.0000000000137712,5.2480999999518189E-6,1.0000120641244283,1.5635559117757721E-2,24.375627097034808,-112.66178613006753,67.338213869932474,null,1000000000,27542553.610000003,null,29.124692319029137,-59.577345804659807,null,28.092237837996596,-52.188889470590027,null,0,0]
[5370.3,5.3703000000000003,1.6317720324598894,0.9111584947431085,1.0000118045450928,4.8588947243760894E-3,1,0,74.304567349588595,1.5573377975957285,1.1781297569803642,0.55707928448914346,1.000458850196366,3.0287780114052386E-2,1.00000000001442,5.3702999999483734E-6,1.00000000001442,5.3702999999483734E-6,1.0000126327780987,1.599964874441049E-2,24.10676201233121,-112.80621237673012,67.193787623269884,null,1000000000,28840122.090000004,null,28.9795876188061,-59.045953261863765,null,27.968477453516027,-52.843854462597406,null,0,0]
[5432.85,5.4328500000000002,1.6436658131666213,0.91675816379947817,1.0000120811292232,4.9154872792810528E-3,1,0,75.169866071678413,1.5574927312122633,1.181981598010539,0.56228927584454991,1.0004695987396797,3.0640334337060055E-2,1.000000000014758,5.432849999946548E-6,1.000000000014758,5.432849999946548E-6,1.000012928927416,1.6186014345492678E-2,23.971374245846665,-112.87572600218303,67.124273997816971,null,1000000000,29515859.122500002,null,28.907280761708549,-58.77651965695145,null,27.90539654412904,-53.172127314413011,null,0,0]
[5495.4,5.4954000000000001,1.6556103916978386,0.92227720501701893,1.0000123609161078,4.9720798026999472E-3,1,0,76.035166557108397,1.5576441384605633,1.1858653138308539,0.56746528143028407,1.0004804716331612,3.09928809409993E-2,1.0000000000150997,5.4953999999446802E-6,1.0000000000150997,5.4953999999446802E-6,1.0000132285134731,1.6372380342145512E-2,23.837465770180941,-112.94236479849793,67.057635201502066,null,1000000000,30199421.159999996,null,28.83626488516164,-58.508830810649535,null,27.842503945010222,-53.49578055581572,null,0,0]
[5559.4,5.5593999999999992,1.6678833023937059,0.9278421925499778,1.000012650503838,5.0299841901770993E-3,1,0,76.920527729720135,1.5577955297360147,1.1898717259802143,0.57272615700916196,1.0004917252794088,3.1353592110921716E-2,1.0000000000154534,5.559399999942725E-6,1.0000000000154534,5.559399999942725E-6,1.0000135386018019,1.6563066987911435E-2,23.701958047878989,-113.00766017491529,66.992339825084713,null,1000000000,30906928.359999996,null,28.764907685237272,-58.236746151923732,null,27.778353422632634,-53.82223871786438,null,0,0]
[5623.4,5.6233999999999993,1.6802071104001652,0.93332571285532895,1.0000129434445268,5.0878885439237373E-3,1,0,77.805890625175962,1.5579434756145307,1.1939108484367018,0.57795158023987137,1.000503109099246,3.1714295119363016E-2,1.0000000000158114,5.623399999940724E-6,1.0000000000158114,5.623399999940724E-6,1.0000138522885951,1.6753754057439681E-2,23.567946498437514,-113.07012126911337,66.929878730886628,null,1000000000,31622627.559999995,null,28.694839463575612,-57.966494888802337,null,27.714410094852827,-54.144029177809564,null,0,0]
[5688.9,5.6888999999999994,1.6928712983311942,0.93885491588668912,1.0000132467227667,5.1471499956305296E-3,1,0,78.712005936713624,1.5580914428200578,1.1980781618423826,0.58326284383716687,1.0005148945084816,3.208344355626281E-2,1.0000000000161817,5.6888999999386289E-6,1.0000000000161817,5.6888999999386289E-6,1.0000141770536743,1.6948910799023425E-2,23.432316558805812,-113.13120095410417,66.868799045895827,null,1000000000,32363583.209999997,null,28.62443218230705,-57.691810444313226,null,27.649187436489683,-54.46861540251399,null,0,0]
[5754.4,5.7543999999999995,1.7055864713859101,0.944301842797581,1.0000135535129711,5.2064114111842709E-3,1,0,79.618122932369118,1.5582360420618317,1.2022790376109058,0.58853713925093143,1.0005268162552277,3.2452583246310611E-2,1.0000000000165565,5.7543999999364839E-6,1.0000000000165565,5.7543999999364839E-6,1.0000145055884653,1.7144067994797379E-2,23.298200233802046,-113.18949126837828,66.810508731621724,null,1000000000,33113119.359999996,null,28.555312060663315,-57.419050649452579,null,27.584191233129651,-54.788487580850088,null,0,0]
[5821.4,5.8213999999999997,1.7186444017461591,0.94978995519450848,1.0000138709624264,5.2670299205535816E-3,1,0,80.544992382073957,1.5583805866892251,1.2066104752444877,0.59389407056620236,1.0005391520706048,3.2830167362886825E-2,1.0000000000169442,5.8213999999342396E-6,1.0000000000169442,5.8213999999342396E-6,1.0000148455474662,1.7343694914688172E-2,23.162551365180146,-113.24632170057546,66.753678299424536,null,1000000000,33888697.959999993,null,28.485909091184666,-57.142036867021474,null,27.517945333986404,-55.110897854295565,null,0,0]
[5888.4,5.8883999999999999,1.7317533150656328,0.95519514123742177,1.0000141920865344,5.3276483912140637E-3,1,0,81.471863476327485,1.5585218424727578,1.2109762903556986,0.59921252794367819,1.0005516305290847,3.3207742115152566E-2,1.0000000000173366,5.8883999999319428E-6,1.0000000000173366,5.8883999999319428E-6,1.0000151894514639,1.7543322320869668E-2,23.028431716155332,-113.30041628146547,66.699583718534527,null,1000000000,34673254.559999995,null,28.417789638602958,-56.867038505441435,null,27.451945137543298,-55.428556827720456,null,0,0]
[5957,5.9569999999999999,1.7452269009862857,0.96064511139248432,1.0000145246866032,5.3897144265723828E-3,1,0,82.420870451651965,1.5586631798081676,1.2154815955668818,0.6046182506961123,1.0005645547684083,3.3594323763438592E-2,1.0000000000177429,5.9569999999295369E-6,1.0000000000177429,5.9569999999295369E-6,1.0000155456558784,1.7747717458380309E-2,22.892665899688311,-113.35306090573832,66.646939094261683,null,1000000000,35485849,null,28.349341445634995,-56.587560935880369,null,27.384627514044237,-55.748971973299142,null,0,0]
[6025.6,6.0256000000000007,1.758751528816467,0.96601141942688773,1.0000148611389184,5.4517804204058896E-3,1,0,83.36987903595211,1.5588012994291394,1.2200221564554168,0.6099838922787385,1.0005776285335972,3.3980895367174691E-2,1.0000000000181539,6.0255999999270751E-6,1.0000000000181539,6.0255999999270751E-6,1.0000159059966705,1.7952113117549615E-2,22.758447532749344,-113.4030236506468,66.596976349353199,null,1000000000,36307855.360000007,null,28.28217507343528,-56.310194911222368,null,27.317575519304988,-56.064593664721507,null,0,0]
[6095.8,6.0958000000000006,1.7726432224621766,0.97141795655924279,1.0000152094265802,5.5152939741064007E-3,1,0,84.341023540295495,1.5589394226522069,1.2247047092117205,0.61543333033790126,1.0005911620178995,3.43764726994066E-2,1.0000000000185794,6.0957999999244956E-6,1.0000000000185794,6.0957999999244956E-6,1.0000162790245102,1.8161276568726913E-2,22.622672387274399,-113.45146968323041,66.548530316769586,null,1000000000,37158777.640000001,null,28.21473707416542,-56.028543898734988,null,27.249238373099903,-56.38271054896164,null,0,0]
[6166,6.1660000000000004,1.7865859249466054,0.97674026089520949,1.000015561748272,5.5788074833094141E-3,1,0,85.312169617065763,1.5590744012425912,1.229423353589026,0.62084109703736268,1.000604852071884,3.4772039269133026E-2,1.0000000000190097,6.1659999999218569E-6,1.0000000000190097,6.1659999999218569E-6,1.0000166563847097,1.8370440578897782E-2,22.488460878342757,-113.49729640089727,66.50270359910273,null,1000000000,38019556,null,28.148577256496118,-55.749099688460589,null,27.181186681837559,-56.696001284044129,null,0,0]
[6237.8,6.2378,1.8008979409112582,0.98209846554973756,1.0000159262730768,5.6437685472973944E-3,1,0,86.305451648619112,1.5592093139501029,1.2342864488506673,0.62632918128271209,1.0006190161063506,3.517661033931771E-2,1.0000000000194551,6.2377999999190955E-6,1.0000000000194551,6.2377999999190955E-6,1.000017046827731,1.8584372444909091E-2,22.352779027850591,-113.54155366954213,66.458446330457875,null,1000000000,38910148.840000004,null,28.082199497184309,-55.465565766843611,null,27.111882590657203,-57.011539195103104,null,0,0]
[6309.6,6.3096000000000005,1.8152608451372159,0.98737202808409064,1.0000162950178852,5.7087295636521771E-3,1,0,87.298735215308909,1.5593411565908555,1.239186427235021,0.63177402659235082,1.0006333439152353,3.5581169889822135E-2,1.0000000000199054,6.3095999999162696E-6,1.0000000000199054,6.3095999999162696E-6,1.0000174418037056,1.8798304909294909E-2,22.218674955944358,-113.58326221985652,66.416737780143478,null,1000000000,39811052.160000004,null,28.017094424685418,-55.184332691858948,null,27.042883591249868,-57.322227506914999,null,0,0]
[6383.05,6.3830499999999999,1.8300052226188259,0.99268097344466377,1.0000166766032148,5.7751833668744498E-3,1,0,88.314846470838418,1.5594729603389383,1.2442367194682731,0.63729945444602465,1.0006481704401062,3.5995014364268607E-2,1.0000000000203717,6.3830499999133111E-6,1.0000000000203717,6.3830499999133111E-6,1.0000178505472899,1.9017154275310009E-2,22.083092227376319,-113.62338858617031,66.376611413829693,null,1000000000,40743327.302500002,null,27.951777713226722,-54.899012335763139,null,26.972617574140514,-57.635139292663496,null,0,0]
[6456.5,6.4565000000000001,1.8448003533041304,0.99790490956685252,1.0000170626047225,5.8416371190885301E-3,1,0,89.330959225690918,1.5596017656333461,1.2493246908958731,0.64278004302933156,1.0006631683381408,3.6408846504221611E-2,1.0000000000208433,6.4564999999102839E-6,1.0000000000208433,6.4564999999102839E-6,1.0000182640354984,1.9236004282084589E-2,21.949101526922195,-113.66104095374378,66.338959046256221,null,1000000000,41686392.25,null,27.887728130840923,-54.616088575163452,null,26.902676456072193,-57.943180447462758,null,0,0]
[6531.7,6.5316999999999998,1.8599993055140209,1.0031670626040525,1.0000174623782527,5.909674127120847E-3,1,0,90.371283111029499,1.5597306389557171,1.2545724447211961,0.64834498421836018,1.0006787011104661,3.6832525571502552E-2,1.0000000000213316,6.5316999999071123E-6,1.0000000000213316,6.5316999999071123E-6,1.0000186922914069,1.9460069221955943E-2,21.813537679467089,-113.69712479921499,66.30287520078501,null,1000000000,42663104.890000001,null,27.82343270951834,-54.328899851352361,null,26.831408029939674,-58.253619349981527,null,0,0]
[6606.9,6.6068999999999996,1.8752489258734482,1.0083437728557667,1.0000178667808948,5.9777110804404001E-3,1,0,91.411608463121638,1.5598565789506269,1.2598587264961194,0.65386339488381218,1.0006944135029781,3.7256191410046616E-2,1.0000000000218257,6.6068999999038662E-6,1.0000000000218257,6.6068999999038662E-6,1.0000191255217512,1.9684134849109493E-2,21.679582214983544,-113.73081039296206,66.269189607037944,null,1000000000,43651127.609999992,null,27.760400361686067,-54.044208304929356,null,26.760484913288394,-58.5591627840097,null,0,0]
[6683.85,6.6838500000000005,1.8909045960392092,1.0135543740085098,1.0000182853864497,6.047331283224917E-3,1,0,92.476144980942152,1.5599825164849956,1.265307406290781,0.65946231871278504,1.0007106774729049,3.7689702641402978E-2,1.0000000000223368,6.6838499999004689E-6,1.0000000000223368,6.6838499999004689E-6,1.0000195739838962,1.9913415489153367E-2,21.5441436510363,-113.76289546898987,66.237104531010132,null,1000000000,44673850.822500005,null,27.697175898454415,-53.7554676525139,null,26.688270812572807,-58.866856108349644,null,0,0]
[6760.8,6.7608000000000006,1.9066107610372196,1.0186792652405718,1.0000187088390617,6.1169514273862703E-3,1,0,93.540682932075214,1.5601055875618823,1.2707954100199725,0.66501305674479139,1.0007271295022448,3.8123199700310528E-2,1.0000000000228542,6.760799999896992E-6,1.0000000000228542,6.760799999896992E-6,1.0000200276558224,2.014269686558515E-2,21.41032750712381,-113.79266561090162,66.207334389098378,null,1000000000,45708416.640000001,null,27.635208465725746,-53.4693227949627,null,26.616422101388991,-59.16963866151734,null,0,0]
[6839.55,6.83955,1.9227353109078509,1.0238372105243299,1.0000191472154472,6.1882000515312303E-3,1,0,94.630123789272787,1.5602286706114499,1.2764519733229025,0.67064404090292251,1.0007441610741381,3.856682219842459E-2,1.0000000000233897,6.8395499998933505E-6,1.0000000000233897,6.8395499998933505E-6,1.0000204973345701,2.0377342320332E-2,21.27502955685965,-113.82083394697102,66.179166053028979,null,1000000000,46779444.202500001,null,27.573060033076011,-53.179161003973995,null,26.543272583774563,-59.474529106363768,null,0,0]
[6918.3,6.9183000000000003,1.9389101624002554,1.028909231256822,1.0000195906682916,6.2594486128483033E-3,1,0,95.71956604743032,1.5603489518975864,1.2821486524753931,0.67622516298379542,1.0007613895866774,3.9010429509556632E-2,1.0000000000239315,6.9182999998896235E-6,1.0000000000239315,6.9182999998896235E-6,1.000020972470921,2.0611988564266687E-2,21.141367821772022,-113.84677475014264,66.153225249857357,null,1000000000,47862874.890000001,null,27.512162268120566,-52.891694700203267,null,26.47050861364238,-59.774496485877393,null,0,0]
[6998.9,6.9988999999999999,1.9555157798986746,1.0340133844487791,1.0000200497954963,6.3323708840775598E-3,1,0,96.834602953653729,1.5604692562596794,1.2880201433838685,0.68188609436535441,1.0007792267567148,3.9464442164088905E-2,1.0000000000244924,6.9988999998857209E-6,1.0000000000244924,6.9988999998857209E-6,1.000021464421295,2.0852147959349331E-2,21.006228358718694,-113.87111713402007,66.128882865979932,null,1000000000,48984601.209999993,null,27.451095848106117,-52.600253164748928,null,26.396435570603497,-60.076524903484589,null,0,0]
[7079.5,7.0795000000000003,1.9721714845458205,1.0390314536859853,1.0000205142404601,6.4052930879592174E-3,1,0,97.949641229469094,1.5605868215839356,1.2939325350061803,0.68749547093127206,1.0007972702074845,3.9918438541341555E-2,1.0000000000250595,7.0794999998817268E-6,1.0000000000250595,7.0794999998817268E-6,1.0000219620900634,2.1092308200373035E-2,20.872738556406727,-113.89332337682288,66.106676623177123,null,1000000000,50119320.25,null,27.391273339830203,-52.311607634720211,null,26.322768276567444,-60.373621126122707,null,0,0]
[7161.95,7.16195,1.9892599982099561,1.0440776258449433,1.0000209948480006,6.4798889940180507E-3,1,0,99.090274184487171,1.5607043477070852,1.3000223707182896,0.6931806232543084,1.0008159412324726,4.0382838394793313E-2,1.0000000000256468,7.1619499998775462E-6,1.0000000000256468,7.1619499998775462E-6,1.0000224770992601,2.1337981689682935E-2,20.737858967595585,-113.91392776622868,66.086072233771318,null,1000000000,51293527.802499995,null,27.33133153899648,-52.019214302835408,null,26.247830488590026,-60.672547517358581,null,0,0]
[7244.4,7.2443999999999997,2.0063983025092451,1.0490377154726376,1.0000214810202015,6.554484827960623E-3,1,0,100.23090847702757,1.5608191989218583,1.3061538317988735,0.69881258071602848,1.0008348280925758,4.0847220820916318E-2,1.0000000000262408,7.2443999998732674E-6,1.0000000000262408,7.2443999998732674E-6,1.0000229980938595,2.1583656084810533E-2,20.604640037737848,-113.93249367940429,66.067506320595712,null,1000000000,52481331.359999992,null,27.272624955125693,-51.729714552526175,null,26.17331814260308,-60.966541798889089,null,0,0]
[7328.75,7.3287500000000003,2.023981752489886,1.0540250549135732,1.0000219841543656,6.6307995928920034E-3,1,0,101.3978291903677,1.5609340228480699,1.3124690548146491,0.7045196823640314,1.0008543735268935,4.1322286358525029E-2,1.0000000000268554,7.3287499998687894E-6,1.0000000000268554,7.3287499998687894E-6,1.0000235372890831,2.1834992815077829E-2,20.470036338749367,-113.94947624027959,66.050523759720406,null,1000000000,53710576.5625,null,27.213810389700924,-51.436519891164572,null,26.097529009039363,-61.262323320127642,null,0,0]
[7413.1,7.4131,2.0416146781972686,1.0589263656635448,1.0000224931125952,6.7071142805875273E-3,1,0,102.56475121017044,1.5610462339761835,1.3188266160611988,0.7101719431095026,1.0008741448324456,4.1797333234417207E-2,1.0000000000274771,7.4130999998642073E-6,1.0000000000274771,7.4130999998642073E-6,1.0000240827503775,2.2086330515443269E-2,20.337103851301194,-113.96452121655221,66.035478783447786,null,1000000000,54954051.610000007,null,27.156221952814089,-51.146316610524806,null,26.022184958478022,-61.553175820459117,null,0,0]
[7499.45,7.4994499999999995,2.0597156160844485,1.0638568416172085,1.000023020171428,6.78523836423726E-3,1,0,103.7593431091468,1.5611584912852015,1.3253781395415765,0.71590186598500216,1.0008946188841759,4.2283624264722312E-2,1.0000000000281208,7.4994499998594059E-6,1.0000000000281208,7.4994499998594059E-6,1.0000246476365244,2.2343628632451037E-2,20.202716541864628,-113.97801364027993,66.021986359720074,null,1000000000,56241750.302499995,null,27.098504617323321,-50.852310506165033,null,25.945514984532227,-61.845937199839064,null,0,0]
[7585.8,7.5857999999999999,2.0778657517518355,1.0687012983191655,1.0000235533337674,6.8633623650601371E-3,1,0,104.95393628590251,1.561268193154205,1.3319727489603048,0.7215752357967099,1.0009153296167153,4.2769895285549926E-2,1.0000000000287721,7.5857999998544936E-6,1.0000000000287721,7.5857999998544936E-6,1.0000252190912011,2.2600927789753769E-2,20.070012389598524,-113.98967033736803,66.010329662631975,null,1000000000,57544361.640000001,null,27.042005262294072,-50.561397091296378,null,25.869310187295376,-62.133770103483855,null,0,0]
[7674.15,7.67415,2.0964858602064269,1.0735710255139135,1.0000241051621575,6.9432957522555898E-3,1,0,106.17619937196167,1.5613778809417909,1.3387640300532295,0.72732197030813528,1.0009367649937708,4.3267408149254144E-2,1.0000000000294462,7.6741499998493501E-6,1.0000000000294462,7.6741499998493501E-6,1.0000258105811128,2.2864187484014951E-2,19.93594200692802,-113.99979398515191,66.000206014848089,null,1000000000,58892578.222499996,null,26.985424278591005,-50.266923492109562,null,25.791820788327939,-62.423288743122413,null,0,0]
[7762.5,7.7625000000000002,2.1151548092265675,1.0783549013401754,1.0000246633800407,7.0232290507234738E-3,1,0,107.39846370639394,1.561485072093985,1.3455990766396519,0.73301050937495404,1.0009584481110962,4.376489958149192E-2,1.0000000000301283,7.7624999998440873E-6,1.0000000000301283,7.7624999998440873E-6,1.0000264089493152,2.3127448292652682E-2,19.803564104950194,-114.00818892339541,65.991811076604591,null,1000000000,60256406.25,null,26.930051154560665,-49.97563997168573,null,25.714816010380453,-62.70788853060845,null,0,0]
[7852.9,7.8529,2.1343061537573669,1.0831630403234362,1.000025241163935,7.1050169621366035E-3,1,0,108.64908969521363,1.5615922541045149,1.3526373264260529,0.73877134321484783,1.000980890758167,4.4273911953058485E-2,1.000000000030834,7.8528999998385748E-6,1.000000000030834,7.8528999998385748E-6,1.0000270283221484,2.3396818753205512E-2,19.669831135207616,-114.01508516576094,65.984914834239063,null,1000000000,61668038.409999996,null,26.87460969528939,-49.680873843300645,null,25.63652449990915,-62.9941222903647,null,0,0]
[7943.3,7.9432999999999998,{"$f":"SQRT(1+(A141/pole1)^2)","v":2.1535059613527059},{"$f":"ATAN(A141/pole1)","v":1.0878855519361861},{"$f":"SQRT(1+(A141/Zero1)^2)","v":1.0000258256372527},{"$f":"ATAN(A141/Zero1)","v":7.1868047784935992E-3},{"$f":"IF(VIN_nom>Vout, 1, SQRT(1+(A141/z_RHP)^2))","v":1},{"$f":"IF(VIN_nom>Vout, 0, -ATAN(A141/z_RHP))","v":0},{"$f":"SQRT(1+(A141/Pole2)^2)","v":109.89971690378492},{"$f":"ATAN(A141/Pole2)","v":1.5616969967152436},{"$f":"SQRT(1+(A141/Zero2)^2)","v":1.3597200008766765},{"$f":"ATAN(A141/Zero2)","v":0.74447234916069593},{"$f":"SQRT(1+(A141/pole4)^2)","v":1.0010035927413061},{"$f":"ATAN(A141/pole4)","v":4.4782901368486401E-2},{"$f":"SQRT(1+(A141/Zero3)^2)","v":1.0000000000315481},{"$f":"ATAN(A141/Zero3)","v":7.943299999832937E-6},{"$f":"SQRT(1+(A141/pole5)^2)","v":1.0000000000315481},{"$f":"ATAN(A141/pole5)","v":7.943299999832937E-6},{"$f":"SQRT((1-(Z141/pterm2))^2+(A141/pterm1)^2)","v":1.0000276548983227},{"$f":"IF((ATAN((A141/pterm1)/(1-A141^2/pterm2))>0),ATAN((A141/pterm1)/(1-A141^2/pterm2)),PI()+ATAN((A141/pterm1)/(1-A141^2/pterm2)))","v":2.3666190407584334E-2},{"$f":"20*LOG10(((E141*K141*G141*O141)/(C141*I141*S141*M141*Q141))*Adc)","v":19.537799271286609},{"$f":"((F141+L141+H141+R141)-(D141+J141+T141+N141+T141))*radconv","v":-114.02036226665516},{"$f":"IF(V141>0,V141,V141+180)","v":65.979637733344845},null,{"$f":"IF(U141<0,A141,1000000000)","v":1000000000},{"$f":"A141^2","v":63096014.890000001},null,{"$f":"20*LOG10((K141/(I141*M141))*AEA)","v":26.820365432107842},{"$f":"(L141-(J141+N141))*radconv","v":-49.389394518142296},null,{"$f":"20*LOG10((E141*G141/(C141*S141))*Acs*Am)","v":25.558736899169695},{"$f":"(F141+H141-(D141+T141))*radconv","v":-63.27545003702177},null,{"$f":"SUM((U142<0)*(U141>0))*A141","v":0},0]
[8035.8,{"$f":"A142/1000","v":8.0358000000000001},2.173200607115457,1.0926312843995438,1.0000264306122475,7.2704924335271846E-3,1,0,111.17939751273208,1.5618017333154881,1.3670124707974189,0.75024444783118982,1.0010270905177578,4.5303690617372105E-2,1.0000000000322871,8.0357999998270327E-6,1.0000000000322871,8.0357999998270327E-6,1.0000283034873572,2.3941820839393779E-2,19.404425174898485,-114.02418047749299,65.97581952250701,null,1000000000,64574081.640000001,null,26.766066501934812,-49.094517616184469,null,25.47966173295459,-63.558357989210933,null,0,0]
[8128.3,8.1282999999999994,2.1929433178771585,1.097291670146914,1.0000270425910425,7.3541799867195149E-3,1,0,112.45907931353392,1.561904086302776,1.3743500014272869,0.75595510165171076,1.0010508597814318,4.5824455275930251E-2,1.0000000000330345,8.1282999998209895E-6,1.0000000000330345,8.1282999998209895E-6,1.0000289596206464,2.4217452550206138E-2,19.27276004006697,-114.02649138479761,65.973508615202391,null,1000000000,66069260.890000001,null,26.712953524677229,-48.803023264922381,null,25.401109575380673,-63.836376013889662,null,0,0]
[8222.9500000000007,8.2229500000000009,2.2131933252150997,1.1019742072995693,1.0000276760440747,7.4398126034250604E-3,1,0,113.76850626148227,1.5620064348466707,1.3819039752007838,0.76173552155885327,1.0010754625256311,4.635729844700167E-2,1.0000000000338085,8.222949999814663E-6,1.0000000000338085,8.222949999814663E-6,1.0000296388151892,2.449949217519283E-2,19.139766997444678,-114.02738869077847,65.972611309221534,null,1000000000,67616906.702500015,null,26.659799786547556,-48.5082234045421,null,25.321270270888046,-64.115918923110755,null,0,0]
[8270.2750000000015,8.2702750000000016,2.2233362777202932,1.1042834643975765,1.0000279955205189,7.482628870938807E-3,1,0,114.42322017469154,1.5620567306825277,1.3856981355595361,0.76460205018532224,1.0010878704789905,4.6623710173348647E-2,1.0000000000341989,8.2702749998114464E-6,1.0000000000341989,8.2702749998114464E-6,1.000029981375486,2.4640512500560124E-2,19.073916221389123,-114.02730922680126,65.972690773198735,null,1000000000,68397448.575625017,null,26.63366526269435,-48.362129418879221,null,25.2815540186857,-64.253856286840872,null,0,0]
[8317.6,8.3176000000000005,2.2334909788176209,1.1065717352532909,1.0000283168302457,7.5254451110172565E-3,1,0,115.07793437406032,1.5621064542211685,1.3895036199442119,0.76745290079694117,1.0011003494830053,4.6890115276805672E-2,1.0000000000345912,8.3175999998081892E-6,1.0000000000345912,8.3175999998081892E-6,1.0000303259113537,2.4781533170467877E-2,19.00848993877198,-114.02689249516914,65.973107504830864,null,1000000000,69182469.760000005,null,26.607820148530415,-48.216900547620625,null,25.241972850232482,-64.390591248771059,null,0,0]
[8366.0499999999993,8.3660499999999995,2.2438990796376386,1.1088929345640202,1.00002864767725,7.569279141212833E-3,1,0,115.74821259378959,1.5621567770515143,1.3934112016441935,0.77035536569168261,1.0011131987367516,4.716284640650964E-2,1.0000000000349956,8.3660499998048175E-6,1.0000000000349956,8.3660499998048175E-6,1.0000306806842034,2.492590651321883E-2,18.941943481414551,-114.02612774441189,65.973872255588105,null,1000000000,69990792.602499992,null,26.581656254200002,-48.069111187264028,null,25.201590287205477,-64.529346651127639,null,0,0]
[8414.5,8.4145000000000003,2.254319158833777,1.1111926877354408,1.0000289804457301,7.6131131423203139E-3,1,0,116.41849110326292,1.5622065204154176,{"$f":"SQRT(1+(A148/Zero2)^2)","v":1.3973304561514586},{"$f":"ATAN(A148/Zero2)","v":0.77324157302867491},1.0011261224536545,4.7435570515028752E-2,1.0000000000354019,8.4144999998014068E-6,1.0000000000354019,8.4144999998014068E-6,1.0000310375280212,2.5070280221260583E-2,18.875832606359136,-114.02503215008934,65.974967849910655,null,1000000000,70803810.25,null,26.555787219494682,-47.922219713086875,null,25.161348446855378,-64.666873302809819,null,0,0]
[8462.9500000000007,8.4629500000000011,2.2647510510691573,1.1134712666277788,1.0000293151356843,7.6569471141712782E-3,1,0,117.08876989750438,1.5622556942641581,1.4012612855213167,0.77611161133830509,1.0011391206308304,4.7708287562066118E-2,1.0000000000358109,8.4629499997979572E-6,1.0000000000358109,8.4629499997979572E-6,1.0000313964429877,2.5214654296705052E-2,18.810152685029447,-114.02361678433661,65.97638321566339,null,1000000000,71621522.702500015,null,26.530208866330732,-47.776221620529135,null,25.121246878689636,-64.803186780391869,null,0,0]
[8511.4,8.5114000000000001,2.2751945938534832,1.115728938997693,1.0000296517471108,7.700781056597307E-3,1,0,117.75904897165121,1.5623043083224579,1.4052035926173632,0.77896556922733629,1.0011521932653789,4.7980997507331126E-2,1.0000000000362219,8.511399999794467E-6,1.0000000000362219,8.511399999794467E-6,1.000031757429285,2.5359028741664076E-2,18.744899149937666,-114.02189246681547,65.978107533184527,null,1000000000,72443929.959999993,null,26.504917087488803,-47.631112387674278,null,25.081285122439784,-64.938302425330903,null,0,0]
[8560.9500000000007,8.5609500000000001,2.285887128841861,1.1180165200615688,1.0000299979883043,7.7456101662804772E-3,1,0,118.44454622471207,1.5623534570105564,1.4092471763181402,0.78186778306361493,1.001165639707871,4.8259891622220399E-2,1.0000000000366449,8.5609499997908571E-6,1.0000000000366449,8.5609499997908571E-6,1.0000321287539455,2.5506681422193297E-2,18.67860043052281,-114.019820464181,65.980179535819005,null,1000000000,73289864.902500018,null,26.479343288818939,-47.483623251553347,null,25.040560201694788,-65.075262522385472,null,0,0]
[8610.5,8.6105,2.296591514516221,1.1202827881168336,1.0000303462392057,7.790439244831129E-3,1,0,119.13004376059411,1.5624020400764729,1.4133025619100343,0.78475336563720344,1.0011791640208607,4.853877822398369E-2,1.0000000000370703,8.6104999997872033E-6,1.0000000000370703,8.6104999997872033E-6,1.0000325022454475,2.5654334493673932E-2,18.612738206899948,-114.01744742561345,65.982552574386546,null,1000000000,74140710.25,null,26.45406075634326,-47.337054178359352,null,24.999980510547616,-65.211001498180138,null,0,0]
[8660.0499999999993,8.66005,2.3073075859384651,1.1225280166800526,1.0000306964998131,7.8352682920691131E-3,1,0,119.815541574443,1.562450067228218,1.4173696480901483,0.78762241185591342,1.0011927662011924,4.8817657269544033E-2,1.0000000000374982,8.6600499997835071E-6,1.0000000000374982,8.6600499997835071E-6,1.0000328779039886,2.5801987958364758E-2,18.547307785505648,-114.01478413866964,65.98521586133036,null,1000000000,74996466.002499983,null,26.429065317374068,-47.191400284035147,null,24.959545528122501,-65.345535024199492,null,0,0]
[8709.6,8.7096,2.318035181042065,1.1247524750613691,1.0000310487701241,7.880097307814287E-3,1,0,120.50103966151498,1.562497547952908,1.4214483344243729,0.79047501663187847,1.0012064462456927,4.9096528715831485E-2,1.0000000000379285,8.7095999997797719E-6,1.0000000000379285,8.7095999997797719E-6,1.0000332557297684,2.594964181852448E-2,18.482304535539164,-114.01184113699262,65.988158863007385,null,1000000000,75857132.160000011,null,26.404352870592387,-47.046656671620042,null,24.919254724937694,-65.478878530917825,null,0,{"$f":"IF(AH154>0,W154,0)","v":0}]
[8760.3250000000007,8.7603249999999999,2.3290289346934543,1.1270084449659687,1.0000314114757214,7.9259893400633417E-3,1,0,121.20279353135281,1.5625455982703518,1.4256356524494178,0.79337833461231833,1.0012205313432117,4.9382005241394286E-2,1.0000000000383715,8.760324999775902E-6,1.0000000000383715,8.760324999775902E-6,1.000033644760236,2.6100797468806083E-2,18.416197552376278,-114.00854934035773,65.991450659642268,null,1000000000,76743294.105625018,null,26.379343336461609,-46.899418485046738,null,24.878157275905586,-65.614167246364048,null,0,0]
[8811.0499999999993,8.8110499999999998,2.340034430293267,1.1292432058974851,1.0000317762874618,7.9718813389262084E-3,1,0,121.90454767780582,1.5625930953762293,1.4298349170778222,0.79626462336530301,1.0012346980347473,4.9667473711680114E-2,1.0000000000388174,8.8110499997719848E-6,1.0000000000388174,8.8110499997719848E-6,1.0000340360623725,2.6251953538324893E-2,18.350528616410962,-114.00498595367122,65.995014046328777,null,1000000000,77634602.102499992,null,26.354621899761234,-46.753123843114764,null,24.837209776640648,-65.74824080309682,null,0,0]
[8861.7749999999996,8.8617749999999997,2.3510515029459782,1.1314570335334684,1.0000321432053432,8.0177733042096182E-3,1,0,122.60630209612432,1.5626400487694769,1.4340460233611827,0.79913398461010998,1.0012489463168359,4.9952934080504961E-2,1.0000000000392655,8.8617749997680252E-6,1.0000000000392655,8.8617749997680252E-6,1.0000344296363952,2.6403110029503928E-2,18.285292957582925,-114.00116148589949,65.998838514100512,null,1000000000,78531056.15062499,null,26.330184383420395,-46.607767459341659,null,24.796411634153451,-65.881114996426177,null,0,0]
[8912.5,8.9124999999999996,2.362079990660594,1.1336501992318357,1.0000325122293634,8.0636652357203072E-3,1,0,123.30805678166668,1.5626864677328045,{"$f":"SQRT(1+(A158/Zero2)^2)","v":1.4382688672859858},{"$f":"ATAN(A158/Zero2)","v":0.80198651999137327},1.0012632761859945,5.0238386301692708E-2,1.0000000000397162,8.9124999997640181E-6,1.0000000000397162,8.9124999997640181E-6,1.0000348254825231,2.6554266944766106E-2,18.22048587054239,-113.99708619040058,66.00291380959942,null,1000000000,79432656.25,null,26.306026682508232,-46.463344039133233,null,24.755762248025086,-66.012805374165438,null,0,0]
[8964.4,8.9643999999999995,2.3733755923717048,1.1358730608533658,1.0000328919813817,8.1106201782944701E-3,1,0,124.02606726898486,1.5627334182694195,1.4426015707925897,0.80488782275109227,1.0012780224341096,5.0530442291383551E-2,1.0000000000401803,8.964399999759873E-6,1.0000000000401803,8.964399999759873E-6,1.0000352328499689,2.6708925718450217E-2,18.154616321449108,-113.99266731601973,66.007332683980266,null,1000000000,80360467.359999999,null,26.281594795373159,-46.316535278928633,null,24.714324586066873,-66.146336938633297,null,0,0]
[9016.2999999999993,9.0162999999999993,2.3846828100716428,1.1380748534164975,1.0000332739382376,8.1575750851038253E-3,1,0,124.74407802655298,1.5627798283237195,1.4469463446991992,0.80777172606869341,1.0012928540854169,5.0822489653825229E-2,1.0000000000406468,9.0162999997556754E-6,1.0000000000406468,9.0162999997556754E-6,1.0000356425964692,2.6863584941223487E-2,18.089185666327666,-113.98800677996383,66.011993220036175,null,1000000000,81293665.689999983,null,26.257447367921184,-46.170691971663871,null,24.673041358397402,-66.278661362755315,null,0,0]
[9068.2000000000007,9.0682000000000009,2.3960014793057813,1.1402558540104331,1.0000336580999283,8.2045299559413681E-3,1,0,125.46208904973119,1.5628257071749336,1.4513030806001523,0.81063833845493605,1.0013077711361216,5.1114528339583826E-2,1.000000000041116,9.0681999997514338E-6,1.000000000041116,9.0681999997514338E-6,1.000036054722262,2.7018244615680899E-2,18.024189068968198,-113.98311477020367,66.01688522979633,null,1000000000,82232251.24000001,null,26.233580228237926,-46.025808428958676,null,24.631911900721196,-66.409794522733876,null,0,0]
[9120.1,9.1201000000000008,2.4073314385473914,1.1424163353071135,1.0000340444664515,8.2514847906000888E-3,1,0,126.18010033398522,1.562871063891091,1.4556716710909094,0.81348776826003566,1.0013227735824071,5.140655829923426E-2,1.0000000000415881,9.120099999747143E-6,1.0000000000415881,9.120099999747143E-6,1.0000364692275869,2.7172904744417328E-2,17.959621759699374,-113.97800121871778,66.021998781282221,null,1000000000,83176224.010000005,null,26.209989277145574,-45.881878959530958,null,24.59093554254472,-66.539752041680998,null,0,0]
[9173.2000000000007,9.1732000000000014,2.4189348812974103,1.1446058133187844,1.0000344420481919,8.2995252485166347E-3,1,0,126.91471330079521,1.5629169381761341,1.4601534273833068,0.81638541054699176,1.0013382112821634,5.1705331314062491E-2,1.0000000000420739,9.173199999742699E-6,1.0000000000420739,9.173199999742699E-6,1.0000368957797972,2.7331141302749509E-2,17.89400095038064,-113.97255024626283,66.027449753737173,null,1000000000,84147598.24000001,null,26.186134511325477,-45.735603121485802,null,24.549169499046087,-66.6715136627096,null,0,0]
[9226.2999999999993,9.2262999999999984,2.4305498092211306,1.1467743758191018,1.0000348419378957,8.3475656681236202E-3,1,0,127.64932653161675,1.5629622844544635,1.4646473685174011,0.81926529536337778,1.001353738363929,5.2004095089956417E-2,1.0000000000425624,9.2262999997382042E-6,1.0000000000425624,9.2262999997382042E-6,1.0000373248233598,2.7489378342105738E-2,17.828819617861534,-113.96688760680723,66.033112393192766,null,1000000000,85124611.689999983,null,26.162560399125304,-45.590313929652076,null,24.507562278727157,-66.80207694296557,null,0,0]
[9279.4,9.279399999999999,2.4421760584489678,1.148922300977185,1.0000352441355598,8.3956060491993511E-3,1,0,128.38394002191782,1.5630071117896611,1.4691533826778578,0.82212753811059369,1.0013693548235465,5.2302849574011878E-2,1.0000000000430536,9.2793999997336586E-6,1.0000000000430536,9.2793999997336586E-6,1.0000377563585363,2.7647615865264794E-2,17.764072863336068,-113.96102314285942,66.038976857140582,null,1000000000,86107264.359999999,null,26.139262777125658,-45.446005288290401,null,24.46611314620133,-66.931457820537304,null,0,0]
[9332.5,9.3324999999999996,2.4538134680587889,1.1510498624546164,1.0000356486411817,8.4436463915221298E-3,1,0,129.11855376726953,1.5630514290390509,1.4736713591183588,0.82497225393677942,1.0013850606568342,5.2601594713334629E-2,1.0000000000435478,9.3324999997290587E-6,1.0000000000435478,9.3324999997290587E-6,1.0000381903855897,2.7805853875005355E-2,17.69975585636049,-113.95496644135834,66.045033558641663,null,1000000000,87095556.25,null,26.116237555203369,-45.302671104355014,null,24.424821361148041,-67.059671975250495,null,0,0]
[9386.85,9.3868500000000008,2.4657362206167277,1.1532067003686257,1.0000360650591538,8.4928175866622949E-3,1,0,129.87046093949479,1.5630962703336677,1.4783079644550297,0.82786590499754309,1.0014012287630221,5.2907362727027979E-2,1.0000000000440563,9.386849999724299E-6,1.0000000000440563,9.386849999724299E-6,1.0000386372106855,2.796781739177313E-2,17.634364865886305,-113.94857782728745,66.051422172712549,null,1000000000,88112952.922499999,null,26.092948208912233,-45.156965544647377,null,24.382719716964996,-67.189712208956365,null,0,0]
[9441.2000000000007,9.4412000000000003,2.4776703332310119,1.1553427706004848,1.0000364838950178,8.5419887407335287E-3,1,0,130.62236836984957,1.5631405953844395,1.4829568705208556,0.8307414374570552,1.0014174904912665,5.3213120838750919E-2,1.0000000000445681,9.4411999997194834E-6,1.0000000000445681,9.4411999997194834E-6,1.0000390866469206,2.8129781424191088E-2,17.569414068503633,-113.94200734756886,66.057992652431139,null,1000000000,89136257.440000013,null,26.06993579642819,-45.012267958388662,null,24.340781332066364,-67.318562574021044,null,0,0]
[9495.5499999999993,9.4955499999999997,2.4896156425364389,1.1574583524493531,1.0000369051487701,8.5911598534981082E-3,1,0,131.37427605390178,1.5631844130552024,1.4876179619940264,0.83359897384909432,1.0014338458370067,5.351886899181775E-2,1.0000000000450826,9.4955499997146084E-6,1.0000000000450826,9.4955499997146084E-6,1.0000395386945817,2.8291745975238466E-2,17.504898499930007,-113.93526448916485,66.064735510835149,null,1000000000,90165469.80249998,null,26.047196160663919,-44.868571829523042,null,24.299005399257009,-67.446239073291963,null,0,0]
[9549.9,9.5498999999999992,2.5015719881363454,1.1595537206158342,1.0000373288204081,8.6403309247183192E-3,1,0,132.12618398732025,1.5632277320080303,1.492291124693143,0.83643863635414972,1.0014502947956556,5.3824607129553989E-2,1.0000000000456004,9.549899999709681E-6,1.0000000000456004,9.549899999709681E-6,1.0000399933539572,2.845371104789441E-2,17.440813266180612,-113.92835848424242,66.071641515757577,null,1000000000,91200590.00999999,null,26.024725218478068,-44.725870650677201,null,24.257391107693461,-67.57275744613861,null,0,0]
[9605.5249999999996,9.6055250000000001,2.5138200817330247,1.1616775955464436,1.0000377649346146,8.6906554598633057E-3,1,0,132.89573122908709,1.5632715596121292,1.4970862967538938,0.83932653402844204,1.0014672265593998,5.4137507167464918E-2,1.0000000000461331,9.6055249997045784E-6,1.0000000000461331,9.6055249997045784E-6,1.0000404613838534,2.8619476212388473E-2,17.375665214512029,-113.92113091197604,66.078869088023964,null,1000000000,92266110.52562499,null,26.002001166523193,-44.580845290431711,null,24.214967107979763,-67.7010607768688,null,0,0]
[9661.15,9.6611499999999992,2.5260794047898432,1.1637808651212296,1.0000382035814734,8.7409799509880291E-3,1,0,133.66527872318855,1.5633148825613508,1.5018938746564521,0.8421959671253697,1.0014842563699076,5.445039659454682E-2,1.0000000000466689,9.6611499996994166E-6,1.0000000000466689,9.6611499996994166E-6,1.0000409321500541,2.8785241929564994E-2,17.310957772785486,-113.91375122544351,66.086248774556495,null,1000000000,93337819.32249999,null,25.979550138989961,-44.436848349990569,null,24.172710693786449,-67.82818354186216,null,0,0]
[9716.7749999999996,9.7167750000000002,2.5383497946039593,1.1658638094146665,1.0000386447609813,8.7913043978376498E-3,1,0,134.43482646529125,1.5633577095219471,1.506713739648236,0.84504706536701124,1.0015013842221774,5.4763275350078931E-2,1.000000000047208,9.7167749996941938E-6,1.000000000047208,9.7167749996941938E-6,1.0000414056528744,2.8951008202617375E-2,17.246685915779338,-113.90622853264384,66.093771467356163,null,1000000000,94415716.40062499,null,25.957367989224203,-44.293872889886799,null,24.130620986546059,-67.9541417884016,null,0,0]
[9772.4,9.7723999999999993,2.5506310914579324,1.1679267038197811,1.0000390884731347,8.8416288001573265E-3,1,0,135.20437445116053,1.5634000489628723,1.5115457741897511,0.84787995801533955,1.001518610111179,5.5076143373352995E-2,1.0000000000477498,9.7723999996889117E-6,1.0000000000477498,9.7723999996889117E-6,1.0000418818926298,2.9116775034738886E-2,17.182844690474987,-113.89857168840703,66.101428311592969,null,1000000000,95499801.75999999,null,25.935450645108663,-44.151911985711912,null,24.088697105357248,-68.078951295542808,null,0,0]
[9829.2999999999993,9.8292999999999999,2.5632050136548288,1.1700164203299344,1.0000395449761537,8.8931066592929462E-3,1,0,135.99156176235618,1.5634428630995358,1.5165010353592356,0.85075908232408004,1.0015363322686954,5.5396171586212718E-2,1.0000000000483076,9.8292999996834461E-6,1.0000000000483076,9.8292999996834461E-6,1.0000423718805302,2.9286342047925393E-2,17.117980599709618,-113.89060951268425,66.10939048731575,null,1000000000,96615138.48999998,null,25.913300736800878,-44.007739649219111,null,24.045982922899661,-68.205449242231325,null,0,0]
[9886.2000000000007,9.8862000000000005,2.5757900198400923,1.1720857255864428,1.0000400041292452,8.9445844712944377E-3,1,0,136.77874931996192,1.5634851844293767,1.5214687854026892,0.85361942894822773,1.0015541569979807,5.5716188440718073E-2,1.0000000000488685,9.8861999996779177E-6,1.0000000000488685,9.8861999996779177E-6,1.000042864732948,2.9455909652862853E-2,17.053556850263384,-113.8825249243225,66.117475075677504,null,1000000000,97736950.440000013,null,25.891419525218048,-43.864614308266873,null,24.003440385036257,-68.330777746835494,null,0,0]
[9943.1,9.9431000000000012,2.5883859483391571,1.1741348997207619,1.0000404659324054,8.9960622358890314E-3,1,0,137.56593711974764,1.5635270214121457,1.5264489023869079,0.85646113464396356,1.0015720842935587,5.6036193871930866E-2,1.0000000000494325,9.9430999996723233E-6,1.0000000000494325,9.9430999996723233E-6,1.0000433604502275,2.9625477852968776E-2,16.989568367471598,-113.87432661951456,66.125673380485438,null,1000000000,98865237.610000014,null,25.869802883750751,-43.722528608290553,null,23.961068543711768,-68.454952859916915,null,0,0]
[10000,10,2.6009926404702841,1.1761642181166416,1.0000409303856304,9.0475399528039697E-3,1,0,138.35312515757957,1.5635683823150666,1.531441265663172,0.85928433559509654,1.0015901141499219,5.635618781492694E-2,1.00000000005,9.9999999996666679E-6,1.00000000005,9.9999999996666679E-6,1.0000438590327148,2.9795046651660537E-2,16.926010150606491,-113.86602304419382,66.133976955806176,null,1000000000,100000000,null,25.84844676072106,-43.581475216489778,null,23.918866449876347,-68.577990360013615,null,0,0]
[10058.25,10.058249999999999,2.6139094240224918,1.1782213984451337,1.0000414086035156,9.1002389718514865E-3,1,0,139.15899013111925,1.5636102398180465,1.5365646378673532,0.86215549239886269,1.0016086780135578,5.6683761913279264E-2,1.0000000000505842,1.0058249999660807E-5,1.0000000000505842,1.0058249999660807E-5,1.0000443724128354,2.9968639235281997E-2,16.861384516922072,-113.85742197504048,66.142578024959519,null,1000000000,101168393.0625,null,25.826849655953275,-43.438136920725007,null,23.875837920959722,-68.702784801696538,null,0,0]
[10116.5,10.1165,2.6268371607990777,1.1802583388769508,1.0000418895986998,9.1529379403515361E-3,1,0,139.964855345665,1.5636516153214486,1.5417005925569873,0.86500754288815329,1.0016273493506118,5.7011323834160854E-2,1.0000000000511717,1.011649999965488E-5,1.0000000000511717,1.011649999965488E-5,1.000044888796477,3.0142232453477583E-2,16.79719943428201,-113.84872771776504,66.151272282234956,null,1000000000,102343572.25,null,25.805517218918371,-43.295865021883763,null,23.832985275354559,-68.826419621975447,null,0,0]
[10174.75,10.17475,2.6397756898768252,1.1822753199937612,1.000042373371179,9.2056368580114793E-3,1,0,140.77072079707767,1.5636925171029905,1.5468490044003731,0.86784063120902444,1.0016461281550739,5.7338873507961977E-2,1.0000000000517628,1.0174749999648884E-5,1.0000000000517628,1.0174749999648884E-5,1.0000454081840178,3.0315826309913294E-2,16.733449770292946,-113.83994856027907,66.160051439720931,null,1000000000,103525537.5625,null,25.784445336443365,-43.154651731295289,null,23.790307493840501,-68.948910897222561,null,0,0]
[10233,10.233000000000001,2.6527248533390573,1.1842726175551062,1.0000428599209488,9.2583357245386803E-3,1,0,141.57658648131252,1.5637329532519271,1.5520097494268545,0.87065490081480579,1.0016650144208998,5.7666410865088627E-2,1.0000000000523572,1.023299999964282E-5,1.0000000000523572,1.023299999964282E-5,1.0000459305758378,3.0489420808254935E-2,16.670130468437808,-113.8310925430997,66.1689074569003,null,1000000000,104714289,null,25.763629970872302,-43.014489289181959,null,23.747803557556431,-69.070274427522619,null,0,0]
[10292.5,10.2925,2.6659627138577466,1.1862927356946626,1.000043359779025,9.3121654149352865E-3,1,0,142.39974565683386,1.5637737846212121,1.5572938455727976,0.87351028209569581,1.0016844169102428,5.8000964132548558E-2,1.0000000000529679,1.0292499999636554E-5,1.0000000000529679,1.0292499999636554E-5,1.0000464672798559,3.0666741176951166E-2,16.605891517547022,-113.82197524001243,66.178024759987565,null,1000000000,105935556.25,null,25.742628635468211,-42.872395948103474,null,23.704565942069728,-69.19309416585314,null,0,0]
[10352,10.352,2.6792113463075085,1.1882928830630888,1.0000438625348593,9.3659950513638648E-3,1,0,143.22290506703519,1.5638141466420914,1.5625905527177526,0.87634632861939166,1.0017039315096541,5.8335504402315976E-2,1.000000000053582,1.0351999999630213E-5,1.000000000053582,1.0351999999630213E-5,1.0000470071192848,3.0844062223129794E-2,16.542091169081615,-113.81279394034108,66.187206059658919,null,1000000000,107163904,null,25.721886662446501,-42.731382770615667,null,23.661507566626035,-69.314769705191992,null,0,0]
[10411.5,10.4115,2.6924705916745149,1.1902733385797692,1.0000443681884477,9.4198246335125361E-3,1,0,144.04606470789324,1.5638540473607887,1.5678997430536128,0.87916319094547479,1.0017235582125812,5.8670031600271094E-2,1.0000000000541998,1.0411499999623801E-5,1.0000000000541998,1.0411499999623801E-5,1.0000475500945372,3.1021383950697222E-2,16.478724270887778,-113.80355645579405,66.196443544205948,null,1000000000,108399332.25,null,25.701399982317412,-42.591441587057851,null,23.618627348561287,-69.435317026684444,null,0,0]
[10471,10.471,2.7057402939357322,1.1922343763169672,1.0000448767397856,9.4736541610694319E-3,1,0,144.86922457547615,1.5638934946406564,1.5732212901983473,0.88196101882135303,1.0017432970124356,5.900454565231162E-2,1.000000000054821,1.0470999999617314E-5,1.000000000054821,1.0470999999617314E-5,1.0000480962060276,3.1198706363559692E-2,16.415785747914825,-113.79427035641739,66.205729643582615,null,1000000000,109641841,null,25.681164600979145,-42.452564263826723,null,23.575924206926608,-69.554751833756143,null,0,0]
[10532,10.532,2.7193552218980779,1.1942249756548677,1.00004540111999,9.5288406785395199E-3,1,0,145.71313660384203,1.5639334737046224,1.5786896911871908,0.88480977577912445,1.0017636497936633,5.9347479106952102E-2,1.0000000000554614,1.0531999999610587E-5,1.0000000000554614,1.0531999999610587E-5,1.0000486593413032,3.1380499804867873E-2,16.35170001687117,-113.78470736215036,66.215292637849643,null,1000000000,110923024,null,25.6606758619725,-42.311281784365327,null,23.532327214889591,-69.676058817051057,null,0,0]
[10593,10.593,2.7329808178819275,1.1961957340048144,1.0000459285458811,9.5840271379667597E-3,1,0,146.55704886242276,1.5639729923496888,1.5841708153899201,0.88763884254990455,1.0017841203808617,5.9690398586825941E-2,1.0000000000561058,1.059299999960378E-5,1.0000000000561058,1.059299999960378E-5,1.0000492257738303,3.1562293974773593E-2,16.288053972142372,-113.77510863368643,66.224891366313571,null,1000000000,112211649,null,25.640442986219092,-42.171100288762716,null,23.4889140459142,-69.796229040544702,null,0,0]
[10654,10.654,2.7466169231194413,1.1981469314566295,1.0000464590174543,9.6392135390150971E-3,1,0,147.40096134726423,1.5640120584838191,1.5896645311985544,0.89044837775502439,1.0018047087668087,6.0033304012141901E-2,1.0000000000567537,1.0653999999596897E-5,1.0000000000567537,1.0653999999596897E-5,1.0000497955040637,3.1744088877485449E-2,16.224842388834986,-113.7654815796803,66.234518420319702,null,1000000000,113507716,null,25.620461906117193,-42.032011137207292,null,23.445683542708714,-69.915278552462212,null,0,0]
[10715,10.715,2.7602633818588673,1.2000788431633889,1.0000469925347046,9.6943998813484762E-3,1,0,148.24487405450233,1.5640506798349119,1.5951707085178615,0.89323853906661255,1.0018254149442418,6.0376195303128495E-2,1.0000000000574056,1.0714999999589933E-5,1.0000000000574056,1.0714999999589933E-5,1.0000503685324604,3.1925884517211851E-2,16.162060121476671,-113.7558333700012,66.244166629998801,null,1000000000,114811225,null,25.600728630379308,-41.894005733956945,null,23.402634551088283,-70.03322311817395,null,0,0]
[10777.5,10.7775,2.7742559880126456,1.2020385405968723,1.0000475423301649,9.7509432036369525E-3,1,0,149.10953894027622,1.5640897974648327,1.6008250740999859,0.89607738040598506,1.0018467524542018,6.0727503603825964E-2,1.0000000000580771,1.0777499999582714E-5,1.0000000000580771,1.0777499999582714E-5,1.0000509590730144,3.2112151310344492E-2,16.098174010572258,-113.74593322014159,66.254066779858405,null,1000000000,116154506.25,null,25.580763034661906,-41.753721864380232,null,23.358714035901276,-70.152938117755127,null,0,0]
[10840,10.84,2.7882591414992732,1.2039785614921612,1.0000480953229209,9.8074864635731163E-3,1,0,149.97420405158488,1.5641284640352442,1.6064922498874468,0.89889621533381314,1.00186821360433,6.1078796897035458E-2,1.0000000000587528,1.0839999999575412E-5,1.0000000000587528,1.0839999999575412E-5,1.0000515530769116,3.2298418886127771E-2,16.0347279026549,-113.73602536021848,66.263974639781523,null,1000000000,117505600,null,25.561049335741085,-41.61455757407758,null,23.314981626904739,-70.271525783156136,null,0,0]
[10902.5,10.9025,2.8022726842014634,1.2058991863295649,1.0000486515129674,9.8640296607955189E-3,1,0,150.83886938454987,1.56416668730296,1.6121721007873182,0.90169521027125643,1.0018897983866808,6.1430075097020101E-2,1.0000000000594322,1.0902499999568026E-5,1.0000000000594322,1.0902499999568026E-5,1.0000521505446522,3.2484687249087582E-2,15.971716513643104,-113.72611676539937,66.273883234600632,null,1000000000,118864506.25,null,25.54158347913253,-41.476503767339231,null,23.271436094501496,-70.389002184995007,null,0,0]
[10965,10.965,2.8162964610328682,1.2078006905813898,1.000049210900299,9.9205727949427166E-3,1,0,151.70353493538096,1.5642044748479527,1.6178644933037243,0.90447453054859561,1.001911506793264,6.1781338118065299E-2,1.0000000000601155,1.0964999999560553E-5,1.0000000000601155,1.0964999999560553E-5,1.0000527514767394,3.2670956403749625E-2,15.909134640966528,-113.71621417628613,66.28378582371387,null,1000000000,120231225,null,25.522361487346558,-41.339551400827226,null,23.228076213610894,-70.505383106952266,null,0,0]
[11028.75,11.02875,2.8306110988521338,1.2097208074631809,1.0000497847692149,9.9782467264179341E-3,1,0,152.58549401783333,1.5642425769441723,1.6236835172456607,0.90728933870866002,1.0019337767173295,6.2139610673319412E-2,1.0000000000608167,1.1028749999552846E-5,1.0000000000608167,1.1028749999552846E-5,1.0000533679969636,3.2860951761809747E-2,15.845738306584927,-113.70612647551827,66.293873524481725,null,1000000000,121633326.5625,null,25.503002238820859,-41.200985367593631,null,23.184039127754993,-70.62297915986754,null,0,0]
[11092.5,11.092499999999999,2.8449360676640003,1.2116215947511124,1.0000503619645749,1.0035920591510093E-2,1,0,153.46745331925862,1.564280241103966,1.6295153139283551,0.91008402130723287,1.0019561752431103,6.2497867256337665E-2,1.0000000000615219,1.1092499999545046E-5,1.0000000000615219,1.1092499999545046E-5,1.0000539881225612,3.3050947953067358E-2,15.782778160044526,-113.69605847256662,66.303941527433381,null,1000000000,123043556.25,null,25.483888585595167,-41.063546437044515,null,23.140192634440279,-70.739467760175884,null,0,0]
[11156.25,11.15625,2.8592712121934349,1.2135033293365569,1.0000509424863733,1.0093594389835632E-2,1,0,154.34941283590317,1.5643174748343915,1.6353597467065999,0.91285875022931162,1.0019787023619819,6.2856107776231435E-2,1.0000000000622311,1.1156249999537158E-5,1.0000000000622311,1.1156249999537158E-5,1.0000546118540758,3.3240944982324439E-2,15.720248933159969,-113.68601660934074,66.31398339065926,null,1000000000,124461914.0625,null,25.465016543546938,-40.927225185810144,null,23.096535449603955,-70.854864772881427,null,0,0]
[11220,11.22,2.8736163801545813,1.2153662831275096,1.0000515263346044,1.0151268121010986E-2,1,0,155.23137256409859,1.5643542854719032,1.6412166805876018,0.91561369614326127,1.0020013580652714,6.3214332142136731E-2,1.0000000000629443,1.1219999999529176E-5,1.0000000000629443,1.1219999999529176E-5,1.0000552391920539,3.3430942854382681E-2,15.658145439825198,-113.67600710215812,66.323992897841876,null,1000000000,125888400,null,25.446382204796283,-40.792012250455244,null,23.053066295019839,-70.969185777461817,null,0,0]
[11285.5,11.285500000000001,2.888365620002983,1.2172610962640875,1.0000521296746923,1.0210524982306336E-2,1,0,156.13754316807288,1.5643916734595122,1.6472472734496928,0.91842384105876296,1.0020247696081777,6.3582373197367842E-2,1.0000000000636813,1.1285499999520885E-5,1.0000000000636813,1.1285499999520885E-5,1.0000558875079759,3.3626157237170398E-2,15.594775203134601,-113.66576282694163,66.334237173058369,null,1000000000,127362510.25,null,25.427479887209877,-40.654232179866185,null,23.008598375915646,-71.085540365461213,null,0,0]
[11351,11.351000000000001,2.9031251246070235,1.2191366495960994,1.0000527365263345,1.0269781771893305E-2,1,0,157.04371398778704,1.5644286299761825,1.653290779524919,0.92121346323470987,1.0020483168732133,6.39503970051572E-2,1.0000000000644227,1.1350999999512492E-5,1.0000000000644227,1.1350999999512492E-5,1.0000565396322614,3.3821372519942113E-2,15.531843554552673,-113.65556531013966,66.344434689860336,null,1000000000,128845201,null,25.408820378524368,-40.517602265969565,null,22.964326236019232,-71.200791503617324,null,0,0]
[11416.5,11.416499999999999,2.9178947382009341,1.2209932222914002,1.000053346889525,1.0329038489355877E-2,1,0,157.94988501952795,1.5644651624479609,1.6593470577196889,0.92398274372687894,1.0020719998508099,6.4318403467032756E-2,1.0000000000651683,1.1416499999504004E-5,1.0000000000651683,1.1416499999504004E-5,1.0000571955655131,3.4016588707905096E-2,15.469345130067831,-113.64542059361976,66.354579406380239,null,1000000000,130336472.25,null,25.390399680588853,-40.382112554872649,null,22.9202485094699,-71.314955187392243,null,0,0]
[11482,11.481999999999999,2.932674308051217,1.222831088419428,1.0000539607642567,1.0388295134278042E-2,1,0,158.85605625966724,1.5645012781314562,1.6654159686967309,0.92673186220825354,1.0020958185313456,6.4686392484550576E-2,1.0000000000659182,1.1481999999495419E-5,1.0000000000659182,1.1481999999495419E-5,1.0000578553083377,3.4211805806266371E-2,15.407274650659993,-113.6353344966536,66.364665503346401,null,1000000000,131836324,null,25.372213872911267,-40.247753162204397,null,22.87636383773965,-71.428047120130273,null,0,0]
[11548.75,11.54875,2.9477460187854843,1.2246850614296723,1.0000545899668509,1.0448682556141672E-2,1,0,159.77952105481472,1.5645376615923112,1.6716135528353897,0.92951288652504571,1.0021202313691111,6.5061386144451894E-2,1.0000000000666867,1.1548749999486568E-5,1.0000000000666867,1.1548749999486568E-5,1.0000585315616255,3.4410749363787844E-2,15.344454514599208,-113.62512202570511,66.37487797429489,null,1000000000,133373626.5625,null,25.353918684708404,-40.111982378781391,null,22.83183888988173,-71.542210630877705,null,0,0]
[11615.5,11.615500000000001,2.9628277584570655,1.2265201660645495,1.0000552228162802,1.050906990179744E-2,1,0,160.70298605904051,1.5645736269047563,1.6778239698255011,0.93227334429763642,1.002144785118392,6.5436361481491262E-2,1.0000000000674598,1.1615499999477612E-5,1.0000000000674598,1.1615499999477612E-5,1.0000592117725602,3.4609693877704781E-2,15.282068006474226,-113.61498195866329,66.385018041336707,null,1000000000,134919840.25,null,25.335859455518921,-39.977364963579852,null,22.787511610946222,-71.655293122512944,null,0,0]
[11682.25,11.68225,{"$f":"SQRT(1+(A205/pole1)^2)","v":2.9779193746906278},{"$f":"ATAN(A205/pole1)","v":1.2283366767351451},{"$f":"SQRT(1+(A205/Zero1)^2)","v":1.0000558593125377},{"$f":"ATAN(A205/Zero1)","v":1.0569457170805074E-2},{"$f":"IF(VIN_nom>Vout, 1, SQRT(1+(A205/z_RHP)^2))","v":1},{"$f":"IF(VIN_nom>Vout, 0, -ATAN(A205/z_RHP))","v":0},{"$f":"SQRT(1+(A205/Pole2)^2)","v":161.62645126876089},{"$f":"ATAN(A205/Pole2)","v":1.5646091812360674},1.6840470776923722,0.93501342122280073,{"$f":"SQRT(1+(A205/pole4)^2)","v":1.0021694797688305},{"$f":"ATAN(A205/pole4)","v":6.581131839157138E-2},{"$f":"SQRT(1+(A205/Zero3)^2)","v":1.0000000000682374},{"$f":"ATAN(A205/Zero3)","v":1.1682249999468554E-5},{"$f":"SQRT(1+(A205/pole5)^2)","v":1.0000000000682374},{"$f":"ATAN(A205/pole5)","v":1.1682249999468554E-5},{"$f":"SQRT((1-(Z205/pterm2))^2+(A205/pterm1)^2)","v":1.0000598959417952},{"$f":"IF((ATAN((A205/pterm1)/(1-A205^2/pterm2))>0),ATAN((A205/pterm1)/(1-A205^2/pterm2)),PI()+ATAN((A205/pterm1)/(1-A205^2/pterm2)))","v":3.4808639353527161E-2},{"$f":"20*LOG10(((E205*K205*G205*O205)/(C205*I205*S205*M205*Q205))*Adc)","v":15.220109801707363},{"$f":"((F205+L205+H205+R205)-(D205+J205+T205+N205+T205))*radconv","v":-113.60491978383062},{"$f":"IF(V205>0,V205,V205+180)","v":66.395080216169376},null,{"$f":"IF(U205<0,A205,1000000000)","v":1000000000},{"$f":"A205^2","v":136474965.0625},null,{"$f":"20*LOG10((K205/(I205*M205))*AEA)","v":25.318032273987875},{"$f":"(L205-(J205+N205))*radconv","v":-39.843890681648631},null,{"$f":"20*LOG10((E205*G205/(C205*S205))*Acs*Am)","v":22.743380587710412},{"$f":"(F205+H205-(D205+T205))*radconv","v":-71.767310317973937},null,{"$f":"SUM((U206<0)*(U205>0))*A205","v":0},0]
[11749,{"$f":"A206/1000","v":11.749000000000001},2.9930207180853223,1.2301348628106501,1.0000564994556167,1.06298443627243E-2,1,0,162.54991668047344,1.5646443315906517,1.6902827362641426,0.93773330148962131,1.0021943153100115,6.6186256770625951E-2,1.0000000000690195,1.1748999999459394E-5,1.0000000000690195,1.1748999999459394E-5,1.0000605840699879,3.5007585796764586E-2,15.158574660796592,-113.59494077768491,66.405059222315089,null,1000000000,138039001,null,25.300433305248703,-39.711549375091053,null,22.699444415538817,-71.87827765131938,null,0,0]
[11817.5,11.817500000000001,3.0085279362638246,1.2319614181136629,1.0000571601729544,1.0691814658842195E-2,1,0,163.4975930022795,1.5646799906666871,1.6966947799797072,0.94050368320419564,1.0022199484390739,6.6571005619574672E-2,1.0000000000698268,1.1817499999449883E-5,1.0000000000698268,1.1817499999449883E-5,1.000061294355695,3.5211749075926398E-2,15.095860678808037,-113.58479193474471,66.415208065255285,null,1000000000,139653306.25,null,25.282606263290749,-39.576905794827312,null,22.654557475508209,-71.991078619162948,null,0,0]
[11886,11.885999999999999,3.0240450888448769,1.2337692343472102,1.0000578247308245,1.0753784872837142E-2,1,0,164.44526952958796,1.5647152387456071,1.7031197477410913,0.94325318352633092,1.0022457299208343,6.6955734731134933E-2,1.0000000000706386,1.188599999944026E-5,1.0000000000706386,1.188599999944026E-5,1.0000620088120802,3.5415913385649846E-2,15.033581322510594,-113.57474128139917,66.42525871860083,null,1000000000,141276996,null,25.265011614050291,-39.443433950952866,null,22.609872768451229,-72.102805981165019,null,0,0]
[11954.5,11.954499999999999,3.0395720236817603,1.2355585867756695,1.0000584931292187,1.0815755004233336E-2,1,0,165.39294625886635,1.5647500828921788,1.7095574938323874,0.94598199655124138,1.0022716597438444,6.7340443992941743E-2,1.0000000000714551,1.1954499999430528E-5,1.0000000000714551,1.1954499999430528E-5,1.0000627274398666,3.5620078731888313E-2,14.971731198506307,-113.56479386735153,66.435206132648474,null,1000000000,142910070.25,null,25.247645453087607,-39.311123120974393,null,22.565388805409622,-72.213475509181109,null,0,0]
[12023,12.023,3.0551085916258209,1.2373297455423027,1.0000591653681294,1.0877725052554974E-2,1,0,166.34062318666264,1.564784530010175,1.7160078744367027,0.94869031469682641,1.0022977378965907,6.772513329266526E-2,1.0000000000722764,1.2022999999420682E-5,1.0000000000722764,1.2022999999420682E-5,1.0000634502397805,3.5824245120594851E-2,14.910305000867211,-113.55495453576746,66.445045464232535,null,1000000000,144552529,null,25.230503953363339,-39.179962669279377,null,22.5211041074948,-72.323102681648308,null,0,0]
[12093,12.093,3.0709951760729846,1.239121169059451,1.0000598562951784,1.0941052022915693E-2,1,0,167.30905236554847,1.5648193283003675,1.7226124090968813,0.95143696457747384,1.0023245403291732,6.8118225706252547E-2,1.0000000000731202,1.2092999999410503E-5,1.0000000000731202,1.2092999999410503E-5,1.0000641931783587,3.6032883389288589E-2,14.847966224892913,-113.54501623371401,66.454983766285991,null,1000000000,146240649,null,25.213215283430252,-39.047107554585821,null,22.476054001453583,-72.434069412738253,null,0,0]
[12163,12.163,3.0868915144927471,1.2408941478936004,1.0000605512327667,1.1004378905519118E-2,1,0,168.27748174470048,1.5648537260653945,1.7292298399665298,0.95416261308543815,1.002351497634296,6.8511297036870242E-2,1.0000000000739693,1.2162999999400208E-5,1.0000000000739693,1.2162999999400208E-5,1.0000649404753332,3.6241522759174076E-2,14.786059213980433,-113.53520039403779,66.464799605962213,null,1000000000,147938569,null,25.19615338088126,-38.91543157354559,null,22.431208893090098,-72.54397940945843,null,0,0]
[12233,12.233000000000001,3.1027974569696379,1.2426489544719497,1.0000612501808865,1.1067705699857513E-2,1,0,169.24591132068088,1.564887730180621,1.7358600195571923,0.95686746013609836,1.0023786097994642,6.8904347164761237E-2,1.0000000000748233,1.2232999999389792E-5,1.0000000000748233,1.2232999999389792E-5,1.0000656921314932,3.6450163236602905E-2,14.724578578387051,-113.52551155918474,66.474488440815264,null,1000000000,149646289,null,25.179314400914979,-38.784923658919013,null,22.386567237462994,-72.652848281130616,null,0,0]
[12303,12.303000000000001,3.1187128565569044,1.2443858561134238,1.0000619531395292,1.1131032405423145E-2,1,0,170.21434109013006,1.5649213473649464,1.742502802343181,0.95955170382265154,1.0024058768121125,6.9297375970207506E-2,1.0000000000756819,1.2302999999379258E-5,1.0000000000756819,1.2302999999379258E-5,1.000066448147632,3.6658804827926286E-2,14.663519016687673,-113.51595407435909,66.484045925640913,null,1000000000,151363809,null,25.162694575664943,-38.655572838907176,null,22.342127501013653,-72.760691344394004,null,0,0]
[12374.5,12.374499999999999,3.1349789139227364,1.246141765235121,1.0000626753019157,1.1195716019647868E-2,1,0,171.20352312238575,1.5649552922877477,{"$f":"SQRT(1+(A215/Zero2)^2)","v":1.7493007923801125},{"$f":"ATAN(A215/Zero2)","v":0.9622724007369774},1.0024338879650223,6.9698804684345042E-2,1.0000000000765641,1.2374499999368371E-5,1.0000000000765641,1.2374499999368371E-5,1.0000672248660682,3.6871918467049625E-2,14.601580319299552,-113.5063317070225,66.493668292977503,null,1000000000,153128250.25,null,25.145941021533744,-38.524633460140265,null,22.296942357756731,-72.869801940380171,null,0,0]
[12446,12.446,3.1512545373055647,1.247879541803194,1.0000634016485286,1.126039954018373E-2,1,0,172.19270534964551,1.5649888472089986,1.7561116307714562,0.96497201380494557,1.002462060646111,7.0100210900069557E-2,1.0000000000774514,1.244599999935736E-5,1.0000000000774514,1.244599999935736E-5,1.0000680061350293,3.7085033281710748E-2,14.540070029035558,-113.49685494187152,66.503145058128482,null,1000000000,154902916,null,25.129408406599207,-38.394878462279962,null,22.251964682427271,-72.977873690292014,null,0,0]
[12517.5,12.5175,3.1675395792475127,1.2495994549110296,1.0000641321793584,1.1325082966489677E-2,1,0,173.18188776856789,1.5650220188114692,1.7629351686040871,0.96765074826701514,1.0024903948417603,7.0501594489928668E-2,1.000000000078344,1.2517499999346219E-5,1.000000000078344,1.2517499999346219E-5,1.0000687919553757,3.7298149278676661E-2,14.478982770800545,-113.487527813808,66.512472186191999,null,1000000000,156687806.25,null,25.11309295282469,-38.266296461506201,null,22.207192877966779,-73.084922012463622,null,0,0]
[12589,12.589,3.1838338952231768,1.2513017685708481,1.0000648668943961,1.1389766298024646E-2,1,0,174.17107037588733,1.5650548136261182,1.7697712589859464,0.9703088073999081,1.0025188905382756,7.0902955326513431E-2,1.0000000000792415,1.2588999999334951E-5,1.0000000000792415,1.2588999999334951E-5,1.0000695823279722,3.7511266464713991E-2,14.418313258415303,-113.47835417042229,66.521645829577707,null,1000000000,158482921,null,25.096990958442905,-38.138876177817082,null,22.162625359963318,-73.190962034099712,null,0,{"$f":"IF(AH218>0,W218,0)","v":0}]
[12662.25,12.66225,3.2005364923328337,1.2530277671903174,1.000065623931037,1.1456032689179385E-2,1,0,175.18446393835669,1.5650880270500429,1.7767875319438302,0.97301069380470784,1.002548251145978,7.1314115951483931E-2,1.0000000000801663,1.2662249999323277E-5,1.0000000000801663,1.2662249999323277E-5,1.0000703967670042,3.7729601045810468E-2,14.356586600835948,-113.46911899514541,66.530881004854592,null,1000000000,160332575.0625,null,25.080712427687921,-38.009530247477308,null,22.117177233138953,-73.298567336045537,null,0,0]
[12735.5,12.7355,3.2172485250527063,1.2547358394168178,1.0000663853591942,1.1522298979717622E-2,1,0,176.19785769185455,1.5651208584230889,1.7838166736969721,0.97569130604671106,1.0025777812275858,7.1725252425177161E-2,1.0000000000810965,1.2735499999311464E-5,1.0000000000810965,1.2735499999311464E-5,1.0000712159857053,3.7947936889273143E-2,14.295287435102004,-113.46005250970278,66.539947490297223,null,1000000000,162192960.25,null,25.064650305597848,-37.881379963210669,null,22.071940189495081,-73.405145609424309,null,0,0]
[12808.75,12.80875,3.233969847102931,1.2564262532723067,1.0000671511788575,1.1588565169057609E-2,1,0,177.21125163310376,1.5651533142995324,1.7908585327148403,0.9783508563312685,1.0026074807681249,7.2136364610741854E-2,1.0000000000820322,1.2808749999299514E-5,1.0000000000820322,1.2808749999299514E-5,1.0000720399850218,3.8166274002376301E-2,14.234410356404974,-113.45115828070881,66.54884171929119,null,1000000000,164064076.5625,null,25.048800849474251,-37.754413534237486,null,22.026912566921641,-73.510712211213161,null,0,0]
[12882,12.882,3.2507003151329674,1.2580992716692811,1.0000679213900168,1.1654831256617598E-2,1,0,178.22464575890163,1.5651854010845812,1.7979129595688743,0.98098955473406113,1.0026373497525363,7.254745237137579E-2,1.000000000082973,1.2881999999287428E-5,1.000000000082973,1.2881999999287428E-5,1.000072868765906,3.8384612392393706E-2,14.173950050423853,-113.44243969551005,66.557560304489954,null,1000000000,165945924,null,25.03316039306133,-37.628619283261067,null,21.982092717353446,-73.615282205638678,null,0,0]
[12957.25,12.95725,3.267896964109354,1.2598001263521501,1.0000687172038107,1.1722906550550813E-2,1,0,179.26570953777201,1.5652179861913798,1.8051729311756488,0.98367880435962907,1.0026682107031579,7.296973879313387E-2,1.0000000000839453,1.2957249999274867E-5,1.0000000000839453,1.2957249999274867E-5,1.0000737251558074,3.8608913577488878E-2,14.112267457876817,-113.4336693395508,66.566330660449196,null,1000000000,167890327.5625,null,25.017306757246178,-37.500598848319562,null,21.936263760621564,-73.721685084867971,null,0,0]
[13032.5,13.032500000000001,3.2851029678152721,1.2614831691219581,1.0000695176521617,1.179098173582557E-2,1,0,180.30677350478678,1.565250195015282,1.8124458532651828,0.98634649048748124,1.0026992504443877,7.3391999145436732E-2,1.0000000000849232,1.3032499999262159E-5,1.0000000000849232,1.3032499999262159E-5,1.0000745865940048,3.883321612574013E-2,14.051013623301284,-113.42509104289928,66.574908957100718,null,1000000000,169846056.25,null,25.001666086041045,-37.373790857698481,null,21.89065059725116,-73.827067500981414,null,0,0]
[13107.75,13.107749999999999,3.3023181800284327,1.2631486689327684,1.0000703227350582,1.1859056811811174E-2,1,0,181.34783765670565,1.5652820340366058,1.8197315705598798,0.98899283392282733,1.0027304689596217,7.3814233280131092E-2,1.0000000000859064,1.3107749999249305E-5,1.0000000000859064,1.3107749999249305E-5,1.0000754530815481,3.9057520045031831E-2,13.990183071673734,-113.41670792802744,66.583292071972565,null,1000000000,171813110.0625,null,24.986234644899042,-37.248183022997495,null,21.845251486765616,-73.931444864399595,null,0,0]
[13183,13.183,3.3195424574823416,1.2647968895502946,1.0000711324524889,1.192713177787694E-2,1,0,182.38890199036246,1.5653135095877153,1.827029929987956,0.99161805314773721,1.0027618662321633,7.4236441049119445E-2,1.0000000000868958,1.3182999999236302E-5,1.0000000000868958,1.3182999999236302E-5,1.0000763246194935,3.9281825343247763E-2,13.929770420951757,-113.40852294476883,66.591477055231167,null,1000000000,173791489,null,24.971008776642691,-37.123763180448471,null,21.800064704299995,-74.034832288272568,null,0,0]
[13259.75,13.25975,3.3371192685558877,1.2664604340120349,1.0000719630844841,1.1996563606128174E-2,1,0,183.45071862098217,1.5653452445646541,1.8344866378499713,0.99427406644282612,1.0027940734842715,7.4667037607017456E-2,1.0000000000879106,1.3259749999222886E-5,1.0000000000879106,1.3259749999222886E-5,1.0000772187338038,3.9510603272024429E-2,13.868578524719906,-113.40038178634782,66.599618213652178,null,1000000000,175820970.0625,null,24.955687449548662,-36.998074473847581,null,21.754194135162166,-74.139276224123961,null,0,0]
[13336.5,13.336499999999999,3.3547052179188648,1.2681065418095387,1.000072798537597,1.2065995318708491E-2,1,0,184.51253543423024,1.5653766142902115,1.8419561820950039,0.99690855674159196,1.0028264666558711,7.5097606426595076E-2,1.0000000000889311,1.3336499999209314E-5,1.0000000000889311,1.3336499999209314E-5,1.0000781181041063,3.9739382651811123E-2,13.807810334268595,-113.39245241375905,66.607547586240955,null,1000000000,177862232.25,null,24.940572525886772,-36.873596427448547,null,21.70854086837274,-74.242721202468886,null,0,0]
[13413.25,13.41325,3.3723001626075835,1.2697354768784239,1.0000736388118157,1.2135426914948757E-2,1,0,185.57435242697187,1.5654076250339981,1.8494384071916337,0.99952174847688302,1.0028590457289459,7.5528147350902117E-2,1.0000000000899576,1.3413249999195584E-5,1.0000000000899576,1.3413249999195584E-5,1.0000790227315408,3.996816349097073E-2,13.747460426224068,-113.38473744157064,66.615262558429365,null,1000000000,179915275.5625,null,24.925660362401594,-36.750316532426027,null,21.663103123813396,-74.345182346221819,null,0,0]
[13490,13.49,3.3899039625541327,1.2713474980405803,1.0000744839071274,1.2204858394179841E-2,1,0,186.63616959614347,1.565438282922949,1.8569331598532748,1.002113863630983,1.0028918106853786,7.5958660223050103E-2,1.0000000000909901,1.3489999999181696E-5,1.0000000000909901,1.3489999999181696E-5,1.000079932617254,4.0196945797865521E-2,13.687523469935304,-113.37723932359171,66.622760676408291,null,1000000000,181980100,null,24.910947391842726,-36.628222412190482,null,21.617879138083502,-74.446674485302182,null,0,0]
[13568.5,13.5685,3.4079181694673948,1.2729790431337606,1.0000753532589384,1.2275872879862877E-2,1,0,187.72219775963683,1.5654692810777704,1.8646116044718399,1.0047435082944518,1.0029255149957714,7.6398960167258348E-2,1.0000000000920521,1.3568499999167328E-5,1.0000000000920521,1.3568499999167328E-5,1.0000808686902383,4.0430946166476876E-2,13.626641594757373,-113.36979696165804,66.630203038341961,null,1000000000,184104192.25,null,24.896101363404448,-36.50455826318025,null,21.57184329134385,-74.549493536556184,null,0,0]
[13647,13.647,3.4259413526373579,1.2745934260305518,1.0000762276541777,1.2346887241724053E-2,1,0,188.80822610143471,1.565499922628723,1.8723028371286599,1.0073515662353871,1.0029594137242677,7.6839230433679268E-2,1.0000000000931202,1.3646999999152791E-5,1.0000000000931202,1.3646999999152791E-5,1.0000818102664739,4.0664948088212402E-2,13.56618072639877,-113.36258615915985,66.637413840840154,null,1000000000,186240609,null,24.881456402135225,-36.382108809957494,null,21.526027384254466,-74.651329362470719,null,0,0]
[13725.5,13.7255,3.4439733711389646,1.2761909078237563,1.0000771070928323,1.2417901479047436E-2,1,0,189.89425461847782,1.5655302136941327,1.8800067008735912,1.0099382671283266,1.0029935068511548,7.7279470854648535E-2,1.0000000000941947,1.3725499999138087E-5,1.0000000000941947,1.3725499999138087E-5,1.0000827573472089,4.0898951572017499E-2,13.506135450065717,-113.35560905824495,66.644390941755049,null,1000000000,188389350.25,null,24.867008926204136,-36.260861234088324,null,21.480429583852501,-74.752196923115008,null,0,0]
[13804,13.804,3.4620140869148397,1.2777717445129702,1.0000779915748885,1.2488915591117103E-2,1,0,190.98028330777649,1.5655601602531579,1.8877230410629042,1.0125038380449431,1.0030277943566097,7.7719681262570825E-2,1.0000000000952753,1.3803999999123214E-5,1.0000000000952753,1.3803999999123214E-5,1.0000837099336986,4.1132956626836838E-2,13.446500444383087,-113.3488676504054,66.651132349594604,null,1000000000,190550416,null,24.852755429224494,-36.140802858302273,null,21.435048075149517,-74.85211088673897,null,0,0]
[13884.25,13.88425,3.4804658336802232,1.2793708783222115,1.0000789009879876,1.2561512690116027E-2,1,0,192.09052300274431,1.5655904243834418,1.8956241396609423,1.0151049951770279,1.0030630471392359,7.8169674079731188E-2,1.0000000000963862,1.3884249999107834E-5,1.0000000000963862,1.3884249999107834E-5,1.0000846894487403,4.1372179988105322E-2,13.385954642025904,-113.34222151175496,66.657778488245043,null,1000000000,192772398.0625,null,24.83838111847853,-36.019284228814996,null,21.388876583538291,-74.953281486584871,null,0,0]
[13964.5,13.964499999999999,3.4989263869075899,1.2809531418832998,1.0000798156718318,1.2634109656701375E-2,1,0,193.20076287162914,1.5656203406844427,1.9035379575630056,1.017684541405947,1.0030985030213444,7.8619635176783012E-2,1.0000000000975038,1.3964499999092274E-5,1.0000000000975038,1.3964499999092274E-5,1.0000856747204288,4.1611405010116079E-2,13.325826650522439,-113.33582544394476,66.664174556055244,null,1000000000,195007260.25,null,24.824202354675194,-35.898982066293712,null,21.342927355838164,-75.053485595151429,null,0,0]
[14044.75,14.044750000000001,3.5173956079385316,1.2825187929587196,1.0000807356264065,1.2706706490108291E-2,1,0,194.3110029114498,1.5656499151183112,1.9114643367882471,1.0202427110339611,1.0031341619813996,7.906956437489672E-2,1.0000000000986276,1.4044749999076534E-5,1.0000000000986276,1.4044749999076534E-5,1.0000866657501286,4.1850631702423147E-2,13.266111074998266,-113.329681123645,66.670318876354997,null,1000000000,197255002.5625,null,24.810215624445149,-35.779883277567635,null,21.297198510544035,-75.152737981732344,null,0,0]
[14125,14.125,3.535873360947277,1.2840680842524788,1.0000816608516971,1.2779303189571926E-2,1,0,195.42124311929294,1.5656791535117105,1.9194031217167149,1.0227797356153396,1.0031700239977452,7.9519461495319729E-2,1.0000000000997578,1.4124999999060613E-5,1.0000000000997578,1.4124999999060613E-5,1.0000876625392123,4.2089860074579807E-2,13.20680261441405,-113.32379008738654,66.676209912613459,null,1000000000,199515625,null,24.796417489086163,-35.661974919155824,null,21.251688185318809,-75.251053125791969,null,0,0]
[14207.25,14.20725,3.5548203330752739,1.2856392699323671,1.0000826146049357,1.2853709012781239E-2,1,0,196.55915303640307,1.5657087778386449,1.9275524709210226,1.0253582855528449,1.0032069904589624,7.9980537531268353E-2,1.0000000001009228,1.4207249999044108E-5,1.0000000001009228,1.4207249999044108E-5,1.0000886901483124,4.2335052277711532E-2,13.146433072149586,-113.31801653138385,66.681983468616153,null,1000000000,201845952.5625,null,24.782467657400602,-35.542349950135097,null,21.205268474739903,-75.350860772962889,null,0,0]
[14289.5,14.2895,3.5737759876573278,1.2871937919733623,1.0000835738948477,1.2928114693660895E-2,1,0,197.69706312402789,1.5657380611406049,1.935714528305821,1.027915107147731,1.0032441701773249,8.044157949073788E-2,1.0000000001020948,1.4289499999027409E-5,1.0000000001020948,1.4289499999027409E-5,1.0000897238103901,4.2580246265785396E-2,13.086480208018454,-113.31251188249352,66.687488117506476,null,1000000000,204189810.25,null,24.768708856302737,-35.423948431713477,null,21.159074411706634,-75.449713774377329,null,0,0]
[14371.75,14.37175,3.5927401872649676,1.2887319066782323,1.000084538721417,1.3002520231387456E-2,1,0,198.8349733792399,1.5657670092724827,1.9438891337927,1.030450440880182,1.0032815631291241,8.0902587181529817E-2,1.0000000001032736,1.4371749999010518E-5,1.0000000001032736,1.4371749999010518E-5,1.0000907635269487,4.2825442049084325E-2,13.026938608836762,-113.30727737295665,66.692722627043352,null,1000000000,206547198.0625,null,24.755137615883068,-35.30675690983982,null,21.11310405294461,-75.547626815738582,null,0,0]
[14454,14.454000000000001,3.6117127972948264,1.2902538652784152,1.0000855090846277,1.3076925625137492E-2,1,0,199.97288379917825,1.5657956279559087,1.9520761297406051,1.0329645243103678,1.0033191692905183,8.1363560411532518E-2,1.0000000001044591,1.4453999998993431E-5,1.0000000001044591,1.4453999998993431E-5,1.0000918092995004,4.3070639637890346E-2,12.967802956542279,-113.30231410412291,66.697685895877086,null,1000000000,208918116,null,24.74175054081347,-35.190762090137056,null,21.067355475719726,-75.644614292184002,null,0,0]
[14622.5,14.6225,3.650606408548696,1.2933223795784592,1.0000875142915164,1.3229354458954951E-2,1,0,202.30404425031031,1.5658532517513442,1.9688863142445856,1.0380495827729137,1.0033968761862559,8.2307816600507774E-2,1.0000000001069087,1.4622499998957817E-5,1.0000000001069087,1.4622499998957817E-5,1.0000939706206928,4.3572964999799388E-2,12.847901511080909,-113.29299719225135,66.707002807748651,null,1000000000,213817506.25,null,24.714886528224405,-34.956813196073931,null,20.974318042847429,-75.840474805501785,null,0,0]
[14706.75,14.70675,3.670065899230146,1.2948322406394552,1.0000885256086531,1.3305568645760059E-2,1,0,203.46962472345382,1.5658815685002436,1.9773102545660914,1.0405596564612531,1.0034360650882492,8.277988964157372E-2,1.0000000001081442,1.4706749998939699E-5,1.0000000001081442,1.4706749998939699E-5,1.0000950608189361,4.3824130566125892E-2,12.788567766661449,-113.28876932856718,66.711230671432816,null,1000000000,216288495.5625,null,24.701730480853602,-34.841666790410123,null,20.92814034579877,-75.937007447724881,null,0,0]
[14791,14.791,3.6895336682232265,1.2963261715578269,1.0000895427348944,1.3381782677982847E-2,1,0,204.63520535788845,1.5659095626707107,1.985746547127222,1.0430484180064343,1.0034754775914412,8.3251925705545585E-2,1.0000000001093867,1.4790999998921372E-5,1.0000000001093867,1.4790999998921372E-5,1.0000961573778251,4.407529807076286E-2,12.729638213043595,-113.28482946075607,66.715170539243928,null,1000000000,218773681,null,24.688753923514465,-34.727720879588865,null,20.882187349520049,-76.03262747992143,null,0,0]
[14877.25,14.87725,3.7094720194379565,1.2978393197970211,1.0000905900241412,1.3459805784337708E-2,1,0,205.82845572649902,1.5659378929571437,1.9943957396615124,1.0455744333039947,1.0035160573017716,8.3735128854137336E-2,1.0000000001106661,1.4877249998902393E-5,1.0000000001106661,1.4877249998902393E-5,1.0000972865584612,4.4332430028153423E-2,12.669722977596551,-113.28109497541953,66.718905024580465,null,1000000000,221332567.5625,null,24.675651834508475,-34.612299570828036,null,20.835374203078999,-76.129586669153483,null,0,0]
[14963.5,14.9635,3.7294187730997423,1.2993362853211032,1.0000916434015317,1.3537828726807052E-2,1,0,207.02170625840418,1.5659658966582377,2.0030575479964119,1.0480786180031987,1.0035568712993519,8.4218292812424961E-2,1.0000000001119531,1.4963499998883192E-5,1.0000000001119531,1.4963499998883192E-5,1.0000984224088734,4.4589564040399578E-2,12.610220362674692,-113.27766337741488,66.722336622585118,null,1000000000,223906332.25,null,24.662730997691106,-34.498108105818076,null,20.788792424974517,-76.225618784231997,null,0,0]
[15049.75,15.04975,3.7493737951049599,1.3008173197511692,1.000092702867047,1.3615851504441457E-2,1,0,208.21495695079645,1.5659935793887929,2.0117318091743503,1.0505612228827679,1.0035979195555982,8.4701417359616879E-2,1.0000000001132476,1.5049749998863769E-5,1.0000000001132476,1.5049749998863769E-5,1.0000995649308775,4.4846700119350165E-2,12.551124957815883,-113.27453502547276,66.725464974527242,null,1000000000,226494975.0625,null,24.649988055688219,-34.385132425050557,null,20.742439962118585,-76.320738242717113,null,0,0]
[15136,15.135999999999999,3.7693369541347796,1.3022826696606526,1.0000937684206674,1.3693874116291509E-2,1,0,209.40820780093242,1.5660209466356336,2.0204183628039791,1.0530224954819756,1.0036392020417673,8.5184502275031077E-2,1.0000000001145493,1.5135999998844122E-5,1.0000000001145493,1.5135999998844122E-5,1.0001007141262985,4.5103838276852951E-2,12.492431449295466,-113.27171016739432,66.728289832605682,null,1000000000,229098496,null,24.637419724763969,-34.273358647297584,null,20.696314784522421,-76.414959172959129,null,0,0]
[15224,15.224,3.7897134156887149,1.3037618369145072,1.0000948618688448,1.3773479623779184E-2,1,0,210.62566969767798,1.5660485495731395,2.0292936706530904,1.0555119745413155,1.003681563520481,8.5677347838379575E-2,1.0000000001158851,1.5223999998823844E-5,1.0000000001158851,1.5223999998823844E-5,1.000101893518528,4.5366195884837583E-2,12.432955853799495,-113.26914093318538,66.730859066814617,null,1000000000,231770176,null,24.624773013105766,-34.160541506435166,null,20.649485900684649,-76.510180137963388,null,0,0]
[15312,15.311999999999999,3.8100980801939226,1.305225179755211,1.0000959616546463,1.3853084956690105E-2,1,0,211.84313175305934,1.5660758352426125,2.0381814454868024,1.0579797573416554,1.003724168769571,8.6170151681622564E-2,1.0000000001172287,1.5311999998803327E-5,1.0000000001172287,1.5311999998803327E-5,1.0001030798616002,4.5628555681490657E-2,12.37388775232138,-113.26688782326217,66.733112176737833,null,1000000000,234457344,null,24.612301390300452,-34.04894690114083,null,20.602889422011845,-76.604494566283776,null,0,0]
[15400,15.4,3.830490816689843,1.3066729446027572,1.000097067778051,1.3932690114015935E-2,1,0,213.06059396435708,1.566102809082772,2.0470815249221133,1.0604260966145944,1.0037670177579969,8.6662913570727446E-2,1.00000000011858,1.5399999998782582E-5,1.00000000011858,1.5399999998782582E-5,1.0001042731574878,4.5890917679392178E-2,12.31522179908912,-113.26495077570213,66.735049224297867,null,1000000000,237160000,null,24.600001593829838,-33.938560649167201,null,20.556523265250206,-76.697916577524452,null,0,0]
[15488,15.488,3.8508914969386567,1.3081053729196763,1.0000981802390376,1.4012295094748342E-2,1,0,214.27805632891364,1.5661294764087346,2.0559937491648683,1.0628512417453595,1.0038101104545458,8.7155633271782995E-2,1.0000000001199392,1.5487999998761592E-5,1.0000000001199392,1.5487999998761592E-5,1.0001054734081749,4.6153281891120987E-2,12.256952744333297,-113.26332962919913,66.736670370800866,null,1000000000,239878144,null,24.587870433179425,-33.829368752924864,null,20.510385371144796,-76.790460007247844,null,0,0]
[15578.25,15.578250000000001,3.8718219049637601,1.3095587439307874,1.0000993277263215,1.4093935245621603E-2,1,0,215.52664714903,1.56615651264098,2.065146292626336,1.0653166372691265,1.0038545580546596,8.7660906854993004E-2,1.0000000001213409,1.5578249998739814E-5,1.0000000001213409,1.5578249998739814E-5,1.0001067115729851,4.6422356591349433E-2,12.197600705650292,-113.26199488404336,66.738005115956639,null,1000000000,242681873.0625,null,24.575600991121004,-33.718611100274998,null,20.463302774520212,-76.884471240971592,null,0,0]
[15668.5,15.6685,3.8927604034326091,1.3109964830789489,1.0001004818793662,1.417557520860748E-2,1,0,216.77523812487249,1.5661832374244291,2.0743112775943415,1.0677602616906618,1.0038992619175093,8.8166135567283477E-2,1.0000000001227509,1.5668499998717786E-5,1.0000000001227509,1.5668499998717786E-5,1.0001079570570486,4.6691433646854248E-2,12.138655237186333,-113.2609917564323,66.739008243567696,null,1000000000,245501892.25,null,24.563502345753431,-33.609080424283874,null,20.416455951423828,-76.977586980633916,null,0,0]
[15758.75,15.758749999999999,3.9137068624925493,1.3124188353608726,1.0001016426981488,1.425721498261835E-2,1,0,218.02382925376554,1.5662096561099108,2.0834885398833669,1.0701823733222178,1.0039442220088619,8.867131915674048E-2,1.0000000001241691,1.57587499986955E-5,1.0000000001241691,1.57587499986955E-5,1.0001092098625421,4.6960513071199875E-2,12.080110977111287,-113.2603197772047,66.7396802227953,null,1000000000,248338201.5625,null,24.551571279620109,-33.50076221689595,null,20.3698427574821,-77.069821264351916,null,0,0]
[15849,15.849,3.9346611550071993,1.3138260408063041,1.0001028101826459,1.4338854566566606E-2,1,0,219.2724205330947,1.5662357739263799,2.0926779179699548,1.0725832269576161,1.0039894382942947,8.9176457371587081E-2,1.0000000001255955,1.584899999867296E-5,1.0000000001255955,1.584899999867296E-5,1.0001104699916565,4.7229594877949366E-2,12.021962660764942,-113.25997838722911,66.740021612770889,null,1000000000,251190801,null,24.539804647066916,-33.393642164671846,null,20.32346107368895,-77.161187845656428,null,0,0]
[15941.25,15.94125,3.9560877747512082,1.3152490216364292,1.0001040104282779,1.442230314041131E-2,1,0,220.54868157807584,1.5662621649069619,2.1020832948681849,1.0750155768887382,1.0040359213397707,8.9692742629065542E-2,1.0000000001270617,1.5941249998649649E-5,1.0000000001270617,1.5941249998649649E-5,1.000111765617226,4.7504642192729013E-2,11.962929559909002,-113.25997041983722,66.740029580162783,null,1000000000,254123451.5625,null,24.527943996227535,-33.285371837278788,null,20.276288623672389,-77.25369644087192,null,0,0]
[16033.5,16.0335,3.9775223187620239,1.3166566686355925,1.0001052176382819,1.4505751513378412E-2,1,0,221.82494277489798,1.5662882522085975,2.111500997539983,1.0774262434744879,1.0040826719866698,9.0208979947079951E-2,1.0000000001285365,1.6033499998626073E-5,1.0000000001285365,1.6033499998626073E-5,1.0001130688992725,4.7779692025325046E-2,11.904299324370042,-113.26030640660234,66.739693593397661,null,1000000000,257073122.25,null,24.516248723211611,-33.178323727811787,null,20.229353661149354,-77.345326628058231,null,0,0]
[16125.75,16.12575,3.998964659616882,1.3180492228388256,1.0001064318126327,1.458919968430643E-2,1,0,223.10120412095529,1.5663140410428815,2.1209308617926332,1.0798154877274926,1.0041296901976149,9.072516905719008E-2,1.00000000013002,1.612574999860222E-5,1.00000000013002,1.612574999860222E-5,1.0001143798401753,4.8054744390217743E-2,11.846066632648579,-113.26098548784049,66.739014512159514,null,1000000000,260039813.0625,null,24.504715689322328,-33.072483164570755,null,20.182654003317175,-77.436092218401583,null,0,0]
[16218,16.218,4.0204146725655283,1.3194269203741686,1.0001076529513049,1.4672647652033907E-2,1,0,224.37746561370128,1.5663395365028361,2.1303727261303789,1.0821835670204005,1.0041769759350219,9.1241309691108607E-2,1.0000000001315117,1.6217999998578096E-5,1.0000000001315117,1.6217999998578096E-5,1.0001156984423276,4.8329799301885877E-2,11.788226260201689,-113.26200672448778,66.737993275512224,null,1000000000,263023524,null,24.493341826441842,-32.967835677626105,null,20.136187493750768,-77.526006741938261,null,0,0]
[16312.5,16.3125,4.042395683959076,1.3208230574598401,1.0001089110950057,1.4758130724138197E-2,1,0,225.68485558503616,1.5663653548111216,2.1400571564937647,1.0845877240211257,1.0042256923371813,9.1769988576564154E-2,1.0000000001330487,1.6312499998553095E-5,1.0000000001330487,1.6312499998553095E-5,1.0001170571518427,4.8611565525776973E-2,11.729376574478351,-113.26340658381891,66.736593416181094,null,1000000000,266097656.25,null,24.481852459103685,-32.861857977029835,null,20.088827175365594,-77.617245700860096,null,0,0]
[16407,16.407,4.0643844895492611,1.3222040906763919,1.0001101765468394,1.4843613580541553E-2,1,0,226.99224570507627,1.5663908757118974,2.1497538448372349,1.0869702062887665,1.0042746893945147,9.2298616022858465E-2,1.0000000001345948,1.6406999998527803E-5,1.0000000001345948,1.6406999998527803E-5,1.0001184239060128,4.8893334452944276E-2,11.670927782815248,-113.26516326061279,66.734836739387205,null,1000000000,269189649,null,24.470523823340486,-32.75710215972083,null,20.041707019465683,-77.707619439071124,null,0,0]
[16501.5,16.5015,4.0863809635144266,1.323570258619577,1.0001114493067786,1.4929096219995495E-2,1,0,228.29963597126687,1.5664161043145688,2.1594626260338643,1.0893312789368017,1.0043239670659454,9.2827191742095125E-2,1.0000000001361498,1.6501499998502217E-5,1.0000000001361498,1.6501499998502217E-5,1.0001197987074553,4.917510609894684E-2,11.612874571474874,-113.26727551362238,66.73272448637762,null,1000000000,272299502.25,null,24.459352839567806,-32.653553312067743,null,19.99482479189799,-77.797141628064054,null,0,0]
[16596,16.596,4.1083849826841252,1.3249217949982284,1.0001127293747951,1.5014578641251563E-2,1,0,229.60702638111138,1.5664410456121705,2.1691833377089123,1.0916712032902274,1.00437352531017,9.3355715446549692E-2,1.0000000001377136,1.6595999998476335E-5,1.0000000001377136,1.6595999998476335E-5,1.0001211815588027,4.9456880479341991E-2,11.555211724223554,-113.26974203200658,66.730257967993424,null,1000000000,275427216,null,24.448336498114294,-32.551196730845632,null,19.948178286100177,-77.88582565933153,null,0,0]
[16692.5,16.692499999999999,4.1308623564991196,1.3262870738896475,1.0001140440758858,1.5101869987809144E-2,1,0,230.94208657497049,1.5664662233486017,2.1791219246996949,1.0940390931279658,1.0044244219056662,9.3895370861339769E-2,1.0000000001393197,1.6692499998449604E-5,1.0000000001393197,1.6692499998449604E-5,1.0001226019868577,4.9744621176664477E-2,11.496726021869685,-113.27262491229914,66.727375087700864,null,1000000000,278639556.25,null,24.437243536127205,-32.44788919236732,null,19.900785545733402,-77.975535279575624,null,0,0]
[16789,16.789000000000001,4.1533473468358588,1.3276375728459731,1.0001153663976043,1.5189161104204004E-2,1,0,232.27714691354515,1.5664911116566844,2.1890726188316565,1.0963854689633497,1.0044756109879511,9.4434971430503403E-2,1.0000000001409353,1.6788999998422558E-5,1.0000000001409353,1.6788999998422558E-5,1.0001240308147568,5.0032364758129069E-2,11.438636689416207,-113.27587424446511,66.724125755534885,null,1000000000,281870521,null,24.426305703248428,-32.345794589979981,null,19.853634046158703,-78.064398250352923,null,0,0]
[16885.5,16.8855,4.1758398306598732,1.3289735257299611,1.0001166963399208,1.5276451989106791E-2,1,0,233.61220739435424,1.566515715498513,2.1990352557493771,1.098710597188792,1.0045270925123109,9.4974516848219587E-2,1.0000000001425602,1.6885499998395201E-5,1.0000000001425602,1.6885499998395201E-5,1.000125468045352,5.0320111240296159E-2,11.380938473106724,-113.27948843345108,66.720511566548922,null,1000000000,285120110.25,null,24.415520008647178,-32.244897927307441,null,19.806721524450463,-78.152427972037387,null,0,0]
[16982,16.981999999999999,{"$f":"SQRT(1+(A269/pole1)^2)","v":4.1983396875327381},{"$f":"ATAN(A269/pole1)","v":1.3302951616012795},{"$f":"SQRT(1+(A269/Zero1)^2)","v":1.0001180339028051},{"$f":"ATAN(A269/Zero1)","v":1.5363742641188168E-2},{"$f":"IF(VIN_nom>Vout, 1, SQRT(1+(A269/z_RHP)^2))","v":1},{"$f":"IF(VIN_nom>Vout, 0, -ATAN(A269/z_RHP))","v":0},{"$f":"SQRT(1+(A269/Pole2)^2)","v":234.9472680149731},{"$f":"ATAN(A269/Pole2)","v":1.5665400397233968},2.2090096738669187,1.1010147403129227,{"$f":"SQRT(1+(A269/pole4)^2)","v":1.0045788664337856},{"$f":"ATAN(A269/pole4)","v":9.5514006808858257E-2},{"$f":"SQRT(1+(A269/Zero3)^2)","v":1.0000000001441942},{"$f":"ATAN(A269/Zero3)","v":1.6981999998367531E-5},{"$f":"SQRT(1+(A269/pole5)^2)","v":1.0000000001441942},{"$f":"ATAN(A269/pole5)","v":1.6981999998367531E-5},{"$f":"SQRT((1-(Z269/pterm2))^2+(A269/pterm1)^2)","v":1.0001269136815119},{"$f":"IF((ATAN((A269/pterm1)/(1-A269^2/pterm2))>0),ATAN((A269/pterm1)/(1-A269^2/pterm2)),PI()+ATAN((A269/pterm1)/(1-A269^2/pterm2)))","v":5.0607860639724167E-2},{"$f":"20*LOG10(((E269*K269*G269*O269)/(C269*I269*S269*M269*Q269))*Adc)","v":11.32362621593154},{"$f":"((F269+L269+H269+R269)-(D269+J269+T269+N269+T269))*radconv","v":-113.28346582507993},{"$f":"IF(V269>0,V269,V269+180)","v":66.716534174920071},null,{"$f":"IF(U269<0,A269,1000000000)","v":1000000000},{"$f":"A269^2","v":288388324},null,{"$f":"20*LOG10((K269/(I269*M269))*AEA)","v":24.404883529813386},{"$f":"(L269-(J269+N269))*radconv","v":-32.145184424046768},null,{"$f":"20*LOG10((E269*G269/(C269*S269))*Acs*Am)","v":19.760045746109071},{"$f":"(F269+H269-(D269+T269))*radconv","v":-78.239637569806121},null,{"$f":"SUM((U270<0)*(U269>0))*A269","v":0},0]
[17081,{"$f":"A270/1000","v":17.081},4.2214299807203064,1.3316363937195319,1.0001194140368059,1.5453294465786227E-2,1,0,236.31691584110831,1.5665647085001198,2.2192545730663338,1.1033570397553296,1.0046322854589964,9.6067415242442458E-2,1.0000000001458802,1.7080999998338814E-5,1.0000000001458802,1.7080999998338814E-5,1.000128405507436,5.0903067735764695E-2,11.265224966637302,-113.28792190427731,66.712078095722688,null,1000000000,291760561,null,24.394123565791102,-32.044101935908806,null,19.712404460837124,-78.328267688718924,null,0,0]
[17180,17.18,4.244527785223176,1.3329630308110156,1.0001208021912715,1.5542846042508945E-2,1,0,237.6865638093964,1.5665890929735349,2.2295115359739501,1.1056778001359193,1.0046860121310162,9.6620764657250835E-2,1.0000000001475762,1.7179999998309761E-5,1.0000000001475762,1.7179999998309761E-5,1.0001299061862572,5.1198277937477644E-2,11.207219240525923,-113.29275654655591,66.707243453444093,null,1000000000,295152400,null,24.383514630532787,-31.944233874202606,null,19.665007669984057,-78.416061766339169,null,0,0]
[17279,17.279,4.2676329790803713,1.3342753052225222,1.0001221983661688,1.5632397369921044E-2,1,0,239.05621191739414,1.5666131980302729,2.2397803968543188,1.1079772925372724,1.0047400464004919,9.7174054723912176E-2,1.0000000001492819,1.7278999998280369E-5,1.0000000001492819,1.7278999998280369E-5,1.0001314157211263,5.1493491262735475E-2,11.149603772465326,-113.29796779576041,66.702032204239586,null,1000000000,298563841,null,24.373053780906645,-31.845564968152146,null,19.617853051549606,-78.50303311626368,null,0,0]
[17378,17.378,4.2907454429193077,1.3355734444948983,1.0001236025614635,1.572194844658727E-2,1,0,240.42586016271372,1.5666370284456141,2.2500609928070259,1.1102557839959224,1.0047943882177992,9.7727285113271278E-2,1.0000000001509974,1.7377999998250642E-5,1.0000000001509974,1.7377999998250642E-5,1.0001329341152125,5.1788707729408502E-2,11.092373395032586,-113.30355364582887,66.69644635417113,null,1000000000,301994884,null,24.362738141725671,-31.748080172435259,null,19.570938313297845,-78.589194776728775,null,0,0]
[17479.25,17.47925,4.3143905879606432,1.3368866984929153,1.0001250469661445,1.5813534514141338E-2,1,0,241.82663691685224,1.5666611212495414,2.2605872099703186,1.1125646111707441,1.0048502831362518,9.8293026850589008E-2,1.0000000001527622,1.747924999821989E-5,1.0000000001527622,1.747924999821989E-5,1.0001344961851015,5.209063692917517E-2,11.03423536001671,-113.30965177581893,66.690348224181065,null,1000000000,305524180.5625,null,24.352335327329865,-31.64958914940469,null,19.523203092677768,-78.676490462068926,null,0,0]
[17580.5,17.580500000000001,4.338043092634285,1.3381856340848248,1.0001264997598578,1.5905120316385961E-2,1,0,243.22741380974531,1.5666849365465805,2.2711253658668507,1.1148520242559294,1.0049064996349795,9.8858705471472783E-2,1.0000000001545368,1.7580499998188775E-5,1.0000000001545368,1.7580499998188775E-5,1.0001360675282389,5.2392569452572507E-2,10.976489489131795,-113.31613733831074,66.683862661689261,null,1000000000,309073980.25,null,24.342078525578316,-31.552305547055013,null,19.475714023544402,-78.762965968799932,null,0,0]
[17681.75,17.681750000000001,4.3617028372114879,1.3394704798588855,1.0001279609425668,1.5996705851785864E-2,1,0,244.62819083900951,1.5667084791038401,2.2816752950757655,1.1171182961888735,1.0049630376600158,9.9424320624519544E-2,1.0000000001563221,1.7681749998157301E-5,1.0000000001563221,1.7681749998157301E-5,1.0001376481480742,5.2694505318709832E-2,10.919130557283179,-113.32300804756507,66.676991952434932,null,1000000000,312644283.0625,null,24.331964869640181,-31.456213980226721,null,19.428468747633922,-78.84863439524716,null,0,0]
[17783,17.783000000000001,4.3853697045110724,1.3407414596571472,1.0001294305142352,1.6088291118805789E-2,1,0,246.02896800231542,1.5667317535798631,2.292236835038457,1.1193636957537894,1.0050198971570976,9.9989871958567442E-2,1.0000000001581175,1.7782999998125464E-5,1.0000000001581175,1.7782999998125464E-5,1.0001392380480765,5.2996444546693992E-2,10.8621534367549,-113.33026157765774,66.669738422342263,null,1000000000,316235089,null,24.321991559349989,-31.361299295513501,null,19.381464937395833,-78.933508567798029,null,0,0]
[17886.5,17.886500000000002,4.4095697446844211,1.3420265800815301,1.0001309414136752,1.6181911334990948E-2,1,0,247.46087368320087,1.5667552729231986,2.3030449102095982,1.1216376954092981,1.0050783524089044,0.10056792477259351,1.0000000001599636,1.7886499998092542E-5,1.0000000001599636,1.7886499998092542E-5,1.0001408728746204,5.3305097029930637E-2,10.80429955105971,-113.3380695128381,66.661930487161897,null,1000000000,319926882.25,null,24.311938830710332,-31.265476258218548,null,19.333663780340302,-79.019460985740636,null,0,0]
[17990,17.989999999999998,4.4337769879094031,1.3432976697546053,1.0001324610789815,1.6275531267491556E-2,1,0,248.89277949939665,1.5667785216481338,{"$f":"SQRT(1+(A279/Zero2)^2)","v":2.3138647833056312},{"$f":"ATAN(A279/Zero2)","v":1.123890439704142},1.0051371434635452,0.10114591015844288,1.0000000001618199,1.7989999998059236E-5,1.0000000001618199,1.7989999998059236E-5,1.0001425174057605,5.3613753066456341E-2,10.746834100998372,-113.34627244243244,66.653727557567564,null,1000000000,323640100,null,24.302027043074517,-31.170851694740954,null,19.286110117914774,-79.104609720691386,null,0,0]
[18093.5,18.093499999999999,4.4579913168466092,1.3445549531663925,1.0001339895101138,1.6369150914667809E-2,1,0,250.32468544858071,1.5668015043986132,2.3246962895927195,1.1261222027194275,1.0051962702620996,0.1017238277418088,1.0000000001636873,1.8093499998025548E-5,1.0000000001636873,1.8093499998025548E-5,1.0001441716452673,5.392241267667211E-2,10.689751910427336,-113.35486777214471,66.645132227855285,null,1000000000,327374742.25,null,24.292253409924133,-31.077410146022277,null,19.238801560494132,-79.188967636243802,null,0,0]
[18197,18.196999999999999,4.4822126166582725,1.3457986501311852,1.000135526707032,1.6462770274879936E-2,1,0,251.75659152848391,1.5668242257129295,2.3355392672174795,1.128333254290703,1.0052557327453242,0.10230167714865353,1.0000000001655653,1.819699999799147E-5,1.0000000001655653,1.819699999799147E-5,1.0001458355969322,5.4231075880976198E-2,10.633047899996225,-113.3638528769938,66.636147123006197,null,1000000000,331130809,null,24.282615209965059,-30.985136390218635,null,19.191735750022087,-79.272547328091903,null,0,0]
[18303,18.303000000000001,4.5070260800670043,1.347058530299968,1.0001371101202123,1.6558650673136849E-2,1,0,253.2230848449428,1.5668472295005276,2.3466558766770791,1.1305765225586519,1.0053169794032595,0.10289341321352952,1.0000000001674998,1.8302999997956168E-5,1.0000000001674998,1.8302999997956168E-5,1.0001475498115322,5.4547198464902448E-2,10.57536101223376,-113.37345625256916,66.626543747430844,null,1000000000,334999809,null,24.272881806241276,-30.891828585088177,null,19.143782265983408,-79.357352092261877,null,0,{"$f":"IF(AH282>0,W282,0)","v":0}]
[18409,18.408999999999999,4.5318466191215245,1.3483046119152691,1.0001387027276747,1.665453076691787E-2,1,0,254.68957829385775,1.5668699683781711,2.3577841837120532,1.1327986262950192,1.0053785780315534,0.10348507697529866,1.0000000001694458,1.8408999997920449E-5,1.0000000001694458,1.8408999997920449E-5,1.0001492742212639,5.4863324861940371E-2,10.51806031225672,-113.38346280111244,66.616537198887556,null,1000000000,338891281,null,24.263284881846126,-30.799714097408867,null,19.096078490401517,-79.441366493473438,null,0,0]
[18515,18.515000000000001,4.5566741181971446,1.3495371166239396,1.0001403045293751,1.6750410554461602E-2,1,0,256.15607187295376,1.5668924468956653,2.368924023470083,1.1349998419775695,1.005440528565515,0.10407666803304547,1.0000000001714024,1.8514999997884323E-5,1.0000000001714024,1.8514999997884323E-5,1.0001510088302716,5.517945509399317E-2,10.461140644831239,-113.39386962136842,66.606130378631576,null,1000000000,342805225,null,24.253821714809781,-30.708777323885514,null,19.048621990012375,-79.524603232511637,null,0,0]
[18621,18.620999999999999,4.5815084641434147,1.3507562614340525,1.0001419155252698,1.6846290034006693E-2,1,0,257.62256558000774,1.5669146694992184,2.3800752340159317,1.1371804417203597,1.0055028309401004,0.10466818598615657,1.0000000001733709,1.8620999997847774E-5,1.0000000001733709,1.8620999997847774E-5,1.000152753642723,5.5495589182960964E-2,10.404596951596755,-113.40467379040288,66.595326209597118,null,1000000000,346741641,null,24.244489647401117,-30.61900290532661,null,19.001410364186555,-79.607074744378835,null,0,0]
[18729.5,18.729500000000002,4.6069355012182278,1.3519905451742371,1.0001435740383213,1.6944430501212679E-2,1,0,259.12364653304672,1.5669371557173661,2.3915010550009668,1.1393913992204567,1.0055669670277199,0.10527357870533102,1.000000000175397,1.8729499997809933E-5,1.000000000175397,1.8729499997809933E-5,1.0001545501780398,5.5819183281884212E-2,10.347103879838338,-113.41614122029043,66.583858779709573,null,1000000000,350794170.25,null,24.23507054957134,-30.52829918493833,null,18.953336390257924,-79.690711535081903,null,0,0]
[18838,18.838000000000001,4.6323694797034012,1.3532112771120135,1.0001452421842751,1.7042570641986204E-2,1,0,260.62472761559724,1.5669593829145414,2.4029384552317961,1.1415813201053591,1.0056314716088912,0.10587889398248423,1.000000000177435,1.8837999997771654E-5,1.000000000177435,1.8837999997771654E-5,1.0001563574126844,5.6142781468219466E-2,10.289994302680082,-113.42801870753811,66.571981292461885,null,1000000000,354870244,null,24.225783372064317,-30.438781495907804,null,18.905513990606682,-79.773572117595961,null,0,0]
[18946.5,18.9465,4.657810285888198,1.3544186756375194,1.0001469199630828,1.7140710454438435E-2,1,0,262.12580882543426,1.5669813555406249,2.4143872701493208,1.1437504824814115,1.0056963446127103,0.10648413138897728,1.0000000001794849,1.8946499997732925E-5,1.0000000001794849,1.8946499997732925E-5,1.0001581753512043,5.6466383765442885E-2,10.233263096051001,-113.440303063858,66.559696936142004,null,1000000000,358969862.25,null,24.216625462426951,-30.350434134315378,null,18.857940693614971,-79.855669006207492,null,0,0]
[19055,19.055,4.6832578085025229,1.355612954551626,1.0001486073746961,1.7238849936680584E-2,1,0,263.62689016038337,1.5670030779441497,2.4258473381383046,1.1458991599889663,1.0057615859678857,0.10708929049650973,1.0000000001815466,1.9054999997693753E-5,1.0000000001815466,1.9054999997693753E-5,1.000160003998174,5.6789990197027164E-2,10.176905232548519,-113.45299108811102,66.54700891188898,null,1000000000,363093025,null,24.2075942312715,-30.263241646336535,null,18.810614061267938,-79.937014452257216,null,0,0]
[19165.75,19.165749999999999,4.7092398584461019,1.356818686441982,1.0001503397131801,1.7339024226962159E-2,1,0,265.15910003693693,1.5670249971654309,2.4375564980147733,1.1480715484322876,1.0058285600684462,0.10770691779067991,1.0000000001836629,1.9165749997653307E-5,1.0000000001836629,1.9165749997653307E-5,1.0001618816150204,5.7120311649288345E-2,10.119758572010415,-113.46635520417834,66.533644795821658,null,1000000000,367325973.0625,null,24.198503737756546,-30.175416273108535,null,18.762557894244793,-80.019284261941294,null,0,0]
[19276.5,19.276499999999999,4.7352286794966227,1.3580111849764356,1.0001520820880263,1.7439198169219721E-2,1,0,266.69131003942294,1.5670466645236216,2.4492770513622295,1.1502231558385545,1.0058959178046858,0.1083244626041302,1.0000000001857918,1.9276499997612391E-5,1.0000000001857918,1.9276499997612391E-5,1.0001637703987645,5.7450637458567974E-2,10.062990612731653,-113.48013313324986,66.519866866750135,null,1000000000,371583452.25,null,24.189539972805786,-30.088762409109759,null,18.714753699916788,-80.100796125761576,null,0,0]
[19387.25,19.387250000000002,4.7612241607751944,1.3591906634910049,1.0001538344991823,1.7539371761444638E-2,1,0,268.22352016568323,1.5670680843349587,2.4610088353964783,1.1523542593364906,1.0059636590995413,0.10894192448246073,1.0000000001879328,1.9387249997571001E-5,1.0000000001879328,1.9387249997571001E-5,1.0001656703543549,5.7780967649818028E-2,10.006596305080215,-113.49432144451411,66.505678555485886,null,1000000000,375865462.5625,null,24.18070037479476,-30.003264397300899,null,18.667198990276376,-80.181562268516274,null,0,0]
[19498,19.498000000000001,4.7872261937831864,1.3603573308334238,1.0001555969465954,1.7639545001628322E-2,1,0,269.75573041360866,1.5670892608176139,2.4727516902680837,1.1544651315431325,1.0060317838755319,0.10955930297164658,1.0000000001900859,1.9497999997529132E-5,1.0000000001900859,1.9497999997529132E-5,1.0001675814867697,5.8111302247986628E-2,9.9505706947691408,-113.50891670290282,66.491083297097177,null,1000000000,380172004,null,24.171982443278786,-29.91890683354605,null,18.619891311481275,-80.261594657843617,null,0,0]
[19611.75,19.611750000000001,4.813939279627375,1.3615424792360307,1.0001574175829246,1.7742431369575776E-2,1,0,271.32944535255768,1.5671107619546993,2.4848239958783731,1.156612404051502,1.0061021531395411,0.11019331774712635,1.0000000001923104,1.9611749997485638E-5,1.0000000001923104,1.9611749997485638E-5,1.0001695560283286,5.845058957548005E-2,9.8934061686937564,-113.52432733925367,66.475672660746326,null,1000000000,384620738.0625,null,24.163152451241331,-29.833435476447992,null,18.571556777443348,-80.343043436757554,null,0,0]
[19725.5,19.7255,4.8406590523862398,1.3627145455571492,1.0001592488064865,1.7845317361856447E-2,1,0,272.90316041549528,1.5671320151161885,2.4969076476461609,1.1587389030635802,1.0061729267745332,0.11082724358491655,1.0000000001945477,1.9725499997441631E-5,1.0000000001945477,1.9725499997441631E-5,1.0001715423711655,5.8789881605211348E-2,9.8366202901231077,-113.54015991786322,66.459840082136779,null,1000000000,389095350.25,null,24.1544456504149,-29.749135049305149,null,18.523477699699129,-80.423742958556602,null,0,0]
[19839.25,19.83925,4.8673854019352554,1.3638737420471383,1.0001610906172227,1.7948202976294209E-2,1,0,274.47687560028896,1.5671530245673717,2.5090024816381553,1.1608449096278266,1.0062441046951842,0.11146107999433597,1.0000000001967979,1.983924999739712E-5,1.0000000001967979,1.983924999739712E-5,1.000173540520767,5.9129178364198426E-2,9.7802079905099006,-113.55641071638054,66.44358928361946,null,1000000000,393595840.5625,null,24.14585952208953,-29.665989665496131,null,18.475651528411291,-80.503705385963272,null,0,0]
[19953,19.952999999999999,4.8941182205286005,1.3650202764589796,1.0001629430150747,1.8051088210712971E-2,1,0,276.05059090485446,1.5671737944762776,2.521108336916638,1.1629307001291667,1.0063156868157075,0.11209482648512925,1.0000000001990612,1.9952999997352091E-5,1.0000000001990612,1.9952999997352091E-5,1.0001755504826519,5.9468479879454757E-2,9.7241642976461744,-113.57307601642604,66.426923983573957,null,1000000000,398122209,null,24.137391608338746,-29.583983700052009,null,18.428075749298351,-80.582942624018997,null,0,0]
[20069,20.068999999999999,4.9213863731142622,1.3661766601353029,1.0001648429570125,1.8156008144056237E-2,1,0,277.65543476525363,1.5671947327444793,2.5334648353371558,1.1650372099382347,1.0063891010285821,0.11274101550888289,1.0000000002013825,2.0068999997305639E-5,1.0000000002013825,2.0068999997305639E-5,1.0001776123728472,5.9814497779573463E-2,9.6673866072488721,-113.59049399220939,66.409506007790611,null,1000000000,402764761,null,24.128875456073718,-29.501513156622302,null,18.379814211166075,-80.663012424207068,null,0,0]
[20185,20.184999999999999,4.9486610341616197,1.3673202984555468,1.0001667539089154,1.8260927677627437E-2,1,0,279.260278745981,1.5672154303579588,2.5458324665556735,1.167123262117743,1.0064629354081385,0.11338710999320134,1.000000000203717,2.0184999997258646E-5,1.000000000203717,2.0184999997258646E-5,1.0001796865589383,6.0160520682709329E-2,9.6109821022045612,-113.60833523971237,66.391664760287625,null,1000000000,407434225,null,24.1204772642241,-29.420195543815996,null,18.331807897971384,-80.742352278839562,null,0,0]
[20301,20.300999999999998,4.9759420966460635,1.3684513980360782,1.0001686758707202,1.8365846809118944E-2,1,0,280.86512284497383,1.5672358914419517,2.5582110691081859,1.1691891353490351,1.0065371898619127,0.11403310941954016,1.0000000002060654,2.0300999997211114E-5,1.0000000002060654,2.0300999997211114E-5,1.0001817730468798,6.0506548617496318E-2,9.5549458042774571,-113.62659583997754,66.37340416002246,null,1000000000,412130601,null,24.112194610589945,-29.340015101016423,null,18.284054253678434,-80.820974027935151,null,0,0]
[20417,20.417000000000002,5.0032294558524253,1.3695701611156907,1.0001706088423639,1.8470765536223167E-2,1,0,282.46996706021633,1.5672561200279456,2.5706004844989097,1.1712351036369832,1.0066118642969419,0.11467901326982477,1.0000000002084271,2.0416999997163034E-5,1.0000000002084271,2.0416999997163034E-5,1.0001838718426606,6.0852581612563482E-2,9.4992728297812921,-113.64527188582809,66.354728114171905,null,1000000000,416853889,null,24.104025131609276,-29.260956330204575,null,18.236550758162938,-80.898889260695711,null,0,0]
[20536,20.536000000000001,5.031228958342246,1.3707052459917528,1.0001726032452127,1.8578397256055094E-2,1,0,284.11631598596608,1.567276634301213,2.5833213886683497,1.1733135834645263,1.0066889062834847,0.11534152167183345,1.0000000002108638,2.0535999997113137E-5,1.0000000002108638,2.0535999997113137E-5,1.0001860377133693,6.1207569025090301E-2,9.4425325551719723,-113.66485855287195,66.335141447128052,null,1000000000,421727296,null,24.095759558786295,-29.181002524796973,null,18.188076056376602,-80.978097270803659,null,0,0]
[20655,20.655000000000001,5.0592348714008333,1.3718277655434854,1.000174609234602,1.8686028545393096E-2,1,0,285.76266502990427,1.5672969121989346,2.5960533435891744,1.1753716849245108,1.0067663900555497,0.1160039283872648,1.0000000002133145,2.065499999706266E-5,1.0000000002133145,2.065499999706266E-5,1.0001882165496399,6.1562561824041677E-2,9.3861645232058848,-113.68487414668994,66.315125853310064,null,1000000000,426629025,null,24.087608233350434,-29.102196944312279,null,18.139859349846372,-81.056585674143363,null,0,0]
[20774,20.774000000000001,5.0872470891553094,1.3729379244860391,1.0001766268104617,1.8793659401746054E-2,1,0,287.40901418999999,1.5673169577831443,2.6087961874653045,1.1774096890714913,1.0068443155111408,0.11666623285835756,1.0000000002157794,2.0773999997011598E-5,1.0000000002157794,2.0773999997011598E-5,1.0001904083580497,6.1917560040309495E-2,9.3301637568613351,-113.70531449781896,66.294685502181039,null,1000000000,431559076,null,24.079568785232301,-29.024523686290738,null,18.091898031619955,-81.134366201941688,null,0,0]
[20893,20.893000000000001,5.1152655080283465,1.3740359231727182,1.0001786559727222,1.8901289822622923E-2,1,0,289.05536346426845,1.5673367750233338,2.621549761509459,1.1794278721656304,1.0069226825477131,0.11732843452788146,1.0000000002182587,2.0892999996959949E-5,1.0000000002182587,2.0892999996959949E-5,1.0001926131452148,6.2272563704780091E-2,9.2745253740981202,-113.72617545630679,66.273824543693209,null,1000000000,436517449,null,24.071638902246466,-28.947967117699132,null,18.044189531842576,-81.211450335509767,null,0,0]
[21014.75,21.014749999999999,5.1439377234224697,1.3751469152480622,1.000180744018438,1.9011407047839581E-2,1,0,290.73975874126512,1.5673568179501631,2.6346090034729559,1.1814724637062739,1.0070033174855058,0.11800583220406728,1.0000000002208098,2.1014749996906491E-5,1.0000000002208098,2.1014749996906491E-5,1.0001948823223974,6.26357769061653E-2,9.2179712780677221,-113.747949489216,66.252050510784002,null,1000000000,441619717.5625,null,24.063636805597859,-28.870781054517739,null,17.995637532460783,-81.289606823834987,null,0,0]
[21136.5,21.136500000000002,5.1726162176038306,1.3762455893382797,1.0001828441920979,1.9121523811945453E-2,1,0,292.42415413371197,1.5673766299780605,2.6476791503639929,1.1834968775751809,1.0070844144303868,0.11868312109412092,1.0000000002233758,2.1136499996852412E-5,1.0000000002233758,2.1136499996852412E-5,1.0001971650992558,6.2998995875860345E-2,9.1617864639232067,-113.77015507389555,66.229844926104448,null,1000000000,446751632.25,null,24.055744678520554,-28.794731624247998,null,17.947344845393573,-81.367057900519015,null,0,0]
[21258.25,21.25825,5.2013008867140877,1.3773321465662822,1.0001849564936258,1.9231640112272963E-2,1,0,294.10854963962538,1.5673962150741689,2.6607600414814945,1.1855013946497643,1.0071659732707532,0.11936030060302386,1.0000000002259566,2.1258249996797703E-5,1.0000000002259566,2.1258249996797703E-5,1.0001994614829985,6.3362220646924344E-2,9.1059659972124294,-113.79278783789876,66.207212162101243,null,1000000000,451913193.0625,null,24.047960222349282,-28.719802927008097,null,17.899308834854068,-81.44381509110292,null,0,0]
[21380,21.38,5.2299916291512858,1.3784067837575662,1.0001870809229447,1.9341755946154612E-2,1,0,295.792945257067,1.5674155771152689,2.6738515191382612,1.1874862909529798,1.0072479938944034,0.12003737013635107,1.0000000002285523,2.1379999996742367E-5,1.0000000002285523,2.1379999996742367E-5,1.0002017714808753,6.3725451252410206E-2,9.0505050378225462,-113.81584343555095,66.184156564449054,null,1000000000,457104400,null,24.040281194893595,-28.645979335912703,null,17.851526902919876,-81.519889674903553,null,0,0]
[21504.5,21.5045,5.2593365941909642,1.3794935678215938,1.0001892658790248,1.9454358510848906E-2,1,0,297.51538688477342,1.5674351497700987,2.6872494842332717,1.1894960127056315,1.0073323445691269,0.12072961847293384,1.0000000002312217,2.1504499996685127E-5,1.0000000002312217,2.1504499996685127E-5,1.0002041477417587,6.4096892313306633E-2,8.9941581997075062,-113.83985256505395,66.160147434946055,null,1000000000,462443520.25,null,24.032535468094174,-28.571615099981905,null,17.802925791604252,-81.596988168510407,null,0,0]
[21629,21.629000000000001,5.2886877020927985,1.3805682902958691,1.0001914635167866,1.9566960582146357E-2,1,0,299.23782862514253,1.5674544971007658,2.7006581953629563,1.1914857859761416,1.007417177884355,0.12142175055444683,1.0000000002339067,2.1628999996627219E-5,1.0000000002339067,2.1628999996627219E-5,1.0002065382542,6.446833954505525E-2,8.9381773482845066,-113.86429474455365,66.135705255446354,null,1000000000,467813641,null,24.024895418132871,-28.49837425683841,null,17.754584990142554,-81.673395965762779,null,0,0]
[21753.5,21.753499999999999,5.3180448511465856,1.3816311484273578,1.0001936738361465,1.9679562157194814E-2,1,0,300.96027047623994,1.5674736229759505,2.714077493257208,1.1934558907866324,1.0075024937181707,0.1221137657472134,1.0000000002366074,2.1753499996568643E-5,1.0000000002366074,2.1753499996568643E-5,1.0002089430260865,6.4839792982979177E-2,8.8825575993639205,-113.88916542094601,66.110834579053986,null,1000000000,473214762.25,null,24.017358820281288,-28.426240947748475,null,17.706501839073553,-81.749124370266642,null,0,0]
[21878,21.878,5.3474079418549616,1.382682335239189,1.000195896837021,1.9792163233142201E-2,1,0,302.68271243617545,1.5674925311762724,2.7275072216558254,1.1954066022613827,1.0075882919480046,0.12280566341821877,1.0000000002393234,2.1877999996509387E-5,1.0000000002393234,2.1877999996509387E-5,1.0002113620653508,6.5211252662394484E-2,8.8272941622290553,-113.9144600747365,66.085539925263504,null,1000000000,478646884,null,24.009923504757474,-28.355199589596545,null,17.658673717462502,-81.824184443619515,null,0,0]
[22005.25,22.00525,5.3774256535329634,1.3837448767992484,1.0001981820450148,1.9907250962721671E-2,1,0,304.4432004134041,1.5675116359335362,2.7412442096943042,1.1973806425004971,1.0076764836878849,0.12351272186702099,1.0000000002421157,2.2005249996448127E-5,1.0000000002421157,2.2005249996448127E-5,1.0002138492890866,6.5590923761054243E-2,8.7711733593685093,-113.94074690541619,66.059253094583809,null,1000000000,484231027.5625,null,24.002426415272012,-28.283701502169855,null,17.610050004087423,-81.900223101032694,null,0,0]
[22132.5,22.1325,5.4074493688880061,1.3847956204614809,1.000200480500758,2.0022338164883427E-2,1,0,306.2036885004743,1.5675305210089487,2.7549917733573484,1.1993349891488858,1.0077651791088136,0.12421965620994521,1.0000000002449236,2.2132499996386149E-5,1.0000000002449236,2.2132499996386149E-5,1.0002163514343485,6.5970601454558492E-2,8.7154149519256112,-113.96746721432223,66.032532785677773,null,1000000000,489847556.25,null,23.995030717258427,-28.213312076790555,null,17.561687294658107,-81.975586196768077,null,0,0]
[22259.75,22.25975,5.4374789884699437,1.3858347593553908,1.0002027922041601,2.0137424836582436E-2,1,0,307.96417669550226,1.5675491901699541,2.7687497551127711,1.201269920738971,1.0078543780778124,0.12492646577326104,1.0000000002477483,2.2259749996323457E-5,1.0000000002477483,2.2259749996323457E-5,1.0002188685097533,6.6350285780592794E-2,8.6600141128083017,-113.99461628997749,66.005383710022514,null,1000000000,495496470.0625,null,23.98773426178737,-28.14401553198309,null,17.513582911011856,-82.050284798664833,null,0,0]
[22387,22.387,5.4675144149941586,1.3868624824682103,1.0002051171551287,2.0252510974773756E-2,1,0,309.72466499664716,1.5675676470983397,2.7825180004258074,1.2031857108781154,1.0079440804611957,0.12563314988397464,1.0000000002505889,2.2386999996260046E-5,1.0000000002505889,2.2386999996260046E-5,1.0002214005239676,6.6729976776834773E-2,8.6049661073290569,-114.02218946088871,65.977810539111289,null,1000000000,501177769,null,23.980534953248927,-28.075796363591508,null,17.465734214071055,-82.124329737227015,null,0,0]
[22517.5,22.517499999999998,5.4983228861932769,1.3879047907734052,1.0002075152452949,2.0370535887278801E-2,1,0,311.53011676155643,1.5675863587580559,2.7966483918331244,1.2051308313260618,1.008036596591932,0.12635775189742213,1.000000000253519,2.2517499996194256E-5,1.000000000253519,2.2517499996194256E-5,1.0002240127316453,6.7119372152934439E-2,8.5488737621033692,-114.05090248853709,65.949097511462909,null,1000000000,507037806.25,null,23.973250532211647,-28.006937907527544,null,17.416926289882642,-82.199597986400605,null,0,0]
[22648,22.648,5.5291372642349401,1.3889354824325744,1.0002099272681648,2.0488560232189826E-2,1,0,313.33556863428356,1.5676048547831396,2.8107892579318352,1.2070563874935418,1.0081296418930419,0.12708222053694121,1.000000000256466,2.2647999996127708E-5,1.000000000256466,2.2647999996127708E-5,1.0002266406695821,6.7508774624551113E-2,8.4931427056789754,-114.080051730986,65.919948269014,null,1000000000,512931904,null,23.966063984894497,-27.939180405447225,null,17.368381780775401,-82.274201089847978,null,0,0]
[22778.5,22.778500000000001,5.5599574509084961,1.389954748419074,1.0002123532236376,2.0606584006222853E-2,1,0,315.14102061297547,1.5676231388797093,2.8249404414217705,1.20896265900776,1.0082232162180196,0.12780655507908176,1.00000000025943,2.2778499996060381E-5,1.00000000025943,2.2778499996060381E-5,1.0002292843472884,6.7898184232297903E-2,8.4377681194292578,-114.10963228448054,65.89036771551946,null,1000000000,518860062.25,null,23.958973215719222,-27.872508006786163,null,17.32009796370096,-82.348149992051574,null,0,0]
[22909,22.908999999999999,5.590783350150601,1.390962775590538,1.0002147931116119,2.0724607206093999E-2,1,0,316.94647269582134,1.5676412146694376,2.8391017880253049,1.2108499204835774,1.0083173194195809,0.12853075480122428,1.000000000262411,2.2908999995992281E-5,1.000000000262411,2.2908999995992281E-5,1.0002319437743286,6.8287601016778998E-2,8.3827452772767348,-114.13963929184651,65.860360708153493,null,1000000000,524822281,null,23.951976181507785,-27.806905143375346,null,17.272072155759869,-82.421455401679822,null,0,0]
[23042.25,23.042249999999999,5.6222646340792393,1.3919806381286501,1.0002172987907341,2.0845116889039349E-2,1,0,318.78997080941519,1.5676594601066141,2.8535718832058667,1.2127576169061705,1.0084139511963219,0.12927007557558087,1.0000000002654725,2.3042249995921944E-5,1.0000000002654725,2.3042249995921944E-5,1.0002346755035858,6.8685231349442821E-2,8.326921074010885,-114.17071366130628,65.82928633869372,null,1000000000,530945285.0625,null,23.944926348984694,-27.741007536315824,null,17.223297785017113,-82.495652472967691,null,0,0]
[23175.5,23.1755,5.6537516780500354,1.3929871642785601,1.0002198189955231,2.096562596645013E-2,1,0,320.63346902791255,1.5676774957376831,2.8680522585943202,1.2146460567845501,1.0085111340614934,0.13000925426799864,1.0000000002685518,2.3175499995850781E-5,1.0000000002685518,2.3175499995850781E-5,1.0002374236732654,6.9082869250026394E-2,8.2714539222308261,-114.20222256249347,65.797777437506525,null,1000000000,537103800.25,null,23.937970098775487,-27.676193086269063,null,17.174786883446259,-82.569200485360355,null,0,0]
[23308.75,23.30875,5.6852443863590842,1.3939825403732866,1.0002223537258685,2.1086134434830761E-2,1,0,322.47696734951444,1.5676953251608177,2.8825427592636323,1.2165155169542881,1.0086088678557974,0.13074829011191258,1.0000000002716489,2.3308749995778801E-5,1.0000000002716489,2.3308749995778801E-5,1.0002401882937266,6.9480514761726522E-2,8.2163390749372827,-114.23416097738324,65.76583902261676,null,1000000000,543297826.5625,null,23.931105415168478,-27.612446093964341,null,17.126536719759731,-82.642110117628647,null,0,0]
[23442,23.442,5.7167426653943263,1.3949669487286867,1.0002249029816606,2.1206642290685765E-2,1,0,324.32046577246263,1.5677129518923802,2.8970432332791862,1.218366269244894,1.0087071524190954,0.13148718234167811,1.0000000002747638,2.3441999995705994E-5,1.0000000002747638,2.3441999995705994E-5,1.0002429693753885,6.987816792773012E-2,8.1615718761892353,-114.26652393997463,65.733476060025367,null,1000000000,549527364,null,23.924330333020094,-27.549751142322535,null,17.078544603160065,-82.714391818376427,null,0,0]
[23578.5,23.578499999999998,5.7490148756144661,1.3959641812484167,1.0002275294754925,2.1330088723766186E-2,1,0,326.20892767486839,1.5677308019689211,2.9119075628386804,1.2202430429504958,1.0088084050814863,0.13224394662273836,1.0000000002779728,2.3578499995630548E-5,1.0000000002779728,2.3578499995630548E-5,1.0002458353676003,7.0285527933190262E-2,8.1058245893930341,-114.30011131322064,65.69988868677936,null,1000000000,555945662.25,null,23.917480908603817,-27.486602063259042,null,17.029646740780137,-82.787796082477882,null,0,0]
[23715,23.715,5.7812927392403548,1.396950279328727,1.0002301712117332,2.1453534506652047E-2,1,0,328.09738968001597,1.5677484465626299,2.9267820447491837,1.2221007468780671,1.0089102353644044,0.1330005585751344,1.0000000002812006,2.3714999995554218E-5,1.0000000002812006,2.3714999995554218E-5,1.0002487186561155,7.0692896062600027E-2,8.0504325089102196,-114.33413381497941,65.66586618502059,null,1000000000,562401225,null,23.910721491421782,-27.42452510090558,null,16.981014077479358,-82.860562892914032,null,0,0]
[23851.5,23.851500000000001,5.8135761621062718,1.3979254265279979,1.0002328281902624,2.1576979635586177E-2,1,0,329.98585178614167,1.5677658892013426,2.9416665250051817,1.2239396575797372,1.0090126430929682,0.1337570173788547,1.0000000002844471,2.3851499995477007E-5,1.0000000002844471,2.3851499995477007E-5,1.0002516192523294,7.1100272362351613E-2,7.9953909125243641,-114.36858627777993,65.631413722220074,null,1000000000,568894052.25,null,23.904050124516161,-27.363504565139216,null,16.932643847999124,-82.932702769678727,null,0,0]
[23988,23.988,5.8458650521105548,1.3988898024335228,1.0002355004109582,2.1700424106811503E-2,1,0,331.87431399152143,1.567783133332598,2.9565608525999654,1.2257600465489056,1.0091156280913756,0.13451332221492071,1.0000000002877121,2.3987999995398908E-5,1.0000000002877121,2.3987999995398908E-5,1.0002545371677014,7.1507656878826112E-2,7.9406951687572258,-114.40346359192573,65.596536408074272,null,1000000000,575424144,null,23.89746490033437,-27.303525051139378,null,16.884533328413777,-83.004226005238692,null,0,0]
[24127.75,24.127749999999999,5.8789282950879951,1.3998661641030057,1.0002382520466788,2.182680704680573E-2,1,0,333.80773968381169,1.5678005859031705,2.9718198542548011,1.2276048679388791,1.0092216629792619,0.13528747394474416,1.0000000002910743,2.4127749995318022E-5,1.0000000002910743,2.4127749995318022E-5,1.0002575425118938,7.1924749587571904E-2,7.8850507045771057,-114.43960618836728,65.560393811632721,null,1000000000,582148320.0625,null,23.890810187221227,-27.243180156926584,null,16.835543577346805,-83.076823851074039,null,0,0]
[24267.5,24.267499999999998,5.9119970796549088,1.4008316041167224,1.0002410196587646,2.195318928942927E-2,1,0,335.74116547660617,1.5678178374662246,2.9870888667471944,1.2294308352542267,1.0093283025773983,0.13606146255385285,1.0000000002944558,2.4267499995236196E-5,1.0000000002944558,2.4267499995236196E-5,1.0002605660343062,7.2341851007324806E-2,7.8297592151848159,-114.47618345408455,65.523816545915452,null,1000000000,588911556.25,null,23.884241873581193,-27.183894658606715,null,16.786820401594547,-83.148796471188319,null,0,0]
[24407.25,24.407250000000001,5.9450713133379089,1.4017863029412103,1.0002438032470826,2.2079570830650652E-2,1,0,337.67459136817848,1.5678348914744809,3.0023677373420914,1.2312382240668724,1.0094355466941352,0.13683528716676327,1.0000000002978569,2.4407249995153419E-5,1.0000000002978569,2.4407249995153419E-5,1.0002636077474505,7.2758961187821838E-2,7.7748160115181433,-114.51319009353561,65.486809906464387,null,1000000000,595713852.5625,null,23.87775806391231,-27.125652914736381,null,16.738361007596755,-83.220154208633204,null,0,0]
[24547,24.547000000000001,{"$f":"SQRT(1+(A333/pole1)^2)","v":5.9781509056949824},{"$f":"ATAN(A333/pole1)","v":1.4027304371279326},{"$f":"SQRT(1+(A333/Zero1)^2)","v":1.0002466028114996},{"$f":"ATAN(A333/Zero1)","v":2.2205951666438548E-2},{"$f":"IF(VIN_nom>Vout, 1, SQRT(1+(A333/z_RHP)^2))","v":1},{"$f":"IF(VIN_nom>Vout, 0, -ATAN(A333/z_RHP))","v":0},{"$f":"SQRT(1+(A333/Pole2)^2)","v":339.60801735684157},{"$f":"ATAN(A333/Pole2)","v":1.5678517513020331},3.0176563163001049,1.2330273048550751,{"$f":"SQRT(1+(A333/pole4)^2)","v":1.0095433951368178},{"$f":"ATAN(A333/pole4)","v":0.13760894690914854},{"$f":"SQRT(1+(A333/Zero3)^2)","v":1.0000000003012777},{"$f":"ATAN(A333/Zero3)","v":2.4546999995069693E-5},{"$f":"SQRT(1+(A333/pole5)^2)","v":1.0000000003012777},{"$f":"ATAN(A333/pole5)","v":2.4546999995069693E-5},{"$f":"SQRT((1-(Z333/pterm2))^2+(A333/pterm1)^2)","v":1.0002666676639109},{"$f":"IF((ATAN((A333/pterm1)/(1-A333^2/pterm2))>0),ATAN((A333/pterm1)/(1-A333^2/pterm2)),PI()+ATAN((A333/pterm1)/(1-A333^2/pterm2)))","v":7.3176080178787503E-2},{"$f":"20*LOG10(((E333*K333*G333*O333)/(C333*I333*S333*M333*Q333))*Adc)","v":7.7202164946971763},{"$f":"((F333+L333+H333+R333)-(D333+J333+T333+N333+T333))*radconv","v":-114.55062087426656},{"$f":"IF(V333>0,V333,V333+180)","v":65.449379125733444},null,{"$f":"IF(U333<0,A333,1000000000)","v":1000000000},{"$f":"A333^2","v":602555209},null,{"$f":"20*LOG10((K333/(I333*M333))*AEA)","v":23.871356910834415},{"$f":"(L333-(J333+N333))*radconv","v":-27.068439571278979},null,{"$f":"20*LOG10((E333*G333/(C333*S333))*Acs*Am)","v":16.690162643853682},{"$f":"(F333+H333-(D333+T333))*radconv","v":-83.290907182142362},null,{"$f":"SUM((U334<0)*(U333>0))*A333","v":0},0]
[24690,{"$f":"A334/1000","v":24.69},6.0120052456773934,1.4036857720721569,1.000249484019651,2.2335270856993154E-2,1,0,341.58640683937392,1.5678688056512688,3.0333103401220507,1.2348393174751338,1.009654377051296,0.13840042716129985,1.000000000304798,2.4689999994983023E-5,1.000000000304798,2.4689999994983023E-5,1.0002698175976603,7.3602908783455073E-2,7.6646982853509122,-114.58935579745274,65.41064420254726,null,1000000000,609596100,null,23.864890577881887,-27.010944515909234,null,16.641110767459949,-83.362689876343893,null,0,0]
[24833,24.832999999999998,6.0458650111535519,1.4046304071958604,1.0002523819553311,2.2464589300382132E-2,1,0,343.56479642011277,1.5678856635883789,3.0489742211966564,1.2366327177698841,1.0097659913153982,0.13919173293687159,1.0000000003083389,2.4832999994895347E-5,1.0000000003083389,2.4832999994895347E-5,1.000272986618127,7.4029746718444409E-2,7.6095304712726968,-114.62852393539718,65.371476064602817,null,1000000000,616677889,null,23.858507025323917,-26.954494617870306,null,16.592326505939702,-83.433860093384808,null,0,0]
[24976,24.975999999999999,6.0797301114750555,1.4055645195982391,1.0002552966183944,2.2593906992286729E-2,1,0,345.54318609737129,1.567902328486996,3.0646478083781727,1.2384077796820037,1.0098782377194582,0.13998286330290388,1.0000000003119003,2.4975999994806651E-5,1.0000000003119003,2.4975999994806651E-5,1.0002761747390276,7.4456594036989565E-2,7.5547084040953569,-114.66811988556502,65.331880114434981,null,1000000000,623800576,null,23.852204421177863,-26.899074321243177,null,16.543807042908412,-83.504427983599186,null,0,0]
[25119,25.119,6.1136004579878902,1.4064882825282405,1.0002582280086949,2.272322392838837E-2,1,0,347.52157586950102,1.5679188036439309,3.0803309535044274,1.240164772042631,1.0099911160527151,0.14077381732772867,1.0000000003154821,2.5118999994716938E-5,1.0000000003154821,2.5118999994716938E-5,1.0002793819741584,7.4883450792310541E-2,7.5002275248638526,-114.70813831335873,65.291861686641269,null,1000000000,630964161,null,23.845980980198789,-26.844668358650868,null,16.495549604655981,-83.574403476717222,null,0,0]
[25265.25,25.265250000000002,6.1482459211363683,1.4074225117325889,1.000261243323153,2.2855479099500264E-2,1,0,349.54492914199398,1.5679354603347573,3.0963802686394648,1.2419432807548565,1.010107213217283,0.14158256421239779,1.0000000003191665,2.5265249994624119E-5,1.0000000003191665,2.5265249994624119E-5,1.0002826818862458,7.5320018653896773E-2,7.4448566914067262,-114.74949775139481,65.250502248605187,null,1000000000,638332857.5625,null,23.839696166697458,-26.790059456821602,null,16.44646358470019,-83.64536670012177,null,0,0]
[25411.5,25.4115,6.1828966902369684,1.4083462703459375,1.000264276133505,2.298773347092771E-2,1,0,351.56828251035023,1.567951925299695,3.1124392768889337,1.2437034421237043,1.010223970912109,0.14239112468228313,1.0000000003228722,2.5411499994530223E-5,1.0000000003228722,2.5411499994530223E-5,1.0002860018207065,7.5756596498630729E-2,7.3898333620343237,-114.79128801803729,65.208711981962708,null,1000000000,645744332.25,null,23.833490522201835,-26.736480114469732,null,16.397645899823409,-83.715730620663138,null,0,0]
[25557.75,25.557749999999999,6.2175526765785856,1.4092597318643452,1.0002673264395923,2.3119987038051421E-2,1,0,353.59163597292417,1.5679682018300678,3.1285078289850601,1.2454455278631495,1.0103413889081945,0.14319949774497123,1.0000000003265992,2.5557749994435239E-5,1.0000000003265992,2.5557749994435239E-5,1.0002893417925549,7.6193184383398227E-2,7.3351529358110596,-114.83350362431531,65.166496375684687,null,1000000000,653198585.0625,null,23.827362279723584,-26.683914895249107,null,16.3490937160784,-83.785505182457229,null,0,0]
[25704,25.704000000000001,6.2522137934038078,1.4101630660061593,1.0002703942412543,2.3252239796252284E-2,1,0,355.61498952810751,1.5679842931422927,3.1445857786232385,1.2471698045740061,1.0104594669753537,0.14400768240948844,1.0000000003303477,2.570399999433916E-5,1.0000000003303477,2.570399999433916E-5,1.0002927018168921,7.6629782365069399E-2,7.2808109002504171,-114.87613915356233,65.123860846437665,null,1000000000,660695616,null,23.821309717546235,-26.632348651566751,null,16.300804242695108,-83.854700113172129,null,0,0]
[25853.75,25.853750000000002,6.2877096345488237,1.411077697977388,1.0002735535888554,2.3387656734709324E-2,1,0,357.68676531397324,1.568000580908625,3.1610580875172789,1.2489171657985965,1.0105810545556984,0.14483501199682958,1.0000000003342082,2.5853749994239644E-5,1.0000000003342082,2.5853749994239644E-5,1.0002961630459952,7.7076839367076683E-2,7.2255143840039482,-114.92022455554994,65.079775444450064,null,1000000000,668416389.0625,null,23.815188974316701,-26.580567941943222,null,16.25162846967817,-83.924960325380169,null,0,0]
[26003.5,26.003499999999999,6.3232106766303353,1.41198206047629,1.0002767312791039,2.3523072815261496E-2,1,0,359.75854119363714,1.5680166810791294,{"$f":"SQRT(1+(A343/Zero2)^2)","v":3.1775399478949065},{"$f":"ATAN(A343/Zero2)","v":1.2506464051754003},1.0107033336860451,0.14566214196259594,1.0000000003380909,2.6003499994138965E-5,1.0000000003380909,2.6003499994138965E-5,1.0002996453311701,7.7523907075666601E-2,7.1705633481191287,-114.96473895562644,65.035261044373556,null,1000000000,676182012.25,null,23.809144063250642,-26.529803351793074,null,16.202722344859414,-83.994632802761714,null,0,0]
[26153.25,26.15325,6.3587168325370573,1.4128763240407816,1.0002799273118248,2.3658488032950627E-2,1,0,361.83031716548822,1.5680325968762188,3.194031211893245,1.2523577929793104,1.0108263041154251,0.14648907124768609,1.0000000003419962,2.6153249994037124E-5,1.0000000003419962,2.6153249994037124E-5,1.0003031486889098,7.7970985551839081E-2,7.115953222427164,-115.00967677050673,64.990323229493271,null,1000000000,683992485.5625,null,23.80317327485573,-26.480039519454245,null,16.154083007562356,-84.063727320198737,null,0,0]
[26303,26.303000000000001,6.394228017080156,1.4137606554857911,1.0002831416868427,2.3793902382818706E-2,1,0,363.90209322795175,1.568048331448922,3.2105317346039719,1.2540515943519543,1.0109499655915719,0.14731579879461049,1.000000000345924,2.6302999993934108E-5,1.000000000345924,2.6302999993934108E-5,1.0003066731358021,7.841807485657655E-2,7.0616795246518471,-115.05503249359452,64.944967506405476,null,1000000000,691847809,null,23.797274943670772,-26.431261373266857,null,16.105707640972003,-84.132253439260751,null,0,0]
[26456,26.456,6.4305150019720259,1.414654091384022,1.0002864447664739,2.3932254706959324E-2,1,0,366.01883280278571,1.5680642235410605,3.2273997800632137,1.255764263504376,1.0110770243149625,0.14816025922412354,1.0000000003499598,2.6455999993827639E-5,1.0000000003499598,2.6455999993827639E-5,1.0003102958712109,7.8874878515144714E-2,7.006570819803831,-115.10179852702093,64.898201472979068,null,1000000000,699919936,null,23.791321747167178,-26.382427227459118,null,16.056552132627576,-84.201689463017203,null,0,{"$f":"IF(AH346>0,W346,0)","v":0}]
[26609,26.609000000000002,6.4668070622713039,1.4155374999626231,1.0002897669928268,2.407060611473899E-2,1,0,368.13557246899791,1.5680799328775863,3.2442771937892543,1.2574591182534165,1.011204803869453,0.14900450683730909,1.0000000003540195,2.6608999993719931E-5,1.0000000003540195,2.6608999993719931E-5,1.0003139406564048,7.9331693606040393E-2,6.9518041160660706,-115.14898942543077,64.85101057456923,null,1000000000,708038881,null,23.785440807174787,-26.334591107178138,null,16.007666368882209,-84.270551671206121,null,0,0]
[26762,26.762,6.503104113004575,1.416411047733418,1.0002931083657107,2.4208956600870461E-2,1,0,370.25231222502089,1.5680954625929435,3.2611638303320771,1.2591364255200646,1.011333303981818,0.14984854051158095,1.0000000003581022,2.6761999993610975E-5,1.0000000003581022,2.6761999993610975E-5,1.0003176075093823,7.9788520194245538E-2,6.8973749032390668,-115.19659955882277,64.803400441177232,null,1000000000,716204644,null,23.779630481372166,-26.287737834248748,null,15.959047481857818,-84.338849608278366,null,0,0]
[26915,26.914999999999999,6.5394060710734507,1.4172748975717895,1.0002964688849341,2.4347306160066699E-2,1,0,372.36905206932329,1.5681108157503059,3.2780595471600864,1.2607964471217339,1.0114625243774296,0.15069235912614107,1.0000000003622085,2.6914999993500769E-5,1.0000000003622085,2.6914999993500769E-5,1.0003212964482457,8.0245358344722462E-2,6.8432787576952601,-115.24462337727323,64.755376622726772,null,1000000000,724417225,null,23.773889169867193,-26.241852518928049,null,15.910692647818987,-84.406592610330975,null,0,0]
[27071.75,27.071750000000002,6.5766027872787918,1.4181500293838603,1.0002999316256223,2.4489045673011755E-2,1,0,374.53767288214897,1.5681263652382351,3.2953786455142526,1.2624794976619513,1.0115956586315924,0.1515566353686269,1.0000000003664398,2.7071749993386557E-5,1.0000000003664398,2.7071749993386557E-5,1.0003250987258132,8.0713405567419419E-2,6.7881976024001291,-115.2942475490286,64.705752450971403,null,1000000000,732879648.0625,null,23.768077082789457,-26.195831127273582,null,15.861423579601597,-84.475430024350288,null,0,0]
[27228.5,27.2285,6.6138044835563941,1.4190153168719819,1.0003034144622864,2.4630784201792665E-2,1,0,376.70629378449013,1.5681417356957399,3.312706980932504,1.2641449452458362,1.0117295483216291,0.15242068350419527,1.0000000003706955,2.722849999327101E-5,1.0000000003706955,2.722849999327101E-5,1.000328924223975,8.1181465064090949E-2,6.7334569105743194,-115.34429439330576,64.655705606694241,null,1000000000,741391212.25,null,23.762334165834915,-26.150794983473684,null,15.812425804730328,-84.543704159789897,null,0,0]
[27385.25,27.385249999999999,6.6510110763398034,1.4198709239406004,1.0003069173947163,2.4772521740724734E-2,1,0,378.87491477480978,1.5681569301970395,3.3300444092159163,1.2657930555038919,1.0118641931476622,0.15328450233349186,1.0000000003749758,2.7385249993154127E-5,1.0000000003749758,2.7385249993154127E-5,1.0003327729625346,8.1649536904529099E-2,6.6790521940754637,-115.39475819737622,64.60524180262378,null,1000000000,749951917.5625,null,23.756658828850913,-26.106728975443428,null,15.763696425215475,-84.611424412007352,null,0,0]
[27542,27.542000000000002,6.6882224839112121,1.4207170109039045,1.0003104404227012,2.4914258284123511E-2,1,0,381.04353585160567,1.568171951746369,3.3473907890781232,1.2674240889416566,1.0119995928082828,0.15414809065916771,1.0000000003792808,2.75419999930359E-5,1.0000000003792808,2.75419999930359E-5,1.0003366449614097,8.2117621158503726E-2,6.6249790509633977,-115.445633332546,64.554366667454005,null,1000000000,758561764,null,23.75104952299834,-26.063618280841855,null,15.715232587955981,-84.678599970652215,null,0,0]
[27702.5,27.702500000000001,6.7263290220295362,1.4215736384896978,1.0003140685558685,2.5059384616439549E-2,1,0,383.26403790347734,1.5681871565213188,3.3651612848944672,1.2690767146271114,1.012139013516788,0.15503209890295491,1.0000000003837142,2.7702499992913439E-5,1.0000000003837142,2.7702499992913439E-5,1.0003406337144316,8.259691653576974E-2,6.5699513495910953,-115.49814599405624,64.501854005943756,null,1000000000,767428506.25,null,23.74537286721127,-26.020450914757909,null,15.665881542370748,-84.74682759193017,null,0,0]
[27863,27.863,6.7644404403878946,1.4224206140694859,1.0003177177571494,2.5204509892958169E-2,1,0,385.48454004293325,1.5682021861284932,3.3829408749709891,1.2707119734593211,1.0122792249639134,0.1559158629481168,1.0000000003881733,2.7862999992789551E-5,1.0000000003881733,2.7862999992789551E-5,1.0003446468966453,8.3076225075600363E-2,6.5152622032860457,-115.55107822464014,64.448921775359864,null,1000000000,776346769,null,23.739762280561749,-25.978254568144596,null,15.616802982715219,-84.814503008651684,null,0,0]
[28023.5,28.023499999999999,6.8025566569614471,1.4232580986646741,1.000321388026314,2.5349634107577887E-2,1,0,387.70504226846845,1.5682170435775995,3.4007294166686872,1.2723301291511346,1.0124202268211278,0.15679938151589143,1.0000000003926581,2.8023499992664227E-5,1.0000000003926581,2.8023499992664227E-5,1.000348684529804,8.3555546852820475E-2,6.460907153637927,-115.60442424861097,64.395575751389032,null,1000000000,785316552.25,null,23.73421622693111,-25.937014230544538,null,15.567993986697742,-84.881635451300468,null,0,0]
[28184,28.184000000000001,6.8406775915433125,1.4240862497613167,1.0003250793631302,2.54947572541975E-2,1,0,389.92554457861235,1.568231731809788,3.4185267702464164,1.2739314402861155,1.0125620187582312,0.15768265332976017,1.000000000397169,2.818399999253746E-5,1.000000000397169,2.818399999253746E-5,1.0003527466357853,8.4034881942230133E-2,6.4068818278571724,-115.65817837780577,64.341821622194232,null,1000000000,794337856,null,23.728733210308587,-25.896715181587236,null,15.519451677539511,-84.948233947798045,null,0,0]
[28348,28.347999999999999,6.8796346156192323,1.4249229794681098,1.0003288729579347,2.5643043970490491E-2,1,0,392.19446914341449,1.5682465685442781,3.4367211878840043,1.2755505352307306,1.0127077184975266,0.15858493031297644,1.0000000004018046,2.8347999992406431E-5,1.0000000004018046,2.8347999992406431E-5,1.0003569226255666,8.4524683650351609E-2,6.3520145049604269,-115.71352043890019,64.28647956109981,null,1000000000,803609104,null,23.723194224435531,-25.856494619941994,null,15.470123340515823,-85.015742396339874,null,0,0]
[28512,28.512,6.9185964019978794,1.4257502857319679,1.0003326885487538,2.5791329558817588E-2,1,0,394.46339379355675,1.5682612345991438,3.4549245198744498,1.2771525729392863,1.0128542424483911,0.15948694697563517,1.0000000004064671,2.8511999992273874E-5,1.0000000004064671,2.8511999992273874E-5,1.0003611242137429,8.5014499415405592E-2,6.2974824767988666,-115.76927686506495,64.230723134935047,null,1000000000,812934144,null,23.717718019690665,-25.817226671442807,null,15.421067517099122,-85.082711791403014,null,0,0]
[28676,28.675999999999998,6.9575628706737316,1.4265683257413631,1.0003365261353361,2.5939614012670541E-2,1,0,396.73231852757493,1.568275732902745,3.4731366260525882,1.2787378134525318,1.0130015902531748,0.16038870196319416,1.0000000004111564,2.8675999992139786E-5,1.0000000004111564,2.8675999992139786E-5,1.0003653514240602,8.5504329317111355E-2,6.2432813415790953,-115.82544186297969,64.174558137020313,null,1000000000,822312976,null,23.712303121992399,-25.778896527025339,null,15.372281279577615,-85.14915114416398,null,0,0]
[28840,28.84,6.9965339434140867,1.4273772532328155,1.000340385717428,2.6087897325541409E-2,1,0,399.00124334403813,1.568290066316834,3.4913573691109909,1.280306511724425,1.013149761552425,0.16129019392359933,1.0000000004158727,2.883999999200415E-5,1.0000000004158727,2.883999999200415E-5,1.0003696042804013,8.5994173435160387E-2,6.1894067818467127,-115.88200972931672,64.117990270683279,null,1000000000,831745600,null,23.706948095856568,-25.741489665403147,null,15.323761745981068,-85.215069268015441,null,0,0]
[29008,29.007999999999999,7.0364602240345269,1.4281966192211262,1.0003443622421686,2.6239796114712624E-2,1,0,401.32550787419524,1.5683045812786522,3.5100313353708157,1.2818965798469615,1.0133024002754267,0.16221339935376961,1.0000000004207319,2.9007999991863606E-5,1.0000000004207319,2.9007999991863606E-5,1.0003739874819748,8.6495979794677838E-2,6.1345524023555251,-115.94036915849763,64.059630841502369,null,1000000000,841464064,null,23.70152307793294,-25.704112893625101,null,15.274332384413508,-85.282063708099258,null,0,0]
[29176,29.175999999999998,7.0763911753480944,1.4290067386439855,1.000348361847913,2.6391693692741185E-2,1,0,403.6497724879315,1.5683189290826332,3.528714082160791,1.2834698147077297,1.0134559023838601,0.16313632590554211,1.0000000004256195,2.9175999991721418E-5,1.0000000004256195,2.9175999991721418E-5,1.0003783976470277,8.6997801241677802E-2,6.0800318136479063,-115.99913951565605,64.000860484343946,null,1000000000,851238976,null,23.696157957377455,-25.667675040709106,null,15.225176916261375,-85.348529292849591,null,0,0]
[29344,29.344000000000001,7.1163267187305665,1.4298077660991677,1.0003523845343845,2.6543590052632227E-2,1,0,405.9740371838115,1.5683331125997846,3.5474054707504377,1.2850264745417912,1.0136102674854692,0.16405897213369092,1.0000000004305352,2.9343999991577584E-5,1.0000000004305352,2.9343999991577584E-5,1.0003828348016783,8.7499637861734314E-2,6.0258406363015933,-116.05831495471102,63.941685045288978,null,1000000000,861070336,null,23.690851309459234,-25.632161392567291,null,15.176292386833282,-85.414474885370169,null,0,0]
[29512,29.512,7.1562667773038289,1.4305998527803943,1.0003564303013044,2.6695485187391239E-2,1,0,408.29830196043235,1.5683471346357418,3.5661053652543453,1.2865668124927754,1.0137654951860329,0.16498133659577691,1.000000000435479,2.9511999991432097E-5,1.000000000435479,2.9511999991432097E-5,1.0003872989721951,8.8001489740390071E-2,5.9719745748107433,-116.11788972267183,63.882110277328167,null,1000000000,870958144,null,23.685601746949445,-25.597557523243434,null,15.127675887852224,-85.47990915372516,null,0,0]
[29684,29.684000000000001,7.1971623888859613,1.431401690448185,1.0003605963070084,2.6850995596440372E-2,1,0,410.67790645680759,1.5683613260985283,3.585259168469022,1.2881271748395682,1.0139253120210763,0.16592536870419791,1.0000000004405698,2.9683999991281414E-5,1.0000000004405698,2.9683999991281414E-5,1.0003918974484509,8.8515306370465938E-2,5.917158407818758,-116.17929073014977,63.820709269850227,null,1000000000,881139856,null,23.68028492481157,-25.563057512681805,null,15.078176542998115,-85.546380502258259,null,0,0]
[29856,29.856000000000002,7.2380625755462011,1.4321944667179523,1.0003647865047181,2.7006504706486741E-2,1,0,413.05751103493941,1.56837535404864,3.6044216080389218,1.2896709499840955,1.0140860321776513,0.16686910241850614,1.0000000004456904,2.985599999112898E-5,1.0000000004456904,2.985599999112898E-5,1.0003965242985648,8.9029139175753599E-2,5.8626741710351249,-116.24109839710943,63.758901602890575,null,1000000000,891380736,null,23.675025111522995,-25.529481413495507,null,15.028952119503053,-85.612333672126283,null,0,0]
[30028,30.027999999999999,7.2789672601630802,1.4329783333482418,1.0003690008941299,2.7162012510025337E-2,1,0,415.43711569342292,1.5683892212958506,3.6235925469506012,1.2911983937772338,1.0142476552263306,0.16781253619991429,1.0000000004508403,3.0027999990974777E-5,1.0000000004508403,3.0027999990974777E-5,1.0004011795512162,8.9542988247949151E-2,5.8085175146353922,-116.30330684325921,63.696693156740793,null,1000000000,901680784,null,23.66982093313765,-25.496814639331294,null,14.979999641488668,-85.677777364137185,null,0,0]
[30200,30.2,7.3198763673306111,1.4337534387493827,1.0003732394749378,2.7317518999551538E-2,1,0,417.81672043088525,1.5684029305859235,3.6427718510147402,1.2927097569900248,1.0144101807355486,0.16875566851274865,1.0000000004560199,3.0199999990818795E-5,1.0000000004560199,3.0199999990818795E-5,1.0004058632352497,9.0056853678713467E-2,5.7546841720922091,-116.36591028402891,63.634089715971086,null,1000000000,912040000,null,23.664671052042607,-25.465042891399854,null,14.931316180040525,-85.742720087258277,null,0,0]
[30375.75,30.37575,7.3616818796954488,1.4345365444230851,1.0003775954546335,2.7476414527087132E-2,1,0,420.2482061657733,1.5684167784017393,3.662377812483733,1.2942377168698869,1.0145771814162161,0.16971905030951789,1.000000000461343,3.0375749990657574E-5,1.000000000461343,3.0375749990657574E-5,1.0004106784326161,9.0581939563674455E-2,5.7000067475285103,-116.43028071148908,63.569719288510925,null,1000000000,922686188.0625,null,23.659463622579885,-25.433488371398706,null,14.881846184939548,-85.80856989932829,null,0,0]
[30551.5,30.551500000000001,7.4034918556579239,1.435310805651794,1.000381976691431,2.7635308666848189E-2,1,0,422.67969198032176,1.5684304668970681,3.6819922332943609,1.2957494009912209,1.0147451234200708,0.17068211411728917,1.0000000004666971,3.0551499990494468E-5,1.0000000004666971,3.0551499990494468E-5,1.0004155233760348,9.1107042721665241E-2,5.6456581393100711,-116.49505163288947,63.504948367110529,null,1000000000,933394152.25,null,23.654310171476013,-25.402839035851621,null,14.83265102782498,-85.873914031212777,null,0,0]
[30727.25,30.727250000000002,7.4453062200204938,1.4360763705159347,1.0003863831849984,2.7794201410829684E-2,1,0,425.11117787316391,1.5684439988056755,3.7016149789714681,1.2972450612293722,1.0149140062798192,0.17164485830789689,1.0000000004720819,3.0727249990329482E-5,1.0000000004720819,3.0727249990329482E-5,1.0004203980968123,9.1632163250358056E-2,5.5916340519024645,-116.56021717621651,63.439782823783489,null,1000000000,944163892.5625,null,23.649209382092646,-25.373080516710537,null,14.783727729800741,-85.938760973350043,null,0,0]
[30903,30.902999999999999,7.4871248992576742,1.4368333838288694,1.000390814935002,2.795309275102701E-2,1,0,427.5426638429638,1.5684573767991388,3.7212459178198602,1.2987249444349032,1.0150838295258608,0.172607281256626,1.0000000004774976,3.0902999990162592E-5,1.0000000004774976,3.0902999990162592E-5,1.0004253026264347,9.2157301247385789E-2,5.5379302718100067,-116.62577156679669,63.374228433203314,null,1000000000,954995409,null,23.64415997270207,-25.344198730460828,null,14.735073359098861,-86.003119028987101,null,0,0]
[31083,31.082999999999998,7.5299592385394041,1.4375999870310221,1.0003953800335244,2.8115824950340051E-2,1,0,430.03294827166445,1.5684709214852075,3.7413599315355102,1.3002245131466867,1.0152587337295607,0.17359264290872267,1.0000000004830765,3.108299998998969E-5,1.0000000004830765,3.108299998998969E-5,1.0004303566896791,9.2695156380845842E-2,5.4832555236040363,-116.69330833077069,63.306691669229309,null,1000000000,966152889,null,23.639040413085112,-25.315512889458731,null,14.685518170509848,-86.068535118031605,null,0,0]
[31263,31.263000000000002,7.5727979529685996,1.438357917447981,1.0003999716240435,2.8278555660160687E-2,1,0,432.52323277834989,1.5684843102022146,3.7614822684828289,1.3017080410498936,1.0154346233459826,0.1745776641559503,1.0000000004886875,3.1262999989814776E-5,1.0000000004886875,3.1262999989814776E-5,1.0004354420883108,9.3233030044869894E-2,5.4289080700145096,-116.76124102004486,63.238758979955136,null,1000000000,977375169,null,23.633972134607614,-25.287717678957776,null,14.636238995397814,-86.133455440152048,null,0,0]
[31443,31.443000000000001,7.615640968713385,1.4391073205719689,1.0004045897061948,2.8441284871890848E-2,1,0,435.01351736168078,1.5684975456287436,3.7816127957955952,1.3031757777302408,1.0156114978631476,0.17556234326420067,1.000000000494331,3.144299998963783E-5,1.000000000494331,3.144299998963783E-5,1.0004405588567424,9.3770922344216481E-2,5.3748836388051666,-116.82956373711293,63.170436262887065,null,1000000000,988662249,null,23.628953867200604,-25.260798852864195,null,14.587232831595486,-86.19788833793362,null,0,0]
[31623,31.623000000000001,7.6584882135866668,1.4398483386780481,1.0004092342796114,2.8604012576932947E-2,1,0,437.50380202034819,1.5685106303823917,3.8017513833682148,1.3046279677604231,1.0157893567665675,0.17654667850322392,1.0000000005000069,3.162299998945885E-5,1.0000000005000069,3.162299998945885E-5,1.0004457070295845,9.4308833383599841E-2,5.3211780392971715,-116.89827068408539,63.101729315914611,null,1000000000,1000014129,null,23.623984374637811,-25.234742449036045,null,14.538496724650287,-86.261841969629216,null,0,0]
[31807,31.806999999999999,7.7022919171114195,1.4405973021302481,1.0004140094462346,2.8770354886963556E-2,1,0,440.04942641463191,1.5685238528393279,3.8223456933807021,1.3060966095066771,1.0159721849939287,0.17755253064468587,1.0000000005058425,3.180699998927378E-5,1.0000000005058425,3.180699998927378E-5,1.0004510021014903,9.4858717479953447E-2,5.2666042399332804,-116.9688956499491,63.031104350050896,null,1000000000,1011685249,null,23.618953608743865,-25.208984148826747,null,14.48895369118034,-86.326729740147172,null,0,0]
[31991,31.991,7.7460998923414373,1.4413377944862389,1.0004188122938129,2.8936695604432128E-2,1,0,442.59505088496593,1.5685369231960122,3.8429481594692914,1.3075495072601719,1.0161560407490071,0.17855801982024641,1.000000000511712,3.1990999989086549E-5,1.000000000511712,3.1990999989086549E-5,1.0004563300628335,9.5408621379617101E-2,5.2123549967673979,-117.03991017151283,62.96008982848717,null,1000000000,1023424081,null,23.613971300995939,-25.184098401839456,null,14.439686755762382,-86.39113337849713,null,0,0]
[32175,32.174999999999997,7.7899120672086051,1.4420699578569371,1.0004236428219475,2.9103034720156625E-2,1,0,445.14067543004552,1.5685498440618852,3.8635586511569069,1.308986906800585,1.0163409234741643,0.1795631441943247,1.0000000005176153,3.2174999988897156E-5,1.0000000005176153,3.2174999988897156E-5,1.0004616909512249,9.5958545194296821E-2,5.1584260846884167,-117.11130836665974,62.888691633340258,null,1000000000,1035230625,null,23.6090362338301,-25.160071170274879,null,14.390692910849241,-86.455061033961186,null,0,0]
[32359,32.359000000000002,7.8337283712502179,1.4427939312099682,1.0004285010302374,2.9269372224955542E-2,1,0,447.68630004859568,1.5685626179870378,3.884177040685568,1.3104090489481304,1.016526832609054,0.18056790193561995,1.0000000005235523,3.2358999988705574E-5,1.0000000005235523,3.2358999988705574E-5,1.0004670848044903,9.6508489035649125E-2,5.1048133590479523,-117.18308445417101,62.816915545828991,null,1000000000,1047104881,null,23.604147222225265,-25.136888697334744,null,14.341969196813608,-86.518520675721305,null,0,0]
[32547.5,32.547499999999999,7.8786204795488057,1.4435272595836319,1.0004335067568562,2.9439776086454678E-2,1,0,450.29418186585423,1.5685755545481215,3.9053077434634744,1.3118503967499473,1.0167183522164049,0.18159685045419427,1.0000000005296699,3.2547499988507043E-5,1.0000000005296699,3.2547499988507043E-5,1.0004726447964587,9.7071903474526128E-2,5.0502130823861027,-117.25700186360876,62.742998136391236,null,1000000000,1059339756.25,null,23.599185195564321,-25.114001169256081,null,14.292330946812706,-86.583055143990933,null,0,0]
[32736,32.735999999999997,7.9235167767260561,1.4442522779607603,1.0004385415332477,2.96101782377633E-2,1,0,452.90206375760368,1.5685883421276676,3.9264464721192551,1.3132762279786938,1.0169109478529903,0.18262541031046592,1.0000000005358227,3.2735999988306202E-5,1.0000000005358227,3.2735999988306202E-5,1.0004782394664942,9.7635339168694282E-2,4.9959360910955661,-117.33130390840793,62.668696091592068,null,1000000000,1071645696,null,23.594269087274682,-25.091971870604908,null,14.242970063811807,-86.647114800355922,null,0,0]
[32924.5,32.924500000000002,7.9684171919780189,1.4449691260480599,1.0004436053589734,2.9780578669011407E-2,1,0,455.50994572256462,1.5686009832845158,3.9475930977210414,1.3146867861493186,1.0171046189075503,0.18365357954954348,1.0000000005420113,3.2924499988103029E-5,1.0000000005420113,3.2924499988103029E-5,1.0004838688559707,9.8198796238040578E-2,4.9419781786786672,-117.40598468970147,62.594015310298531,null,1000000000,1084022700.25,null,23.589397722956058,-25.0707868836061,null,14.193883515713537,-86.710707656855504,null,0,0]
[33113,33.113,8.0133216560812404,1.4456779404547462,1.0004486982335921,2.9950977370329597E-2,1,0,458.11782775948689,1.56861348051924,3.9687474940372507,1.3160823098308192,1.0172993647658777,0.18468135622132348,1.0000000005482352,3.3112999987897518E-5,1.0000000005482352,3.3112999987897518E-5,1.0004895330065013,9.8762274802396063E-2,4.8883352187195284,-117.48103841146104,62.518961588538957,null,1000000000,1096470769,null,23.584569959761676,-25.050432570802567,null,14.145068318948773,-86.773841548052459,null,0,0]
[33305.75,33.305750000000003,8.0592426713523313,1.4463945678392029,1.0004539359725335,3.012521615302452E-2,1,0,460.78450827091234,1.5686261132416588,3.9903867529734187,1.3174939943008321,1.0174996122293745,0.18573189760645747,1.0000000005546363,3.3305749987684939E-5,1.0000000005546363,3.3305749987684939E-5,1.0004953608524412,9.9338480142828672E-2,4.8338042689001002,-117.55816404091844,62.441835959081558,null,1000000000,1109272983.0625,null,23.579677275923249,-25.030464397894214,null,14.095430052967771,-86.837932260002347,null,0,0]
[33498.5,33.4985,8.1051677785863472,1.4471030745456654,1.0004592040840909,3.0299453106033027E-2,1,0,463.45118885502615,1.5686386005876671,4.0120338783724101,1.3188904479033303,1.0177009822006597,0.18678202441412839,1.0000000005610747,3.3498499987469887E-5,1.0000000005610747,3.3498499987469887E-5,1.0005012251333414,9.9914708211704006E-2,4.779594155029061,-117.63566768055472,62.364332319445282,null,1000000000,1122149502.25,null,23.574827861362323,-25.011336806420065,null,14.046069353657661,-86.901559098452992,null,0,0]
[33691.25,33.691249999999997,8.1510969086181806,1.4478035971299226,1.0004645025677843,3.0473688218804942E-2,1,0,466.11786951058082,1.5686509450523753,4.0336887435861515,1.3202719104484348,1.0179034740135429,0.18783173457498281,1.00000000056755,3.3691249987252348E-5,1.00000000056755,3.3691249987252348E-5,1.0005071258944644,0.10049095913695907,4.7257007121809842,-117.71354345399133,62.286456546008665,null,1000000000,1135100326.5625,null,23.570020590200187,-24.993036080666336,null,13.996983181971718,-86.964729895409505,null,0,0]
[33884,33.884,8.1970299938268951,1.4484962691186818,1.0004698314231313,3.0647921480790784E-2,1,0,468.78455023635712,1.5686631490741205,4.0553512246268788,1.3216386168539231,1.0181070869986524,0.18888102602498183,1.0000000005740626,3.3883999987032308E-5,1.0000000005740626,3.3883999987032308E-5,1.0005130631813319,0.10106723304646839,4.6721198545433023,-117.79178558865155,62.20821441134845,null,1000000000,1148125456,null,23.565254366911617,-24.975548782281574,null,13.948168547622606,-87.027452309319813,null,0,0]
[34081.5,34.081499999999998,8.2440990562130274,1.4491980042100976,1.0004753231022239,3.0826446498075488E-2,1,0,471.51694690115772,1.5686755106583485,4.0775553138481282,1.3230239380170468,1.0183168799372049,0.18995573903176671,1.0000000005807743,3.4081499986804232E-5,1.0000000005807743,3.4081499986804232E-5,1.0005191847175503,0.10165773223305612,4.617538629758549,-117.87232995443217,62.127670045567825,null,1000000000,1161548642.25,null,23.560412150968403,-24.958460512425862,null,13.898429538781068,-87.091263149636561,null,0,0]
[34279,34.279000000000003,8.2911721321638812,1.4498917714470703,1.0004808466672965,3.1004969549808647E-2,1,0,474.24934363718,1.5686877297995665,4.099767143594458,1.3243942509250444,1.0185278485546312,0.1910300080663111,1.0000000005875249,3.4278999986573493E-5,1.0000000005875249,3.4278999986573493E-5,1.0005253446995264,0.10224825582228787,4.5632771474418128,-117.95324701529434,62.046752984705662,null,1000000000,1175049841,null,23.555610795842661,-24.942198553128762,null,13.848969411590073,-87.154618976307731,null,0,0]
[34476.5,34.476500000000001,8.3382491537044547,1.4505777051134581,1.0004864021178212,3.1183490624643678E-2,1,0,476.98174044319995,1.5686998089457318,4.1219865887335692,1.3257497930943023,1.0187399921205249,0.19210383092568326,1.0000000005943144,3.4476499986340077E-5,1.0000000005943144,3.4476499986340077E-5,1.0005315431770798,0.10283880395152004,4.5093312579271698,-118.03453088687884,61.965469113121159,null,1000000000,1188629052.25,null,23.550849216024528,-24.926749309742718,null,13.79978510189356,-87.217527491751724,null,0,0]
[34674,34.673999999999999,8.3853300543806135,1.4512559365071451,1.0004919894532671,3.1362009711234755E-2,1,0,479.71413731802147,1.5687117504890278,4.1442135267743296,1.3270907971654164,1.018953309901022,0.19317720541289687,1.0000000006011431,3.4673999986103978E-5,1.0000000006011431,3.4673999986103978E-5,1.000537780200317,0.10342937675803843,4.4556968903506391,-118.11617579024181,61.883824209758188,null,1000000000,1202286276,null,23.546126355430651,-24.912099464127362,null,13.750873594910908,-87.279996227299151,null,0,0]
[34875.75,34.875749999999996,8.4334280260479098,1.4519409435830675,1.0004977299434585,3.1544368283110739E-2,1,0,482.50533267642783,1.5687238093569202,4.1669263778186796,1.3284458845108351,1.0191724296857148,0.19427321260492683,1.0000000006081589,3.4875749985859997E-5,1.0000000006081589,3.4875749985859997E-5,1.0005441912891877,0.10403268371554132,4.4012258619851288,-118.19994447649719,61.800055523502806,null,1000000000,1216317938.0625,null,23.541340773198186,-24.897946187002365,null,13.701188148777863,-87.343362807647779,null,0,0]
[35077.5,35.077500000000001,8.4815299100886747,1.4526181811182708,1.0005035037044678,3.1726724756320983E-2,1,0,485.29652810419117,1.5687357295110387,4.1896467974611298,1.3297862770406244,1.019392773205533,0.19536874730475579,1.0000000006152154,3.5077499985613184E-5,1.0000000006152154,3.5077499985613184E-5,1.0005506427071289,0.10463601671318969,4.3470715628506511,-118.28407803648012,61.715921963519875,null,1000000000,1230431006.25,null,23.53659345670096,-24.88459984127179,null,13.651781166140617,-87.406285838339059,null,0,0]
[35279.25,35.279249999999998,8.5296356403127849,1.453287779942972,1.0005093107357195,3.1909079118773803E-2,1,0,488.08772360012171,1.5687475133311397,4.2123746632327146,1.3311122077565851,1.0196143396671113,0.19646380718984985,1.0000000006223126,3.5279249985363517E-5,1.0000000006223126,3.5279249985363517E-5,1.0005571345084763,0.10523937589709327,4.2932298957382322,-118.36857063690435,61.631429363095648,null,1000000000,1244625480.5625,null,23.531883369402152,-24.872047080194434,null,13.602649586327001,-87.468772824456551,null,0,0]
[35481,35.481000000000002,{"$f":"SQRT(1+(A397/pole1)^2)","v":8.5777451520097205},{"$f":"ATAN(A397/pole1)","v":1.4539498679800205},{"$f":"SQRT(1+(A397/Zero1)^2)","v":1.0005151510366337},{"$f":"ATAN(A397/Zero1)","v":3.2091431358378351E-2},{"$f":"IF(VIN_nom>Vout, 1, SQRT(1+(A397/z_RHP)^2))","v":1},{"$f":"IF(VIN_nom>Vout, 0, -ATAN(A397/z_RHP))","v":0},{"$f":"SQRT(1+(A397/Pole2)^2)","v":490.87891916305659},{"$f":"ATAN(A397/Pole2)","v":1.5687591631428539},4.2351098552536959,1.3324239048631263,{"$f":"SQRT(1+(A397/pole4)^2)","v":1.0198371282733734},{"$f":"ATAN(A397/pole4)","v":0.19755838994424293},{"$f":"SQRT(1+(A397/Zero3)^2)","v":1.0000000006294507},{"$f":"ATAN(A397/Zero3)","v":3.5480999985110978E-5},{"$f":"SQRT(1+(A397/pole5)^2)","v":1.0000000006294507},{"$f":"ATAN(A397/pole5)","v":3.5480999985110978E-5},{"$f":"SQRT((1-(Z397/pterm2))^2+(A397/pterm1)^2)","v":1.0005636667478777},{"$f":"IF((ATAN((A397/pterm1)/(1-A397^2/pterm2))>0),ATAN((A397/pterm1)/(1-A397^2/pterm2)),PI()+ATAN((A397/pterm1)/(1-A397^2/pterm2)))","v":0.10584276141328323},{"$f":"20*LOG10(((E397*K397*G397*O397)/(C397*I397*S397*M397*Q397))*Adc)","v":4.2396968409865963},{"$f":"((F397+L397+H397+R397)-(D397+J397+T397+N397+T397))*radconv","v":-118.45341655004025},{"$f":"IF(V397>0,V397,V397+180)","v":61.546583449959755},null,{"$f":"IF(U397<0,A397,1000000000)","v":1000000000},{"$f":"A397^2","v":1258901361},null,{"$f":"20*LOG10((K397/(I397*M397))*AEA)","v":23.5272095029366},{"$f":"(L397-(J397+N397))*radconv","v":-24.860274829174525},null,{"$f":"20*LOG10((E397*G397/(C397*S397))*Acs*Am)","v":13.55379039804092},{"$f":"(F397+H397-(D397+T397))*radconv","v":-87.530831104499342},null,{"$f":"SUM((U398<0)*(U397>0))*A397","v":0},0]
[35687.75,{"$f":"A398/1000","v":35.687750000000001},8.6270508258619643,1.4546207031753118,1.0005211705946477,3.2278300645363377E-2,1,0,493.73928940554367,1.5687709650196853,4.2584159749954988,1.3337535766327802,1.0200667053977346,0.19867960247433053,1.0000000006368077,3.5687749984849173E-5,1.0000000006368077,3.5687749984849173E-5,1.0005704028879694,0.10646112819363743,4.1851531231643273,-118.54072588472773,61.459274115272265,null,1000000000,1273615500.0625,null,23.522456355712155,-24.849007192266761,null,13.503999827443092,-87.593990115251074,null,0,0]
[35894.5,35.894500000000001,8.6763603379325343,1.4552839136818296,1.0005272250905706,3.246516767726746E-2,1,0,496.59965971600872,1.5687826309409754,4.2817295417610959,1.3350687708609654,1.02029756428782,0.19980030902766885,1.0000000006442076,3.5894499984584326E-5,1.0000000006442076,3.5894499984584326E-5,1.000577181612522,0.10707952293790872,4.1309251981120703,-118.62839441257708,61.37160558742292,null,1000000000,1288415130.25,null,23.517739189628848,-24.838532277372803,null,13.454489068474141,-87.656713994936524,null,0,0]
[36101.25,36.10125,8.7256736231511507,1.4559396281843029,1.0005333145237676,3.2652032441081141E-2,1,0,499.46003009328371,1.5687941632425433,4.3050504345646665,1.3363697182393672,1.0205297040737671,0.20092050713341819,1.0000000006516501,3.6101249984316415E-5,1.0000000006516501,3.6101249984316415E-5,1.000584002981366,0.10769794580299663,4.0770089808369931,-118.71641630000902,61.283583699990984,null,1000000000,1303300251.5625,null,23.513057005821587,-24.828836859096594,null,13.405255035006331,-87.719010126382642,null,0,0]
[36308,36.308,8.7749906179053276,1.4565879725006541,1.0005394388936013,3.283889492379588E-2,1,0,502.3204005362274,1.5688055642070038,4.3283785349902217,1.3376566446816054,1.0207631238816801,0.20204019432808451,1.0000000006591354,3.6307999984045408E-5,1.0000000006591354,3.6307999984045408E-5,1.000590867054675,0.10831639694571189,4.0234004636485379,-118.80478582031328,61.195214179686715,null,1000000000,1318270864,null,23.508408832732535,-24.819907983177551,null,13.356294690906926,-87.780885728155297,null,0,0]
[36519.5,36.519500000000001,8.8254444247458217,1.4572437144120118,1.0005457401175961,3.3030048124742209E-2,1,0,505.24648693279636,1.5688170935320094,4.3522499264259817,1.3389588605935543,1.0210032299743554,0.20318507468230076,1.0000000006668368,3.6519499983764969E-5,1.0000000006668368,3.6519499983764969E-5,1.0005979330778849,0.10894908618338425,3.9688745974888517,-118.89553943903766,61.104460560962337,null,1000000000,1333673880.25,null,23.503688076189654,-24.81155390140604,null,13.306489581290119,-87.843755123605106,null,0,0]
[36731,36.731000000000002,8.8759019833606558,1.4578920011012289,1.0005520779006172,3.3221198911034942E-2,1,0,508.17257339575201,1.5688284900840035,4.3761286177343282,1.3402468673819712,1.0212446737177485,0.20432941518823011,1.0000000006745831,3.6730999983481256E-5,1.0000000006745831,3.6730999983481256E-5,1.0006050439188259,0.10958180534462535,3.9146624875928593,-118.98664505678356,61.013354943216441,null,1000000000,1349166361,null,23.499000938092138,-24.80397540408277,null,13.256964609491648,-87.906199219134109,null,0,0]
[36942.5,36.942500000000003,8.9263632301274818,1.4585329584531173,1.0005584522419695,3.3412347268751322E-2,1,0,511.09865992395402,1.5688397561433962,4.4000144900669671,1.3415208921446875,1.0214874541633387,0.20547321323268053,1.0000000006823742,3.6942499983194264E-5,1.0000000006823742,3.6942499983194264E-5,1.0006121996430313,0.11021455459701211,3.8607600824041697,-119.0780968754059,60.921903124594095,null,1000000000,1364748306.25,null,23.494346461529119,-24.797159460393463,null,13.207716680865971,-87.968225237809875,null,0,0]
[37154,37.154000000000003,8.9768281028499235,1.459166709546152,1.0005648631409545,3.3603493183969657E-2,1,0,514.02474651628836,1.5688508939386725,4.4239074271070269,1.3427811572572124,1.0217315703582579,0.20661646621061436,1.0000000006902099,3.7153999982903958E-5,1.0000000006902099,3.7153999982903958E-5,1.0006194003164099,0.11084733410802182,3.8071634068855893,-119.16988920401795,60.830110795982051,null,1000000000,1380419716,null,23.489723715861839,-24.791093307585047,null,13.158742751014675,-88.029840241903003,null,0,0]
[37370.25,37.370249999999999,9.0284300331027332,1.4598073683296773,1.000571455817612,3.3798929434454866E-2,1,0,517.01654906653266,1.5688621515246632,4.4483441526537399,1.3440557263648245,1.0219825491559194,0.20778482881165589,1.0000000006982677,3.7370249982603705E-5,1.0000000006982677,3.7370249982603705E-5,1.0006268092508446,0.11149435643916548,3.7526750671387243,-119.26408931123254,60.735910688767461,null,1000000000,1396535585.0625,null,23.48502901472532,-24.785653135160292,null,13.108949112404328,-88.092421262887086,null,0,0]
[37586.5,37.586500000000001,9.0800356268980558,1.4604407451136139,1.0005780867109202,3.3994363102068229E-2,1,0,520.0083516815464,1.5688732795724465,{"$f":"SQRT(1+(A407/Zero2)^2)","v":4.4727880256838954},{"$f":"ATAN(A407/Zero2)","v":1.3453163664121424},1.0222349223463432,0.20895261610667665,1.0000000007063725,3.7586499982299949E-5,1.0000000007063725,3.7586499982299949E-5,1.000634265316674,0.11214141075710833,3.6984981759923743,-119.3586336957775,60.641366304222501,null,1000000000,1412744982.25,null,23.480365598576299,-24.78097065450434,null,13.059435637406995,-88.154587036724095,null,0,0]
[37802.75,37.802750000000003,9.13164482212464,1.4610669628521658,1.0005847558201189,3.4189794171932346E-2,1,0,523.00015436021772,1.5688842803050751,4.4972389296512008,1.3465633005507742,1.0224886888970266,0.21011982533776963,1.000000000714524,3.7802749981992689E-5,1.000000000714524,3.7802749981992689E-5,1.000641768585568,0.11278849724054003,3.6446287204662298,-119.45351660744824,60.546483392551764,null,1000000000,1429047907.5625,null,23.475732552510998,-24.777033049326963,null,13.010199227946151,-88.216344619261562,null,0,0]
[38019,38.018999999999998,9.1832575580631968,1.4616861417581244,1.0005914631444439,3.4385222629170979E-2,1,0,525.99195710146057,1.5688951558950233,4.5216967504970773,1.3477967472768022,1.0227438477707949,0.21128645375605765,1.0000000007227221,3.8018999981681886E-5,1.0000000007227221,3.8018999981681886E-5,1.0006493191296064,0.11343561606803887,3.5910627631849228,-119.54873240331744,60.451267596682555,null,1000000000,1445444361,null,23.471128986844366,-24.773827767699345,null,12.961236836331473,-88.277700909269257,null,0,0]
[38240.5,38.240499999999997,9.2361269286205481,1.4623131783507224,1.0005983729227792,3.4585392868224749E-2,1,0,529.05639326781068,1.5689061679986414,4.546755399175713,1.349046379985283,1.0230066436007079,0.21248079994691138,1.0000000007311678,3.8240499981359848E-5,1.0000000007311678,3.8240499981359848E-5,1.0006571020680706,0.11409847901277873,3.5365069631919255,-119.64659911408364,60.353400885916358,null,1000000000,1462335840.25,null,23.466443316818911,-24.771291030633314,null,12.911366706363935,-88.340137798944028,null,0,{"$f":"IF(AH410>0,W410,0)","v":0}]
[38462,38.462000000000003,9.2889998892530681,1.4629330770037816,1.0006053227926599,3.4785560334667703E-2,1,0,532.12082949757837,1.5689170532668224,4.5718210701457043,1.3502823120216616,1.0232708979608094,0.21367453097252664,1.0000000007396628,3.8461999981034064E-5,1.0000000007396628,3.8461999981034064E-5,1.000664934759385,0.11476137627000846,3.4822614497042799,-119.74480341900171,60.255196580998287,null,1000000000,1479325444,null,23.461786764166177,-24.769496770748972,null,12.861777745529025,-88.402167839628092,null,0,0]
[38683.5,38.683500000000002,9.3418763790036525,1.4635459584423702,1.0006123127532509,3.4985725012517566E-2,1,0,535.18526578967476,1.5689278138783185,4.5968936485348433,1.3515047637592976,1.0235366097214187,0.21486764390857374,1.0000000007482066,3.8683499980704505E-5,1.0000000007482066,3.8683499980704505E-5,1.0006728172823489,0.11542430803126293,3.4283222261523689,-119.84333958879064,60.156660411209359,null,1000000000,1496413172.25,null,23.457158449939449,-24.768432318864448,null,12.812466836203843,-88.463797960248201,null,0,0]
[38905,38.905000000000001,9.3947563382835195,1.4641519406948313,1.000619342803712,3.5185886885793383E-2,1,0,538.24970214303482,1.5689384519622642,4.6219730219321704,1.3527139509516064,1.023803777747802,0.2160601358407894,1.0000000007567995,3.8904999980371144E-5,1.0000000007567995,3.8904999980371144E-5,1.0006807497162122,0.11608727448795136,3.3746853712104503,-119.94220200208112,60.057797997918883,null,1000000000,1513599025,null,23.452557519564522,-24.768085268235044,null,12.763430911636851,-88.525034935212901,null,0,0]
[39131.5,39.131500000000003,9.4488335033024029,1.4647645876804534,1.0006265730027057,3.5390564168879056E-2,1,0,541.38331319418103,1.5689492056438161,4.647625433348697,1.3539369365792797,1.0240784814136181,0.21727890111173298,1.0000000007656371,3.9131499980026316E-5,1.0000000007656371,3.9131499980026316E-5,1.0006889129084333,0.11676524240576801,3.32014642717259,-120.04362769943835,59.956372300561654,null,1000000000,1531274292.25,null,23.44788018310274,-24.768459600173976,null,12.713569304060773,-88.587254577744687,null,0,0]
[39358,39.357999999999997,9.5029141744477634,1.4653702617965714,1.0006338451201315,3.5595238485550212E-2,1,0,544.516924307213,1.5689598355538039,4.6732847198689775,1.3551464940715743,1.0243547054169453,0.21849701089504267,1.000000000774526,3.9357999979677469E-5,1.000000000774526,3.9357999979677469E-5,1.0006971284593544,0.1174432470074926,3.2659155963389122,-120.14538298165225,59.854617018347753,null,1000000000,1549052164,null,23.443229748065203,-24.769558659334461,null,12.663988908264628,-88.649076976078504,null,0,0]
[39584.5,39.584499999999998,9.5569982921987187,1.4659690809757331,1.0006411591550759,3.5799909818723455E-2,1,0,547.65053548106869,1.5689703438168574,4.6989507688655774,1.3563428398966364,1.0246324485282097,0.21971446210747028,1.0000000007834662,3.9584499979324583E-5,1.0000000007834662,3.9584499979324583E-5,1.0007053964551804,0.1181212884973792,3.2119889179178336,-120.24746217250869,59.752537827491309,null,1000000000,1566932640.25,null,23.438605374777669,-24.77136998808054,null,12.614686603131089,-88.710508899933274,null,0,0]
[39811,39.811,9.6110857983703877,1.4665611605156887,1.0006485151066193,3.6004578151316892E-2,1,0,550.78414671470978,1.5689807325092548,4.7246234701290515,1.3575261859707655,1.0249117095124116,0.22093125167690975,1.0000000007924579,3.9810999978967646E-5,1.0000000007924579,3.9810999978967646E-5,1.0007137169826104,0.11879936707954113,3.1583625055147753,-120.34985970348424,59.650140296515758,null,1000000000,1584915721,null,23.434006246956834,-24.773881387445897,null,12.56565931854886,-88.771556968057041,null,0,0]
[40042.75,40.042749999999998,9.6664304362738172,1.46716010555089,1.0006560849446111,3.6213987328358281E-2,1,0,553.990391382138,1.5689912403554702,4.7508980068631583,1.358723721759012,1.0251990131939326,0.22217555696063626,1.0000000008017109,4.0042749978598193E-5,1.0000000008017109,4.0042749978598193E-5,1.0007222848330406,0.11949320131955225,3.1037999056561367,-120.45495448315855,59.545045516841455,null,1000000000,1603421827.5625,null,23.429325819162308,-24.77716313739052,null,12.51577714648475,-88.833629502403852,null,0,0]
[40274.5,40.274500000000003,9.7217785023828807,1.467752230964221,1.000663698662912,3.6423393327932471E-2,1,0,557.19663611003091,1.5690016272722902,4.7771792818706391,1.3599080829328432,1.0254879032957702,0.22341916310267959,1.0000000008110177,4.0274499978224445E-5,1.0000000008110177,4.0274499978224445E-5,1.0007309078637538,0.12018707482314539,3.0495436517865837,-120.56037107180366,59.439628928196342,null,1000000000,1622035350.25,null,23.424670163575069,-24.781152750526964,null,12.466176548202437,-88.895313732892163,null,0,0]
[40506.25,40.506250000000001,9.7771299384766426,1.4683376521610343,1.0006713562605205,3.6632796131746935E-2,1,0,560.402880897351,1.5690118953353398,4.8034671845498789,1.3610794824439345,1.0257783784775731,0.22466206684875567,1.000000000820378,4.0506249977846374E-5,1.000000000820378,4.0506249977846374E-5,1.0007395861692234,0.12088098780849628,2.9955898109654786,-120.66610383894405,59.333896161055947,null,1000000000,1640756289.0625,null,23.420038477068562,-24.785837958090774,null,12.416854393887833,-88.956616285310261,null,0,0]
[40738,40.738,9.8324846876416654,1.4689164819664744,1.0006790577364293,3.6842195721510818E-2,1,0,563.60912574308384,1.5690220465730138,4.8297616066796412,1.3622381287505605,1.026070437393158,0.22590426495693597,1.0000000008297922,4.0737999977463952E-5,1.0000000008297922,4.0737999977463952E-5,1.0007483198444638,0.12157494049362276,2.9419345240000898,-120.77214726170554,59.227852738294459,null,1000000000,1659584644,null,23.415429979013219,-24.791206746772239,null,12.367807604977791,-89.017543637602259,null,0,0]
[40975.25,40.975250000000003,9.8891565156073664,1.4695023361038821,1.0006869874389963,3.7056561532359818E-2,1,0,566.89146275897656,1.5690323197771274,4.8566867032155789,1.3634112748518801,1.0263710667353392,0.22717520916665568,1.0000000008394856,4.0975249977067908E-5,1.0000000008394856,4.0975249977067908E-5,1.0007573182476188,0.12228540374193911,2.8873111768390451,-120.88102350300528,59.118976496994719,null,1000000000,1678971112.5625,null,23.410735338205377,-24.797398776872786,null,12.317878898624588,-89.079534896550967,null,0,0]
[41212.5,41.212499999999999,9.945831699098127,1.4700815135927097,1.0006949631251034,3.7270923936005111E-2,1,0,570.17379983400951,1.5690424747011009,4.8836184101632218,1.3645714834297822,1.0266733530013787,0.22844540701190494,1.0000000008492351,4.1212499976667263E-5,1.0000000008492351,4.1212499976667263E-5,1.0007663748831093,0.12299590905862844,2.8329927664487196,-120.99021394142153,59.00978605857847,null,1000000000,1698470156.25,null,23.406063413037167,-24.804282531976334,null,12.268232413402478,-89.141146217272905,null,0,0]
[41449.75,41.449750000000002,10.002510181075769,1.470654127539252,1.0007029847936506,3.7485282912827954E-2,1,0,573.45613696716725,1.569052513375961,4.910556618759137,1.365718964251843,1.0269772947281519,0.22971485505488701,1.0000000008590408,4.1449749976261984E-5,1.0000000008590408,4.1449749976261984E-5,1.0007754898546375,0.12370645667708217,2.7789753807539452,-121.09971298593757,58.900287014062428,null,1000000000,1718081775.0625,null,23.401413434612227,-24.811845912684095,null,12.218865006132642,-89.202384094777869,null,0,0]
[41687,41.686999999999998,10.059191905784351,1.4712202885179102,1.0007110524435325,3.769963844321151E-2,1,0,576.73847415745706,1.5690624377864983,4.937501222587497,1.3668539226424545,1.0272828904462574,0.230983549871529,1.0000000008689029,4.1686999975852028E-5,1.0000000008689029,4.1686999975852028E-5,1.0007846632665001,0.12441704683051437,2.7252551809525887,-121.20951515316231,58.790484846837685,null,1000000000,1737805969,null,23.396784655711997,-24.820077072310148,null,12.169773585231516,-89.263254878998495,null,0,0]
[41929.75,41.929749999999999,10.117190942593426,1.471793008066212,1.0007193547115307,3.7918959639528092E-2,1,0,580.09690352197754,1.5690724760223693,4.9650769749648767,1.3680024403530333,1.0275972809866682,0.23228087277038539,1.0000000008790519,4.1929749975427719E-5,1.0000000008790519,4.1929749975427719E-5,1.0007941099367401,0.12514415436459889,2.6705932943829325,-121.32217092251376,58.677829077486237,null,1000000000,1758103935.0625,null,23.392069756113742,-24.829178130127669,null,12.119826598260111,-89.325163306080071,null,0,0]
[42172.5,42.172499999999999,10.175193260086838,1.472359198377311,1.0007277051151184,3.813827718621661E-2,1,0,583.45533294427923,1.5690823986959872,4.9926592043871434,1.369138269445427,1.0279133999616556,0.23357739990678675,1.0000000008892598,4.2172499974998464E-5,1.0000000008892598,4.2172499974998464E-5,1.0008036180110946,0.12587130692202897,2.6162346286307319,-121.43513275174433,58.564867248255666,null,1000000000,1778519756.25,null,23.387375534197581,-24.838953977156276,null,12.070162154424075,-89.386700424182038,null,0,0]
[42415.25,42.41525,10.233198802479308,1.472918970115445,1.0007361036530904,3.8357591062270276E-2,1,0,586.81376242337012,1.5690922077914942,5.0202478040958187,1.3702616161541359,1.0282312457770526,0.23487312765781856,1.0000000008995267,4.2415249974564228E-5,1.0000000008995267,4.2415249974564228E-5,1.0008131876032131,0.12659850475203313,2.5621752982518502,-121.54839510094975,58.451604899050253,null,1000000000,1799053432.5625,null,23.382701255572329,-24.849392703134775,null,12.020777102670451,-89.447872589381504,null,0,0]
[42658,42.658000000000001,10.291207515240201,1.473472431466015,1.0007445503242349,3.8576901246684378E-2,1,0,590.17219195828056,1.5691019052478685,5.0478426696419589,1.371372682331581,1.0285508168319586,0.23616805241576913,1.0000000009098524,4.2657999974125004E-5,1.0000000009098524,4.2657999974125004E-5,1.0008228188273953,0.12732574810364061,2.5084114904575294,-121.66195253753379,58.338047462466207,null,1000000000,1819704964,null,23.37804620668463,-24.860482647159934,null,11.971668343763822,-89.50868601571716,null,0,0]
[42906.5,42.906500000000001,10.350593504033693,1.474032576657162,1.0007532469266023,3.880140236827849E-2,1,0,593.6101724040916,1.5691117187482821,5.0760975561198443,1.3724975521872784,1.0288797428846637,0.23749281445436946,1.0000000009204839,4.290649997367017E-5,1.0000000009204839,4.290649997367017E-5,1.0008327421447958,0.12807026502239471,2.4536763830326267,-121.77849989330507,58.221500106694933,null,1000000000,1840967742.25,null,23.373300088628248,-24.872497897767612,null,11.921679354395302,-89.570574681612527,null,0,0]
[43155,43.155000000000001,10.409982703402486,1.4745863307370835,1.0007619939668091,3.9025899576736994E-2,1,0,597.0481529064117,1.5691214192305993,5.1043587944349254,1.3736099673323898,1.0292104734596126,0.23881672740661469,1.0000000009311769,4.3154999973210038E-5,1.0000000009311769,4.3154999973210038E-5,1.00084273029307,0.12881483017229628,2.3992431038821569,-121.89534529429278,58.104654705707219,null,1000000000,1862354025,null,23.368572672887687,-24.885171626203142,null,11.871973490985393,-89.632100151455234,null,0,0]
[43403.5,43.403500000000001,10.469375058709074,1.4751338021328175,1.0007707914435331,3.9250392849533938E-2,1,0,600.48613346427032,1.5691310086360157,5.1326262796638522,1.3747101307704241,1.0295430068177505,0.24013978745206679,1.0000000009419319,4.3403499972744572E-5,1.0000000009419319,4.3403499972744572E-5,1.0008527833969516,0.12955944381983703,2.3451077878771516,-122.01248324581984,57.987516754180163,null,1000000000,1883863812.25,null,23.363863257545546,-24.898492093549589,null,11.822547590322529,-89.693268654216411,null,0,0]
[43652,43.652000000000001,10.528770516545922,1.4756750968400065,1.0007796393554442,3.9474882164145728E-2,1,0,603.92411407671909,1.5691404888615239,5.1608999091590952,1.3757982411764396,1.0298773412127951,0.24146199078715269,1.0000000009527485,4.3651999972273747E-5,1.0000000009527485,4.3651999972273747E-5,1.0008629015818877,0.1303041062312848,2.2912666420847447,-122.12990836031054,57.870091639689463,null,1000000000,1905497104,null,23.359171160749138,-24.912447807325581,null,11.773398541326527,-89.754086279545561,null,0,0]
[43906,43.905999999999999,10.589483713922986,1.4762220965249522,1.0007887352169469,3.9704335941127961E-2,1,0,607.43818687084968,1.569150068009544,5.189805558361547,1.3768981807959342,1.0302209348085518,0.24281256887557928,1.0000000009638683,4.3905999971786935E-5,1.0000000009638683,4.3905999971786935E-5,1.0008733110995349,0.13106530077629572,2.2365339746395279,-122.25022368848933,57.749776311510672,null,1000000000,1927736836,null,23.354392422945356,-24.927357178548927,null,11.723444611685093,-89.815893554761644,null,0,0]
[44160,44.16,10.650200043639986,1.4767628595270841,1.000797883768052,3.9933785535198225E-2,1,0,610.9522597200779,1.5691595369629516,5.2187174169784418,1.3779859343191736,1.0305664063352651,0.24416224392969824,1.0000000009750527,4.4159999971294444E-5,1.0000000009750527,4.4159999971294444E-5,1.0008837888782747,0.13182654682946943,2.1821008532426047,-122.37082798127229,57.629172018727715,null,1000000000,1950105600,null,23.349630399659887,-24.942906707916354,null,11.673773513573638,-89.877346685237484,null,0,0]
[44414,44.414000000000001,10.710919452428607,1.4772974915932955,1.0008070850073145,4.0163230922311825E-2,1,0,614.46633262345802,1.5691688976123219,5.2476353823774327,1.3790617006110906,1.030913753904984,0.2455110119426461,1.0000000009863017,4.4413999970796261E-5,1.0000000009863017,4.4413999970796261E-5,1.0008943350543811,0.13258784467441362,2.1279634499801139,-122.49171581601105,57.508284183988948,null,1000000000,1972603396,null,23.344884423620019,-24.959084880052135,null,11.624382086351012,-89.938451747450912,null,0,0]
[44668,44.667999999999999,10.77164188821896,1.4778260961001943,1.0008163389332818,4.0392672078426749E-2,1,0,617.98040558006664,1.5691781518052277,5.276559354154621,1.3801256742885961,1.0312629756220548,0.24685886892614345,1.0000000009976151,4.4667999970292352E-5,1.0000000009976151,4.4667999970292352E-5,1.0009049497649072,0.13334919459448558,2.0741180082581216,-122.61288187621578,57.387118123784219,null,1000000000,1995230224,null,23.34015384675287,-24.975880421575184,null,11.575267221496173,-89.99921468205801,null,0,0]
[44928.25,44.928249999999998,10.833861564851427,1.4783615614284455,1.0008258752098833,4.0627754518698954E-2,1,0,621.58094692156521,1.5691875251797145,5.3062011650117782,1.3812037961402195,1.0316227322912808,0.24823894260000348,1.0000000010092738,4.4928249969770063E-5,1.0000000010092738,4.4928249969770063E-5,1.0009158968930494,0.13412933282750072,2.019246600399542,-122.73731251305601,57.262687486943989,null,1000000000,2018547648.0625,null,23.335322181948609,-24.993718041423904,null,11.525227478441858,-90.061123982036463,null,0,0]
[45188.5,45.188499999999998,10.896084312326055,1.4788909112928454,1.000835466794824,4.0862832466100341E-2,1,0,625.18148831704707,1.5691967905880402,5.3358490749850933,1.382269938348667,1.0319844524205244,0.24961805144172383,1.0000000010210002,4.5188499969241689E-5,1.0000000010210002,4.5188499969241689E-5,1.0009269162636711,0.13490952633138098,1.9646739365720156,-122.86202426680434,57.13797573319566,null,1000000000,2042000532.25,null,23.330505365158235,-25.012180577452479,null,11.475471631404703,-90.122686315955917,null,0,0]
[45448.75,45.448749999999997,10.95831007833289,1.4794142495724925,1.0008451136865133,4.1097905894778887E-2,1,0,628.78202976558475,1.569205949884916,5.3655029829697582,1.3833242970961932,1.03234813394588,0.25099619122229483,1.0000000010327943,4.5448749968707189E-5,1.0000000010327943,4.5448749968707189E-5,1.000938008026736,0.13568977541009225,1.9103961976638026,-122.98701174915543,57.012988250844572,null,1000000000,2065588876.5625,null,23.325702758011442,-25.031256653208423,null,11.425996499643285,-90.183907654547454,null,0,0]
[45709,45.709000000000003,11.020538811740904,1.4799316778135672,1.0008548158833521,4.1332974778885541E-2,1,0,632.38257126627184,1.5692150048828128,5.3951627900635843,1.3843670643571291,1.0327137747951662,0.25237335773337183,1.0000000010446564,4.5708999968166536E-5,1.0000000010446564,4.5708999968166536E-5,1.0009491723330655,0.136470080367318,1.8564096357137556,-123.11226967796505,56.887730322034955,null,1000000000,2089312681,null,23.320913740684372,-25.050935132099315,null,11.376798955020304,-90.244793834859493,null,0,0]
[45975.25,45.975250000000003,11.084205232045443,1.4804550227590743,1.0008647989927029,4.1573458388640648E-2,1,0,636.06612242232382,1.5692241625548928,5.4255124005378512,1.3854220728306927,1.0330898708374128,0.2537812629283856,1.0000000010568617,4.597524996760701E-5,1.0000000010568617,4.597524996760701E-5,1.0009606692591628,0.13726843320633786,1.8014759150738124,-123.24068986901626,56.759310130983735,null,1000000000,2113723612.5625,null,23.316027749598472,-25.071679320826462,null,11.326751225466264,-90.306742843894426,null,0,0]
[46241.5,46.241500000000002,11.147874653525719,1.4809723898319169,1.0008748399832765,4.1813937187136926E-2,1,0,639.74967363110375,1.5692332147708699,5.4558679826512302,1.3864653426558617,1.0334680131745273,0.25518814061522305,1.0000000010691381,4.6241499967040966E-5,1.0000000010691381,4.6241499967040966E-5,1.0009722424341165,0.13806684517221429,1.746839236767423,-123.36938226523574,56.630617734764257,null,1000000000,2138276322.25,null,23.31115472662632,-25.093031170492964,null,11.276987570132025,-90.368353009438991,null,0,0]
[46507.75,46.507750000000001,11.211547025051466,1.4814838806009514,1.0008849388533316,4.2054411146705779E-2,1,0,643.43322489170635,1.5692421633418994,5.4862294372795848,1.3874970664318487,1.0338481995611393,0.25659398635514197,1.0000000010814853,4.6507749966468363E-5,1.0000000010814853,4.6507749966468363E-5,1.0009838920222069,0.13886531658919382,1.6924958075693932,-123.49834153916001,56.501658460839991,null,1000000000,2162970810.0625,null,23.306294064500456,-25.114979495427153,null,11.227504803059858,-90.42963017112325,null,0,0]
[46774,46.774000000000001,11.275222296645032,1.4819895943531092,1.0008950956011162,4.2294880239681976E-2,1,0,647.11677620324633,1.5692510100378996,5.5165966674619984,1.3885174326166165,1.0342304277430514,0.25799879573222545,1.0000000010939034,4.6773999965889173E-5,1.0000000010939034,4.6773999965889173E-5,1.0009956181886537,0.139663847781206,1.6384419048159538,-123.62756246876523,56.372437531234766,null,1000000000,2187807076,null,23.301445173755567,-25.137513346178572,null,11.178299791051307,-90.49058003781424,null,0,0]
[47046.25,47.046250000000001,11.340335451876866,1.4825008318239619,1.0009055410803778,4.254076329332003E-2,1,0,650.88333717357841,1.5692599525534694,5.5476541030316708,1.3895492406916401,1.0346233784923153,0.25943418655079425,1.0000000011066748,4.7046249965290067E-5,1.0000000011066748,4.7046249965290067E-5,1.0010076879662169,0.14048043619025283,1.5834654664625802,-123.75996065348733,56.240039346512674,null,1000000000,2213349639.0625,null,23.296498588433515,-25.161149302495421,null,11.128269938019987,-90.552570795504309,null,0,0]
[47318.5,47.3185,11.405451537218751,1.4830062319044168,1.0009160470715981,4.2786641200061246E-2,1,0,654.64989819536186,1.569268792166616,5.5787173790240514,1.3905695592665099,1.0350184593033762,0.2608684845057217,1.0000000011195203,4.7318499964683989E-5,1.0000000011195203,4.7318499964683989E-5,1.0010198381648407,0.14129708778277206,1.5287840967050481,-123.89262170308336,56.107378296916636,null,1000000000,2239040442.25,null,23.291563118965893,-25.185375046331664,null,11.078524037730077,-90.614231010402619,null,0,0]
[47590.75,47.59075,11.470570502769782,1.483505893751478,1.0009266135728714,4.3032513930338592E-2,1,0,658.41645926771344,1.5692775306433404,5.6097863984179801,1.3915785770979618,1.0354156677379476,0.26230168495009509,1.0000000011324397,4.7590749964070897E-5,1.0000000011324397,4.7590749964070897E-5,1.0010320689642123,0.14211380290404979,1.4743940332899519,-124.02554036006379,55.974459639936214,null,1000000000,2264879485.5625,null,23.28663818918891,-25.210179597658936,null,11.029058904091961,-90.675566385264503,null,0,0]
[47863,47.863,11.535692299753629,1.4839999142946965,1.0009372405822814,4.3278381454588795E-2,1,0,662.18302038977038,1.5692861697094624,5.6408610663120662,1.3925764788766024,1.0358150013483627,0.26373378326214558,1.0000000011454333,4.7862999963450744E-5,1.0000000011454333,4.7862999963450744E-5,1.0010443805450429,0.14293058189901717,1.4202915838147667,-124.15871147138481,55.841288528615195,null,1000000000,2290866769,null,23.281723239989528,-25.235552208559248,null,10.979871403816162,-90.736582495201105,null,0,0]
[48141.75,48.141750000000002,11.602371770965437,1.484499983646353,1.0009481840030883,4.3530113669379276E-2,1,0,666.03950864157719,1.56929491379652,5.6726834009240052,1.3935868770804218,1.0362260684183433,0.26519892636878167,1.0000000011588139,4.814174996280844E-5,1.0000000011588139,4.814174996280844E-5,1.0010570699535652,0.14376692812547623,1.365191643733372,-124.29531835112732,55.704681648872679,null,1000000000,2317628093.0625,null,23.276700720090279,-25.262108171560168,null,10.929793983634015,-90.798730274098702,null,0,0]
[48420.5,48.420499999999997,11.669054110416052,1.4849943378681432,1.0009591908516997,4.3781840363874724E-2,1,0,669.89599694372237,1.5693035572068472,5.7045114621880968,1.3945860013534912,1.0366393581302207,0.26666290436287388,1.0000000011722723,4.8420499962158656E-5,1.0000000011722723,4.8420499962158656E-5,1.0010698444336321,0.14460334204269898,1.3103855981783115,-124.43217927539654,55.567820724603465,null,1000000000,2344544820.25,null,23.271687529182806,-25.289237558829079,null,10.880001128986427,-90.860554794859894,null,0,0]
[48699.25,48.699249999999999,11.735739269213575,1.4854830741403882,1.0009702611260227,4.4033561506355783E-2,1,0,673.75248529534156,1.5693121016692322,5.7363451547814996,1.3955740373773982,1.0370548678266767,0.26812571236587041,1.0000000011858083,4.8699249961501343E-5,1.0000000011858083,4.8699249961501343E-5,1.0010827041825507,0.14543982401974681,1.2558697005304902,-124.56928903708388,55.430710962916123,null,1000000000,2371616950.5625,null,23.266683119153381,-25.316929551126496,null,10.830489641368029,-90.922061648469992,null,0,0]
[48978,48.978000000000002,11.802427199569037,1.4859662874578705,1.0009813948239534,4.4285277065107292E-2,1,0,677.60897369559007,1.5693205488731066,5.7681843854689818,1.3965511668217163,1.0374725948403869,0.26958734552704228,1.0000000011994221,4.897799996083646E-5,1.0000000011994221,4.897799996083646E-5,1.0010956493987551,0.14627637442528205,1.2016402736943661,-124.70664253302344,55.293357466976559,null,1000000000,2398844484,null,23.26168695830215,-25.345173558423578,null,10.781256375383137,-90.983256300669055,null,0,0]
[49263.25,49.263249999999999,11.87067300532339,1.4864551477724388,1.0009928537987931,4.454285641069515E-2,1,0,681.55538922909341,1.56932909408777,5.8007716937845784,1.3975399757541245,1.0379023552569455,0.27108184032808685,1.0000000012134338,4.9263249960148207E-5,1.0000000012134338,4.9263249960148207E-5,1.0011089851646697,0.14713250306054587,1.1464391077905931,-124.84744599877686,55.152554001223137,null,1000000000,2426867800.5625,null,23.256582296943886,-25.374636829224759,null,10.731159870837628,-91.045560281665445,null,0,0]
[49548.5,49.548499999999997,11.9389216155502,1.4869384190806876,1.001004379185102,4.4800429841926434E-2,1,0,685.50180481179143,1.5693375409132888,5.8333646103935033,1.3985177360356116,1.0383344319217098,0.27257509466945345,1.000000001227527,4.9548499959451925E-5,1.000000001227527,4.9548499959451925E-5,1.0011224108543075,0.14798870413261175,1.0915303533027476,-124.98849420825067,55.011505791749329,null,1000000000,2455053852.25,null,23.251485197771707,-25.404656430706734,null,10.681348215521968,-91.107548525378391,null,0,0]
[49833.75,49.833750000000002,12.00717298242772,1.4874161964622929,1.0010159709805861,4.5057997324829076E-2,1,0,689.44822044283922,1.5693458910392062,5.8659630418120576,1.3994846299801786,1.0387688219443447,0.2740671034438798,1.0000000012417012,4.9833749958747578E-5,1.0000000012417012,4.9833749958747578E-5,1.0011359266839706,0.14884497803522345,1.0369102850656622,-125.12978201453159,54.870217985468415,null,1000000000,2483402639.0625,null,23.246395140982401,-25.435221721225794,null,10.631818204074184,-91.169226503978379,null,0,0]
[50119,50.119,12.075427059213455,1.4878885728574152,1.0010276291829383,4.5315558825435746E-2,1,0,693.39463612141139,1.5693541461166018,5.8985668966074547,1.4004408359532197,1.039205522423885,0.27555786157480239,1.0000000012559571,5.011899995803512E-5,1.0000000012559571,5.011899995803512E-5,1.0011495328711939,0.14970132516167625,0.98257524697173515,-125.27130437386286,54.728695626137139,null,1000000000,2511914161,null,23.241311622535648,-25.466322284931888,null,10.582566684427006,-91.230599567024711,null,0,0]
[50410.75,50.41075,12.145239199238782,1.4883662210011881,1.0010396217325983,4.5578983163679601E-2,1,0,697.43097893650952,1.5693624926624186,5.9319192133351102,1.4014079568338622,1.0396545610045929,0.27708129067942988,1.0000000012706218,5.0410749957297998E-5,1.0000000012706218,5.0410749957297998E-5,1.0011635428005186,0.15057726205000704,0.92729318129006644,-125.41628908674687,54.583710913253128,null,1000000000,2541243715.5625,null,23.236118519954037,-25.498674620160426,null,10.532477721326954,-91.293061173845288,null,0,0]
[50702.5,50.702500000000001,12.215054078499833,1.4888384092762499,1.0010516837451149,4.5842401172023241E-2,1,0,701.4673217996351,1.5693707431538093,5.9652770162775548,1.4023642623291865,1.0401060103666291,0.27860340085061536,1.0000000012853716,5.070249995655229E-5,1.0000000012853716,5.070249995655229E-5,1.0011776477165422,0.15145327636808251,0.87230176128515924,-125.56150881076873,54.438491189231272,null,1000000000,2570743506.25,null,23.230931238816733,-25.531565558489209,null,10.482673582459345,-91.355214752305841,null,0,0]
[50994.25,50.994250000000001,12.284871650295404,1.4893052305590548,1.0010638152179772,4.6105812814139495E-2,1,0,705.50366470996346,1.5693788992394191,5.9986402139100106,1.403309931134135,1.0405598673722247,0.28012418675672379,1.0000000013002066,5.0994249955797949E-5,1.0000000013002066,5.0994249955797949E-5,1.0011918478560156,0.15232936853522794,0.81759728857196123,-125.70695846800385,54.293041531996153,null,1000000000,2600413533.0625,null,23.225749287728704,-25.564984650432454,null,10.433151060834183,-91.417065649942174,null,0,0]
[51286,51.286000000000001,{"$f":"SQRT(1+(A461/pole1)^2)","v":12.354691868978172},{"$f":"ATAN(A461/pole1)","v":1.4897667756360407},{"$f":"SQRT(1+(A461/Zero1)^2)","v":1.00107601614866},{"$f":"ATAN(A461/Zero1)","v":4.6369218053706467E-2},{"$f":"IF(VIN_nom>Vout, 1, SQRT(1+(A461/z_RHP)^2))","v":1},{"$f":"IF(VIN_nom>Vout, 0, -ATAN(A461/z_RHP))","v":0},{"$f":"SQRT(1+(A461/Pole2)^2)","v":709.54000766668912},{"$f":"ATAN(A461/Pole2)","v":1.5693869625303785},6.0320087167179661,1.4042451380666174,{"$f":"SQRT(1+(A461/pole4)^2)","v":1.0410161288723621},{"$f":"ATAN(A461/pole4)","v":0.28164364309989492},{"$f":"SQRT(1+(A461/Zero3)^2)","v":1.0000000013151269},{"$f":"ATAN(A461/Zero3)","v":5.1285999955034941E-5},{"$f":"SQRT(1+(A461/pole5)^2)","v":1.0000000013151269},{"$f":"ATAN(A461/pole5)","v":5.1285999955034941E-5},{"$f":"SQRT((1-(Z461/pterm2))^2+(A461/pterm1)^2)","v":1.001206143457039},{"$f":"IF((ATAN((A461/pterm1)/(1-A461^2/pterm2))>0),ATAN((A461/pterm1)/(1-A461^2/pterm2)),PI()+ATAN((A461/pterm1)/(1-A461^2/pterm2)))","v":0.1532055389702659},{"$f":"20*LOG10(((E461*K461*G461*O461)/(C461*I461*S461*M461*Q461))*Adc)","v":0.7631761332314615},{"$f":"((F461+L461+H461+R461)-(D461+J461+T461+N461+T461))*radconv","v":-125.85263308264423},{"$f":"IF(V461>0,V461,V461+180)","v":54.147366917355768},null,{"$f":"IF(U461<0,A461,1000000000)","v":1000000000},{"$f":"A461^2","v":2630253796},null,{"$f":"20*LOG10((K461/(I461*M461))*AEA)","v":23.22057219039888},{"$f":"(L461-(J461+N461))*radconv","v":-25.598921668427661},null,{"$f":"20*LOG10((E461*G461/(C461*S461))*Acs*Am)","v":10.383907002823506},{"$f":"(F461+H461-(D461+T461))*radconv","v":-91.478619094511814},null,{"$f":"SUM((U462<0)*(U461>0))*A461","v":0},0]
[51584.75,{"$f":"A462/1000","v":51.58475},12.426189990583314,1.4902340197149442,1.0010885817929669,4.6638936540578511E-2,1,0,713.67319523176002,1.5693951247686622,6.06618324103151,1.4051921207948062,1.0414858259433943,0.28319817268449604,1.0000000013304933,5.1584749954244559E-5,1.0000000013304933,5.1584749954244559E-5,1.0012208812292773,0.15410281303365136,0.70773911716693716,-126.00203091480111,53.997969085198889,null,1000000000,2660986432.5625,null,23.2152754258987,-25.634199201001877,null,10.333766751259159,-91.541346494251243,null,0,0]
[51883.5,51.883499999999998,12.497690793997089,1.4906959175737431,1.0011012202626968,4.6908648236912771E-2,1,0,717.80638284382962,1.5694031930092809,6.1003631444011308,1.406128492600349,1.0419580375571147,0.28475129700512147,1.0000000013459487,5.1883499953444974E-5,1.0000000013459487,5.1883499953444974E-5,1.0012357196085135,0.15500017005300343,0.65259168607958096,-126.15165438595248,53.848345614047517,null,1000000000,2691897572.25,null,23.209982786467446,-25.669998793296635,null,10.283911959603053,-91.603772720237956,null,0,0]
[52182.25,52.182250000000003,12.569194233452482,1.4911525602541293,1.0011139315550919,4.7178353103727137E-2,1,0,721.9395705020911,1.5694111688666761,6.1345483369152634,1.4070544292176512,1.0424327602963346,0.2863030104837142,1.0000000013614936,5.2182249952636133E-5,1.0000000013614936,5.2182249952636133E-5,1.0012506588547949,0.15589761047636211,0.59773015491496895,-126.30149847004013,53.69850152995987,null,1000000000,2722987215.0625,null,23.204693806778867,-25.70631014937377,null,10.234339408127028,-91.6659030166809,null,0,0]
[52481,52.481000000000002,12.640700264216369,1.4916040367466545,1.0011267156673778,4.744805110204546E-2,1,0,726.07275820575524,1.5694190539185282,6.1687387306416266,1.40797010255755,1.0429099907319326,0.28785330757952277,1.0000000013771275,5.2480999951817975E-5,1.0000000013771275,5.2480999951817975E-5,1.0012656992296507,0.1567951347512013,0.54315090683022516,-126.45155824252416,53.548441757475842,null,1000000000,2754255361,null,23.199408036044893,-25.743123192400578,null,10.185045930776253,-91.727742510234691,null,0,0]
[52786.5,52.786499999999997,12.713824546648038,1.4920604620018529,1.0011398639292413,4.7723835551669626E-2,1,0,730.29933178653073,1.5694270248265492,6.2037069162005665,1.4088960262404679,1.0434005935199075,0.28943716182724127,1.0000000013932073,5.2786499950971639E-5,1.0000000013932073,5.2786499950971639E-5,1.0012811842846812,0.15771302499754156,0.48762671071507668,-126.60522651291372,53.394773487086283,null,1000000000,2786414582.25,null,23.194005701425976,-25.781276536408388,null,10.134924069280025,-91.790683703245378,null,0,0]
[53092,53.091999999999999,12.786951447381492,1.4925116668776333,1.0011530883328585,4.7999612736499518E-2,1,0,734.52590541317215,1.5694349040029401,6.2386803607871135,1.4098115694220259,1.0438938113125291,0.29101952336594111,1.0000000014093802,5.3091999950115457E-5,1.0000000014093802,5.3091999950115457E-5,1.0012967756476188,0.15863100387186488,0.43239025921187058,-126.75911022701121,53.240889772988794,null,1000000000,2818760464,null,23.188605813486873,-25.819933857571876,null,10.085087505715922,-91.85333128479904,null,0,0]
[53397.5,53.397500000000001,12.860080921751006,1.4929577402465153,1.0011663888752129,4.8275382614876468E-2,1,0,738.75247908489234,1.569442693022153,6.2736589764495738,1.4107169041830059,1.0443896404049535,0.29260038639202196,1.0000000014256465,5.3397499949249362E-5,1.0000000014256465,5.3397499949249362E-5,1.0013124736029275,0.15954907185080816,0.37743789541682216,-126.91320443202763,53.086795567972374,null,1000000000,2851293006.25,null,23.183207934323072,-25.859085054076129,null,10.035533021084673,-91.915690376612133,null,0,0]
[53703,53.703000000000003,12.933212926099525,1.4933987689791437,1.0011797655532693,4.8551145145148446E-2,1,0,742.97905280092164,1.5694503934228143,6.3086426771740047,1.4116121988549775,1.0448880770797728,0.29417974514283013,1.0000000014420061,5.3702999948373292E-5,1.0000000014420061,5.3702999948373292E-5,1.001328278436689,0.16046722941037422,0.3227660300252142,-127.06750427550921,52.932495724490792,null,1000000000,2884012209,null,23.177811639944764,-25.898720239213713,null,9.9862574500713759,-91.977765985665414,null,0,0]
[54015.75,54.015749999999997,13.008083045213228,1.4938451270469619,1.001193538545319,4.8833444302825518E-2,1,0,747.30592986629176,1.5694581863379948,6.3444617763388429,1.4125185118927388,1.0454010396936513,0.29579502036340211,1.0000000014588506,5.4015749947466063E-5,1.0000000014588506,5.4015749947466063E-5,1.0013445693577792,0.16140726959745599,0.2670835986457708,-127.22567395222181,52.774326047778189,null,1000000000,2917701248.0625,null,23.172288496037812,-25.939787281320019,null,9.9360981625988813,-92.04102620417278,null,0,0]
[54328.5,54.328499999999998,13.082955726336044,1.4942863762607304,1.0012073913231008,4.9115735671175602E-2,1,0,751.63280697652283,1.5694658895312104,{"$f":"SQRT(1+(A471/Zero2)^2)","v":6.3802860283497269},{"$f":"ATAN(A471/Zero2)","v":1.4134146480637531},1.0459167271984731,0.2974087069732872,1.0000000014757928,5.4328499946548257E-5,1.0000000014757928,5.4328499946548257E-5,1.0013609729022586,0.16234740467490602,0.21168773438861585,-127.38404916322605,52.615950836773948,null,1000000000,2951585912.25,null,23.166766156511919,-25.981341253562579,null,9.8862246378676204,-92.103999590017793,null,0,0]
[54641.25,54.641249999999999,13.157830925731773,1.494722603663599,1.001221323883303,4.9398019205532238E-2,1,0,755.95968413084461,1.5694735045430819,6.4161153468942187,1.4143007764076339,1.0464351355657258,0.29902079892331085,1.000000001492833,5.4641249945619819E-5,1.000000001492833,5.4641249945619819E-5,1.0013774893823317,0.16328763515133696,0.1565747959187502,-127.54262501299127,52.457374987008734,null,1000000000,2985666201.5625,null,23.161244208872812,-26.023372212363878,null,9.8366336470368587,-92.166691162106147,null,0,0]
[54954,54.954000000000001,13.232708600652666,1.4951538943363183,1.0012353362225948,4.9680294861236457E-2,1,0,760.28656132850438,1.5694810328791582,6.4519496475650655,1.4151770622722604,1.046956260753642,0.30063129020940182,1.000000001509971,5.4953999944680701E-5,1.000000001509971,5.4953999944680701E-5,1.0013941191119797,0.16422796153464816,0.10174120920393739,-127.70139670556335,52.298603294436646,null,1000000000,3019942116,null,23.155722254001155,-26.065870426241908,null,9.7873220151937002,-92.229105826865037,null,0,0]
[55274,55.274000000000001,13.309324567702873,1.4955901599784507,1.0012497559594216,4.996910587600429E-2,1,0,764.71374187859237,1.5694886475546261,6.4886197100668195,1.4160636430457989,1.0474922741725148,0.30227745205877832,1.0000000015276074,5.5273999943708684E-5,1.0000000015276074,5.5273999943708684E-5,1.0014112518902487,0.16519018584809231,4.5921981697449633E-2,-127.86404676173805,52.135953238261948,null,1000000000,3055215076,null,23.150071881969069,-26.109827504902327,null,9.7371531597193055,-92.292685746860556,null,55274,{"$f":"IF(AH474>0,W474,0)","v":52.135953238261948}]
[55594,55.594000000000001,13.385943038888719,1.4960214315066407,1.0012642592098857,5.0257908548041949E-2,1,0,769.14092247251062,1.5694961745698426,6.5252948154633916,1.4169402585328208,1.0480311232290842,0.30392192560028203,1.0000000015453463,5.5593999942725343E-5,1.0000000015453463,5.5593999942725343E-5,1.0014285039002528,0.16615251163993838,-9.6121536168438746E-3,-128.02689199621423,51.973108003785768,null,55594,3090692836,null,23.144420698012276,-26.154253796944261,null,9.6872702083618005,-92.355985817491856,null,0,0]
[55914,55.914000000000001,13.462563971455415,1.4964477940296812,1.0012788459703579,5.0546702829536702E-2,1,0,773.56810310950641,1.5695036154298629,6.5619748792000401,1.4178070744862119,1.048572803551749,0.30556470454931856,1.0000000015631876,5.5913999941730618E-5,1.0000000015631876,5.5913999941730618E-5,1.0014458754840867,0.16711493945188577,-6.4864816806271014E-2,-128.18992757939188,51.810072420608122,null,55914,3126375396,null,23.13876831528377,-26.199139531579476,null,9.6376699279008768,-92.419010948910071,null,0,0]
[56234,56.234000000000002,13.539187323614641,1.4968693307369463,1.0012935162371881,5.083548867268417E-2,1,0,777.9952837888444,1.5695109716054843,6.5986598185907805,1.4186642530325322,1.0491173107549909,0.30720578267082455,1.0000000015811312,5.6233999940724435E-5,1.0000000015811312,5.6233999940724435E-5,1.0014633669857891,0.16807746982483313,-0.11983956106434239,-128.35314878025244,51.64685121974756,null,56234,3162262756,null,23.133114359762175,-26.244475146667973,null,9.5883491391644036,-92.48176594124547,null,0,0]
[56561.5,56.561500000000002,13.61760899828988,1.4972958352637133,1.0013086167996317,5.113103414682886E-2,1,0,782.52622655844698,1.5695184140064973,6.6362095252746345,1.4195317083110439,1.0496775022945095,0.30888355601700163,1.0000000015996016,5.6561499939682754E-5,1.0000000015996016,5.6561499939682754E-5,1.0014813929722817,0.16906266626181898,-0.17581864937664532,-128.52038283624921,51.479617163750788,null,56561.5,3199203282.25,null,23.12732588385942,-26.29132937022942,null,9.5381585267548559,-92.545716940153454,null,0,0]
[56889,56.889000000000003,13.696033121723762,1.4977174554968828,1.0013238048208641,5.1426570681154034E-2,1,0,787.05716937089414,1.5695257707184538,6.6737641693696528,1.4203894015302536,1.0502406454388424,0.31055953481945653,1.0000000016181791,5.6888999938628936E-5,1.0000000016181791,5.6888999938628936E-5,1.0014995452990543,0.17004797126748003,-0.23151396163442892,-128.68780159149955,51.31219840850045,null,56889,3236358321,null,23.121535007225873,-26.338635189186032,null,9.4882540911306208,-92.609394822392886,null,0,0]
[57216.5,57.216500000000003,13.774459652090671,1.4981342747131887,1.0013390802969055,5.1722098224442264E-2,1,0,791.58811222545012,1.5695330432127701,6.7113236679908246,1.4212374953157905,1.0508067354425616,0.31223371255562166,1.000000001636864,5.7216499937562915E-5,1.000000001636864,5.7216499937562915E-5,1.0015178243412282,0.17103338541900834,-0.28692909957086621,-128.85540027931268,51.144599720687324,null,57216.5,3273727872.25,null,23.115741367957252,-26.386382996365938,null,9.4386325924628025,-92.672804395374371,null,0,0]
[57544,57.543999999999997,13.852888548510887,1.4985463743102208,1.0013544432237538,5.2017616725485501E-2,1,0,796.11905512139595,1.5695402329273662,6.7488879400876565,1.4220761487285314,1.0513757675456534,0.3139060827573254,1.0000000016556558,5.7543999936484628E-5,1.0000000016556558,5.7543999936484628E-5,1.0015362304760542,0.17201890929269617,-0.34206759839453194,-129.02317423067029,50.976825769329707,null,57544,3311311936,null,23.109944616457728,-26.434563390040029,null,9.3892908451386621,-92.735950358789395,null,0,0]
[57879,57.878999999999998,13.933115932825109,1.4989631112644792,1.0013702484469318,5.2319893417186673E-2,1,0,800.75376011048411,1.5695475031118347,6.7873173187667994,1.422924402995404,1.0519608698761433,0.3156148747278486,1.0000000016749893,5.7878999935368865E-5,1.0000000016749893,5.7878999935368865E-5,1.0015551900126964,0.17302711653525454,-0.39818621384014069,-129.19496689591062,50.805033104089375,null,57879,3349978641,null,23.104011542989937,-26.484285119514226,null,9.3391053031608458,-92.800274468702511,null,0,0]
[58214,58.213999999999999,14.013345709192411,1.4993750764509086,1.0013861451636163,5.2622160539394766E-2,1,0,805.38846514140937,1.5695546896219974,6.8257515261671244,1.423763105218083,1.0525490404805309,0.31732176191176192,1.0000000016944348,5.8213999934240111E-5,1.0000000016944348,5.8213999934240111E-5,1.0015742833349961,0.17403543979984021,-0.45402265101757211,-129.3669333638301,50.6330666361699,null,58214,3388869796,null,23.098074510858638,-26.534440210388738,null,9.2892058981147105,-92.864332372321954,null,0,0]
[58549,58.548999999999999,14.093577836761444,1.4997823512228377,1.0014021333694503,5.2924418037333304E-2,1,0,810.0231702134538,1.5695617938941298,6.8641904811772161,1.4245924146788302,1.0531402742179956,0.31902673756294148,1.0000000017139927,5.8548999933098293E-5,1.0000000017139927,5.8548999933098293E-5,1.0015935108536334,0.17504387970029359,-0.50958048786548349,-129.53906893867727,50.460931061322725,null,58549,3427985401,null,23.092133183285199,-26.585019232230302,null,9.2395893888402405,-92.928128769159031,null,0,0]
[58884,58.884,14.173812275604645,1.5001850150978167,1.0014182130600513,5.3226665856236331E-2,1,0,814.65787532591537,1.569568817331823,6.9026341044825008,1.4254124871638127,1.0537345659325112,0.32072979499481785,1.0000000017336628,5.8883999931943336E-5,1.0000000017336628,5.8883999931943336E-5,1.0016128729816172,0.17605243684944591,-0.56486323627315149,-129.71136902125303,50.288630978746966,null,58884,3467325456,null,23.086187235275638,-26.636012956456668,null,9.1902525884421316,-92.99166825348432,null,0,0]
[59227,59.226999999999997,14.255965114718355,1.5005925986184128,1.0014347715265808,5.3536121447810218E-2,1,0,819.40326000461096,1.5695759261728341,6.9420005403159006,1.4262427321058091,1.0543462126759677,0.32247152805573287,1.0000000017539188,5.9226999930747102E-5,1.0000000017539188,5.9226999930747102E-5,1.0016328373921066,0.1770852010664743,-0.62118474886360187,-129.88794947580109,50.112050524198906,null,59227,3507837529,null,23.080094179779014,-26.688644685394337,null,9.1400241313483068,-93.056463600611551,null,0,0]
[59570,59.57,14.338120294955665,1.5009955114260245,1.0014514258900944,5.3845566776383788E-2,1,0,824.14864472423892,1.5695829531495225,6.981371707349588,1.4270636133419272,1.0549610542054833,0.3242112361913469,1.0000000017742925,5.9569999929536936E-5,1.0000000017742925,5.9569999929536936E-5,1.0016529438015684,0.17811808949597899,-0.67722512339371788,-130.0646929306096,49.935307069390404,null,59570,3548584900,null,23.073995627191472,-26.741692205006139,null,9.0900823094057337,-93.12099904047443,null,0,0]
[59913,59.912999999999997,14.420277776303038,1.5013938332208725,1.001468176145808,5.4155001783207805E-2,1,0,828.89402948409577,1.5695898996678967,7.020747525988245,1.4278752873053191,1.0555790849384712,0.3259489124185081,1.0000000017947837,5.9912999928312749E-5,1.0000000017947837,5.9912999928312749E-5,1.0016731926608962,0.17915110279242363,-0.73298792442364202,-130.2415947480207,49.758405251979298,null,59913,3589567569,null,23.067891264589356,-26.795146232785921,null,9.0404238709779232,-93.185279180423294,null,0,0]
[60256,60.256,14.502437519652551,1.5017876419029985,1.00148502228891,5.4464426409544846E-2,1,0,833.63941428349506,1.5695967671019526,7.0601279184029329,1.4286779069880364,1.0562002992764883,0.32768454981944989,1.0000000018153927,6.0255999927074462E-5,1.0000000018153927,6.0255999927074462E-5,1.0016935844235395,0.18018424160913571,-0.7884766506753369,-130.41865038617581,49.581349613824187,null,60256,3630785536,null,23.061780790372222,-26.84899768530012,null,8.9910456189433638,-93.24930852460011,null,0,0]
[60607,60.606999999999999,14.586515827114097,1.5021860428315377,1.0015023606080524,5.4781057129042937E-2,1,0,838.49547865197917,1.5696037142376269,7.1004314595738451,1.4294900292570922,1.056839292572078,0.32945855070045899,1.0000000018366042,6.0606999925792613E-5,1.0000000018366042,6.0606999925792613E-5,1.0017146002132922,0.18124160758422481,-0.84497941949176081,-130.59999020540172,49.400009794598276,null,60607,3673208449,null,23.055521167538298,-26.904507311786222,null,8.9408024729608666,-93.314576220315985,null,0,0]
[60958,60.957999999999998,14.670596423257953,1.5025798771654484,1.0015197993293441,5.509767685377117E-2,1,0,843.35154306046525,1.5696105813693257,7.1407396309161477,1.4302929834869236,1.0574816077989611,0.33123040209271004,1.0000000018579389,6.0957999924495844E-5,1.0000000018579389,6.0957999924495844E-5,1.0017357666191069,0.18229910638363703,-0.90120238833752764,-130.78148177795899,49.218518222041013,null,60958,3715877764,null,23.049254540362032,-26.960414487702664,null,8.8908461312913616,-93.37959050965965,null,0,0]
[61309,61.308999999999997,14.754679268957457,1.5029692228527904,1.0015373384475406,5.5414285520824509E-2,1,0,848.20760750826639,1.569617369871138,7.1810523544605953,1.4310869230349166,1.0581272389075995,0.3330000967954746,1.0000000018793966,6.1308999923184051E-5,1.0000000018793966,6.1308999923184051E-5,1.0017570841352141,0.1833567387037475,-0.95714910254807561,-130.96312053277242,49.036879467227578,null,61309,3758793481,null,23.042980620079504,-27.016710092476593,null,8.8411733373633403,-93.444355902229518,null,0,0]
[61660,61.66,14.838764325971749,1.5033541560803425,1.0015549779573674,5.5730883067311186E-2,1,0,853.06367199471094,1.5696240810858648,7.2213695539702671,1.4318719978796959,1.058776179832019,0.33476762767957735,1.0000000019009778,6.1659999921857147E-5,1.0000000019009778,6.1659999921857147E-5,1.0017785532586427,0.18441450523965494,-1.0128230419666928,-131.14490199360179,48.855098006398208,null,61660,3801955600,null,23.03669912877907,-27.07338520143098,null,8.7917808892451657,-93.50887680663611,null,0,0]
[62019,62.018999999999998,14.924768100055244,1.5037433758713372,1.0015731233516738,5.6054684943109334E-2,1,0,858.03041605290105,1.569630866681043,7.2626102164658306,1.4326659489744882,1.0594433289247565,0.336573198454647,1.0000000019231781,6.2018999920484278E-5,1.0000000019231781,6.2018999920484278E-5,1.0018006690576671,0.18549651997694952,-1.0694872918724665,-131.33096967482831,48.66903032517169,null,62019,3846356361,null,23.03026635909184,-27.13173552561511,null,8.7415494090266126,-93.574619854974486,null,0,0]
[62378,62.378,15.01077410921372,1.5041281355582283,1.0015913737547621,5.6378475052604182E-2,1,0,862.99716015014383,1.5696375741709474,7.3038554053074636,1.4334509336067933,1.0601139275399332,0.33837649079461363,1.0000000019455073,6.2377999919095429E-5,1.0000000019455073,6.2377999919095429E-5,1.0018229445143401,0.18657867658460445,-1.1258733516155233,-131.51717746285868,48.482822537141317,null,62378,3891014884,null,23.023825114483788,-27.190464570439513,null,8.6916045938916096,-93.640116160903645,null,0,0]
[62737,62.737000000000002,15.096782315247665,1.5045085112553784,1.0016097291608919,5.670225332854846E-2,1,0,867.96390428576888,1.5696442048964017,7.3451050442443853,1.434227101866189,1.0607879691354924,0.34017749730358865,1.0000000019679656,6.2736999917690508E-5,1.0000000019679656,6.2736999917690508E-5,1.0018453801695355,0.18766097580214325,-1.1819847419181448,-131.70352086089201,48.296479139107987,null,62737,3935931169,null,23.017375130542554,-27.249563389475156,null,8.6419431875302255,-93.705370131679913,null,0,0]
[63096,63.095999999999997,15.182792680822189,1.5048845773575434,1.0016281895642904,5.7026019703709713E-2,1,0,872.93064845912102,1.569650760167713,7.3863590587209913,1.4349946005321899,1.0614654471524496,0.3419762106637359,1.0000000019905526,6.3095999916269391E-5,1.0000000019905526,6.3095999916269391E-5,1.001867976567185,0.18874341836765809,-1.2378249184800261,-131.88999546581212,48.11000453418788,null,63096,3981105216,null,23.010916153231623,-27.309023228669258,null,8.5925619882792752,-93.770386075950512,null,0,0]
[63463.25,63.463250000000002,15.27078180422783,1.5052649021754076,1.0016471828352904,5.7357214008266891E-2,1,0,878.01153094223616,1.5696573893425338,7.4285655626502347,1.4357709156374863,1.0621620428824696,0.34381387900960525,1.000000002013792,6.3463249914798815E-5,1.000000002013792,6.3463249914798815E-5,1.0018912591375355,0.18985088510126724,-1.2946712325780494,-132.0808866197832,47.9191133802168,null,63463.25,4027584100.5625,null,23.0042991852753,-27.370214113735432,null,8.5423326421375698,-93.836654216870983,null,0,0]
[63830.5,63.830500000000001,15.358773111196671,1.5056408692410077,1.001666285972463,5.7688395716499287E-2,1,0,883.09241346349256,1.5696639422352854,7.4707764929301028,1.436538458623535,1.0628622208514054,0.34564913235788963,1.0000000020371662,6.3830499913311096E-5,1.0000000020371662,6.3830499913311096E-5,1.0019147110844235,0.19095850340491011,-1.3512408385832353,-132.27190604890481,47.72809395109519,null,63830.5,4074332730.25,null,22.997672299830793,-27.431764864402513,null,8.4923899215768941,-93.902682083017766,null,0,0]
[64197.75,64.197749999999999,15.446766564413217,1.506012552919747,1.0016854989695225,5.8019564756480749E-2,1,0,888.17329602223538,1.5696704201551044,7.5129917749536776,1.4372973764491221,1.0635659739843646,0.3474819631275981,1.0000000020606754,6.4197749911806178E-5,1.0000000020606754,6.4197749911806178E-5,1.0019383330000751,0.19206627406403615,-1.4075372347357518,-132.46304932865857,47.53695067134143,null,64197.75,4121351105.0625,null,22.99103525644929,-27.493666701201519,null,8.442730568805878,-93.968473984338615,null,0,0]
[64565,64.564999999999998,15.534762127406538,1.5063800258968747,1.0017048218201472,5.8350721056301763E-2,1,0,893.254178617825,1.5696768243813413,7.5552113357739268,1.4380478128283827,1.0642732951890916,0.34931236382284508,1.0000000020843196,6.456499991028394E-5,1.0000000020843196,6.456499991028394E-5,1.0019621254800593,0.19317419786248896,-1.4635638546615208,-132.65431212714989,47.345687872850107,null,64565,4168639225,null,22.984387824605903,-27.555911033737821,null,8.3933513807234981,-94.034034134422598,null,0,0]
[64941,64.941000000000003,15.62485639763589,1.5067519659916542,1.0017247188559475,5.8689754123137018E-2,1,0,898.45611699691676,1.5696833061503139,7.5984411669763663,1.4388074886934459,1.0650011580174963,0.35118384980417994,1.0000000021086666,6.4940999908707386E-5,1.0000000021086666,6.4940999908707386E-5,1.0019866621671991,0.19430867822881731,-1.5206493749053371,-132.85025129712869,47.149748702871307,null,64941,4217333481,null,22.97757101950549,-27.619984439099266,null,8.3430826655800896,-94.100920505247601,null,0,0]
[65317,65.316999999999993,15.714952804614594,1.5071196413494385,1.0017447310288319,5.9028773682996381E-2,1,0,903.65805541332099,1.5696897132942385,7.6416753336799035,1.4395585689794037,1.0657327458668855,0.35305277290595904,1.0000000021331552,6.5316999907112468E-5,1.0000000021331552,6.5316999907112468E-5,1.0020113789173162,0.19544332077637377,-1.5774591937865503,-133.04630684669249,46.953693153307512,null,65317,4266310489,null,22.970742866443409,-27.684399216984051,null,8.2931009997609575,-94.167572590834396,null,0,0]
[65693,65.692999999999998,15.805051311801146,1.5074831248048266,1.0017648583318997,5.9367779658761749E-2,1,0,908.85999386639708,1.569696047094483,7.6849137627119104,1.4403011979182228,1.0664680510712625,0.35491912536017067,1.0000000021577851,6.5692999905499078E-5,1.0000000021577851,6.5692999905499078E-5,1.0020362763804553,0.19657812634107849,-1.6339967957065964,-133.24247441362408,46.75752558637592,null,65693,4315570249,null,22.963903148236248,-27.74914673185193,null,8.2434031160480785,-94.233994616611341,null,0,0]
[66069,66.069000000000003,15.895151883481711,1.5078424875454735,1.0017851007582117,5.9706771973333704E-2,1,0,914.06193235551893,1.5697023088032467,7.7281563825302069,1.441035516551457,1.0672070659468593,0.35678289949179082,1.0000000021825564,6.6068999903867121E-5,1.0000000021825564,6.6068999903867121E-5,1.0020613552103301,0.1977130957570436,-1.6902656006396217,-133.43874972758877,46.561250272411229,null,66069,4365112761,null,22.95705165721866,-27.814218534616341,null,8.1939858021326408,-94.300190713539195,null,0,0]
[66453.75,66.453749999999999,15.987351311192418,1.5082060200280185,1.0018059334173588,6.0053638849648212E-2,1,0,919.38492663073066,1.5697086428790412,7.7724095785535363,1.4417784649536995,1.0679671107768562,0.3586873690954836,1.0000000022080504,6.6453749902177839E-5,1.0000000022080504,6.6453749902177839E-5,1.0020872060891939,0.1988746478436284,-1.7475691016158945,-133.63969979512748,46.360300204872516,null,66453.75,4416100889.0625,null,22.950028329321526,-27.881131713161004,null,8.1437056290534997,-94.367697614762278,null,0,0]
[66838.5,66.838499999999996,16.079552827495561,1.5085653835055803,1.0018268866053985,6.0400491258266693E-2,1,0,924.70792094240392,1.5697149040318112,7.8166670161540273,1.4425130007108091,1.0687310236107195,0.3605891230162912,1.0000000022336926,6.6838499900468893E-5,1.0000000022336926,6.6838499900468893E-5,1.0021132482709501,0.20003637325751519,-1.8045981948671006,-133.84075392077088,46.159246079229121,null,66838.5,4467385082.25,null,22.942992263518946,-27.948367125417352,null,8.0937126016048762,-94.434976409455615,null,0,0]
[67223.25,67.223249999999993,16.171756396667497,1.5089206491935161,1.0018479603147683,6.0747329116642282E-2,1,0,930.03091528991274,1.5697210935136716,7.8609286236907829,1.443239265127668,1.0694987961600304,0.36248815333217527,1.0000000022594826,6.7223249898740146E-5,1.0000000022594826,6.7223249898740146E-5,1.0021394824679346,0.2011982728864633,-1.8613563451365558,-134.04190781298601,45.958092187013989,null,67223.25,4518965340.5625,null,22.935943266222466,-28.015916293053525,null,8.0440034486318996,-94.502031233553041,null,0,0]
[67608,67.608000000000004,16.26396198379388,1.5092718866964039,1.0018691545378624,6.1094152342248999E-2,1,0,935.35390967264505,1.5697272125482358,7.9051943311207102,1.4439573963795211,1.0702704201183368,0.36438445222234878,1.0000000022854207,6.7607999896991504E-5,1.0000000022854207,6.7607999896991504E-5,1.0021659093964974,0.20236034761620114,-1.917846953061064,-134.24315727119816,45.756842728801843,null,67608,4570841664,null,22.928881152946829,-28.083770921220928,null,7.9945749539830269,-94.568866130580005,null,0,0]
[68001.75,68.001750000000001,16.358326480466015,1.5096272406392099,1.0018909692995241,6.1449073155555513E-2,1,0,940.80141857970784,1.5697334030274019,7.9504996671110355,1.4446840462413386,1.0710640726739502,0.36632227291438751,1.0000000023121189,6.8001749895181245E-5,1.0000000023121189,6.8001749895181245E-5,1.0021931547973213,0.20354978759519007,-1.9753854583956074,-134.44920897444365,45.55079102555635,null,68001.75,4624238003.0625,null,22.921640080995275,-28.153520586471053,null,7.9442775206000373,-94.6370408379304,null,0,0]
[68395.5,68.395499999999998,16.452693019113649,1.509978518269389,1.0019129102626674,6.1803978468694364E-2,1,0,946.24892752240896,1.5697395222299946,7.9958091535499509,1.4454024611317695,1.0718617412698479,0.36825721665057681,1.0000000023389721,6.8395499893349884E-5,1.0000000023389721,6.8395499893349884E-5,1.0022206035827903,0.20473941283306227,-2.0326507658007187,-134.65535214720819,45.344647852791809,null,68395.5,4677944420.25,null,22.914384909216423,-28.22357315955152,null,7.894267384973781,-94.704993492417358,null,0,0]
[68789.25,68.789249999999996,16.547061564801123,1.5103257892416138,1.0019349774190016,6.2158868193280627E-2,1,0,951.69643650013631,1.5697455713799746,8.0411227202775919,1.4461127795207434,1.072663416946642,0.37018927537643848,1.0000000023659803,6.8789249891497314E-5,1.0000000023659803,6.8789249891497314E-5,1.002248256533754,0.20592922427247953,-2.0896463214916867,-134.86158256839335,45.138417431606655,null,68789.25,4731960915.5625,null,22.907115467529774,-28.293920315359959,null,7.8445412709694606,-94.772728144034289,null,0,0]
[69183,69.183000000000007,16.641432083384483,1.5106691216344776,1.0019571707601886,6.2513742240952852E-2,1,0,957.14394551229202,1.5697515516734382,8.0864402987004489,1.4468151368072688,1.0734690907267679,0.37211844114764869,1.0000000023931437,6.9182999889623426E-5,1.0000000023931437,6.9182999889623426E-5,1.0022761144354557,0.20711922285382067,-2.1463755078612006,-135.06789610700071,44.932103892999294,null,69183,4786287489,null,22.899831594558968,-28.364553909459655,null,7.7950959575707586,-94.840248752339733,null,0,0]
[69586,69.585999999999999,16.738021568317752,1.5110165106000821,1.0019800161261914,6.2876936686428936E-2,1,0,962.71942778707592,1.5697576023743005,8.1328265647324969,1.4475258882530506,1.0742978221507518,0.37408992313299672,1.0000000024211055,6.958599988768329E-5,1.0000000024211055,6.958599988768329E-5,1.0023048398302268,0.20833737172446856,-2.2041650152585754,-135.27913822660963,44.720861773390368,null,69586,4842211396,null,22.892361504995691,-28.437135128185496,null,7.7447765397366535,-94.909137954235362,null,0,0]
[69989,69.989000000000004,16.834613050001245,1.5113599131991082,1.0020029936575463,6.3240114522550947E-2,1,0,968.29491009669994,1.5697635833947894,8.1792168926040905,1.4482285776667292,1.0751307226457649,0.37605835815711491,1.0000000024492299,6.9988999885720561E-5,1.0000000024492299,6.9988999885720561E-5,1.002333781596829,0.20955571861893832,-2.2616824625292908,-135.49045893774618,44.509541062253817,null,69989,4898460121,null,22.884875982749225,-28.509999696915351,null,7.6947446147124037,-94.977811051725368,null,0,0]
[70392,70.391999999999996,16.931206494260955,1.5116993975771706,1.0020261033451618,6.3603275654659785E-2,1,0,973.87039244056575,1.5697694959316806,8.2256112135920496,1.4489233407635225,1.0759677825300453,0.37802373805933387,1.0000000024775169,7.0391999883735092E-5,1.0000000024775169,7.0391999883735092E-5,1.0023629405914416,0.21077426453793188,-2.3189312782054912,-135.70185409005103,44.298145909948971,null,70392,4955033664,null,22.877374881242581,-28.583139440738297,null,7.6449969005428482,-95.046272012025369,null,0,0]
[70795,70.795000000000002,17.027801867697619,1.5120350303372374,1.002049345179894,6.3966419988122789E-2,1,0,979.44587481808878,1.5697753411544997,8.2720094605090964,1.4496103102447082,1.0768089921036614,0.37998605479870373,1.0000000025059659,7.0794999881726759E-5,1.0000000025059659,7.0794999881726759E-5,1.0023923176750555,0.21199301047958455,-2.3759148272507775,-135.91331962246645,44.086680377533554,null,70795,5011932025,null,22.869858062217254,-28.656546362727557,null,7.5955301705228919,-95.114524713815413,null,0,0]
[71207.25,71.207250000000002,17.12661634267138,1.5123744494548148,1.0020732572031259,6.4337882040233385E-2,1,0,985.14933046059025,1.569781252084079,8.3194766732407004,1.4503051189210261,1.0776737933588958,0.38199023461631509,1.0000000025352362,7.1207249879648533E-5,1.0000000025352362,7.1207249879648533E-5,1.0024225956043855,0.21323993811835026,-2.4339352851902021,-136.12970757126601,43.87029242873399,null,71207.25,5070472452.5625,null,22.862152312218548,-28.731906474343909,null,7.5452154625821732,-95.184132480042464,null,0,0]
[71619.5,71.619500000000002,17.225432768085323,1.5127099743475416,1.0020973074898805,6.4709326313452872E-2,1,0,990.85278613711569,1.5697870949657602,8.3669478567037938,1.4509920437150781,1.0785429163941582,0.38399119240107343,1.0000000025646762,7.1619499877546101E-5,1.0000000025646762,7.1619499877546101E-5,1.0024531035871647,0.21448707717198012,-2.4916850855537835,-136.34616084787021,43.653839152129791,null,71619.5,5129352780.25,null,22.854429847663397,-28.807529791399276,null,7.4951881267737432,-95.253530255455743,null,0,0]
[72031.75,72.031750000000002,17.324251110563885,1.5130416715777437,1.002121496030203,6.5080752706568032E-2,1,0,996.55624184708074,1.5697928709678906,8.4144229436940066,1.4516712174181996,1.0794163507700334,0.38598891993231849,1.0000000025942863,7.203174987541933E-5,1.0000000025942863,7.203174987541933E-5,1.0024838425606546,0.21573442870048815,-2.5491676336335849,-136.5626753808364,43.437324619163604,null,72031.75,5188573008.0625,null,22.846690545763909,-28.883408301442802,null,7.4454448805934303,-95.322721920328988,null,0,0]
[72444,72.444000000000003,17.423071337488061,1.5133696062010471,1.0021458228140827,6.545216111839515E-2,1,0,1002.2596975899149,1.5697985812322239,8.4619018685096989,1.4523427698703808,1.0802940860291657,0.38798340911904278,1.0000000026240665,7.2443999873268082E-5,1.0000000026240665,7.2443999873268082E-5,1.0025148134673736,0.21698199376100788,-2.6063862715354897,-136.77924718706689,43.220752812933114,null,72444,5248133136,null,22.83893429165715,-28.959534167028135,null,7.3959824967982799,-95.391711268441725,null,0,0]
[72865.75,72.865750000000006,17.524170721170229,1.513701270475539,1.0021708532392677,6.5832109652575382E-2,1,0,1008.0945853359979,1.5698043562213539,8.51047881497683,1.4530220434291325,1.0811964878242046,0.39002050040774477,1.0000000026547087,7.2865749871041768E-5,1.0000000026547087,7.2865749871041768E-5,1.0025467390762672,0.21825853011575558,-2.664653788860428,-137.00086493735037,42.999135062649628,null,72865.75,5309417523.0625,null,22.830981645905574,-29.037662274895478,null,7.345667625224916,-95.462084929747149,null,0,0]
[73287.5,73.287499999999994,17.625272010417405,1.5140291298304891,1.0021960283314888,6.6212039153040525E-2,1,0,1013.9294731153142,1.5698100647435074,8.5590596437112065,1.4536936062438954,1.0821033688105088,0.39205418566391392,1.0000000026855287,7.3287499868789541E-5,1.0000000026855287,7.3287499868789541E-5,1.0025789094435031,0.21953529218631052,-2.7226519730128649,-137.22253447100175,42.777465528998249,null,73287.5,5371057656.25,null,22.823011038673364,-29.116033216284308,null,7.2956400483046915,-95.532254608335876,null,0,0]
[73709.25,73.709249999999997,17.726375172624767,1.5143532492993816,1.0022213480798441,6.6591949511546136E-2,1,0,1019.7643609272935,1.5698157079396156,8.6076442889792517,1.4543575882703876,1.0830147177358955,0.39408445664289177,1.0000000027165268,7.3709249866511239E-5,1.0000000027165268,7.3709249866511239E-5,1.0026113255953348,0.22081228109511084,-2.7803842068910596,-137.44425179606139,42.555748203938606,null,73709.25,5433053535.5625,null,22.815022370984597,-29.194639138266872,null,7.2458964821152634,-95.602224100864987,null,0,0]
[74131,74.131,{"$f":"SQRT(1+(A525/pole1)^2)","v":17.827480175926535},{"$f":"ATAN(A525/pole1)","v":1.514673692443588},{"$f":"SQRT(1+(A525/Zero1)^2)","v":1.0022468124733706},{"$f":"ATAN(A525/Zero1)","v":6.6971840619880804E-2},{"$f":"IF(VIN_nom>Vout, 1, SQRT(1+(A525/z_RHP)^2))","v":1},{"$f":"IF(VIN_nom>Vout, 0, -ATAN(A525/z_RHP))","v":0},{"$f":"SQRT(1+(A525/Pole2)^2)","v":1025.5992487713784},{"$f":"ATAN(A525/Pole2)","v":1.5698212869246466},8.6562326865180381,1.4550141165735868,{"$f":"SQRT(1+(A525/pole4)^2)","v":1.0839305233306804},{"$f":"ATAN(A525/pole4)","v":0.39611130524026789},{"$f":"SQRT(1+(A525/Zero3)^2)","v":1.0000000027477025},{"$f":"ATAN(A525/Zero3)","v":7.4130999864206713E-5},{"$f":"SQRT(1+(A525/pole5)^2)","v":1.0000000027477025},{"$f":"ATAN(A525/pole5)","v":7.4130999864206713E-5},{"$f":"SQRT((1-(Z525/pterm2))^2+(A525/pterm1)^2)","v":1.0026439885637617},{"$f":"IF((ATAN((A525/pterm1)/(1-A525^2/pterm2))>0),ATAN((A525/pterm1)/(1-A525^2/pterm2)),PI()+ATAN((A525/pterm1)/(1-A525^2/pterm2)))","v":0.2220894979613611},{"$f":"20*LOG10(((E525*K525*G525*O525)/(C525*I525*S525*M525*Q525))*Adc)","v":-2.8378538105604139},{"$f":"((F525+L525+H525+R525)-(D525+J525+T525+N525+T525))*radconv","v":-137.6660130080266},{"$f":"IF(V525>0,V525,V525+180)","v":42.333986991973404},null,{"$f":"IF(U525<0,A525,1000000000)","v":74131},{"$f":"A525^2","v":5495405161},null,{"$f":"20*LOG10((K525/(I525*M525))*AEA)","v":22.807015551407019},{"$f":"(L525-(J525+N525))*radconv","v":-29.273472360090658},null,{"$f":"20*LOG10((E525*G525/(C525*S525))*Acs*Am)","v":7.1964336980234904},{"$f":"(F525+H525-(D525+T525))*radconv","v":-95.671997119458581},null,{"$f":"SUM((U526<0)*(U525>0))*A525","v":0},0]
[74562.75,{"$f":"A526/1000","v":74.562749999999994},17.930984327150458,1.5149979902756183,1.0022730304650171,6.7360719170197453E-2,1,0,1031.5724860931798,1.5698269328161873,8.7059769715764599,1.4556786204313736,1.0848726479885751,0.3981826585168094,1.0000000027798017,7.4562749861820216E-5,1.0000000027798017,7.4562749861820216E-5,1.0026776827427348,0.22339723586489085,-2.8964174175216355,-137.89307381326267,42.106926186737326,null,74562.75,5559603687.5625,null,22.798799993904989,-29.354402380045084,null,7.1460856485643003,-95.743224779525775,null,0,0]
[74994.5,74.994500000000002,18.034490342513536,1.5153185656320329,1.0022994000189904,6.7749577317259807E-2,1,0,1037.545723447485,1.5698325136999904,8.7557250572107996,1.4563355734497634,1.0858194192083666,0.40025040845362697,1.0000000028120875,7.4994499859405936E-5,1.0000000028120875,7.4994499859405936E-5,1.0027116377885785,0.22470521502726246,-2.9547126382413955,-138.12017260200574,41.879827397994262,null,74994.5,5624175030.25,null,22.790565242713082,-29.435554850401658,null,7.0960251790364435,-95.8142541495844,null,0,0]
[75426.25,75.426249999999996,18.137998190102174,1.5156354821753613,1.0023259211233282,6.8138414945083867E-2,1,0,1043.5189608337357,1.5698380306923934,8.8054768790049938,1.4569851030458152,1.0867708248461021,0.40231454680963397,1.0000000028445595,7.5426249856963684E-5,1.0000000028445595,7.5426249856963684E-5,1.0027458548271433,0.22601343663853343,-3.0127428396174132,-138.34730545618825,41.652694543811748,null,75426.25,5689119189.0625,null,22.782311222632568,-29.516922062482607,null,7.0462489977409435,-95.885088952059363,null,0,0]
[75858,75.858000000000004,18.241507838726548,1.5159488021261247,1.0023525937660007,6.8527231937722685E-2,1,0,1049.492198251387,1.5698434848843192,8.8552323739858512,1.4576273337982595,1.0877268527409774,0.40437506549560781,1.000000002877218,7.5857999854493337E-5,1.000000002877218,7.5857999854493337E-5,1.0027803349905744,0.22732190188512189,-3.070511325902014,-138.57446854457169,41.425531455428313,null,75858,5754436164,null,22.77403786565327,-29.59849647747939,null,6.9967538684356354,-95.955732826543979,null,0,0]
[76299.75,76.299750000000003,18.347416763739616,1.5162657199679943,1.0023800410196275,6.8925033056758275E-2,1,0,1055.6037851489875,1.569849001516568,8.9061440210195038,1.4582770122720969,1.0887097951096263,0.40647955431685151,1.0000000029108258,7.6299749851936466E-5,1.0000000029108258,7.6299749851936466E-5,1.0028158872925406,0.22866092661604867,-3.1293503242881733,-138.80692046814684,41.193079531853158,null,76299.75,5821651850.0625,null,22.76555280733422,-29.682167050218325,null,6.9463999283685283,-96.027819021957285,null,0,0]
[76741.5,76.741500000000002,18.453327510358349,1.5165790000141672,1.002407646886915,6.9322812328200881E-2,1,0,1061.7153720783438,1.5698544546376758,8.957059384442891,1.4589193049708646,1.0896975505247017,0.40858023720354031,1.0000000029446288,7.6741499849349834E-5,1.0000000029446288,7.6741499849349834E-5,1.0028517174672953,0.23000020889996711,-3.1879221475872526,-139.0393961973881,40.960603802611899,null,76741.5,5889257822.25,null,22.757047383924103,-29.766039093789978,null,6.8963335284795662,-96.09971279550453,null,0,0]
[77183.25,77.183250000000001,18.559240047397047,1.5168887044823505,1.0024354113547584,6.9720569627980802E-2,1,0,1067.8269590389102,1.5698598453381385,9.0079784012381001,1.4595543366078461,1.0906901059097691,0.41067710598108104,1.0000000029786269,7.7183249846733251E-5,1.0000000029786269,7.7183249846733251E-5,1.0028878267479209,0.23133974999567999,-3.246230140978116,-139.27189189703063,40.728108102969372,null,77183.25,5957254080.5625,null,22.748521544332043,-29.850105056760686,null,6.8465513746807662,-96.171417791230482,null,0,0]
[77625,77.625,18.665154344377324,1.517194894180828,1.0024633344099805,7.0118304832069836E-2,1,0,1073.9385460301542,1.5698651746836292,9.0589010097996088,1.4601822291158604,1.0916874481725205,0.41277015263869726,1.0000000030128202,7.7624999844086554E-5,1.0000000030128202,7.7624999844086554E-5,1.0029242163743808,0.23267955115790218,-3.3042775873156351,-139.50440381785754,40.495596182142464,null,77625,6025640625,null,22.739975244290225,-29.934357554969417,null,6.7970502283850633,-96.242937572189305,null,0,0]
[78077,78.076999999999998,18.773527979311918,1.5175046123951335,1.0024920695044184,7.052524575339994E-2,1,0,1080.1919412397285,1.5698705652661711,9.1110088391890685,1.4608174255430215,1.0927128730366471,0.41490780025058666,1.000000003048009,7.8076999841347075E-5,1.000000003048009,7.8076999841347075E-5,1.0029617418347632,0.2340507104457244,-3.3634055933638516,-139.74232371955472,40.257676280445281,null,78077,6096017929,null,22.731209425652029,-30.020750524506255,null,6.7466880409750445,-96.315928761719746,null,0,0]
[78529,78.528999999999996,18.881903394431838,1.5178107752935661,1.0025209706029261,7.0932163279182794E-2,1,0,1086.4453364803303,1.5698758937941539,{"$f":"SQRT(1+(A535/Zero2)^2)","v":9.1631203028281814},{"$f":"ATAN(A535/Zero2)","v":1.4614453973862922},1.093743281717118,0.4170414298681116,1.0000000030834018,7.8528999838575693E-5,1.0000000030834018,7.8528999838575693E-5,1.0029995634502427,0.23542214465330752,-3.4222675812715275,-139.98025292918985,40.019747070810155,null,78529,6166803841,null,22.722422113127685,-30.107323662625443,null,6.6966133655917135,-96.388733338863744,null,0,0]
[78981,78.980999999999995,18.990280559259137,1.5181134436885895,1.0025500376911467,7.1339057276691209E-2,1,0,1092.6987317514265,1.5698811613329717,9.2152353390627297,1.4620662667179838,1.0947786601415885,0.41917103343783302,1.0000000031189991,7.8980999835772219E-5,1.0000000031189991,7.8980999835772219E-5,1.00303768257145,0.23679385511129397,-3.4808668746954985,-140.2181876965318,39.7818123034682,null,78981,6237998361,null,22.71361327992695,-30.194069574713254,null,6.6468229053684755,-96.461354871763717,null,0,0]
[79433,79.433000000000007,19.098659444007168,1.5184126770148951,1.002579270754643,7.1745927613244526E-2,1,0,1098.9521270524965,1.569886368923769,9.2673538876211552,1.4626801528865101,1.0958189942231549,0.42129660308274614,1.0000000031548006,7.9432999832936476E-5,1.0000000031548006,7.9432999832936476E-5,1.0030761005565367,0.2381658431457338,-3.5392067352785253,-140.45612435666737,39.543875643332626,null,79433,6309601489,null,22.704782905722958,-30.280981030943295,null,6.5973134189894385,-96.533796849355738,null,0,0]
[79895.5,79.895499999999998,19.209557729788052,1.5187153664602984,1.0026093546931365,7.21622249535597E-2,1,0,1105.3507893103044,1.5698916364955984,9.3206867288729143,1.463301193025826,1.0968886103232469,0.42346736629024079,1.0000000031916454,7.9895499830001261E-5,1.0000000031916454,7.9895499830001261E-5,1.0031157217779001,0.2395699912855605,-3.5986366319844301,-140.69958653005116,39.300413469948836,null,79895.5,6383290920.25,null,22.69572508906213,-30.370075431899924,null,6.5469413389443663,-96.607739358765627,null,0,{"$f":"IF(AH538>0,W538,0)","v":0}]
[80358,80.358000000000004,19.320457755361261,1.5190145810392817,1.002639612376871,7.2578497239949233E-2,1,0,1111.7494515984297,1.5698968434325191,9.3740231241215994,1.4639151662009371,1.0979633851111601,0.42563388985532519,1.000000003228704,8.0357999827031866E-5,1.000000003228704,8.0357999827031866E-5,1.0031556588107791,0.24097443284203712,-3.6578016192499052,-140.94304318629202,39.056956813707984,null,80358,6457408164,null,22.686644695643913,-30.45932835233851,null,6.4968567450971033,-96.681501020014949,null,0,0]
[80820.5,80.820499999999996,19.431359490938402,1.5193103801947299,1.0026700437901173,7.2994744330422356E-2,1,0,1118.148113916352,1.5699019907754908,9.4273630130457686,1.4645221918993361,1.0990433034525653,0.42779616590740627,1.0000000032659766,8.0820499824028088E-5,1.0000000032659766,8.0820499824028088E-5,1.0031959131346053,0.24237916922067307,-3.7167049992289973,-141.1864906629732,38.813509337026801,null,80820.5,6531953220.25,null,22.677541723212869,-30.548732554820869,null,6.4470563375490544,-96.755085327595381,null,0,0]
[81283,81.283000000000001,19.542262907406805,1.5196028220225828,1.0027006489170578,7.3410966083040402E-2,1,0,1124.5467762635628,1.56990707954178,9.4807063366775761,1.4651223869400676,1.1001283502002726,0.42995418676559194,1.0000000033034631,8.1282999820989738E-5,1.0000000033034631,8.1282999820989738E-5,1.0032364862370298,0.24378420182181815,-3.7753500123653478,-141.42992538231181,38.570074617688192,null,81283,6606926089,null,22.668416175621001,-30.638280964311129,null,6.3975368720045722,-96.828495698525671,null,0,0]
[81756.25,81.756249999999994,19.655745789229979,1.5198986450894916,1.0027321452069378,7.3836835802988277E-2,1,0,1131.0941643059396,1.5699122269897441,9.535293027409967,1.4657295809457391,1.1012439097327189,0.43215795451307837,1.0000000033420422,8.1756249817844777E-5,1.0000000033420422,8.1756249817844777E-5,1.003278333929291,0.24522220002309456,-3.8350939983360099,-141.67900146290208,38.320998537097921,null,81756.25,6684084414.0625,null,22.659055162557372,-30.730052828546999,null,6.3471538990975382,-96.903435802132904,null,0,0]
[82229.5,82.229500000000002,19.769230371404621,1.520191071857609,1.0027638233459084,7.4262678693011383E-2,1,0,1137.6415523779417,1.5699173151882209,9.5898831936355116,1.4663298622977554,1.1023648067180889,0.43435725129172853,1.0000000033808454,8.2229499814663183E-5,1.0000000033808454,8.2229499814663183E-5,1.0033205185690179,0.24666051132706321,-3.8945741402638001,-141.92805686956214,38.071943130437859,null,82229.5,6761690670.25,null,22.64967053948083,-30.821961196272497,null,6.2970583802462885,-96.978200788857492,null,0,0]
[82702.75,82.702749999999995,19.882716624815448,1.5204801604325098,1.0027956833167357,7.4688494601213171E-2,1,0,1144.1889404790597,1.5699223451543394,9.6444767763377097,1.4669233479492185,1.1034910248914525,0.43655206948291192,1.0000000034198724,8.2702749811444754E-5,1.0000000034198724,8.2702749811444754E-5,1.0033630417767065,0.2480991372170214,-3.9537937186623444,-142.17708803101539,37.822911968984613,null,82702.75,6839744857.5625,null,22.640262328937872,-30.913998988330306,null,6.2472470123907051,-97.052794081593362,null,0,0]
[83176,83.176000000000002,19.996204521007716,1.5207659676029233,1.002827725102089,7.5114283375755514E-2,1,0,1150.7363286087968,1.5699273178820801,9.6990737178251667,1.4675101522392706,1.1046225479771545,0.43874240167158884,1.0000000034591234,8.3175999808189299E-5,1.0000000034591234,8.3175999808189299E-5,1.0034059051818354,0.24953807917046875,-4.0127559526371606,-142.42609145997497,37.57390854002503,null,83176,6918246976,null,22.630830559228421,-31.006159285670496,null,6.1977165481253369,-97.127219027449186,null,0,0]
[83660.5,83.660499999999999,20.112391900514073,1.5210552275345148,1.0028607169088468,7.5550165644645229E-2,1,0,1157.4393599086354,1.569932350539166,9.7549719469997207,1.4681041011449043,1.1057864479604897,0.44098014721859957,1.0000000034995395,8.3660499804817849E-5,1.0000000034995395,8.3660499804817849E-5,1.0034501416619248,0.25101155631050631,-4.0728565293321308,-142.68098186195743,37.319018138042566,null,83660.5,6999079260.25,null,22.621150208937991,-31.100630245717884,null,6.1472963217207974,-97.203242207759686,null,0,0]
[84145,84.144999999999996,20.22858094351907,1.5213411645839869,1.002893899239917,7.5986019152630938E-2,1,0,1164.1423912374514,1.5699373252410422,9.8108735782724441,1.4686912817019391,1.1069558735148284,0.44321317586799552,1.0000000035401904,8.414499980140711E-5,1.0000000035401904,8.414499980140711E-5,1.0034947381910539,0.25248536783463144,-4.1326940183375918,-142.93583606118537,37.06416393881463,null,84145,7080381025,null,22.611445243658292,-31.195215424659768,null,6.0971637979950364,-97.279095807624103,null,0,0]
[84629.5,84.629499999999993,20.344771621521961,1.5216238356359437,1.0029272720763889,7.6421843736978898E-2,1,0,1170.8454225947471,1.5699422429830809,9.8667785538181256,1.4692718085499916,1.1081308071465392,0.44544148031888808,1.0000000035810761,8.4629499797956879E-5,1.0000000035810761,8.4629499797956879E-5,1.0035396965468997,0.25395951530911609,-4.1922716832540701,-143.19065057606613,36.809349423933867,null,84629.5,7162152270.25,null,22.601715711107584,-31.28990789285043,null,6.0473156656292657,-97.354783185354904,null,0,0]
[85114,85.114000000000004,20.460963906669001,1.5219032962849759,1.0029608353992454,7.685763923502098E-2,1,0,1177.5484539800366,1.5699471047379898,9.9226868171113018,1.4698457937631544,1.1093112313538831,0.44766505348890379,1.0000000036221965,8.5113999794466912E-5,1.0000000036221965,8.5113999794466912E-5,1.0035850185169723,0.25543400029370417,-4.2515927264547191,-143.44542200855844,36.554577991441562,null,85114,7244392996,null,22.591961664414519,-31.384700878859338,null,5.9977486691216839,-97.430307624974418,null,0,0]
[85609.5,85.609499999999997,20.579795834276119,1.5221858378185167,1.0029953577403903,7.7303298701085044E-2,1,0,1184.4036698008813,1.5699520199556776,9.9798677544376879,1.4704261587144014,1.1105241164274839,0.44993420947959462,1.0000000036644932,8.5609499790856379E-5,1.0000000036644932,8.5609499790856379E-5,1.0036317474330461,0.25694231242740168,-4.3119984312459012,-143.70592970886807,36.294070291131931,null,85609.5,7328986490.25,null,22.581960869127244,-31.481743099238766,null,5.9473437596177749,-97.507381575415252,null,0,0]
[86105,86.105000000000004,20.698629385898744,1.522465135157987,1.0030300792750744,7.7748927401181653E-2,1,0,1191.2588856500113,1.569956878603163,10.037052014916865,1.4709999108116274,1.1117427071723665,0.45219840262472516,1.0000000037070356,8.6104999787203805E-5,1.0000000037070356,8.6104999787203805E-5,1.0036788604747273,0.25845098084942175,-4.3721423146022289,-143.96638541823106,36.033614581768944,null,86105,7414071025,null,22.571934562760486,-31.578876616905422,null,5.8972261826282093,-97.584291823804989,null,0,0]
[86600.5,86.600499999999997,20.817464533725492,1.5227412438172494,1.0030649999826118,7.8194525161524697E-2,1,0,1198.1141015269407,1.5699616816514741,10.094239542071463,1.4715671620664845,1.1129669848470629,0.454457626048897,1.0000000037498233,8.6600499783508948E-5,1.0000000037498233,8.6600499783508948E-5,1.0037263595859176,0.25996000720672313,-4.4320276126921039,-144.22678575995178,35.773214240048219,null,86600.5,7499646600.25,null,22.561882818366406,-31.676094675768848,null,5.8473926289324121,-97.661041655174671,null,0,0]
[87096,87.096000000000004,20.93630125057604,1.5230142180517274,1.0031001198422016,7.8640091808401286E-2,1,0,1204.9693174311953,1.5699664300495422,10.151430280693573,1.4721280219833885,1.1141969307052073,0.45671187310978595,1.0000000037928565,8.7095999779771563E-5,1.0000000037928565,8.7095999779771563E-5,1.0037742467212378,0.26146939313894407,-4.4916575008972206,-144.48712744013051,35.512872559869493,null,87096,7585713216,null,22.551805714040491,-31.77339067548084,null,5.7978398450532058,-97.737634282028438,null,0,0]
[87603.25,87.603250000000003,21.057957590040221,1.5232904740016393,1.0031362787838718,7.9096191954453832E-2,1,0,1211.9870939825942,1.5699712354070201,10.2099804776252,1.4726956730988991,1.1154618946061428,0.45901441461574743,1.0000000038371646,8.7603249775901264E-5,1.0000000038371646,8.7603249775901264E-5,1.0038236734115915,0.26301494594516223,-4.5524401039893387,-144.75357859335719,35.24642140664281,null,87603.25,7674329410.5625,null,22.54146346460027,-31.873067899587909,null,5.747399491401314,-97.815883621519987,null,0,0]
[88110.5,88.110500000000002,21.179615518129534,1.5235635562860175,1.0031726463902484,7.9552259125752145E-2,1,0,1219.0048705616575,1.5699759854358837,10.26853392697781,1.4732568506493482,1.1167327589325768,0.46131172760129324,1.00000000388173,8.8110499771985889E-5,1.00000000388173,8.8110499771985889E-5,1.003873510926816,0.26456087903569636,-4.6129615857934709,-145.01996154133744,34.980038458662563,null,88110.5,7763460210.25,null,22.531094819185753,-31.97281328940247,null,5.6972466550116954,-97.893974801371229,null,0,0]
[88617.75,88.617750000000001,21.301275007624643,1.5238335192417252,1.0032092226386378,8.0008293136171318E-2,1,0,1226.0226471679102,1.5699806810862389,10.327090573428809,1.4738116643974262,1.1180095035631057,0.46360380568912013,1.0000000039265529,8.861774976802514E-5,1.0000000039265529,8.861774976802514E-5,1.0039237613987466,0.26610719414547873,-4.6732251643968983,-145.2862730069227,34.713726993077302,null,88617.75,7853105615.0625,null,22.520699876714691,-32.072620245030144,null,5.6473780188793343,-97.971911044923601,null,0,0]
[89125,89.125,21.422936031924177,1.5241004159731508,1.0032460075062204,8.0464293799668588E-2,1,0,1233.040423800888,1.5699853232865619,10.385650362900307,1.4743602216460978,1.1192921083752432,0.46589064275097136,1.0000000039716328,8.9124999764018814E-5,1.0000000039716328,8.9124999764018814E-5,1.0039744269709456,0.26765389300120024,-4.7332339973065061,-145.5525097953612,34.447490204638797,null,89125,7943265625,null,22.510278740798139,-32.172482320538407,null,5.5977903218862775,-98.049695504426012,null,0,0]
[89644,89.644000000000005,21.547416788250374,1.5243703756779341,1.003283860362848,8.0930822608868455E-2,1,0,1240.2207610829114,1.5699900186441749,10.44556983631457,1.4749151195827024,1.1206104679843483,0.4682250217113833,1.0000000040180232,8.9643999759872201E-5,1.0000000040180232,8.9643999759872201E-5,1.0040266980493733,0.26923681875006517,-4.7943724478360137,-145.8248331850447,34.175166814955304,null,89644,8036046736,null,22.499589210626457,-32.274708097217513,null,5.5473414015284517,-98.129127889143575,null,0,0]
[90163,90.162999999999997,21.671899096874707,1.5246372341317926,1.0033219315668305,8.139731611457994E-2,1,0,1247.4010983919623,1.5699946599465984,10.505492489352292,1.4754636874823794,1.1219349197934749,0.47055390183721146,1.0000000040646833,9.0162999755677301E-5,1.0000000040646833,9.0162999755677301E-5,1.0040794082592266,0.27082014985950997,-4.855250713601551,-146.0970718870326,33.902928112967402,null,90163,8129366569,null,22.488872493119558,-32.376978401148691,null,5.4971798532698148,-98.208407833463085,null,0,0]
[90682,90.682000000000002,21.796382931200974,1.5249010444321234,1.003360221093313,8.18637741178002E-2,1,0,1254.5814357275767,1.5699992481219534,10.565418267912973,1.4760060327217497,1.1232654422525292,0.4728772773621554,1.0000000041116126,9.0681999751433828E-5,1.0000000041116126,9.0681999751433828E-5,1.004132559934545,0.27240388815189426,-4.9158719890730342,-146.36922273437631,33.630777265623692,null,90682,8223225124,null,22.478128713267456,-32.479286802897448,null,5.4473023576504325,-98.287538495456786,null,0,0]
[91201,91.200999999999993,21.920868265236788,1.5251618584719147,1.0033987289173021,8.2330196419618501E-2,1,0,1261.7617730893012,1.5700037840772338,10.625347119113806,1.4765422602697722,1.1246020138148594,0.47519514278485314,1.0000000041588111,9.1200999747141498E-5,1.0000000041588111,9.1200999747141498E-5,1.0041861554221667,0.27398803544031963,-4.9762394084855259,-146.64128264197154,33.358717358028457,null,91201,8317622401,null,22.467358000388103,-32.581627024947579,null,5.3977056511172936,-98.366522963653736,null,0,0]
[91732,91.731999999999999,22.04823339852269,1.5254256548090643,1.0034383529962607,8.2807365895618795E-2,1,0,1269.1081298385509,1.5700083717893558,10.686664734608351,1.4770846616615494,1.1259757268148507,0.47756089233298682,1.0000000042073798,9.1731999742699087E-5,1.0000000042073798,9.1731999742699087E-5,1.0042414518960709,0.27560923558307171,-5.0377430853247072,-146.91953570024904,33.080464299750957,null,91732,8414759824,null,22.456310518576302,-32.686360035551651,null,5.3472494560899131,-98.447185509354014,null,0,0]
[92263,92.263000000000005,22.175600048487695,1.5256864209097034,1.0034782055307352,8.3284497579251854E-2,1,0,1276.4544866142041,1.5700129066943149,10.74798545823797,1.4776208740598173,1.127355726264615,0.47992086322054239,1.0000000042562305,9.2262999738204932E-5,1.0000000042562305,9.2262999738204932E-5,1.0042972179536478,0.27723086766341276,-5.0989874820465815,-147.1976872852259,32.802312714774104,null,92263,8512461169,null,22.445235130817114,-32.791113530873332,null,5.297080447127227,-98.527701348835123,null,0,0]
[92794,92.793999999999997,22.302968189147691,1.5259442086534276,1.0035182864935082,8.3761591257790702E-2,1,0,1283.8008434158078,1.5700173896986542,10.80930923710573,1.478151002488465,1.1287419891067205,0.48227505040321728,1.0000000043053632,9.2793999733658763E-5,1.0000000043053632,9.2793999733658763E-5,1.0043534561498191,0.27885293359267188,-5.1599757688862811,-147.47573434609274,32.524265653907264,null,92794,8610726436,null,22.434131988473169,-32.895881256410867,null,5.2471953026314742,-98.608073576278443,null,0,0]
[93325,93.325000000000003,22.430337795108443,1.5261990687430536,1.00355859585721,8.423864671861149E-2,1,0,1291.1472002429186,1.5700218216882842,10.870636019505715,1.4786751496152652,1.1301344922924734,0.48462344911783667,1.0000000043547776,9.332499972906024E-5,1.0000000043547776,9.332499972906024E-5,1.0044101690534684,0.28047543527177893,-5.2207110562079206,-147.75367391333907,32.246326086660929,null,93325,8709555625,null,22.423001246863102,-33.000657107583315,null,5.1975907569198956,-98.688305217839016,null,0,0]
[93868.5,93.868499999999997,22.560707235504083,1.5264569482398316,1.0036000906235636,8.4726892498953765E-2,1,0,1298.6664939327895,1.5700263060825013,10.93340952206206,1.4792055460100761,1.131566214063088,0.48702113114237994,1.0000000044056476,9.3868499724298972E-5,1.0000000044056476,9.3868499724298972E-5,1.0044687113037374,0.28213658466513014,-5.2826172637066886,-148.03804197896864,31.961958021031364,null,93868.5,8811295292.25,null,22.411580066752592,-33.107901630297256,null,5.1471057295316456,-98.7702830515221,null,0,0]
[94412,94.412000000000006,22.691078158988109,1.5267118644752422,1.0036418246122474,8.5215097790656863E-2,1,0,1306.1857876484751,1.5700307388462726,10.996186065291045,1.4797298865508486,1.1330044246085722,0.48941273975881205,1.0000000044568129,9.4411999719482261E-5,1.0000000044568129,9.4411999719482261E-5,1.0045277563648314,0.28379819456152494,-5.3442648278138645,-148.32229138783705,31.677708612162945,null,94412,8913625744,null,22.400130313868871,-33.215142189030303,null,5.0969079183081902,-98.852119807544042,null,0,0]
[94955.5,94.955500000000001,22.821450540143424,1.5269638682006472,1.0036837977934197,8.570326236606407E-2,1,0,1313.705081389533,1.5700351208661545,11.058965597411273,1.4802482740803926,1.1344490992502754,0.49179827075910981,1.0000000045082735,9.4955499714609754E-5,1.0000000045082735,9.4955499714609754E-5,1.0045873070366926,0.28546026696505439,-5.4056568981740494,-148.60641920771391,31.393580792286087,null,94955.5,9016546980.25,null,22.388652166476191,-33.322372701017393,null,5.0469939953406833,-98.93381852161346,null,0,0]
[95499,95.498999999999995,22.951824354130167,1.5272130090157703,1.0037260101370737,8.6191385997634165E-2,1,0,1321.2243751555295,1.5700394530085204,11.12174806780807,1.4807608091322844,1.1359002133244576,0.49417772023329737,1.0000000045600295,9.5498999709681167E-5,1.0000000045600295,9.5498999709681167E-5,1.0046473661345146,0.2871228038681094,-5.4667965648379644,-148.89042258726707,31.109577412732932,null,95499,9120059001,null,22.37714580642124,-33.429587231723389,null,4.9973606887317148,-99.015382162777897,null,0,0]
[96611.5,96.611500000000007,23.218693243383466,1.5277142549200435,1.0038131610245327,8.7190406469833268E-2,1,0,1336.6157539153758,1.5700481685524392,11.250267600064321,1.4817920871374324,1.1388905020583304,0.49902927899583549,1.0000000046668909,9.6611499699416435E-5,1.0000000046668909,9.6611499699416435E-5,1.0047718995870845,0.29052733759772226,-5.5911700534902762,-149.47135462015535,30.528645379844647,null,96611.5,9333781932.25,null,22.353506034101699,-33.648972559810275,null,4.8966269723989422,-99.181927194993861,null,0,0]
[97724,97.724000000000004,23.485567833697107,1.5282041092856231,1.0039013135850614,8.8189252490829581E-2,1,0,1352.0071327744404,1.5700566856591831,11.378798827077024,1.4828000682296913,1.1419074568032208,0.5038553149181213,1.00000000477499,9.7723999688912583E-5,1.00000000477499,9.7723999688912583E-5,1.0048985996296496,0.29393384263825845,-5.7145239126211766,-150.05173095100733,29.948269048992671,null,97724,9549980176,null,22.329750464116277,-33.86821898204095,null,4.7970286832534716,-99.347942483233567,null,0,0]
[98862,98.861999999999995,23.758565247732914,1.528693805547144,1.0039925228217932,8.9210810884676472E-2,1,0,1367.7513028885398,1.5700651996616384,11.510287854587885,1.4838078611334378,1.1450209343036388,0.50876553995218643,1.0000000048868474,9.8861999677917663E-5,1.0000000048868474,9.8861999677917663E-5,1.005030471252867,0.29742048630036527,-5.8396756048452243,-150.64481293394388,29.355187066056118,null,98862,9773695044,null,22.305332328048003,-34.092299689607962,null,4.696295127097696,-99.517238994466666,null,0,0]
[100000,100,24.031568229686087,1.5291723758442333,1.0040847796156116,9.0232182619655057E-2,1,0,1383.4954730995282,1.5700735198855003,11.641788308400123,1.4847928878596239,1.1481618685034529,0.5136490171778203,1.000000005,9.9999999666666668E-5,1.000000005,9.9999999666666668E-5,1.00516466258242,0.30090922762888239,-5.9638108890213459,-151.23726928236454,28.762730717635463,null,100000,10000000000,null,22.280796633534727,-34.316141163834665,null,4.5966955374348482,-99.686028917091747,null,0,0]
[101165,101.16500000000001,24.311054007086899,1.5296511666763959,1.0041803101105897,9.127759172647415E-2,1,0,1399.6131869889236,1.5700818436117019,11.776420156781796,1.485778496654957,1.1514055309547819,0.51862063811680525,1.0000000051171785,1.0116499965488042E-4,1.0000000051171785,1.0116499965488042E-4,1.0053044688799049,0.30448293325259773,-6.0898636892429883,-151.84311278396399,28.156887216036012,null,101165,10234357225,null,22.255559011523136,-34.544999751396496,null,4.4958803592247962,-99.858322331016879,null,0,0]
[102330,102.33,24.590545230886448,1.5301190739319315,1.0042769378448604,9.2322800804766847E-2,1,0,1415.7309009730825,1.5700899778111543,11.911063186449846,1.4867418236634284,1.1546774924116845,0.52356420492197264,1.0000000052357143,1.0232999964281957E-4,1.0000000052357143,1.0232999964281957E-4,1.0054467639656244,0.30805887374044744,-6.2149014429158758,-152.4482586697103,27.551741330289701,null,102330,10471428900,null,22.230202246529277,-34.773516748756641,null,4.3961993705457703,-100.03013167100774,null,0,0]
[103520,103.52,24.876039552514968,1.5305861669385219,1.0043767716171421,9.3390230434940533E-2,1,0,1432.1944887423974,1.5700980975466245,12.04860670551899,1.4877035936854075,1.1580486346392249,0.5285848903509115,1.0000000053581952,1.0351999963021309E-4,1.0000000053581952,1.0351999963021309E-4,1.0055947129094644,0.31171387724189759,-6.3415993653349396,-153.06565023189034,26.934349768109655,null,103520,10716390400,null,22.204180536979109,-35.006540697815517,null,4.2955231576768718,-100.20515119112791,null,0,0]
[104710,104.71,25.161539178332124,1.5310426601444997,1.0044777495541193,9.4457446668202202E-2,1,0,1448.6580766039908,1.5701060327251173,12.186161117978676,1.4886436521101138,1.1614487982405628,0.53357630468350503,1.0000000054820919,1.0470999961731343E-4,1.0000000054820919,1.0470999961731343E-4,1.005745321502624,0.31537125035256519,-6.4672877804691753,-153.68227453245967,26.317725467540328,null,104710,10964184100,null,22.178039009218185,-35.239120945145935,null,4.1959762703035599,-100.37971138275844,null,0,0]
[105930,105.93,25.454241593319118,1.5315000307655304,1.0045824605871687,9.5551343500881292E-2,1,0,1465.5367129916117,1.570113982866741,12.327194215770126,1.4895856291240077,1.1649645422611292,0.53866317484190729,1.0000000056105824,1.0592999960378067E-4,1.0000000056105824,1.0592999960378067E-4,1.0059025218302671,0.31912330564859981,-6.5951215614237402,-154.31362862605351,25.686371373946486,null,105930,11221164900,null,22.151116492264002,-35.477061338692423,null,4.0950650063031802,-100.558218050448,null,0,0]
[107150,107.15,25.746949211957038,1.5319470021207502,1.0046883734625092,9.6645011007807008E-2,1,0,1482.4153494697516,1.5701217519692923,12.468238004278616,1.4905062951861139,1.168510249343254,0.54371930415576797,1.0000000057405611,1.0714999958993258E-4,1.0000000057405611,1.0714999958993258E-4,1.0060625867136315,0.32287789092697106,-6.721943673602226,-154.94413927379267,25.055860726207328,null,107150,11481122500,null,22.124073005571816,-35.714451066407442,null,3.9952863808168795,-100.73628698080401,null,0,0]
[108400,108.4,26.046859772637205,1.5323945450126977,1.0047981368912786,9.7765331464656324E-2,1,0,1499.7090344765688,1.5701295307357184,12.612760795909955,1.4914282431211114,1.1721739389157,0.54886790316804368,1.00000000587528,1.0839999957541311E-4,1.00000000587528,1.0839999957541311E-4,1.0062295958744516,0.32672744646854113,-6.8508597452541231,-155.58926186954119,24.41073813045881,null,108400,11750560000,null,22.096241716014205,-35.95706602537318,null,3.8942015987225909,-100.91830295152519,null,0,0]
[109650,109.65,26.346775431589833,1.5328318988787049,1.0049091611837773,9.888540577676562E-2,1,0,1517.0027195720631,1.5701371321477671,12.757294065329512,1.4923293014606998,1.17586850645593,0.55398428340184847,1.0000000060115612,1.0964999956055487E-4,1.0000000060115612,1.0964999956055487E-4,1.0063996881647883,0.3305796988999839,-6.9787629812009113,-156.23346454494256,23.766535455057436,null,109650,12023122500,null,22.068288880860493,-36.199021708306091,null,3.7942511979295195,-101.09990375752443,null,0,0]
[110925,110.925,26.652694477473574,1.5332678596301688,1.0050237044705648,0.10002762516731908,1,0,1534.6422784577135,1.5701447090955767,12.904728429250364,1.4932275869240712,1.1796684749454911,0.55916983695316214,1.0000000061521777,1.1092499954504645E-4,1.0000000061521777,1.1092499954504645E-4,1.0065763990451821,0.33451179562429545,-7.1082052301015439,-156.88958744240162,23.11041255759838,null,110925,12304355625,null,22.039654660149544,-36.445098202798548,null,3.6934431697398362,-101.2847306654114,null,0,0]
[112200,112.2,26.958618474047807,1.5336939259736846,1.0051395586768963,0.1011695827389079,1,0,1552.2818374294654,1.5701521138400996,13.052172970961527,1.4941055780269694,1.1834999604836471,0.56432195267925811,1.0000000062944199,1.1219999952917739E-4,1.0000000062944199,1.1219999952917739E-4,1.0067564001313996,0.33844674015392545,-7.2366421796234661,-157.54472183603673,22.455278163963271,null,112200,12588840000,null,22.010899848270057,-36.690411765710572,null,3.5937610320973974,-101.46916883382903,null,0,0]
[113510,113.51,27.272945365553287,1.5341217325128,1.0052599581108503,0.10234261243220689,1,0,1570.4056196753074,1.5701595485924678,13.203675252224716,1.4949872463990803,1.1874691300593696,0.56958072594074682,1.0000000064422601,1.1350999951249271E-4,1.0000000064422601,1.1350999951249271E-4,1.0069448138400079,0.34249269052072173,-7.3675820504552112,-158.21679601465786,21.783203985342141,null,113510,12884520100,null,21.981233216198859,-36.941627382577479,null,3.4924877933368528,-101.65828657265182,null,0,0]
[114820,114.82,27.587277134765731,1.5345397901991937,1.0053817404487524,0.10351535955966211,1,0,1588.5294020059735,1.5701668136963132,13.355187564351427,1.4958489106754886,1.1914709194104287,0.57480431760650363,1.0000000065918162,1.1481999949541845E-4,1.0000000065918162,1.1481999949541845E-4,1.007136791948946,0.34654169073032243,-7.4975091640361491,-158.88779797439418,21.112202025605825,null,114820,13183632400,null,21.951445659971291,-37.191963672603769,null,3.3923482359834809,-101.84703667630929,null,0,0]
[116155,116.155,27.90761244944418,1.5349561372971405,1.0055072690995261,0.10471019341852307,1,0,1606.9990581295365,1.5701740488542348,13.509601303225066,1.4967071340910283,1.1955822991324305,0.58009147319008669,1.000000006745992,1.1615499947761287E-4,1.000000006745992,1.1615499947761287E-4,1.00733614938661,0.35067112174585441,-7.6288978863750492,-159.57048908245486,20.429510917545144,null,116155,13491984025,null,21.920968582382876,-37.446137337885858,null,3.2914365912329928,-102.03903163970189,null,0,0]
[117490,117.49,28.227952491967923,1.5353630347780574,1.0056342328810148,0.10590472728098294,1,0,1625.4687143353101,1.5701811195908078,13.664024767661237,1.4975459597532075,1.1997268705710804,0.58534224474168817,1.0000000069019499,1.1748999945939327E-4,1.0000000069019499,1.1748999945939327E-4,1.0075393073934036,0.3548037643764585,-7.7592825493426929,-160.25204131712226,19.747958682877737,null,117490,13803900100,null,21.890372705614567,-37.699328340442825,null,3.1916478050336616,-102.23068638043696,null,0,0]
[118860,118.86,28.556695711105686,1.5357711088786834,1.0057660167925877,0.1071302631581862,1,0,1644.4225938200568,1.5701882105689384,13.822506556864711,1.4983872904555995,1.2040142501044633,0.5906929416540726,1.0000000070638497,1.1885999944026054E-4,1.0000000070638497,1.1885999944026054E-4,1.0077517961074431,0.35904811505650286,-7.8920654922171227,-160.95026640970312,19.049733590296881,null,118860,14127699600,null,21.85885476059704,-37.958102275969495,null,3.0903828071767574,-102.4270326516902,null,0,0]
[120230,120.23,{"$f":"SQRT(1+(A589/pole1)^2)","v":28.885443577390166},{"$f":"ATAN(A589/pole1)","v":1.5361698943873918},{"$f":"SQRT(1+(A589/Zero1)^2)","v":1.005899310905414},{"$f":"ATAN(A589/Zero1)","v":0.10835547607782485},{"$f":"IF(VIN_nom>Vout, 1, SQRT(1+(A589/z_RHP)^2))","v":1},{"$f":"IF(VIN_nom>Vout, 0, -ATAN(A589/z_RHP))","v":0},{"$f":"SQRT(1+(A589/Pole2)^2)","v":1663.376473385604},{"$f":"ATAN(A589/Pole2)","v":1.570195139946196},13.980997908335334,1.499209546747307,{"$f":"SQRT(1+(A589/pole4)^2)","v":1.208335855324302},{"$f":"ATAN(A589/pole4)","v":0.59600551629866449},{"$f":"SQRT(1+(A589/Zero3)^2)","v":1.0000000072276265},{"$f":"ATAN(A589/Zero3)","v":1.2022999942068166E-4},{"$f":"SQRT(1+(A589/pole5)^2)","v":1.0000000072276265},{"$f":"ATAN(A589/pole5)","v":1.2022999942068166E-4},{"$f":"SQRT((1-(Z589/pterm2))^2+(A589/pterm1)^2)","v":1.0079683959519832},{"$f":"IF((ATAN((A589/pterm1)/(1-A589^2/pterm2))>0),ATAN((A589/pterm1)/(1-A589^2/pterm2)),PI()+ATAN((A589/pterm1)/(1-A589^2/pterm2)))","v":0.36329589334742429},{"$f":"20*LOG10(((E589*K589*G589*O589)/(C589*I589*S589*M589*Q589))*Adc)","v":-8.0238386397964678},{"$f":"((F589+L589+H589+R589)-(D589+J589+T589+N589+T589))*radconv","v":-161.64726996367867},{"$f":"IF(V589>0,V589,V589+180)","v":18.352730036321333},null,{"$f":"IF(U589<0,A589,1000000000)","v":120230},{"$f":"A589^2","v":14455252900},null,{"$f":"20*LOG10((K589/(I589*M589))*AEA)","v":21.827218983810166},{"$f":"(L589-(J589+N589))*radconv","v":-38.215775590625867},null,{"$f":"20*LOG10((E589*G589/(C589*S589))*Acs*Am)","v":2.9902454363842867},{"$f":"(F589+H589-(D589+T589))*radconv","v":-102.62306161757107},null,{"$f":"SUM((U590<0)*(U589>0))*A589","v":0},0]
[126030,{"$f":"A590/1000","v":126.03},30.277270863555422,1.537762243149158,1.0064803383837961,0.11353884943691946,1,0,1743.6191760304307,1.5702228070329165,14.65208198296164,1.5024935443240528,1.2270024892911542,0.61807701754167266,1.0000000079417803,1.2602999933273163E-4,1.0000000079417803,1.2602999933273163E-4,1.0089322297824117,0.38131765781741062,-8.5710321281996951,-164.58435905994602,15.415640940053976,null,126030,15883560900,null,21.69206510392516,-39.293805466821595,null,2.5782058278660687,-103.44988210847031,null,0,0]
[131830,131.83000000000001,31.669168171942733,1.5392146241146714,1.0070883757051208,0.11871610275525658,1,0,1823.8618798925002,1.5702480396350367,15.323310233339908,1.5054898648792676,1.2462487861342586,0.63947696341260896,1.0000000086895744,1.3182999923630226E-4,1.0000000086895744,1.3182999923630226E-4,1.0099751174839147,0.3994027892603681,-9.1020857475681201,-167.49890646989917,12.501093530100832,null,131830,17379148900,null,21.555137906710687,-40.349701247966692,null,2.18407940571212,-104.2726643479895,null,0,0]
[144540,144.54,34.719546843447162,1.5419901238379743,1.008515021259428,0.13003873067160163,1,0,1999.7040844824928,1.5702962527842272,16.79464562383815,1.5112183006973579,1.2903238146223575,0.68408240458295133,1.0000000104459057,1.4453999899343253E-4,1.0000000104459057,1.4453999899343253E-4,1.0125593081982875,0.43926201475595583,-10.215723781832232,-173.80624540321611,6.1937545967838901,null,144540,20891811600,null,21.250147871788776,-42.579951987272345,null,1.3754314063699176,-106.06671537317835,null,0,0]
[158490,158.49,38.067779557944519,1.544524370383817,1.010229228206426,0.14242742039776154,1,0,2192.7016305562947,1.57034026837786,18.410053960700566,1.5164514346139875,1.3414466894548263,0.72956587065306278,1.0000000125595401,1.5848999867295902E-4,1.0000000125595401,1.5848999867295902E-4,1.0159181830958206,0.48337954998271609,-11.369493710523304,-180.60502133736375,-0.60502133736375185,null,158490,25119080100,null,20.910061990547799,-44.888648054052567,null,0.56174735891981564,-108.02984594275098,null,0,0]
[173780,173.78,41.737868244476509,1.5468349761191382,1.0122855526243728,0.15595562379315411,1,0,2404.2380130715169,1.5703803945854413,20.181116102316391,1.5212247535882468,1.4004200296332987,0.77549944149011152,1.0000000150997441,1.7377999825064433E-4,1.0000000150997441,1.7377999825064433E-4,1.0203111360405823,0.53218594550812026,-12.56461767424419,-187.91483302255315,-7.9148330225531538,null,173780,30199488400,null,20.534208069202467,-47.249255834525542,null,-0.25752268345573354,-110.18352541986586,null,0,0]
[190550,190.55,45.763417377748198,1.5489430724738613,1.0147530159375706,0.17072723359876923,1,0,2636.2501250001837,1.5704170001086697,22.124048698085748,1.5255812385001049,1.4682086979934594,0.82152955583775167,1.0000000181546511,1.9054999769375417E-4,1.0000000181546511,1.9054999769375417E-4,1.0261024648930765,0.58625405463607716,-13.804781356922762,-195.77387565101935,-15.773875651019353,null,190550,36309302500,null,20.121823909210388,-49.639076262906627,null,-1.0853022061422282,-112.55583400731804,null,0,0]
[208930,208.93,50.175632748999291,1.5508650143666638,1.0177103646618211,0.18683080078129807,1,0,2890.5365098448474,1.5704503702513477,24.253913399841892,1.5295541764828311,1.5457454068857088,0.86723550101628744,1.0000000218258722,2.0892999695994706E-4,1.0000000218258722,2.0892999695994706E-4,1.033783855734419,0.64613093996440529,-15.092268941673954,-204.21469807499184,-24.214698074991844,null,208930,43651744900,null,19.673327885868634,-52.032113412687252,null,-1.92429376755167,-115.1739795542744,null,0,0]
[229090,229.09,55.015323745590358,1.552618571838049,1.0212557152498338,0.20438158336976187,1,0,3169.4491091406248,1.5704808145458728,26.590409855375462,1.5331799125758465,1.6341302469965175,0.91227717005727704,1.0000000262411137,2.2908999599228225E-4,1.0000000262411137,2.2908999599228225E-4,1.0440419442896025,0.71248050275505248,-16.431859588592683,-213.28623100825837,-33.286231008258369,null,229090,52482228100,null,19.189111512359201,-54.406815907503031,null,-2.7796680409609604,-118.07041515079973,null,0,0]
[251190,251.19,60.320900656331169,1.5542175655395338,1.0255009848407959,0.22347529858145737,1,0,3475.2015149458798,1.5705085736935298,29.152081886406489,1.5364867285210331,1.7344178996253681,0.95628133165053519,1.0000000315482076,2.5118999471693726E-4,1.0000000315482076,2.5118999471693726E-4,1.0578023154725735,0.78588583190774441,-17.827617063951923,-223.02759880990251,-43.027598809902514,null,251190,63096416100,null,18.670736621147249,-56.740192535192534,null,-3.6570506251082522,-121.27385700238625,null,0,0]
[275420,275.42,66.137976983194349,1.5556758445627139,1.0305812543734099,0.24422006759934556,1,0,3810.422367852334,1.570533888693568,{"$f":"SQRT(1+(A599/Zero2)^2)","v":31.960952887554932},{"$f":"ATAN(A599/Zero2)","v":1.5395030410850157},1.8477872129693416,0.99894726064443984,1.0000000379280876,2.7541999303589765E-4,1.0000000379280876,2.7541999303589765E-4,1.0763299734345941,0.86692167465414249,-19.28599797174008,-233.48040574760373,-53.480405747603726,null,275420,75856176400,null,18.119912786389808,-59.013398661197712,null,-4.5646076981389641,-124.81183430676535,null,0,0]
[302000,302,72.519369849030809,1.5570064704276747,1.0366589727379643,0.26673216040563941,1,0,4178.1553569921316,1.5705569867215616,35.042526676233486,1.5422556971936201,1.9755509302452361,1.0400375057236853,1.0000000456019988,3.0199999081879784E-4,1.0000000456019988,3.0199999081879784E-4,1.1013396053279692,0.95606673906994455,-20.815944192304098,-244.67845155421139,-64.678451554211392,null,302000,91204000000,null,17.538471870109731,-61.211304127953326,null,-5.5131130024229078,-128.70586160702797,null,0,0]
[331130,331.13,79.513095753982938,1.558219450571263,1.043915599906869,0.2910891992527736,1,0,4581.1674725016419,1.5705780418241018,38.419990462553422,1.5447652702310515,2.1189147588578972,1.0793067114902246,1.000000054823537,3.3112998789752197E-4,1.000000054823537,3.3112998789752197E-4,1.1350624088940975,1.0534118313420093,-22.426117144809027,-256.61302972478603,-76.613029724786031,null,331130,109647076900,null,16.929371879089711,-63.318682310702982,null,-6.514185963907817,-132.95726767087061,null,0,0]
[363080,363.08,87.183978083319005,1.5593260779018125,1.0525763051447921,0.31740062345286579,1,0,5023.1941510843071,1.5705972502757481,42.124649247399198,1.5470550264967995,2.2794156066124929,1.1166348596776581,1.0000000659135411,3.630799840454084E-4,1.0000000659135411,3.630799840454084E-4,1.1804583320679616,1.1588095944239905,-24.129627555785159,-269.25341718586844,-89.253417185868443,null,363080,131827086400,null,16.294676231179789,-65.327334854246359,null,-7.5830007269740305,-137.55198618672878,null,0,{"$f":"IF(AH602>0,W602,0)","v":0}]
[398110,398.11,95.594440331871255,1.5603352765948046,1.062894669526669,0.34573389913265068,1,0,5507.8324799529892,1.5706147671688306,46.18665059786678,1.5491433570909146,2.4585363998862064,1.1519069955233334,1.0000000792457828,3.9810997896764209E-4,1.0000000792457828,3.9810997896764209E-4,1.2412447212353319,1.2714533529640077,-25.938423131923841,-282.496175378511,-102.496175378511,null,398110,158491572100,null,15.637201982408172,-67.229630489562325,null,-8.7343220543410887,-142.4404438547146,null,0,0]
[436520,436.52,104.81651043136604,1.5612557003550567,1.0751691284822653,0.37614881453357929,1,0,6039.2329443676044,1.5706307428517401,50.640781858457082,1.5510481127090112,2.6579566953495637,1.1850736077930621,1.0000000952748507,4.3651997227374997E-4,1.0000000952748507,4.3651997227374997E-4,1.3220409901688277,1.3899376914554706,-27.864151032648049,-296.17345762674495,-116.17345762674495,null,436520,190549710400,null,14.959434310298347,-69.021718276697129,null,-9.9822822829554738,-147.53918650460636,null,0,0]
[478630,478.63,114.92701894445675,1.5620950429016955,1.0897412346273705,0.40867281814534101,1,0,6621.822728618753,1.5706453109727003,55.524151114119078,1.5527851722085046,2.879456841460013,1.216119079127659,1.0000001145433319,4.7862996345075299E-4,1.0000001145433319,4.7862996345075299E-4,1.4283835471346482,1.5121977897469447,-29.914604646314281,-310.04570582763381,-130.04570582763381,null,478630,229086676900,null,14.263895989833561,-70.701801272846055,null,-11.337197576156912,-152.72877679115842,null,0,0]
[524810,524.80999999999995,126.01480197570434,1.5628606678073873,1.1070095222242011,0.44331525364233532,1,0,7260.7207645557692,1.5706585994210465,60.879666167709942,1.5543697424116429,3.125079979272209,1.2450754836888629,1.0000001377127585,5.2480995181798282E-4,1.0000001377127585,5.2480995181798282E-4,1.5668152999667617,1.6357520988358079,-32.092741144723483,-323.82939451585514,-143.82939451585514,null,524810,275425536100,null,13.552647731319873,-72.270853232893799,null,-12.804085816052428,-157.86691897823059,null,0,0]
[575440,575.44000000000005,138.17109724449034,1.5635588599863486,1.1274183324726414,0.48002753720363944,1,0,7961.1843335485219,1.5706707173427432,66.75139581151889,1.5558148062366899,3.3969251475740814,1.2719855616284763,1.000000165565583,5.7543993648463459E-4,1.000000165565583,5.7543993648463459E-4,1.7447934877336639,1.7578818765751265,-34.393197812536428,-337.21781198195163,-157.21781198195163,null,575440,331131193600,null,12.827953805940982,-73.73058537433721,null,-14.379848558486483,-162.8009843619956,null,0,0]
[630960,630.96,151.501549031298,1.5641956862876534,1.1514786202895122,0.51873184298818242,1,0,8729.3008140358052,1.5706817700825675,73.190368317388348,1.5571329016949527,3.6974166048546597,1.2969264457211915,1.000000199055241,6.3095991626941511E-4,1.000000199055241,6.3095991626941511E-4,1.9709026682297544,1.8761120261198587,-36.804614518463367,-349.93582154952855,-169.93582154952855,null,630960,398110521600,null,12.091541628015145,-75.084704740312247,null,-16.05485308648759,-167.39396703626721,null,0,0]
[691830,691.83,166.11660416282848,1.5647764226140977,1.1797530266018377,0.55928435135903531,1,0,9571.4342834856125,1.5706918492451165,80.249932526106591,1.5583349346162461,4.0290928103700194,1.3199799970852908,1.0000002393143459,6.9182988962345599E-4,1.0000002393143459,6.9182988962345599E-4,2.2548735992239117,1.9884015273241362,-39.309284063158948,-361.76212641413491,-181.76212641413491,null,691830,478628748900,null,11.345227564350679,-76.337282017943664,null,-17.813208567518707,-171.53746770583248,null,0,0]
[758580,758.58,182.14351710404688,1.5653061230278895,1.2128776619852957,0.60150399482142614,1,0,10494.917265946067,1.5707010425752908,87.991556638854334,1.5594313553633223,4.3948800458464383,1.3412482315415311,1.0000002877217669,7.5857985449337743E-4,1.0000002877217669,7.5857985449337743E-4,2.6080690286041417,2.0933947736136362,-41.887625733172911,-372.55727045958469,-192.55727045958469,null,758580,575443616400,null,10.59031902491242,-77.49356854894279,null,-19.636641698094412,-175.1644798149174,null,0,0]
[831760,831.76,199.71434481427951,1.5657891542777116,1.2515369045070504,0.64513667777731742,1,0,11507.358984493589,1.5707094258819585,96.479029319229213,1.5604311944622495,4.7978221465529662,1.3608290441704676,1.000000345912289,8.3175980818937605E-4,1.000000345912289,8.3175980818937605E-4,3.0436333919796668,2.190328436803505,-44.518505208070991,-382.25365591560387,-202.25365591560387,null,831760,691824697600,null,9.8282822925688738,-78.558660240764112,null,-21.505484440648939,-178.24607668174352,null,0,0]
[912010,912.01,218.98275400173989,1.5662297412654365,1.2964956302609618,0.68989952745073457,1,0,12617.613807806363,1.5707170725067023,105.7865782609779,1.5613431909602378,5.2414662974823862,1.3788332216942709,1.0000004158810336,9.1200974714163261E-4,1.0000004158810336,9.1200974714163261E-4,3.5773657502700136,2.2790287938756268,-47.18364197631611,-390.85363951011237,-210.85363951011237,null,912010,831762240100,null,9.0600307435229848,-79.538408196661763,null,-23.402369659848176,-180.78875419582457,null,0,0]
[1000000,1000,240.10961487996639,1.5666315502556494,1.3485638529832862,0.73544899364737037,1,0,13834.95115310093,1.5707240460914951,115.99191136350922,1.5621749291781586,5.7295346781858321,1.3953635953832983,1.0000004999998751,9.9999966666686679E-4,1.0000004999998751,9.9999966666686679E-4,4.2279545752577619,2.3596741248471513,-49.866361326343366,-398.40296717267239,-218.40296717267239,null,1000000,1000000000000,null,8.2866343633494779,-80.438273311275481,null,-25.31169262970192,-182.82262108742117,null,0,0]
[]
[]
["Pole/Zero Locations for Chart"]
[{"$f":"Q4*1000","v":55274},null,{"$f":"SQRT(1+(A617/pole1)^2)","v":13.309324567702873},{"$f":"ATAN(A617/pole1)","v":1.4955901599784507},{"$f":"SQRT(1+(A617/Zero1)^2)","v":1.0012497559594216},{"$f":"ATAN(A617/Zero1)","v":4.996910587600429E-2},{"$f":"IF(VIN_nom>Vout, 1, SQRT(1+(A617/z_RHP)^2))","v":1},{"$f":"IF(VIN_nom>Vout, 0, -ATAN(A617/z_RHP))","v":0},{"$f":"SQRT(1+(A617/Pole2)^2)","v":764.71374187859237},{"$f":"ATAN(A617/Pole2)","v":1.5694886475546261},{"$f":"SQRT(1+(A617/Zero2)^2)","v":6.4886197100668195},{"$f":"ATAN(A617/Zero2)","v":1.4160636430457989},{"$f":"SQRT(1+(A617/pole4)^2)","v":1.0474922741725148},{"$f":"ATAN(A617/pole4)","v":0.30227745205877832},{"$f":"SQRT(1+(A617/Zero3)^2)","v":1.0000000015276074},{"$f":"ATAN(A617/Zero3)","v":5.5273999943708684E-5},{"$f":"SQRT(1+(A617/pole5)^2)","v":1.0000000015276074},{"$f":"ATAN(A617/pole5)","v":5.5273999943708684E-5},{"$f":"SQRT((1-(A617^2/(pole3^2)))^2+(A617/(Q*pole3))^2)","v":1.0014112518902487},{"$f":"ATAN((A617/(Q*pole3))/(1-A617^2/pole3^2))","v":0.16519018584809231},{"$f":"20*LOG10(((E617*K617*G617*O617)/(C617*I617*S617*M617*Q617))*Adc)","v":4.5921981697449633E-2},{"$f":"((F617+L617+H617+R617)-(D617+J617+T617+N617+T617))*radconv","v":-127.86404676173805},{"$f":"IF(V617>0,V617,V617+180)","v":52.135953238261948},"crossover",null,null,null,{"$f":"20*LOG10((K617/(I617*M617))*AEA)","v":23.150071881969069},{"$f":"(L617-(J617+N617))*radconv","v":-26.109827504902327},null,{"$f":"20*LOG10((E617*G617/(C617*S617))*Acs*Am)","v":9.7371531597193055},{"$f":"(F617+H617-(D617+T617))*radconv","v":-92.292685746860556}]
[{"$f":"A617","v":55274},null,null,null,null,null,null,null,null,null,null,null,null,null,null,null,null,null,null,null,null,-180]
[{"$f":"A618","v":55274}]
[1000000]
[]
[{"$f":"pole1","v":4164.8006192688572},null,1.4142135623730951,0.78539816339744828,1.0000070997264079,3.7682049846138824E-3,{"$f":"IF(VIN_nom>Vout, 1, SQRT(1+(A622/z_RHP)^2))","v":1},{"$f":"IF(VIN_nom>Vout, 0, -ATAN(A622/z_RHP))","v":0},57.628489896832328,1.5534429275711596,1.1105638285875026,0.45000824208206786,1.0002759954720373,2.3491786184395225E-2,{"$f":"SQRT(1+(A622/Zero3)^2)","v":1.0000000000086726},{"$f":"ATAN(A622/Zero3)","v":4.1648006192447766E-6},{"$f":"SQRT(1+(A622/pole5)^2)","v":1.0000000000086726},{"$f":"ATAN(A622/pole5)","v":4.1648006192447766E-6},{"$f":"SQRT((1-(A622^2/(pole3^2)))^2+(A622/(Q*pole3))^2)","v":1.0000075962651529},{"$f":"ATAN((A622/(Q*pole3))/(1-A622^2/pole3^2))","v":1.2407975243524794E-2},{"$f":"20*LOG10(((E622*K622*G622*O622)/(C622*I622*S622*M622*Q622))*Adc)","v":27.045815698692074},{"$f":"((F622+L622+H622+R622)-(D622+J622+T622+N622+T622))*radconv","v":-110.77383913509452},69.226160864905481,"p1",null,null,null,{"$f":"20*LOG10((K622/(I622*M622))*AEA)","v":30.675748674311301},{"$f":"(L622-(J622+N622))*radconv","v":-64.568130722239772},null,{"$f":"20*LOG10((E622*G622/(C622*S622))*Acs*Am)","v":29.211370084371701},{"$f":"(F622+H622-(D622+T622))*radconv","v":-45.495022423783887}]
[{"$f":"Zero1","v":1105242.6616233082},null,265.37897238832289,1.5670281218102828,1.4142135623730951,0.78539816339744828,1,0,15290.978228636892,1.5707309287552316,128.19834471013951,1.5629958349585016,6.3150080122971621,1.4117740186386762,1.000000610780484,1.1052422115830688E-3,1.000000610780484,1.1052422115830688E-3,5.0936227516812673,-0.7029120776910629,-52.785709696757259,-45.504862377945706,134.4951376220543,"z1",null,null,null,{"$f":"20*LOG10((K623/(I623*M623))*AEA)","v":7.4414847484539406},{"$f":"(L623-(J623+N623))*radconv","v":-81.331881215845442},null,-27.385891385220269,-4.5102023427253997]
[{"$f":"Pole2","v":72.280703527320554},null,1.0001505891274522,1.7353399223736955E-2,1.0000000021384516,6.5398039664984987E-5,1,0,1.4142135623730951,0.78539816339744828,1.0000351423050655,8.3834689651746848E-3,1.0000000831415616,4.0777826315434643E-4,1.0000000000000027,7.2280703527320419E-8,1.0000000000000027,7.2280703527320419E-8,1.0000000022872859,2.1533827583859315E-4,61.349087861731888,-45.558227947561953,134.44177205243804,"p2",null,null,{"$f":"Pole2","v":72.280703527320554},{"$f":"20*LOG10((K624/(I624*M624))*AEA)","v":61.970024471221308},{"$f":"(L624-(J624+N624))*radconv","v":-44.543026634970325},null,32.220366450501501,-1.0028674795836121]
[{"$f":"Zero2","v":8621.6112282641589},null,2.2989935052244923,1.1207880847128286,1.0000304246078053,7.8004918363950926E-3,1,0,119.28376165150634,1.5624128578297218,1.4142135623730951,0.78539816339744828,1.001182207438476,4.8601315486846458E-2,1.000000000037166,8.6216112280505368E-6,1.000000000037166,8.6216112280505368E-6,1.0000325862956578,2.5687444678366984E-2,18.598028516907576,-114.01687507048079,65.983124929519207,"z2",null,null,{"$f":"Zero2","v":8621.6112282641589},{"$f":"20*LOG10((K625/(I625*M625))*AEA)","v":26.448430885961486},{"$f":"(L625-(J625+N625))*radconv","v":-47.304312920849746},null,24.990900690937011,-65.241273963339609]
[{"$f":"pole3","v":500000},null,120.05793097272435,1.5624669181905171,1.0975682741375505,0.42483912693617937,1,0,6917.4756307609932,1.570651765388849,58.002421289460365,1.5535548130019823,2.9928066939135087,1.2301095127255544,1.0000001249999921,4.9999995833333955E-4,1.0000001249999921,4.9999995833333955E-4,1.4895972518136436,{"$error":"#DIV/0!"},-30.931775854037468,{"$error":"#DIV/0!"},{"$error":"#DIV/0!"},"p3",null,null,null,{"$f":"20*LOG10((K626/(I626*M626))*AEA)","v":13.928416292765606},{"$f":"(L626-(J626+N626))*radconv","v":-71.459666714026639},null,-12.018889086812152,{"$error":"#DIV/0!"}]
[{"$f":"Fp2_u","v":177254.91045511764},null,{"$f":"SQRT(1+(A627/pole1)^2)","v":42.571985604181421},{"$f":"ATAN(A627/pole1)","v":1.5473045406105015},{"$f":"SQRT(1+(A627/Zero1)^2)","v":1.0127786581265621},{"$f":"ATAN(A627/Zero1)","v":0.15902230815622043},1,0,{"$f":"SQRT(1+(A627/Pole2)^2)","v":2452.3132252769119},{"$f":"ATAN(A627/Pole2)","v":1.5703885485317424},{"$f":"SQRT(1+(A627/Zero2)^2)","v":20.583677207223602},{"$f":"ATAN(A627/Zero2)","v":1.5221950113080502},{"$f":"SQRT(1+(A627/pole4)^2)","v":1.4142135623730951},{"$f":"ATAN(A627/pole4)","v":0.78539816339744828},1.0000000157096516,1.7725490859870908E-4,1.0000000157096516,1.7725490859870908E-4,1.0214232719143539,0.54334366401797551,-12.827270583639512,-189.55644078060189,{"$f":"IF(V627>0,V627,V627+180)","v":-9.5564407806018892},"p4",null,null,null,null,null,null,-0.43462792770641973,-110.67401159249789]
[{"$f":"z_RHP","v":0},null,{"$f":"SQRT(1+(A628/pole1)^2)","v":1},{"$f":"ATAN(A628/pole1)","v":0},{"$f":"SQRT(1+(A628/Zero1)^2)","v":1},{"$f":"ATAN(A628/Zero1)","v":0},1,0,{"$f":"SQRT(1+(A628/Pole2)^2)","v":1},{"$f":"ATAN(A628/Pole2)","v":0},{"$f":"SQRT(1+(A628/Zero2)^2)","v":1},{"$f":"ATAN(A628/Zero2)","v":0},{"$f":"SQRT(1+(A628/pole4)^2)","v":1},{"$f":"ATAN(A628/pole4)","v":0},1,0,1,0,1,0,64.360391207069057,0,{"$f":"IF(V628>0,V628,V628+180)","v":180},"z_RHP",null,null,null,null,null,null,32.221674353860557,0]
[{"$f":"Fp2_u","v":177254.91045511764},null,null,null,null,null,null,null,null,null,null,null,null,null,null,null,null,null,null,null,-25]
[]
[null,null,null,"System","Plant"]
["p1","p-dom",{"$f":"pole1","v":4164.8006192688572},{"$f":"U622","v":27.045815698692074},{"$f":"AE622","v":29.211370084371701}]
["z1","ESR zero",{"$f":"Zero1","v":1105242.6616233082},{"$f":"U623","v":-52.785709696757259},{"$f":"AE623","v":-27.385891385220269}]
["p2","EA pole",{"$f":"Pole2","v":72.280703527320554},{"$f":"U624","v":61.349087861731888},{"$f":"AE624","v":32.220366450501501}]
["z2","EA zero",{"$f":"Zero2","v":8621.6112282641589},{"$f":"U625","v":18.598028516907576},{"$f":"AE625","v":24.990900690937011}]
["p3","p_sampling",{"$f":"pole3","v":500000},{"$f":"U626","v":-30.931775854037468},{"$f":"AE626","v":-12.018889086812152}]
[]
[]
[{"$f":"Q4*1000","v":55274}]
[{"$f":"Q4*1000","v":55274}]
[]
[]
[]
[]
[]
[]
[]
[]
[]
[]
[]
[]
[]
[]
[]
[]
[]
[]
[]
[]
[]
[]
[]
[]
[]
[]
[]
[]
[]
[]
[]
[]
[]
[]
[]
[]
[]
[]
[]
[]
[]
[]
[]
[]
[]
[]
[null,null,null,null,null,null,null,null,null,null,null,null,null,null,null,null,null,null,null,null,null,null,null,null,null,null,null,null,null,null,null,null,null,"phase margin",{"$f":"SUM(AI689:AI1306)","v":0}]

{"sheet":"Bode Plot Management","index":7,"n_rows":6,"n_cols":14,"rows_kept":6,"cut":false,"hidden":true,"merged":[]}
[null,null,null,null,null,null,null,null,null,"Single or dual output (MODE)",null,null,null,"3.3V or 5V fixed (FB1/2)"]
[{"$f":"CHOOSE(BODE_PLOT_TYPE, \"BODE_PLOT_Ch1\", \"BODE_PLOT_Ch2\")","v":"BODE_PLOT_Ch1"},null,null,null,null,null,null,null,null,"With/without dither (DITH)",null,null,null,"With/without VOUT connected to VCCX"]
[null,null,null,null,null,null,null,null,null,"FPWM or DEM (DEMB)"]
[null,null,null,null,null,null,null,null,null,"Shunt or inductor DCR current sensing"]
[]
[null,null,null,null,null,{"$f":"INDIRECT(A2)","v":0}]

{"sheet":"Efficiency Calculations","index":8,"n_rows":109,"n_cols":57,"rows_kept":109,"cut":false,"hidden":false,"merged":[[6,24,6,26],[0,0,3,3],[5,0,6,3],[6,6,6,13],[6,17,6,20],[6,21,6,23],[6,51,6,56],[6,27,6,32],[6,33,6,36],[6,38,6,42],[6,45,6,49]]}
["BUCK CONTROLLER POWER DESIGN TOOL",null,null,null,null,null,null,null,null,null,null,null,null,null,null,null,null,null,null,null,null,null,null,null,null,null,null,null,null,null,null,null,null,null,null,null,null,null,null,null,{"$f":"Ext_VCC","v":1}]
[null,null,null,null,null,null,null,{"$f":"AV19","v":0.86500397717420174},"10% load"]
[null,null,null,null,null,null,null,{"$f":"AV59","v":0.9352546981460963},"50% load",null,null,null,null,null,null,null,null,null,null,null,null,null,null,null,null,null,null,null,null,null,null,null,null,null,null,null,null,null,null,{"$f":"IF(MODE=1, (Qg_Q1+Qg_Q2)*Fsw*Vin, (Qg_Q1+Qg_Q2+Qg_Q3+Qg_Q4)*Fsw*Vin)","v":0.43199999999999994}]
[null,null,null,null,null,null,null,{"$f":"AV109","v":0.91782414688890457},"100% load",null,null,null,null,null,null,null,null,null,null,null,3,null,null,null,null,null,null,null,null,null,null,null,1,null,null,null,2,null,"I_VCC",{"$f":"(Qg_Q1+Qg_Q2)*Fsw*1000","v":18},"mA",{"$f":"AN4*5/1000","v":0.09}]
[null,null,null,null,null,null,null,null,null,null,null,null,null,null,null,null,null,null,null,null,null,null,null,null,null,null,null,null,null,null,null,null,null,null,null,null,null,null,null,null,null,{"$f":"VCC","v":3.3}]
["Enter the values of your design and MOSFET datasheet specifications below. Note that thermal resistance (θJA) will change when components are placed on the PCB"]
[null,null,null,null,null,null,"Operating Point Condtions",null,null,null,null,null,null,null,null,null,null,"Filter Inductor",null,null,null,"Cout",null,null,"Cin",null,null,"High-side BUCK \"Control\" MOSFET Losses ",null,null,null,null,null,"Low-side BUCK \"Sync\" MOSFET Losses ",null,null,null,"Diode/FET","\"Controller\" Losses",null,null,null,null,null,null,"RESULTS",null,null,null,null,null,"Consolidated Buck/Boost Efficiency & Losses"]
["Input Parameters",null,null,null,null,null,"Step","Vin","Mode","Iout","Iout/ phase","Iin","Duty Cycle BUCK Leg","Ripple Current pk-pk","Peak Inductor Current","Valley Inductor Current","SW node voltage at Q1 turn-on","Irms Lf","DCR    Loss","Core Loss","Total Inductor Loss","Irms Cout","Cout ESR Loss","Total Cout Loss","Irms Cin","Cin ESR Loss","Total Cin Loss","Irms","RDS(on) Loss","Transition Loss (not including capacitive loss)","MOSFET Output Capacitance Loss","Dead Time Loss ","Total Control MOSFET Loss","Irms","RDS(on) Loss","Deadtime Loss","Total Sync MOSFET Loss","Reverse Recovery Loss","IQ Loss","Switching Current Loss","Switching Current Diss from VCC","LDO Loss Saved from Gate Drive Current (ext VCC = Vout)","Total \"Control\" Loss","Total Loss (not considering total loss)","Total Loss (considering total loss)","Total Loss","Pout","EFF, h",{"$f":"IF(Vin>Vout, \"Buck ''CONTROL'' MOSFET Temp Rise\", \"Boost ''CONTROL'' MOSFET Temp Rise\")","v":"Buck ''CONTROL'' MOSFET Temp Rise"},{"$f":"IF(Vin>Vout, \"Buck ''SYNC'' MOSFET Temp Rise\", \"Boost ''SYNC'' MOSFET Temp Rise\")","v":"Buck ''SYNC'' MOSFET Temp Rise"},null,"h","Inductor Cu & Core Loss","Total MOSFET Loss","Control MOSFET Loss","SYNC MOSFET Loss","Power Loss"]
["Design","Input Value","Units","Description",null,null,0,{"$f":"Vin","v":24},{"$f":"MODE","v":1},0,{"$f":"Iout*G9/100/Number_of_Phases","v":0},{"$f":"Vout*K9/(Vin*Efficiency)","v":0},{"$f":"(Vout+(Rdson2+Rs+Rdcr)*K9)/(Vin+(Rs+Rdson2-Rdson1)*K9)","v":0.20833333333333334},{"$f":"(Vin-(Rdson1+Rdcr)*K9-Vout)*M9/(Fsw*Lf)","v":2.3718217588431507},{"$f":"K9+N9/2","v":1.1859108794215754},{"$f":"K9-N9/2","v":-1.1859108794215754},{"$f":"IF(MIN(Vin, -P9/(Coss_Q1+Coss_Q2)*0.00000002)<0, 0, MIN(Vin, -P9/(Coss_Q1+Coss_Q2)*0.00000002))","v":24},{"$f":"SQRT(K9^2+(N9^2)/12)","v":0.68468596546895244},{"$f":"R9^2*Rdcr","v":6.1880923012940002E-3},{"$f":"Core_Loss","v":0.39590702674761175},{"$f":"(T9+S9*(1+Ltc*(Ta-25)))/(1-S9*Ltc*ThetaCa)","v":0.40231036412975474},{"$f":"N9/SQRT(12)","v":0.68468596546895244},{"$f":"RCoutEsr*V9^2","v":9.375897426203031E-4},{"$f":"W9","v":9.375897426203031E-4},{"$f":"SQRT(M9*(1-M9))*SQRT(K9^2+(N9^2)/12)","v":0.27806222067511877},{"$f":"RCinEsr*Y9^2","v":7.7318598566778453E-5},{"$f":"Z9","v":7.7318598566778453E-5},{"$f":"SQRT(M9)*SQRT(K9^2+(N9^2)/12)","v":0.3125149567454571},{"$f":"Rdson1*AB9^2","v":2.0509775619819131E-3},{"$f":"(Vin*K9/2)*Fsw*(Tr_buck+Tf_buck)","v":0},{"$f":"(0.5*Coss_Q1*(Vin-Q9)^2-0.5*Coss_Q2*(Vin-Q9)^2+(Qoss_Q2*(Vin-Q9)/Vin)*Vin)*Fsw","v":0},{"$f":"IF(K9>N9/2,0,ABS(K9-N9/2)*Vsd_Q1*Deadtime*Fsw)","v":6.6411009247608213E-3},{"$f":"(AF9+AE9+AD9+AC9*(1+RdsonTC*(Ta-25))/(1-AC9*RdsonTC*ThetaJA_Q1))","v":8.6924487263542686E-3},{"$f":"SQRT((1-M9))*SQRT(K9^2+(N9^2)/12)","v":0.60920380261496776},{"$f":"Rdson2*AH9^2","v":4.8246805505669762E-3},{"$f":"IF(K9<N9/2,Deadtime*Fsw*Vsd_Q2*(K9+N9/2),2*Deadtime*Fsw*Vsd_Q2*K9)","v":6.6411009247608222E-3},{"$f":"(AJ9+AI9*(1+RdsonTC*(Ta-25)))/(1-AI9*RdsonTC*ThetaJA_Q2)","v":1.1470651591535768E-2},{"$f":"Qrr_Q2*K9/Iout*Fsw*Vin","v":0},{"$f":"Iq*Vin","v":8.3999999999999993E-4},{"$f":"IF(Ext_VCC=1,  (Qg_Q1+Qg_Q2)*Fsw*Vout, (Qg_Q1+Qg_Q2)*Fsw*Vin)","v":0.09},{"$f":"(Vin-VCC)*Fsw*(Qg_Q1+Qg_Q2)","v":0.37259999999999999},{"$f":"(Qg_Q1+Qg_Q2)*Fsw*(Vin-Vout)","v":0.34199999999999997},{"$f":"SUM(AM9:AN9)","v":9.083999999999999E-2},{"$f":"SUM(S9,T9,AC9,AD9,AE9,AF9,AI9,AJ9,AQ9, AL9)","v":0.51309297901097628},{"$f":"((T9+S9*(1+Ltc*(Ta-25))) + (AF9+AE9+AD9+AC9*(1+RdsonTC*(Ta-25))) + (AJ9+AI9*(1+RdsonTC*(Ta-25))) + AQ9 + AL9) / (1-S9*Ltc*ThetaCa-AC9*RdsonTC*ThetaJA_Q1 -AI9*RdsonTC*ThetaJA_Q2)","v":0.51367861391738789},{"$f":"AS9","v":0.51367861391738789},{"$f":"Vout*K9","v":0},{"$f":"AU9/(AU9+AT9)","v":0},{"$f":"ThetaJA_Q1*BC9","v":0.19123387197979391},{"$f":"ThetaJA_Q2*BD9","v":0.2523543350137869},null,{"$f":"AV9*100","v":0},{"$f":"U9","v":0.40231036412975474},{"$f":"AG9+AK9+AL9","v":2.0163100317890037E-2},{"$f":"AG9+AL9*0.66","v":8.6924487263542686E-3},{"$f":"AK9+AL9*0.33","v":1.1470651591535768E-2},{"$f":"BA9+BB9","v":0.42247346444764478}]
[null,null,null,null,null,null,1,24,1,{"$f":"Iout*G10/100","v":0.08},{"$f":"Iout*G10/100/Number_of_Phases","v":0.08},1.8518518518518517E-2,0.2084816324625933,{"$f":"(Vin-(Rdson1+Rdcr)*K10-Vout)*M10/(Fsw*Lf)","v":2.3731683210754722},{"$f":"K10+N10/2","v":1.2665841605377361},{"$f":"K10-N10/2","v":-1.106584160537736},24,{"$f":"SQRT(K10^2+(N10^2)/12)","v":0.6897298915853568},6.2796006681717937E-3,0.39590702674761175,0.40240510694028159,{"$f":"N10/SQRT(12)","v":0.68507468450260811},9.3865464669269606E-4,{"$f":"W10","v":9.3865464669269606E-4},{"$f":"SQRT(M10*(1-M10))*SQRT(K10^2+(N10^2)/12)","v":0.28018407414805291},7.8503115406201607E-5,{"$f":"Z10","v":7.8503115406201607E-5},{"$f":"SQRT(M10)*SQRT(K10^2+(N10^2)/12)","v":0.31492921264675749},2.0827885885444388E-3,5.2458051221666181E-3,0,6.1968712990113214E-3,{"$f":"(AF10+AE10+AD10+AC10*(1+RdsonTopTc*Ta-RdsonTopTc*25))/(1-AC10*RdsonTopTc*ThetaJA_Q1)","v":1.3527944484381448E-2},0.61363418611420395,4.8951098867845389E-3,7.0928712990113224E-3,{"$f":"(AJ10+AI10*(1+RdsonBotTc*Ta-RdsonBotTc*25))/(1-AI10*RdsonBotTc*ThetaJA_Q2)","v":1.1993147469974208E-2},7.2000000000000005E-4,8.3999999999999993E-4,0.09,0.37259999999999999,0.34199999999999997,9.083999999999999E-2,{"$f":"SUM(S10,T10,AC10,AD10,AE10,AF10,AI10,AJ10,AQ10, AL10)","v":0.51926007361130178},0.51986154788026684,{"$f":"AS10","v":0.51986154788026684},0.4,{"$f":"AU10/(AU10+AT10)","v":0.43484804960242313},0.30806917865639188,0.26907644433943256,null,{"$f":"AV10*100","v":43.484804960242315},0.40240510694028159,2.6241091954355655E-2,1.4003144484381449E-2,1.2230747469974207E-2,{"$f":"BA10+BB10","v":0.42864619889463723}]
["Vin",{"$f":"Vin","v":24},"V","Vin",null,null,2,24,1,0.16,0.16,3.7037037037037035E-2,0.20862991874037581,2.374514250795011,1.3472571253975054,-1.0272571253975056,24,0.70388907312803861,6.5400697199514508E-3,0.39590702674761175,0.40267479071100953,0.68546322094555112,9.3971965453809895E-4,9.3971965453809895E-4,0.2860107333213377,8.180213957500936E-5,8.180213957500936E-5,0.32150854343588198,2.1707226135475109E-3,1.0491610244333236E-2,0,5.7526399022260312E-3,1.8418491126403983E-2,0.62617256708257896,5.097197088968229E-3,7.5446399022260306E-3,1.2647510074129124E-2,1.4400000000000001E-3,8.3999999999999993E-4,0.09,0.37259999999999999,0.34199999999999997,9.083999999999999E-2,0.52578390621886428,0.52641825672764964,0.52641825672764964,0.8,0.60312800728003113,0.42611560478088761,0.28869962163084073,null,60.312800728003111,0.40267479071100953,3.2506001200533104E-2,1.9368891126403984E-2,1.3122710074129124E-2,0.43518079191154263]
["Vout",{"$f":"Vout","v":5},"V","Vout",null,null,3,24,1,0.24,0.24,5.5555555555555552E-2,0.20877819216835145,2.3758595480839833,1.4279297740419916,-0.94792977404199164,24,0.72663084347222173,6.9694994514440112E-3,0.39590702674761175,0.40311943908880743,0.68585157482151526,9.4078476537030507E-4,9.4078476537030507E-4,0.29532860860485854,8.7218987060481734E-5,8.7218987060481734E-5,0.33201399840317952,2.3148991978489968E-3,1.5737415366499856E-2,0,5.3084067346351521E-3,2.3365481107529645E-2,0.64634285603655117,5.4308681381433173E-3,7.9964067346351524E-3,1.3433695055906655E-2,2.16E-3,8.3999999999999993E-4,0.09,0.37259999999999999,0.34199999999999997,9.083999999999999E-2,0.53266452237081829,0.5333494553138417,0.5333494553138417,1.2,0.69230125311501423,0.54540378436565218,0.3112228912299464,null,69.230125311501425,0.40311943908880743,3.8959176163436304E-2,2.4791081107529644E-2,1.4146495055906655E-2,0.44207861525224373]
["Fsw",{"$f":"Fsw/1000","v":1000},"kHz","Switching Frequency",null,null,4,24,1,0.32,0.32,7.407407407407407E-2,0.20892645274819033,2.3772042130245916,1.5086021065122959,-0.86860210651229575,24,0.75718226947137535,7.5678898574640567E-3,0.39590702674761175,0.4037390910690663,0.68623974615423022,9.418499784036447E-4,9.418499784036447E-4,0.30782620079975337,9.4756969898810082E-5,9.4756969898810082E-5,0.34609645514773957,2.5154378815824578E-3,2.0983220488666472E-2,0,4.8641717964688557E-3,2.8369109911286699E-2,0.67345544242807276,5.896049028167886E-3,8.448171796468857E-3,1.4351667220390671E-2,2.8800000000000002E-3,8.3999999999999993E-4,0.09,0.37259999999999999,0.34199999999999997,9.083999999999999E-2,0.53990196759643028,0.54065592883603963,0.54065592883603963,1.6,0.74743445616222126,0.66593801804830743,0.3366454788485948,null,74.743445616222132,0.4037390910690663,4.5600777131677372E-2,3.02699099112867E-2,1.5302067220390672E-2,0.44933986820074368]
["Iout",{"$f":"Iout","v":8},"A","Max Output Current",null,null,5,24,1,0.4,0.4,9.2592592592592587E-2,0.20907470048156235,2.3785482456990215,1.5892741228495106,-0.78927412284951071,24,0.79464309373862363,8.3352409328296805E-3,0.39590702674761175,0.40453380100425057,0.68662773496742113,9.4291529285298232E-4,9.4291529285298232E-4,0.32313990186401431,1.0441939617668481E-4,1.0441939617668481E-4,0.36334806768911115,2.7724581841616289E-3,2.6229025610833095E-2,0,4.4199350879572602E-3,3.3429574907624007E-2,0.70670773883768967,6.4926657657300418E-3,8.899935087957259E-3,1.5401400514523416E-2,3.5999999999999999E-3,8.3999999999999993E-4,0.09,0.37259999999999999,0.34199999999999997,9.083999999999999E-2,0.54749628741708078,0.54833853312212399,0.54833853312212399,2,0.78482508269797213,0.78772264796772817,0.36496681131951519,null,78.482508269797208,0.40453380100425057,5.2430975422147426E-2,3.580557490762401E-2,1.6589400514523418E-2,0.45696477642639799]
["Ta",{"$f":"Ta","v":25},"°C","Ambient Temperature",null,null,6,24,1,0.48,0.48,0.1111111111111111,0.20922293537013709,2.3798916461894475,1.6699458230947237,-0.70994582309472376,23.664860769824124,0.83808731881997822,9.2715526723625499E-3,0.39590702674761175,0.40550363861581912,0.68701554128480957,9.4398070793371986E-4,9.4398070793371986E-4,0.34089524788838343,1.1620957003288239E-4,1.1620957003288239E-4,0.3833486293605548,3.0860796042849366E-3,3.1474830732999712E-2,1.3293250903432181E-3,3.9756966093304532E-3,3.9876761568687781E-2,0.74527456842042039,7.2206443703451704E-3,9.351696609330452E-3,1.6582878017378049E-2,4.3200000000000001E-3,8.3999999999999993E-4,0.09,0.37259999999999999,0.34199999999999997,9.083999999999999E-2,0.55677685243660824,0.5577297952278224,0.5577297952278224,2.4,0.81143314844794245,0.94001515451113116,0.39618651638231706,null,81.143314844794247,0.40550363861581912,6.0779639586065824E-2,4.2727961568687779E-2,1.8008478017378048E-2,0.46628327820188492]
["Vcc",{"$f":"VCC","v":3.3},"V","Subregulated VCC Voltage",null,null,7,24,1,0.56000000000000005,0.56000000000000005,0.12962962962962962,0.20937115741558393,2.3812344145780289,1.7506172072890145,-0.63061720728901438,21.020573576300482,0.8866358392434277,1.0376825070887845E-2,0.39590702674761175,0.40664868900952228,0.68740316513011301,9.4504622286179483E-4,9.4504622286179483E-4,0.3607364573478149,1.3013079165985191E-4,1.3013079165985191E-4,0.40569878692378047,3.4564216199399677E-3,3.6720635855166335E-2,1.1030007513374185E-2,3.5314563608184802E-3,5.475517596301116E-2,0.78837275810334184,8.0799108743531134E-3,9.8034563608184813E-3,1.7896091932018871E-2,5.0400000000000011E-3,8.3999999999999993E-4,0.09,0.37259999999999999,0.34199999999999997,9.083999999999999E-2,0.57478574040297015,0.57588705387909667,0.57588705387909667,2.8000000000000003,0.8294116347235706,1.2777946711862456,0.43030442250441514,null,82.941163472357061,0.40664868900952228,7.7691267895030031E-2,5.808157596301116E-2,1.9559291932018871E-2,0.48433995690455234]
["Components","Input Value","Units","Description",null,null,8,24,1,0.64,0.64,0.14814814814814814,0.20951936661957188,2.3825765509469092,1.8312882754734545,-0.5512882754734546,18.376275849115157,0.93949769474269562,1.1651058123234279E-2,0.39590702674761175,0.40796905269407902,0.68779060652704416,9.461118368536785E-4,9.461118368536785E-4,0.38234324540300146,1.4618635730529979E-4,1.4618635730529979E-4,0.43003896215553289,3.883603688407965E-3,4.1966440977332944E-2,1.9332269271014828E-2,3.0872143426513457E-3,6.829286785355404E-2,0.83529779686949457,9.0703913229154068E-3,1.0255214342651345E-2,1.9341043578945956E-2,5.7600000000000004E-3,8.3999999999999993E-4,0.09,0.37259999999999999,0.34199999999999997,9.083999999999999E-2,0.59175321881581988,0.59302662610358114,0.59302662610358114,3.2,0.84365345024936655,1.5860782927781889,0.46732055873681105,null,84.365345024936659,0.40796905269407902,9.339391143249999E-2,7.2094467853554042E-2,2.1241843578945957E-2,0.50136296412657899]
["L",{"$f":"Lf*1000000","v":1.6688999999999998},"uH","Filter Inductance",null,null,9,24,1,0.72,0.72,0.16666666666666663,0.20966756298376968,2.3839180553782202,1.9119590276891101,-0.47195902768911013,15.731967589637005,0.99598633251826774,1.3094251824234099E-2,0.39590702674761175,0.40946484560324359,0.68817786549931237,9.4717754912637935E-4,9.4717754912637935E-4,0.40543749120397832,1.6437955927377598E-4,1.6437955927377598E-4,0.45605687021458191,4.367745246268321E-3,4.7212246099499561E-2,2.6236093647570687E-2,2.6429705550590167E-3,8.048999280934252E-2,0.88543825628514006,1.0192011774012502E-2,1.0706970555059016E-2,2.0917743391121187E-2,6.4799999999999996E-3,8.3999999999999993E-4,0.09,0.37259999999999999,0.34199999999999997,9.083999999999999E-2,0.60767931644931505,0.60914943014916811,0.60914943014916811,3.5999999999999996,0.8552796853003195,1.8648694418055354,0.50723515460466606,null,85.527968530031956,0.40946484560324359,0.1078877362004637,8.4766792809342517E-2,2.3056143391121185E-2,0.51735258180370725]
["Rdcr",{"$f":"Rdcr*1000","v":13.2},"mW","Inductor DCR at 25°C",null,null,10,24,1,0.8,0.8,0.18518518518518517,0.20981574650984572,2.385258927954077,1.9926294639770386,-0.39262946397703846,13.087648799234614,1.05551962532618,1.4706406168723096E-2,0.39590702674761175,0.41113619912126992,0.68856494207062235,9.4824335889743909E-4,9.4824335889743909E-4,0.4297833011277406,1.8471368592825815E-4,1.8471368592825815E-4,0.48348761295025555,4.9089657094030584E-3,5.2458051221666191E-2,3.1741463930176975E-2,2.1987249982714156E-3,9.1346666613075944E-2,0.93827576307415261,1.1444698298440983E-2,1.1158724998271415E-2,2.2626210910573138E-2,7.1999999999999998E-3,8.3999999999999993E-4,0.09,0.37259999999999999,0.34199999999999997,9.083999999999999E-2,0.62256406207256487,0.62425619482954842,0.62425619482954842,4,0.86500397717420174,2.1141706654876709,0.550048640032609,null,86.500397717420171,0.41113619912126992,0.12117287752364908,9.609866661307595E-2,2.5002210910573138E-2,0.532309076644919]
["LTc",3930,"ppm","Inductor Series Resistance Temp Co",null,null,11,24,1,0.88,0.88,0.20370370370370372,0.20996391719946825,2.3865991687565833,2.0732995843782915,-0.31329958437829164,10.443319479276388,1.1176111276702947,1.6487521151540573E-2,0.39590702674761175,0.41298326011178499,0.68895183626467527,9.4930926538493588E-4,9.4930926538493588E-4,0.45518350331677782,2.0719202169173508E-4,2.0719202169173508E-4,0.51210975725546715,5.5073844730013236E-3,5.77038563438328E-2,3.5848363408797754E-2,1.7544776725184332E-3,0.1008629651174133,0.99337718376063688,1.2828376979810784E-2,1.1610477672518433E-2,2.4466474786578991E-2,7.92E-3,8.3999999999999993E-4,0.09,0.37259999999999999,0.34199999999999997,9.083999999999999E-2,0.63640748444963191,0.63834745945836557,0.63834745945836557,4.4000000000000004,0.87330221573742162,2.3339836325830925,0.59576164530473785,null,87.330221573742165,0.41298326011178499,0.13324943990399229,0.1060901651174133,2.7080074786578992E-2,0.54623270001577728]
["ThetaCa",{"$f":"ThetaCa","v":22},"°C/W","Core to Ambient Thermal Resistance",null,null,12,24,1,0.96,0.96,0.22222222222222221,0.2101120750543051,2.3879387778678258,2.1539693889339127,-0.23396938893391295,7.7989796311304325,1.1818577045921139,1.8437596767529374E-2,0.39590702674761175,0.41500619095008118,0.68933854810516759,9.5037526780748099E-4,9.5037526780748099E-4,0.48147465878152979,2.3181784704879056E-4,2.3181784704879056E-4,0.54173974209920017,6.1631209115638663E-3,6.2949661465999424E-2,3.8556775376225608E-2,1.3102285780299124E-3,0.10903892409826783,1.0503835898061396,1.4342973914542421E-2,1.206222857802991E-2,2.6438572775422029E-2,8.6400000000000001E-3,8.3999999999999993E-4,0.09,0.37259999999999999,0.34199999999999997,9.083999999999999E-2,0.64920961233953212,0.65142357369442894,0.65142357369442894,4.8,0.88050395187821384,2.5243091301618921,0.64437500105928469,null,88.05039518782138,0.41500619095008118,0.14411749687368988,0.11474132409826783,2.9289772775422031E-2,0.55912368782377109]
["Cin",{"$f":"Cin*1000000","v":25},"μF","Input Capacitance",null,null,13,24,1,1.04,1.04,0.24074074074074073,0.21026022007602385,2.3892777553698781,2.2346388776849393,-0.154638877684939,5.1546292561646334,1.2479265534045305,2.055663301153586E-2,0.39590702674761175,0.41720516955884351,0.68972507761579205,9.5144136538422074E-4,9.5144136538422074E-4,0.5085218171791509,2.5859443854718577E-4,2.5859443854718577E-4,0.57222599510314709,6.876294378907525E-3,6.819546658816604E-2,3.9866683128080872E-2,8.6597771503565838E-4,0.1158745391050779,1.1089986894583437,1.5988415211864209E-2,1.251397771503566E-2,2.8542551741723717E-2,9.3600000000000003E-3,8.3999999999999993E-4,0.09,0.37259999999999999,0.34199999999999997,9.083999999999999E-2,0.66097047449623769,0.66348469729767579,0.66348469729767579,5.2,0.88684464417491216,2.685147060311714,0.69588973831792178,null,88.684464417491213,0.41720516955884351,0.15377709084680163,0.12205213910507791,3.1631351741723719E-2,0.57098226040564515]
["RCinEsr",{"$f":"RCinEsr*1000","v":1},"mW","Input Capacitor ESR",null,null,14,24,1,1.1200000000000001,1.1200000000000001,0.25925925925925924,0.21040835226629176,2.3906161013447993,2.3153080506723995,-7.530805067239954E-2,2.5102683557466512,1.315543149679028,2.2844629878409909E-2,0.39590702674761175,0.41958038944732423,0.6901114248202368,9.5250755733483476E-4,9.5250755733483476E-4,0.53621364100462932,2.8752506879944152E-4,2.8752506879944152E-4,0.60344346041103369,7.647024208169699E-3,7.344127171033267E-2,3.9778069962811032E-2,4.2172508376543742E-4,0.12136976530802246,1.1689780873714333,1.7764626993809464E-2,1.2965725083765436E-2,3.0778467661350055E-2,1.0080000000000002E-2,8.3999999999999993E-4,0.09,0.37259999999999999,0.34199999999999997,9.083999999999999E-2,0.67169009966867543,0.67453079979548591,0.67453079979548591,5.6000000000000005,0.892497013510959,2.8164964367764944,0.75030708854970118,null,89.249701351095894,0.41958038944732423,0.16222823296937253,0.12802256530802247,3.4104867661350055E-2,0.58180862241669673]
["Cout",{"$f":"Cout*1000000","v":72},"μF","Output Capcitance",null,null,15,24,1,1.2,1.2,0.27777777777777773,0.21055647162677593,2.3919538158746363,2.3959769079373183,4.0230920626818101E-3,0,1.3844807407254784,2.5301587363004956E-2,0.39590702674761175,0.42213205975398227,0.69049758974218689,9.5357384287953883E-4,9.5357384287953883E-4,0.56445815299667657,3.1861300648441954E-4,3.1861300648441954E-4,0.63528882489676142,8.4754297118128669E-3,7.8687076832499259E-2,3.8400000000000011E-2,0,0.12565622570909085,1.2301199252109778,1.96715353952138E-2,1.3439999999999999E-2,3.3168954009461904E-2,1.0800000000000001E-2,8.3999999999999993E-4,0.09,0.37259999999999999,0.34199999999999997,9.083999999999999E-2,0.68152265605014273,0.68471652186243759,0.68471652186243759,6,0.89756984912926896,2.9212529655999986,0.80812498820816181,null,89.756984912926896,0.42213205975398227,0.16962517971855276,0.13278422570909085,3.6732954009461902E-2,0.591757239472535]
["RCoutEsr",{"$f":"Cout_ESR*1000","v":2},"mW","Output Capacitor ESR",null,null,16,24,1,1.28,1.28,0.29629629629629628,0.21070457815914301,2.3932908990414181,2.4766454495207091,8.3354550479290968E-2,0,1.4545515152855673,2.7927505460177925E-2,0.39590702674761175,0.42486040529260394,0.69088357240532217,9.546402212390801E-4,9.546402212390801E-4,0.59317916041353258,3.5186151634890338E-4,3.5186151634890338E-4,0.66767650356359365,9.3616301816290149E-3,8.3932881954665889E-2,3.8400000000000011E-2,0,0.13180309461721179,1.292257016699323,2.1709066563712246E-2,1.4336E-2,3.6114058784243147E-2,1.1520000000000001E-2,8.3999999999999993E-4,0.09,0.37259999999999999,0.34199999999999997,9.083999999999999E-2,0.69393411090779689,0.69752555380144876,0.69752555380144876,6.4,0.90172271328732978,3.0669384815786596,0.87814449325334931,null,90.172271328732975,0.42486040529260394,0.17943715340145494,0.1394062946172118,3.9915658784243149E-2,0.60429755869405888]
["Top Driver","Input Value","Units","Description",null,null,17,24,1,1.36,1.36,0.31481481481481483,0.21085267186505943,2.3946273509271627,2.5573136754635817,0.16268632453641874,0,1.5255993398718324,3.0722384164789295E-2,0.39590702674761175,0.42776566660192555,0.69126937283331891,9.5570669163474011E-4,9.5570669163474011E-4,0.62231331273658275,3.8727385920917987E-4,3.8727385920917987E-4,0.70053533573037186,1.0305744888744162E-2,8.9178687076832505E-2,3.8400000000000011E-2,0,0.1380095936320237,1.355250378790025,2.387714665973658E-2,1.5232000000000001E-2,3.9191495395072488E-2,1.2240000000000001E-2,8.3999999999999993E-4,0.09,0.37259999999999999,0.34199999999999997,9.083999999999999E-2,0.70670298953771438,0.71072880753168122,0.71072880753168122,6.8000000000000007,0.90537152575406932,3.2139358599045216,0.95107529869159468,null,90.537152575406935,0.42776566660192555,0.18944108902709619,0.14608799363202371,4.3230695395072488E-2,0.61720675562902172]
["RdsonDRT",1,"W","Drain to Source Resistance of pullup Top FET Driver",null,null,18,24,1,1.44,1.44,0.33333333333333326,0.21100075274619129,2.3959631716138721,2.6379815858069362,0.24201841419306391,0,1.5974938580927838,3.3686223471703004E-2,0.39590702674761175,0.43084809999877599,0.69165499104984929,9.5677325328833416E-4,9.5677325328833416E-4,0.65180771087232137,4.2485329195261567E-4,4.2485329195261567E-4,0.73380590023529568,1.1307893083622787E-2,9.4424492198999121E-2,3.8400000000000011E-2,0,0.14427595350361652,1.418983977155498,2.617570185651245E-2,1.6128E-2,4.2401371795157163E-2,1.2959999999999999E-2,8.3999999999999993E-4,0.09,0.37259999999999999,0.34199999999999997,9.083999999999999E-2,0.71982933735844912,0.72432818843783575,0.72432818843783575,7.1999999999999993,0.90859437277033994,3.3622501770795634,1.0269197794934575,null,90.85943727703399,0.43084809999877599,0.19963732529877368,0.15282955350361652,4.667817179515716E-2,0.6304854252975497]
["RdsonDRT2",1,"W","Drain to Source Resistance of pulldown Top FET Driver",null,null,19,24,1,1.52,1.52,0.3518518518518518,0.21114882080420452,2.3972983611835339,2.718649180591767,0.32135081940823307,0,1.6701257296117273,3.6819023375786582E-2,0.39590702674761175,0.43410797763476422,0.69204042707858104,9.5783990542220969E-4,9.5783990542220969E-4,0.68161797771129862,4.6460306753924038E-4,4.6460306753924038E-4,0.76743834857308846,1.2368193996072373E-2,9.9670297321165766E-2,3.8400000000000011E-2,0,0.15060240713856149,1.4833604868171848,2.8604658340056696E-2,1.7024000000000001E-2,4.5743805100671636E-2,1.3679999999999999E-2,8.3999999999999993E-4,0.09,0.37259999999999999,0.34199999999999997,9.083999999999999E-2,0.7333131997806932,0.73832568084243322,0.73832568084243322,7.6,0.91145396460841543,3.5118865570483528,1.1056805122147759,null,91.145396460841539,0.43410797763476422,0.21002621223923312,0.15963120713856149,5.0258205100671638E-2,0.6441341898739974]
["Bottom Driver","Input Value","Units","Description",null,null,20,24,1,1.6,1.6,0.37037037037037035,0.21129687604076466,2.3986329197181249,2.7993164598590625,0.40068354014093766,0,1.7434028001668533,4.012078387191105E-2,0.39590702674761175,0.43754558755653283,0.69242568094317869,9.5890664725924938E-4,9.5890664725924938E-4,0.71170670574564843,5.0652643500332295E-4,5.0652643500332295E-4,0.80139066138473247,1.3486766835247839E-2,0.10491610244333238,3.8400000000000011E-2,0,0.1569891896190323,1.5482978820223732,3.1163942309174561E-2,1.7920000000000002E-2,4.9218921604915117E-2,1.44E-2,8.3999999999999993E-4,0.09,0.37259999999999999,0.34199999999999997,9.083999999999999E-2,0.74715462220727757,0.75272334886285264,0.75272334886285264,8,0.91400124065835509,3.662850171618711,1.1873602753081325,null,91.400124065835513,0.43754558755653283,0.22060811122394741,0.16649318961903231,5.3970921604915116E-2,0.65815369878048025]
["RdsonDRB",1,"W","Drain to Source Resistance of pullup Bottom FET Driver",null,null,21,24,1,1.68,1.68,0.3888888888888889,0.21144491845753699,2.3999668472996025,2.8799834236498012,0.48001657635019868,0,1.8172470220119863,4.3591504954950913E-2,0.39590702674761175,0.44116123376960303,0.69281075266730152,9.5997347802286568E-4,9.5997347802286568E-4,0.74204220867478166,5.5062663945494822E-4,5.5062663945494822E-4,0.83562724629198382,1.4663730789656E-2,0.11016190756549898,3.8400000000000011E-2,0,0.1634365382221511,1.6137266944144877,3.3853479975456825E-2,1.8815999999999999E-2,5.2826856794057492E-2,1.5120000000000001E-2,8.3999999999999993E-4,0.09,0.37259999999999999,0.34199999999999997,9.083999999999999E-2,0.76135365003317457,0.76752333730909306,0.76752333730909306,8.4,0.91627800562170358,3.8151462408873238,1.2719620494692649,null,91.627800562170364,0.44116123376960303,0.23138339501620858,0.17341573822215109,5.7816456794057496E-2,0.67254462878581167]
["RdsonDRB2",1,"W","Drain to Source Resistance of pulldown Bottom FET Driver",null,null,22,24,1,1.76,1.76,0.40740740740740744,0.21159294805618642,2.4013001440099133,2.9606500720049569,0.55934992799504335,0,1.891591974625739,4.7231186619784232E-2,0.39590702674761175,0.44495523630583894,0.69319564227460528,9.610403969370051E-4,9.610403969370051E-4,0.77259751622794981,5.9690692208159719E-4,5.9690692208159719E-4,0.87011780885885637,1.5899205027160086E-2,0.1154077126876656,3.8400000000000011E-2,0,0.16994469243956262,1.6795878057354325,3.6673197563277145E-2,1.9712E-2,5.6567755364478098E-2,1.584E-2,8.3999999999999993E-4,0.09,0.37259999999999999,0.34199999999999997,9.083999999999999E-2,0.7759103286454988,0.78272787262302734,0.78272787262302734,8.8000000000000007,0.91831888758323099,3.9687800336703778,1.3594890180185182,null,91.831888758323103,0.44495523630583894,0.24235244780404072,0.18039909243956262,6.1794955364478099E-2,0.68730768410987964]
["Deadtime","Input Value","Units","Description",null,null,23,24,1,1.84,1.84,0.42592592592592593,0.21174096483837773,2.402632809930989,3.0413164049654946,0.63868359503450556,0,1.9663808638239626,5.1039828861292567E-2,0.39590702674761175,0.44892793129455733,0.69358034978874183,9.6210740322614694E-4,9.6210740322614694E-4,0.8033495628614743,6.4537052014972183E-4,6.4537052014972183E-4,0.90483644128396867,1.7193308694984175E-2,0.12065351780983222,3.8400000000000011E-2,0,0.17651389399723985,1.7458306665131178,3.9623021309789286E-2,2.0608000000000001E-2,6.044177124170149E-2,1.6559999999999998E-2,8.3999999999999993E-4,0.09,0.37259999999999999,0.34199999999999997,9.083999999999999E-2,0.79082470342350997,0.79833926385996012,0.79833926385996012,9.2000000000000011,0.92015281310310804,4.1237568679392771,1.4499445673174327,null,92.015281310310797,0.44892793129455733,0.25351566523894137,0.18744349399723986,6.5906571241701489E-2,0.70244359653349875]
["Deadtime",15,"ns","Total Deadtime",null,null,24,24,1,1.92,1.92,0.44444444444444442,0.21188896880577532,2.4039648451447473,3.1219824225723736,0.71801757742762629,0,2.0415649017500401,5.5017431674360989E-2,0.39590702674761175,0.45307967103731411,0.69396487523335848,9.6317449611530164E-4,9.6317449611530164E-4,0.83427853083147308,6.9602066700632115E-4,6.9602066700632115E-4,0.93976088447357553,1.85461609197177E-2,0.12589932293199885,3.8400000000000011E-2,0,0.18314438687552376,1.8124118538762357,4.270287746492421E-2,2.1503999999999999E-2,6.4449067600935453E-2,1.728E-2,8.3999999999999993E-4,0.09,0.37259999999999999,0.34199999999999997,9.083999999999999E-2,0.80609681973861347,0.81435990371334366,0.81435990371334366,9.6,0.92180413282788742,4.2800821112615228,1.5433322872205799,null,92.180413282788749,0.45307967103731411,0.26487345447645921,0.19454918687552375,7.0151467600935449E-2,0.71795312551377333]
["IQ","Input Value","Units","Description",null,null,25,24,1,2,2,0.46296296296296291,0.21203695996004329,2.405296249733091,3.2026481248665455,0.79735187513345451,0,2.1171019903195516,5.9163995053878086E-2,0.39590702674761175,0.45741082408639744,0.69434921863209875,9.6424167483001209E-4,9.6424167483001209E-4,0.86536731627703478,7.488605920805176E-4,7.488605920805176E-4,0.97487192827521785,1.9957880807319875E-2,0.13114512805416545,3.8400000000000011E-2,0,0.18983641732940085,1.8792938995473711,4.5912692291387537E-2,2.24E-2,6.8589816889217364E-2,1.8000000000000002E-2,8.3999999999999993E-4,0.09,0.37259999999999999,0.34199999999999997,9.083999999999999E-2,0.82172672295436266,0.83079226958354679,0.83079226958354679,10,0.92329349054946908,4.4377611812468185,1.6396559715627821,null,92.329349054946903,0.45741082408639744,0.27642623421861823,0.20171641732940085,7.4529816889217365E-2,0.73383705830501567]
["IQ ",{"$f":"Iq*1000","v":3.4999999999999996E-2},"mA","Quiescent Current Of Controller (Not Switching!)",null,null,26,24,1,2.08,2.08,0.48148148148148145,0.21218493830284546,2.4066270237779093,3.2833135118889549,0.87668648811104544,0,2.1929556469062881,6.3479518994735917E-2,0.39590702674761175,0.46192177532706097,0.69473338000860196,9.6530893859635321E-4,9.6530893859635321E-4,0.8966010935110057,8.0389352088513122E-4,8.0389352088513122E-4,1.0101529220187688,2.1428587443124196E-2,0.13639093317633208,3.8400000000000011E-2,0,0.19659023390902128,1.9464443335053585,4.925239206465655E-2,2.3296000000000001E-2,7.2864200849174277E-2,1.8720000000000001E-2,8.3999999999999993E-4,0.09,0.37259999999999999,0.34199999999999997,9.083999999999999E-2,0.83771445842646053,0.84763892469161606,0.84763892469161606,10.4,0.92463850143421489,4.5967995459984685,1.7389196186818343,null,92.463850143421496,0.46192177532706097,0.28817443475819554,0.20894543390902129,7.9041800849174282E-2,0.75009621008525651]
["High-side FET","Input Value","Units","Description",null,null,27,24,1,2.16,2.16,0.5,0.21233290383584538,2.4079571673610767,3.3639785836805385,0.9560214163194618,0,2.269094123944722,6.7964003491830141E-2,0.39590702674761175,0.46661292606353166,0.69511735938650321,9.6637628664093009E-4,9.6637628664093009E-4,0.92796695793452399,8.611226750182547E-4,8.611226750182547E-4,1.0455893733712127,2.2958399891842909E-2,0.14163673829849868,3.8400000000000011E-2,0,0.20340608748046102,2.0138349002869278,5.272190307297759E-2,2.4192000000000002E-2,7.7272410544404077E-2,1.9440000000000002E-2,8.3999999999999993E-4,0.09,0.37259999999999999,0.34199999999999997,9.083999999999999E-2,0.85406007150276109,0.86490251923901651,0.86490251923901651,10.8,0.92585428658211877,4.757202724570142,1.8411274319768896,null,92.585428658211882,0.46661292606353166,0.30011849802486512,0.21623648748046101,8.3687610544404073E-2,0.76673142408839678]
["RdsonTop",{"$f":"Rdson1*1000","v":21},"mW","Drain-Source Resistance of Top FET ",null,null,28,24,1,2.2400000000000002,2.2400000000000002,0.51851851851851849,0.21248085656070637,2.4092866805644548,3.4446433402822274,1.0353566597177728,0,2.3454896842867252,7.2617448540059831E-2,0.39590702674761175,0.47148469410882821,0.69550115678943403,9.6744371819088189E-4,9.6744371819088189E-4,0.95945363210778767,9.2055127216482608E-4,9.2055127216482608E-4,1.0811686181335163,2.4547437197571482E-2,0.14688254342066534,3.8400000000000011E-2,0,0.21028423124673171,2.0814409139484851,5.632115161736316E-2,2.5088000000000003E-2,8.1814646386484724E-2,2.0160000000000004E-2,8.3999999999999993E-4,0.09,0.37259999999999999,0.34199999999999997,9.083999999999999E-2,0.87076360752327153,0.88258579161438511,0.88258579161438511,11.200000000000001,0.92695389821052032,4.918976287428098,1.946283820502664,null,92.695389821052032,0.47148469410882821,0.31225887763321641,0.22358983124673171,8.8467446386484724E-2,0.78374357174204468]
["RdsonTopTc",{"$f":"RdsonTopTc*1000000","v":4000},"ppm","Drain to Source Resistance Temp Co",null,null,29,24,1,2.3199999999999998,2.3199999999999998,0.53703703703703698,0.2126287964790913,2.4106155634698894,3.5253077817349445,1.1146922182650552,0,2.4221180021289088,7.7439854134327565E-2,0.39590702674761175,0.47653751387842702,0.69588477224102108,9.6851123247387568E-4,9.6851123247387568E-4,0.99105122274189328,9.8218252609820174E-4,9.8218252609820174E-4,1.1168795472376427,2.6195818383793E-2,0.15212834854283191,3.8400000000000011E-2,0,0.2172249207690401,2.1492407248140388,6.0050064011589271E-2,2.5983999999999997E-2,8.6491118163619291E-2,2.0879999999999996E-2,8.3999999999999993E-4,0.09,0.37259999999999999,0.34199999999999997,9.083999999999999E-2,0.88782511182015356,0.90069156964837382,0.90069156964837382,11.6,0.92794866070968041,5.0821258569188821,2.0543933995996246,null,92.794866070968041,0.47653751387842702,0.32459603893265943,0.23100572076904011,9.3381518163619295E-2,0.80113355281108645]
["QgTop",{"$f":"Qg_Q1*1000000000","v":6},"nC","Gate Charge Of Top FET",null,null,30,24,1,2.4,2.4,0.55555555555555547,0.21277672359266286,2.4119438161592117,3.6059719080796055,1.1940280919203941,0,2.498957665579602,8.2431220269539501E-2,0.39590702674761175,0.48177183648781702,0.69626820576488713,9.6957882871811043E-4,9.6957882871811043E-4,1.0227510189101405,1.0460196466817308E-3,1.0460196466817308E-3,1.1527123800469323,2.7903662453382733E-2,0.15737415366499852,3.8400000000000011E-2,0,0.22422841398830332,2.2172152767030968,6.3908566582192669E-2,2.6879999999999998E-2,9.1302045070925167E-2,2.1600000000000001E-2,8.3999999999999993E-4,0.09,0.37259999999999999,0.34199999999999997,9.083999999999999E-2,0.90524462971772512,0.91922277191772073,0.91922277191772073,12,0.92884844636971364,5.2466571077426725,2.1654609915603538,null,92.884844636971366,0.48177183648781702,0.3371304590592285,0.23848441398830331,9.8430045070925162E-2,0.81890229554704552]
["QgdTop",{"$f":"Qgd_Q1*1000000000","v":2},"nC","Gate to Drain Charge",null,null,31,24,1,2.48,2.48,0.57407407407407407,0.2129246379030835,2.4132714387142422,3.6866357193571213,1.2733642806428789,0,2.5759897618344993,8.7591546940605322E-2,0.39590702674761175,0.48718812985398269,0.69665145738465162,9.7064650615231822E-4,9.7064650615231822E-4,1.0545453237629603,1.1120658398703267E-3,1.1120658398703267E-3,1.1886584752931824,2.9671088388612574E-2,0.16261995878716515,3.8400000000000011E-2,0,0.23129497124692011,2.2853477376954801,6.7896585668468026E-2,2.7775999999999999E-2,9.6247655742376162E-2,2.232E-2,8.3999999999999993E-4,0.09,0.37259999999999999,0.34199999999999997,9.083999999999999E-2,0.92302220653246292,0.93818240909972572,0.93818240909972572,12.4,0.92966189992575987,5.4125757674322426,2.2794916263322755,null,92.966189992575991,0.48718812985398269,0.34986262698929627,0.24602617124692011,0.10361325574237616,0.83705075684327901]
["QgsTop",{"$f":"Qgs_Q1*1000000000","v":2},"nC",null,null,null,32,{"$f":"Vin","v":24},{"$f":"MODE","v":1},2.56,{"$f":"Iout*G41/100/Number_of_Phases","v":2.56},{"$f":"Vout*K41/(Vin*Efficiency)","v":0.59259259259259256},{"$f":"(Vout+(Rdson2+Rs+Rdcr)*K41)/(Vin+(Rs+Rdson2-Rdson1)*K41)","v":0.21307253941201532},{"$f":"(Vin-(Rdson1+Rdcr)*K41-Vout)*M41/(Fsw*Lf)","v":2.4145984312167839},3.767299215608392,1.3527007843916081,{"$f":"IF(MIN(Vin, -P41/(Coss_Q1+Coss_Q2)*0.00000002)<0, 0, MIN(Vin, -P41/(Coss_Q1+Coss_Q2)*0.00000002))","v":0},2.6531975297747583,{"$f":"R41^2*Rdcr","v":9.2920834142438014E-2},{"$f":"Core_Loss","v":0.39590702674761175},{"$f":"(T41+S41*(1+Ltc*(Ta-25)))/(1-S41*Ltc*ThetaCa)","v":0.49278687880085847},0.6970345271239291,9.7171426400575892E-4,9.7171426400575892E-4,1.086427313588918,1.1803243077120331E-3,1.1803243077120331E-3,1.2247101727338905,{"$f":"Rdson1*AB41^2","v":3.1498215151155397E-2},{"$f":"(Vin*K41/2)*Fsw*(Tr_buck+Tf_buck)","v":0.16786576390933178},{"$f":"(0.5*Coss_Q1*(Vin-Q41)^2-0.5*Coss_Q2*(Vin-Q41)^2+(Qoss_Q2*(Vin-Q41)/Vin)*Vin)*Fsw","v":3.8400000000000011E-2},{"$f":"IF(K41>N41/2,0,ABS(K41-N41/2)*Vsd_Q1*Deadtime*Fsw)","v":0},{"$f":"(AF41+AE41+AD41+AC41*(1+RdsonTopTc*Ta-RdsonTopTc*25))/(1-AC41*RdsonTopTc*ThetaJA_Q1)","v":0.2384248553108039},{"$f":"SQRT((1-M41))*SQRT(K41^2+(N41^2)/12)","v":2.353623190913321},{"$f":"Rdson2*AH41^2","v":7.2014047622465036E-2},{"$f":"IF(K41<N41/2,Deadtime*Fsw*Vsd_Q2*(K41+N41/2),2*Deadtime*Fsw*Vsd_Q2*K41)","v":2.8672E-2},{"$f":"(AJ41+AI41*(1+RdsonBotTc*Ta-RdsonBotTc*25))/(1-AI41*RdsonBotTc*ThetaJA_Q2)","v":0.10132818828440684},{"$f":"Qrr_Q2*K41/Iout*Fsw*Vin","v":2.3040000000000001E-2},{"$f":"Iq*Vin","v":8.3999999999999993E-4},{"$f":"IF(Ext_VCC=1,  (Qg_Q1+Qg_Q2)*Fsw*Vout, (Qg_Q1+Qg_Q2)*Fsw*Vin)","v":0.09},{"$f":"(Vin-VCC)*Fsw*(Qg_Q1+Qg_Q2)","v":0.37259999999999999},{"$f":"(Qg_Q1+Qg_Q2)*Fsw*(Vin-Vout)","v":0.34199999999999997},{"$f":"SUM(AM41:AN41)","v":9.083999999999999E-2},0.94115788757300189,{"$f":"((T41+S41*(1+Ltc*(Ta-25))) + (AF41+AE41+AD41+AC41*(1+RdsonTC*(Ta-25))) + (AJ41+AI41*(1+RdsonTC*(Ta-25))) + AQ41 + AL41) / (1-S41*Ltc*ThetaCa-AC41*RdsonTC*ThetaJA_Q1 -AI41*RdsonTC*ThetaJA_Q2)","v":0.95757358537836856},0.95757358537836856,{"$f":"Vout*K41","v":12.8},0.93039662267217793,{"$f":"ThetaJA_Q1*BC41","v":5.5798876168376852},{"$f":"ThetaJA_Q2*BD41","v":2.3964905422569505},null,93.039662267217793,{"$f":"U41","v":0.49278687880085847},{"$f":"AG41+AK41+AL41","v":0.36279304359521075},{"$f":"AG41+AL41*0.66","v":0.25363125531080388},{"$f":"AK41+AL41*0.33","v":0.10893138828440685},0.85557992239606917]
["RGateTop",{"$f":"Rgate1","v":1},"W","Gate Resistance",null,null,33,24,1,{"$f":"Iout*G42/100","v":2.64},2.64,0.61111111111111116,0.21322042812112013,2.4159247937486268,3.8479623968743137,1.4320376031256867,0,2.7305660678244195,9.8419081869954281E-2,0.39590702674761175,0.49856858516880104,0.69741741500633048,9.727821015082244E-4,9.727821015082244E-4,1.1183909192896753,1.250798248349605E-3,1.250798248349605E-3,1.2608606599894503,3.3385161682089673E-2,0.17311156903149841,3.8400000000000011E-2,0,0.24561833139168057,2.4220283744921489,7.6260878808986049E-2,2.9568000000000001E-2,0.10654389031118969,2.376E-2,8.3999999999999993E-4,0.09,0.37259999999999999,0.34199999999999997,9.083999999999999E-2,0.95965171814014016,0.97739949990336761,0.97739949990336761,13.200000000000001,0.93105932439090622,5.7485984906169723,2.5164631868461731,null,93.105932439090623,0.49856858516880104,0.37592222170287026,0.26129993139168056,0.11438469031118968,0.87449080687167124]
["GfsTop",{"$f":"Gfs_Q1","v":100},"S","Transconductance of Top FET",null,null,34,24,1,2.72,2.72,0.62962962962962965,0.21336830403205942,2.417250526391546,3.928625263195773,1.5113747368042272,0,2.808082087287517,0.10408629011807424,0.39590702674761175,0.50453376792812388,0.69780012105546185,9.7385001789003446E-4,9.7385001789003446E-4,1.1504307263030087,1.3234908560220682E-3,1.3234908560220682E-3,1.2971038601053435,3.5332046901903835E-2,0.17835737415366501,3.8400000000000011E-2,0,0.25287566716965426,2.490551462035032,8.0637005605582845E-2,3.0464000000000001E-2,0.11189501898159414,2.4480000000000002E-2,8.3999999999999993E-4,0.09,0.37259999999999999,0.34199999999999997,9.083999999999999E-2,0.97850374352683778,0.99766344830351827,0.99766344830351827,13.600000000000001,0.93165594947186825,5.918714277732394,2.6394152175950709,null,93.165594947186818,0.50453376792812388,0.38925068615124842,0.26903246716965429,0.11997341898159414,0.89378445407937224]
["VthTop",{"$f":"Vth_Q1","v":1.5},"V","Threshold Voltage of Top FET",null,null,35,24,1,2.8,2.8,0.64814814814814814,0.21351616714649446,2.4185756292273037,4.0092878146136517,1.590712185386348,0,2.8857337032704562,0.10992245888172149,0.39590702674761175,0.51068296329674323,0.69818264529492624,9.7491801238204154E-4,9.7491801238204154E-4,1.1825418897723226,1.3984053210662959E-3,1.3984053210662959E-3,1.3334343362428698,3.7338989710500724E-2,0.18360317927583159,3.8400000000000011E-2,0,0.26019713281604528,2.5591818765221745,8.5142354402554257E-2,3.1359999999999999E-2,0.11738184103784025,2.52E-2,8.3999999999999993E-4,0.09,0.37259999999999999,0.34199999999999997,9.083999999999999E-2,0.99771400901821983,1.0183688242557303,1.0183688242557303,14,0.93219178219867704,6.0902409219529954,2.765352502832485,null,93.2191782198677,0.51068296329674323,0.4027789738538855,0.27682913281604526,0.12569784103784024,0.91346193715062873]
["VspTop",{"$f":"Vsp_Q1","v":1.58},"V",null,null,null,36,24,1,2.88,2.88,0.66666666666666652,0.21366401746608624,2.419900102337647,4.0899500511688238,1.6700499488311764,0,2.9635102567913973,0.11592758815582313,0.39590702674761175,0.51701672486198624,0.69856498774832176,9.7598608421562588E-4,9.7598608421562588E-4,1.2147200623676941,1.4755448299185747E-3,1.4755448299185747E-3,1.3698472105833401,3.9406108987202121E-2,0.18884898439799824,3.8400000000000011E-2,0,0.26758300101650412,2.6279101319803262,8.9776851602943117E-2,3.2256E-2,0.12300463284585708,2.5919999999999999E-2,8.3999999999999993E-4,0.09,0.37259999999999999,0.34199999999999997,9.083999999999999E-2,1.0172825598915782,1.039519121111228,1.039519121111228,14.399999999999999,0.93267153510695544,6.2631844223630901,2.8942811226088558,null,93.26715351069555,0.51701672486198624,0.41650763386236117,0.28469020101650411,0.13155823284585708,0.93352435872434736]
["VsdTop",{"$f":"Vsd_Q1","v":0.7},"V",null,null,null,37,24,1,2.96,2.96,0.68518518518518512,0.21381185499249539,2.4212239458043099,4.1706119729021545,1.749388027097845,0,3.04140216287017,0.12210167793530978,0.39590702674761175,0.52353562370661355,0.6989471484392431,9.7705423262269865E-4,9.7705423262269865E-4,1.2469613326467559,1.5549125651161736E-3,1.5549125651161736E-3,1.4063380950734825,4.1533523590753144E-2,0.19409478952016485,3.8400000000000011E-2,0,0.27503354699440397,2.696727698277384,9.4540423622533676E-2,3.3152000000000001E-2,0.1287636804373592,2.6639999999999997E-2,8.3999999999999993E-4,0.09,0.37259999999999999,0.34199999999999997,9.083999999999999E-2,1.0372094414163731,1.0611179335804497,1.0611179335804497,14.8,0.93309942350697117,6.4375508338768874,3.0262073696219023,null,93.309942350697114,0.52353562370661355,0.43043722743176316,0.29261594699440396,0.13755488043735919,0.95397285113837671]
["θJATop",{"$f":"ThetaJA_Q1","v":22},"°C/W","Junction to Ambient Resistance",null,null,38,24,1,3.04,3.04,0.70370370370370361,0.21395967972738222,2.4225471597090098,4.2512735798545052,1.8287264201454951,0,3.1194007803451371,0.12844472821511563,0.39590702674761175,0.53024024853910867,0.69932912739128006,9.781224568356985E-4,9.781224568356985E-4,1.2792621722301147,1.6365117052989117E-3,1.6365117052989117E-3,1.4429030320738601,4.3721352359326719E-2,0.19934059464233153,3.8400000000000011E-2,0,0.28254904853451807,2.765626885255839,9.9432996889848871E-2,3.4048000000000002E-2,0.13465927955365306,2.7359999999999999E-2,8.3999999999999993E-4,0.09,0.37259999999999999,0.34199999999999997,9.083999999999999E-2,1.0574946988542344,1.0831689594782512,1.0831689594782512,15.2,0.93347922863333366,6.6133462677593977,3.1611377501803672,null,93.347922863333366,0.53024024853910867,0.44456832808817109,0.30060664853451807,0.14368807955365306,0.97480857662727982]
["Low-side FET","Input Value","Units","Description",null,null,39,24,1,3.12,3.12,0.72222222222222221,0.21410749167240697,2.4238697441334534,4.3319348720667268,1.9080651279332734,0,3.1974982999282111,0.13495673899017818,0.39590702674761175,0.53713120582829277,0.69971092462801932,9.7919075608759554E-4,9.7919075608759554E-4,1.3116193903761584,1.7203454252107254E-3,1.7203454252107254E-3,1.4795384433204972,4.596971411052804E-2,0.20458639976449811,3.8400000000000011E-2,0,0.29012978600698286,2.834600743099557,0.10445449784614728,3.4944000000000003E-2,0.14069173569118715,2.8080000000000001E-2,8.3999999999999993E-4,0.09,0.37259999999999999,0.34199999999999997,9.083999999999999E-2,1.0781383774589635,1.1056760015310747,1.1056760015310747,15.600000000000001,0.93381435139591251,6.7905768921536236,3.2990789852061173,null,93.381435139591247,0.53713120582829277,0.45890152169817,0.30866258600698288,0.14995813569118716,0.99603272752646277]
["RdsonBot",{"$f":"Rdson2*1000","v":13},"mW","Drain-Source Resistance of Low-side FET",null,null,40,24,1,3.2,3.2,0.7407407407407407,0.21425529082922934,2.4251916991593307,4.4125958495796658,1.9874041504203348,0,3.2756876476254488,0.14163771025543848,0.39590702674761175,0.5442091199423218,0.70009254017304279,9.8025912961188723E-4,9.8025912961188723E-4,1.3440300947900066,1.806416895701234E-3,1.806416895701234E-3,1.5162410858906346,4.8278727641399032E-2,0.20983220488666476,3.8400000000000011E-2,0,0.29777604239155431,2.9036429763769402,0.10960485294542077,3.5840000000000004E-2,0.14686136414885995,2.8799999999999999E-2,8.3999999999999993E-4,0.09,0.37259999999999999,0.34199999999999997,9.083999999999999E-2,1.0991405224765347,1.1286429692478352,1.1286429692478352,16,0.9341078583239687,6.9692489326141951,3.4400380112749191,null,93.410785832396868,0.5442091199423218,0.47343740654041427,0.31678404239155433,0.15636536414885996,1.0176465264827361]
["RdsonBotTc",{"$f":"RdsonBotTc*1000000","v":4000},"ppm","Drain To Source Resitance Temp Co",null,null,41,24,1,3.28,3.28,0.75925925925925919,0.21440307719950891,2.4265130248683189,4.4932565124341597,2.0667434875658404,0,3.3539624011490199,0.14848764200584116,0.39590702674761175,0.55147463329212587,0.70047397404992851,9.8132757664259993E-4,9.8132757664259993E-4,1.3764916577034918,1.894729283727307E-3,1.894729283727307E-3,1.5530080140906073,5.0648511728422697E-2,0.21507801000883134,3.8400000000000011E-2,0,0.30548810330215748,2.9727478696471468,0.11488398865439144,3.6735999999999998E-2,0.15316849007709948,2.9519999999999998E-2,8.3999999999999993E-4,0.09,0.37259999999999999,0.34199999999999997,9.083999999999999E-2,1.1205011791450983,1.1520738808563322,1.1520738808563322,16.399999999999999,0.93436252099457751,7.1493686726474639,3.5840219816961882,null,93.436252099457747,0.55147463329212587,0.48817659337925695,0.32497130330215745,0.16291009007709947,1.0396512266713829]
["QgBot",{"$f":"Qg_Q2*1000000000","v":12},"nC","Gate Charge Of Top FET",null,null,42,24,1,3.36,3.36,0.77777777777777779,0.2145508507849048,2.4278337213420795,4.5739168606710399,2.1460831393289599,0,3.4323167173509996,0.15550653423633429,0.39590702674761175,0.55892840647935416,0.70085522628225028,9.8239609641428841E-4,9.8239609641428841E-4,1.409001686427177,1.9852857523546289E-3,1.9852857523546289E-3,1.5898365463682069,5.3079185127527753E-2,0.22032381513099797,3.8400000000000011E-2,0,0.31326625701173749,3.0419102228762696,0.12029183145250903,3.7631999999999999E-2,0.15961344852873055,3.0240000000000003E-2,8.3999999999999993E-4,0.09,0.37259999999999999,0.34199999999999997,9.083999999999999E-2,1.1422203926949808,1.1759728653070813,1.1759728653070813,16.8,0.93458084999801805,7.3309424542582242,3.7310382676320719,null,93.458084999801798,0.55892840647935416,0.50311970554046803,0.33322465701173748,0.16959264852873054,1.0620481120198222]
["RGateBot",{"$f":"Rgate2","v":1},"W","Gate Resistance",null,null,43,24,1,3.44,3.44,0.79629629629629617,0.21469861158707607,2.4291537886622625,4.6545768943311314,2.2254231056688685,0,3.5107452690391847,0.16269438694186944,0.39590702674761175,0.56657111844888874,0.70123629689357836,9.8346468816203764E-4,9.8346468816203764E-4,1.4415579977091681,2.0780894607592662E-3,2.0780894607592662E-3,1.6267242365021419,5.5570866574093013E-2,0.22556962025316457,3.8400000000000011E-2,0,0.3211107944774132,3.1111252952038977,0.12582830783194801,3.8528E-2,0.16619658451164437,3.0959999999999998E-2,8.3999999999999993E-4,0.09,0.37259999999999999,0.34199999999999997,9.083999999999999E-2,1.1642982083486868,1.2003441643465431,1.2003441643465431,17.2,0.93476512430281644,7.5139766785030906,3.8810944592561762,null,93.476512430281645,0.56657111844888874,0.51826737898905761,0.34154439447741319,0.17641338451164437,1.0848384974379464]
["VsdBot",{"$f":"Vsd_Q2","v":0.7},"V","Diode Forward Voltage of Bottom FET Body Diode",null,null,44,24,1,3.52,3.52,0.81481481481481488,0.21484635960768134,2.4304732269105007,4.7352366134552506,2.3047633865447494,0,3.5892431898048827,0.17005120011740163,0.39590702674761175,0.57440346664599484,0.70161718590747801,9.8453335112145711E-4,9.8453335112145711E-4,1.4741585953448919,2.1731435642292248E-3,2.1731435642292248E-3,1.6636688484441287,5.8123674782951676E-2,0.2308154253753312,3.8400000000000011E-2,0,0.32902200936593895,3.1803887558405992,0.13149334429760506,3.9424000000000001E-2,0.17291825304328809,3.168E-2,8.3999999999999993E-4,0.09,0.37259999999999999,0.34199999999999997,9.083999999999999E-2,1.1867346713209013,1.2251921346618013,1.2251921346618013,17.600000000000001,0.93491741673085393,7.6984778060506569,4.0341983669523378,null,93.4917416730854,0.57440346664599484,0.53362026240922711,0.34993080936593896,0.18337265304328809,1.108023729055222]
["QrrBot",{"$f":"Qrr_Q2*1000000000","v":3},"nC","Reverse Recovery Charge of Body Diode",null,null,45,24,1,3.6,3.6,0.83333333333333326,0.214994094848379,2.4317920361684155,4.8158960180842083,2.3841039819157923,0,3.6678060257140568,0.17757697375788933,0.39590702674761175,0.58242616717817741,0.7019978933475115,9.8560208452868822E-4,9.8560208452868822E-4,1.50680165057184,2.2704512141660214E-3,2.2704512141660214E-3,1.7006683342900675,6.0737728448396013E-2,0.23606123049749783,3.8400000000000011E-2,0,0.33700019807947851,3.2496966410739621,0.13728686736709608,4.0320000000000002E-2,0.17977881920698979,3.2399999999999998E-2,8.3999999999999993E-4,0.09,0.37259999999999999,0.34199999999999997,9.083999999999999E-2,1.2095298268184909,1.2505212500988392,1.2505212500988392,18,0.93503961613026876,7.8844523577485273,4.1903580225537755,null,93.503961613026874,0.58242616717817741,0.54917901728646834,0.35838419807947852,0.1904708192069898,1.1316051844646458]
["TrrBot",{"$f":"Trr_Q2*1000000000","v":40},"ns","Reverse Recovery Time of Body Diode",null,null,46,24,1,3.68,3.68,0.85185185185185186,0.21514181731082707,2.4331102165176128,4.8965551082588066,2.4634448917411937,0,3.7464296928956506,0.18527170785829464,0.39590702674761175,0.59063995498181232,0.70237841923723621,9.8667088762039758E-4,9.8667088762039758E-4,1.5394854848572765,2.3700155580862439E-3,2.3700155580862439E-3,1.7377208149398782,6.3413146244181609E-2,0.24130703561966443,3.8400000000000011E-2,0,0.34504565978169582,3.3190453165232445,0.1432088035707535,4.1216000000000003E-2,0.18677865821013806,3.3119999999999997E-2,8.3999999999999993E-4,0.09,0.37259999999999999,0.34199999999999997,9.083999999999999E-2,1.2326837200405059,1.2763361039566399,1.2763361039566399,18.400000000000002,0.93513344673452758,8.0719069151973084,4.3495816806230376,null,93.513344673452764,0.59063995498181232,0.56494431799183387,0.36690485978169585,0.19770825821013807,1.1555842729736461]
["θJABot",{"$f":"ThetaJA_Q2","v":22},"°C/W","Junction to Ambient Resistance",null,null,47,24,1,3.76,3.76,0.87037037037037013,0.21528952699668341,2.4344277680396833,4.9772138840198412,2.5427861159801584,0,3.8251104402117448,0.19313540241358293,0.39590702674761175,0.59904558399362917,0.7027587636002055,9.8773975963377912E-4,9.8773975963377912E-4,1.5722085547481002,2.4718397396231101E-3,2.4718397396231101E-3,1.7748245630743333,6.6150046823531969E-2,0.24655284074183106,3.8400000000000011E-2,0,0.35315869642416753,3.3884314439169176,0.14925907945162353,4.2111999999999997E-2,0.19391815544423308,3.3839999999999995E-2,8.3999999999999993E-4,0.09,0.37259999999999999,0.34199999999999997,9.083999999999999E-2,1.2561963961781812,1.3026414113594555,1.3026414113594555,18.799999999999997,0.9352004851151865,8.2608481213316853,4.5118778197731277,null,93.520048511518652,0.59904558399362917,0.58091685186840059,0.37549309642416751,0.20508535544423306,1.1799624358620298]
[null,null,null,null,null,null,48,24,1,3.84,3.84,0.88888888888888884,0.2154372239076055,2.4357446908162061,5.0578723454081027,2.622127654591897,0,3.9038448163193267,0.20116805741872326,0.39590702674761175,0.60764382732711941,0.70313892645996923,9.8880869980655611E-4,9.8880869980655611E-4,1.6049694385028128,2.5759268985280342E-3,2.5759268985280342E-3,1.8119779881342362,6.8948548819142877E-2,0.25179864586399769,3.8400000000000011E-2,0,0.36133961277311938,3.4578519517787751,0.1554376215654637,4.3007999999999998E-2,0.20119770654682945,3.456E-2,8.3999999999999993E-4,0.09,0.37259999999999999,0.34199999999999997,9.083999999999999E-2,1.2800679004149393,1.3294420117096537,1.3294420117096537,19.2,0.93524217506976759,8.4512826810086263,4.6772551440302479,null,93.524217506976754,0.60764382732711941,0.5970973193199488,0.38414921277311936,0.21260250654682944,1.2047411466470681]
[null,null,null,null,null,null,49,24,1,3.92,3.92,0.90740740740740744,0.2155849080452506,2.4370609849287455,5.1385304924643727,2.7014695075356272,0,3.9826296405375792,0.20936967286868802,0.39590702674761175,0.616435477453949,0.70351890784007287,9.8987770737697786E-4,9.8987770737697786E-4,1.6377668242677856,2.6822801706721882E-3,2.6822801706721882E-3,1.8491796230347644,7.1808770843186862E-2,0.2570444509861643,3.8400000000000011E-2,0,0.36958871643649499,3.527304009500952,0.1617443564807394,4.3903999999999999E-2,0.20861771746538835,3.5279999999999999E-2,8.3999999999999993E-4,0.09,0.37259999999999999,0.34199999999999997,9.083999999999999E-2,1.3042982779263903,1.3567428712236842,1.3567428712236842,19.600000000000001,0.93525984073189794,8.6432173616028898,4.8457225842385432,null,93.52598407318979,0.616435477453949,0.61348643390188329,0.39287351643649499,0.22026011746538834,1.2299219113558322]
[null,null,null,null,null,null,50,24,1,4,4,0.92592592592592582,0.21573257941127555,2.4383766504588489,5.2191883252294247,2.7808116747705753,0,4.0614619770215636,0.21774024875845319,0.39590702674761175,0.6254213463904581,0.70389870776405727,9.9094678158381951E-4,9.9094678158381951E-4,1.6705994995952966,2.7909026880480556E-3,2.7909026880480556E-3,1.8864281123874289,7.4730831487317573E-2,0.2622902561083309,3.8400000000000011E-2,0,0.37790631789135765,3.596785004359631,0.16817921077862205,4.48E-2,0.21617860452306237,3.6000000000000004E-2,8.3999999999999993E-4,0.09,0.37259999999999999,0.34199999999999997,9.083999999999999E-2,1.3288875738803354,1.3845490855537999,1.3845490855537999,20,0.9352546981460963,8.8366589936098681,5.0172892995073717,null,93.525469814609636,0.6254213463904581,0.63008492241442005,0.40166631789135765,0.22805860452306237,1.2555062688048781]
[null,null,null,null,null,null,51,24,1,4.08,4.08,0.94444444444444431,0.21588023800733711,2.4396916874880543,5.299845843744027,2.8601541562559731,0,4.1403391118159867,0.22627978508299815,0.39590702674761175,0.634602265889327,0.70427832625546027,9.9201592166638509E-4,9.9201592166638509E-4,1.7034663421303642,2.9017975787710027E-3,2.9017975787710027E-3,1.9237222020352991,7.7714849322674348E-2,0.26753606123049756,3.8400000000000011E-2,0,0.38629273051163365,3.6662925210939803,0.17474211105298551,4.5696000000000001E-2,0.22388079448643,3.6720000000000003E-2,8.3999999999999993E-4,0.09,0.37259999999999999,0.34199999999999997,9.083999999999999E-2,1.3538358334367673,1.4128658824982718,1.4128658824982718,20.399999999999999,0.93522786551253234,9.0316144712559403,5.1919646787014599,null,93.522786551253233,0.634602265889327,0.64689352499806363,0.41052793051163367,0.23599839448643001,1.2814957908873907]
["Controller","Input Value","Units","Std Units",null,null,52,24,1,4.16,4.16,0.96296296296296291,0.21602788383509161,2.4410060960978823,5.3805030480489417,2.939496951951059,0,4.219258532423944,0.23498828183730577,0.39590702674761175,0.64397908763650091,0.70465776333781494,9.9308512686450403E-4,9.9308512686450403E-4,1.7363663113182159,3.0149679670808281E-3,3.0149679670808281E-3,1.9610607297350284,8.0760942899886529E-2,0.27278186635266416,3.8400000000000011E-2,0,0.3947482705961981,3.7358243237233961,0.1814329839104038,4.6592000000000001E-2,0.23172472463520541,3.7440000000000001E-2,8.3999999999999993E-4,0.09,0.37259999999999999,0.34199999999999997,9.083999999999999E-2,1.3791431017478719,1.4416986248029762,1.4416986248029762,20.8,0.93518037227627671,9.2280907531163585,5.369758341974519,null,93.518037227627673,0.64397908763650091,0.66391299523140357,0.41945867059619812,0.24407992463520542,1.3078920828679044]
["θJA",22,"°C/W","Junction to Ambient Resistance",null,null,53,24,1,4.24,4.24,0.98148148148148151,0.2161755168961951,2.4423198763698384,5.4611599381849194,3.018840061815081,0,4.298217909577092,0.24386573901636233,0.39590702674761175,0.65355268345345618,0.70503701903464988,9.9415439641853051E-4,9.9415439641853051E-4,1.7692984410051698,3.1304169733433239E-3,3.1304169733433239E-3,1.9984426168427347,8.3869230749077997E-2,0.27802767147483076,3.8400000000000011E-2,0,0.40327325739731246,3.8053783393239664,0.18825175597014837,4.7488000000000002E-2,0.23971084283394287,3.8159999999999999E-2,8.3999999999999993E-4,0.09,0.37259999999999999,0.34199999999999997,9.083999999999999E-2,1.4048094239580313,1.4710528130573279,1.4710528130573279,21.200000000000003,0.93511316720985815,9.4260948627408752,5.5506801423467431,null,93.511316720985818,0.65355268345345618,0.68114410023125527,0.42845885739731249,0.25230364283394285,1.3346967836847115]
["Theta Ja",2,"°C/W","Junction to Ambient Resistance",null,null,54,24,1,4.32,4.32,1,0.21632313719230334,2.4436330283854182,5.5418165141927096,3.098183485807291,0,4.3772150809372707,0.25291215661515776,0.39590702674761175,0.66332394550490414,0.70541609336949085,9.9522372956934845E-4,9.9522372956934845E-4,1.8022618328233659,3.2481477140518383E-3,3.2481477140518383E-3,2.0358668608806361,8.7039831379871493E-2,0.28327347659699736,3.8400000000000011E-2,0,0.41186801314941412,3.8749526435238795,0.1951983538641851,4.8384000000000003E-2,0.24783960760576024,3.8880000000000005E-2,8.3999999999999993E-4,0.09,0.37259999999999999,0.34199999999999997,9.083999999999999E-2,1.4308348452038233,1.5009340886876736,1.5009340886876736,21.6,0.93502712561641954,9.6256338892871103,5.7347401673267253,null,93.502712561641957,0.66332394550490414,0.69858762075517444,0.43752881314941411,0.26067000760576026,1.3619115662600785]
[null,null,null,null,null,null,55,24,1,4.4000000000000004,4.4000000000000004,1.0185185185185184,0.21647074472507188,2.4449455522260992,5.6224727761130495,3.1775272238869507,0,4.4562480364965307,0.26212753462868527,0.39590702674761175,0.67329378651202509,0.70579498636585836,9.9629312555836436E-4,9.9629312555836436E-4,1.8352556502647874,3.368163301828828E-3,3.368163301828828E-3,2.0733325288781912,9.027286328139314E-2,0.28851928171916402,3.8400000000000011E-2,0,0.42053286309826776,3.9445454475103654,0.20227270423717172,4.9280000000000004E-2,0.25611148820810503,3.9599999999999996E-2,8.3999999999999993E-4,0.09,0.37259999999999999,0.34199999999999997,9.083999999999999E-2,1.4572194106140259,1.531348237051396,1.531348237051396,22,0.93492305576268664,9.8267149881618909,5.9219487405783111,null,93.492305576268663,0.67329378651202509,0.71624435130637276,0.44666886309826775,0.26917948820810506,1.389538137818398]
[null,null,null,null,null,null,56,24,1,4.4800000000000004,4.4800000000000004,1.037037037037037,0.216618339496156,2.4462574479733483,5.7031287239866746,3.2568712760133263,0,4.5353149054739035,0.27151187305194169,0.39590702674761175,0.6834631399713289,0.70617369804726982,9.9736258362751319E-4,9.9736258362751319E-4,1.8682791133627281,3.4904668454274214E-3,3.4904668454274214E-3,2.1108387513957916,9.3568444922277047E-2,0.29376508684133068,3.8400000000000011E-2,0,0.42926813553047966,4.0141550863686888,0.20947473374645498,5.0176000000000005E-2,0.26452696471058768,4.0320000000000009E-2,8.3999999999999993E-4,0.09,0.37259999999999999,0.34199999999999997,9.083999999999999E-2,1.4839631653096159,1.5623011906351019,1.5623011906351019,22.400000000000002,0.93480170463571022,10.029345381670552,6.1123164236329295,null,93.480170463571028,0.6834631399713289,0.73411510024106741,0.45587933553047966,0.2778325647105877,1.4175782402123964]
["Outputs",null,null,null,null,null,57,24,1,4.5599999999999996,4.5599999999999996,1.0555555555555554,0.21676592150721052,2.447568715708615,5.7837843578543069,3.3362156421456923,0,4.614413944533978,0.28106517187992708,0.39590702674761175,0.69383296037924647,0.70655222843723775,9.9843210301925334E-4,9.9843210301925334E-4,1.9013314939097192,3.6150614497329646E-3,3.6150614497329646E-3,2.1483847171512389,9.6926694750669187E-2,0.29901089196349723,3.8400000000000011E-2,0,0.43807416180338232,4.0837800085975022,0.21680436906206799,5.1071999999999992E-2,0.27308652807490752,4.104E-2,8.3999999999999993E-4,0.09,0.37259999999999999,0.34199999999999997,9.083999999999999E-2,1.5110661544037731,1.5937990323604321,1.5937990323604321,22.799999999999997,0.93466376310446253,10.233532359674411,6.3058540176479649,null,93.46637631044625,0.69383296037924647,0.75220068987828981,0.46516056180338233,0.2866297280749075,1.4460336502575362]
["Design","Value","Units",null,null,null,58,24,1,4.6399999999999997,4.6399999999999997,1.074074074074074,0.21691349075989011,2.4488793555133364,5.8644396777566676,3.4155603222433317,0,4.6935435271752075,0.29078743110764538,0.39590702674761175,0.70440422346255049,0.70693057755927102,9.9950168297656904E-4,9.9950168297656904E-4,1.9344121111502044,3.7419502157645906E-3,3.7419502157645906E-3,2.1859696681796725,0.10034773119423251,0.30425669708566383,3.8400000000000011E-2,0,0.44695127637529553,4.1534187666652089,0.22426153686672765,5.1967999999999993E-2,0.28179068023689657,4.1759999999999992E-2,8.3999999999999993E-4,0.09,0.37259999999999999,0.34199999999999997,9.083999999999999E-2,1.538528423001881,1.6258479990011565,1.6258479990011565,23.2,0.93450987055642287,10.439283280256502,6.5025725652117243,null,93.450987055642287,0.70440422346255049,0.77050195661219212,0.47451287637529554,0.29557148023689656,1.4749061800747425]
["Dmax",{"$f":"D1_Vinmin","v":0.41666666666666669},"index",null,null,null,59,24,1,4.72,4.72,1.0925925925925923,0.21706104725584921,2.4501893674689357,5.9450946837344674,3.4949053162655321,0,4.7727021341553968,0.30067865073010352,0.39590702674761175,0.71517792641471489,0.7073087454368745,1.0005713227429706E-3,1.0005713227429706E-3,1.9675203278941649,3.8711362406767622E-3,3.8711362406767622E-3,2.2235928954664992,0.10383167266015089,0.30950250220783049,3.8400000000000011E-2,0,0.45589981683616632,4.2230700084893682,0.23184616385583109,5.2863999999999994E-2,0.29063993419070866,4.2479999999999997E-2,8.3999999999999993E-4,0.09,0.37259999999999999,0.34199999999999997,9.083999999999999E-2,1.566350016201528,1.6584544847154039,1.6584544847154039,23.599999999999998,0.93434061906998389,10.646605570395659,6.70248335219559,null,93.434061906998394,0.71517792641471489,0.78901975102687494,0.48393661683616629,0.30465833419070865,1.5041976774415899]
["Dprime",{"$f":"1-B68","v":0.58333333333333326},"index",null,null,null,60,24,1,4.8,4.8,1.1111111111111109,0.21720859099674181,2.4514987516568216,6.0257493758284104,3.5742506241715892,0,4.8518883448386614,0.31073883074231246,0.39590702674761175,0.72615508813832474,0.70768673209354882,1.0016410215624926E-3,1.0016410215624926E-3,2.0006555470047402,4.0026226177608372E-3,4.0026226177608372E-3,2.2612537350005626,0.10737863753513391,0.31474830732999703,3.8400000000000011E-2,0,0.46492012393859578,4.2927324697361762,0.23955817673745425,5.3759999999999995E-2,0.29963481407518294,4.3200000000000002E-2,8.3999999999999993E-4,0.09,0.37259999999999999,0.34199999999999997,9.083999999999999E-2,1.5945309790925091,1.6916250446970196,1.6916250446970196,24,0.93415655717557711,10.855506726649107,6.9055979096540243,null,93.415655717557712,0.72615508813832474,0.80775493801377873,0.49343212393859576,0.31389081407518293,1.5339100261521035]
["Ipp",{"$f":"Iripple_Vinnom","v":2.4421750148918102},"A",null,null,null,61,24,1,4.88,4.88,1.1296296296296295,0.21735612198422172,2.4528075081583882,6.106403754079194,3.6535962459208058,0,4.9311008293625314,0.32096797113928593,0.39590702674761175,0.73733674949364336,0.70806453755279031,1.0027107786796936E-3,1.0027107786796936E-3,2.0338172082187262,4.136412436446614E-3,4.136412436446614E-3,2.2989515642013529,0.1109887441854208,0.31999411245216369,3.8400000000000011E-2,0,0.47401254162925871,4.3624049668498222,0.24739750223234797,5.4655999999999996E-2,0.3087758552624067,4.3919999999999994E-2,8.3999999999999993E-4,0.09,0.37259999999999999,0.34199999999999997,9.083999999999999E-2,1.6230713567568302,1.7253663989502235,1.7253663989502235,24.4,0.93395819325161489,11.065994315843692,7.1119280157729472,null,93.395819325161483,0.73733674949364336,0.82670839689166531,0.50299974162925876,0.32326945526240669,1.5640451463853087]
["Top FET","Value","Units",null,null,null,62,24,1,4.96,4.96,1.1481481481481481,0.21750364021994242,2.4541156370550166,6.1870578185275082,3.7329421814724917,0,5.0103383415364107,0.33136607191604173,0.39590702674761175,0.74872397355346088,0.70844216183809194,1.0037805933396583E-3,1.0037805933396583E-3,2.0670047852639075,4.2725087823038922E-3,4.2725087823038922E-3,2.3366857986797651,0.11466211095678552,0.3252399175743303,3.8400000000000011E-2,0,0.4831774170807186,4.4320863907327146,0.25536406707393583,5.5551999999999997E-2,0.31806360444851056,4.4639999999999999E-2,8.3999999999999993E-4,0.09,0.37259999999999999,0.34199999999999997,9.083999999999999E-2,1.6519711942687054,1.7596854361919254,1.7596854361919254,24.8,0.93374599859552299,11.27807597577581,7.3214856978672325,null,93.374599859552305,0.74872397355346088,0.84588102152922917,0.5126398170807186,0.33279480444851056,1.5946049950826899]
["Tr",{"$f":"(Qgd_Q1+Qgs_Q1/2)*(RdsonDRT+Rgate1)/(VCC-Vsp_Q1)*1000000000","v":2.6162790697674425},"ns","Turn on of MOSFET -> Rise time of current",null,null,63,24,1,5.04,5.04,1.1666666666666665,0.21765114570555716,2.4554231384280736,6.267711569214037,3.812288430785963,0,5.0895997123933032,0.3419331330676007,0.39590702674761175,0.76031784586433748,0.70881960497294205,1.0048504647879953E-3,1.0048504647879953E-3,2.1002177832415412,4.4109147370440136E-3,4.4109147370440136E-3,2.3744558892967911,0.11839885617454052,0.33048572269649701,3.8400000000000011E-2,0,0.49241510072364758,4.5017757010070794,0.26345779800831115,5.6447999999999998E-2,0.32749861974672362,4.5359999999999998E-2,8.3999999999999993E-4,0.09,0.37259999999999999,0.34199999999999997,9.083999999999999E-2,1.681230536694561,1.7945892178862397,1.7945892178862397,25.2,0.93352041020512466,11.491759415920248,7.53428323442792,null,93.352041020512473,0.76031784586433748,0.86527372047037121,0.52235270072364759,0.34246741974672362,1.6255915663347087]
["Tf",{"$f":"(Qgd_Q1+Qgs_Q1/2)*(RdsonDRT2+Rgate1)/(Vsp_Q1)*1000000000","v":2.8481012658227853},"ns","Turn off of MOSFET -> Fall time of current",null,null,64,{"$f":"Vin","v":24},{"$f":"MODE","v":1},5.12,{"$f":"Iout*G73/100/Number_of_Phases","v":5.12},{"$f":"Vout*K73/(Vin*Efficiency)","v":1.1851851851851851},{"$f":"(Vout+(Rdson2+Rs+Rdcr)*K73)/(Vin+(Rs+Rdson2-Rdson1)*K73)","v":0.21779863844271888},{"$f":"(Vin-(Rdson1+Rdcr)*K73-Vout)*M73/(Fsw*Lf)","v":2.4567300123589102},6.3483650061794554,3.8916349938205448,{"$f":"IF(MIN(Vin, -P73/(Coss_Q1+Coss_Q2)*0.00000002)<0, 0, MIN(Vin, -P73/(Coss_Q1+Coss_Q2)*0.00000002))","v":0},5.1688838443261051,{"$f":"R73^2*Rdcr","v":0.35266915458898751},{"$f":"Core_Loss","v":0.39590702674761175},{"$f":"(T73+S73*(1+Ltc*(Ta-25)))/(1-S73*Ltc*ThetaCa)","v":0.77211947471437026},0.70919686698082474,1.0059203922708354E-3,1.0059203922708354E-3,2.1334557362461108,4.5516333785214349E-3,4.5516333785214349E-3,2.4122613194888292,{"$f":"Rdson1*AB73^2","v":0.12219909814354174},{"$f":"(Vin*K73/2)*Fsw*(Tr_buck+Tf_buck)","v":0.33573152781866356},{"$f":"(0.5*Coss_Q1*(Vin-Q73)^2-0.5*Coss_Q2*(Vin-Q73)^2+(Qoss_Q2*(Vin-Q73)/Vin)*Vin)*Fsw","v":3.8400000000000011E-2},{"$f":"IF(K73>N73/2,0,ABS(K73-N73/2)*Vsd_Q1*Deadtime*Fsw)","v":0},{"$f":"(AF73+AE73+AD73+AC73*(1+RdsonTopTc*Ta-RdsonTopTc*25))/(1-AC73*RdsonTopTc*ThetaJA_Q1)","v":0.50172594627945499},{"$f":"SQRT((1-M73))*SQRT(K73^2+(N73^2)/12)","v":4.5714719207967827},{"$f":"Rdson2*AH73^2","v":0.27167862179423452},{"$f":"IF(K73<N73/2,Deadtime*Fsw*Vsd_Q2*(K73+N73/2),2*Deadtime*Fsw*Vsd_Q2*K73)","v":5.7343999999999999E-2},{"$f":"(AJ73+AI73*(1+RdsonBotTc*Ta-RdsonBotTc*25))/(1-AI73*RdsonBotTc*ThetaJA_Q2)","v":0.33708147078272138},{"$f":"Qrr_Q2*K73/Iout*Fsw*Vin","v":4.6080000000000003E-2},{"$f":"Iq*Vin","v":8.3999999999999993E-4},{"$f":"IF(Ext_VCC=1,  (Qg_Q1+Qg_Q2)*Fsw*Vout, (Qg_Q1+Qg_Q2)*Fsw*Vin)","v":0.09},{"$f":"(Vin-VCC)*Fsw*(Qg_Q1+Qg_Q2)","v":0.37259999999999999},{"$f":"(Qg_Q1+Qg_Q2)*Fsw*(Vin-Vout)","v":0.34199999999999997},9.083999999999999E-2,1.7108494290930389,{"$f":"((T73+S73*(1+Ltc*(Ta-25))) + (AF73+AE73+AD73+AC73*(1+RdsonTC*(Ta-25))) + (AJ73+AI73*(1+RdsonTC*(Ta-25))) + AQ73 + AL73) / (1-S73*Ltc*ThetaCa-AC73*RdsonTC*ThetaJA_Q1 -AI73*RdsonTC*ThetaJA_Q2)","v":1.8300849824159411},1.8300849824159411,{"$f":"Vout*K73","v":25.6},0.93328183330131442,{"$f":"ThetaJA_Q1*BC73","v":11.70705241814801},{"$f":"ThetaJA_Q2*BD73","v":7.7503331572198704},null,93.328183330131438,{"$f":"U73","v":0.77211947471437026},{"$f":"AG73+AK73+AL73","v":0.88488741706217644},{"$f":"AG73+AL73*0.66","v":0.53213874627945501},{"$f":"AK73+AL73*0.33","v":0.35228787078272139},1.6570068917765468]
["Part Power","Value","Units",null,null,null,65,24,1,{"$f":"Iout*G74/100","v":5.2},5.2,1.2037037037037037,0.21794611843308018,2.4580362589288667,{"$f":"K74+N74/2","v":6.4290181294644331},{"$f":"K74-N74/2","v":3.9709818705355668},0,{"$f":"SQRT(K74^2+(N74^2)/12)","v":5.2481897057478228},0.3635741364752299,0.39590702674761175,0.78412999140760653,{"$f":"N74/SQRT(12)","v":0.70957394788522099},{"$f":"RCoutEsr*V74^2","v":1.0069903750348367E-3},{"$f":"W74","v":1.0069903750348367E-3},{"$f":"SQRT(M74*(1-M74))*SQRT(K74^2+(N74^2)/12)","v":2.1667182051977276},{"$f":"RCinEsr*Y74^2","v":4.6946677807352625E-3},{"$f":"Z74","v":4.6946677807352625E-3},{"$f":"SQRT(M74)*SQRT(K74^2+(N74^2)/12)","v":2.4501016028319409},0.12606295514819257,0.34097733294083021,3.8400000000000011E-2,0,0.5111103107933308,4.6411741319754176,0.28002646520313101,5.824E-2,0.34681273879229629,4.6800000000000001E-2,8.3999999999999993E-4,0.09,0.37259999999999999,0.34199999999999997,9.083999999999999E-2,{"$f":"SUM(S74,T74,AC74,AD74,AE74,AF74,AI74,AJ74,AQ74, AL74)","v":1.7408279165149954},1.8661801493958086,{"$f":"AS74","v":1.8661801493958086},26,{"$f":"AU74/(AU74+AT74)","v":0.93303064361922339},11.923962837453278,7.9696482534305186,null,{"$f":"AV74*100","v":93.303064361922338},0.78412999140760653,0.9047230495856271,0.54199831079333083,0.36225673879229631,{"$f":"BA74+BB74","v":1.6888530409932336}]
["Power Dis",{"$f":"AQ9","v":9.083999999999999E-2},"W",null,null,null,66,24,1,5.28,5.28,1.2222222222222223,0.2180935856782934,2.4593418782192651,6.5096709391096326,4.0503290608903679,0,5.3275163262221534,0.37464807872135941,0.39590702674761175,0.79635055054523685,0.70995084770960626,1.008060412327177E-3,1.008060412327177E-3,2.2000047758654535,4.8400210138308045E-3,4.8400210138308045E-3,2.4879762808206438,0.12999054545244859,0.34622313806299682,3.8400000000000011E-2,0,0.52056855466771046,4.7108814708329767,0.28850125501908708,5.9136000000000001E-2,0.35669301672138554,4.752E-2,8.3999999999999993E-4,0.09,0.37259999999999999,0.34199999999999997,{"$f":"SUM(AM75:AN75)","v":9.083999999999999E-2},1.7711660440035037,1.9028823241330213,1.9028823241330213,26.400000000000002,0.93276718949184589,12.142498602689631,8.1922415678704823,null,93.276718949184584,0.79635055054523685,0.924781571389096,0.55193175466771049,0.37237461672138555,1.7211321219343327]
["Temp rise",{"$f":"B75*B62","v":1.9984799999999998},"°C",null,null,null,67,24,1,5.36,5.36,1.2407407407407407,0.21824104018001067,2.4606468703114177,6.5903234351557094,4.1296765648442912,0,5.4068627920169927,0.38589098132241079,0.39590702674761175,0.8087823303137025,0.71032756647745365,1.0091305033955627E-3,1.0091305033955627E-3,2.2333150570622879,4.987696144101131E-3,4.987696144101131E-3,2.5258849208395953,0.13398198729982183,0.35146894318516347,3.8400000000000011E-2,0,0.53010104169616723,4.7805931241189041,0.29710291803884825,6.0032000000000002E-2,0.36672290932848894,4.8240000000000012E-2,8.3999999999999993E-4,0.09,0.37259999999999999,0.34199999999999997,9.083999999999999E-2,1.8018638565938563,1.9401993022400073,1.9401993022400073,26.8,0.9324917937472762,12.362667717315681,8.4181264052267579,null,93.249179374727618,0.8087823303137025,0.94506395102465623,0.56193944169616727,0.38264210932848897,1.7538462813383586]
["Current (switching)",{"$f":"(Qg_Q1+Qg_Q2)*Fsw+Iq","v":1.8034999999999999E-2},"A",null,null,null,68,24,1,5.44,5.44,1.2592592592592593,0.21838848193988381,2.4619512352866204,6.670975617643311,4.2090243823566897,0,5.4862282420387976,0.39730284427342233,0.39590702674761175,0.82142653277985611,0.71070410421223107,1.0102006474882197E-3,1.0102006474882197E-3,2.2666486789947431,5.1376962339886147E-3,5.1376962339886147E-3,2.5638271143089906,0.13803739891338529,0.35671474830733002,3.8400000000000011E-2,0,0.53970813909773763,4.8503083254240806,0.30583138107181596,6.0928000000000003E-2,0.37690303328951169,4.8960000000000004E-2,8.3999999999999993E-4,0.09,0.37259999999999999,0.34199999999999997,9.083999999999999E-2,1.8329213993135656,1.9781390744053731,1.9781390744053731,27.200000000000003,0.93220475543827375,12.584478260150229,8.6473163323692575,null,93.220475543827376,0.82142653277985611,0.96557117238724932,0.57202173909773768,0.39305983328951172,1.7869977051671055]
["Qrr Current",{"$f":"Qrr_Q2*Fsw","v":3.0000000000000001E-3},"A",null,null,null,69,24,1,5.52,5.52,1.2777777777777777,0.21853591095956423,2.4632549732261553,6.751627486613077,4.2883725133869222,0,5.5656118641104451,0.40888366756943567,0.39590702674761175,0.83428438419331663,0.71108046093740263,1.0112708438538981E-3,1.0112708438538981E-3,2.3000052917518445,5.2900243420864876E-3,5.2900243420864876E-3,2.6018024749866262,0.14215689849577723,0.36196055342949662,3.8400000000000011E-2,0,0.54939021755168782,4.9200263518684944,0.31468657094004526,6.1823999999999997E-2,0.3872340173050674,4.9679999999999995E-2,8.3999999999999993E-4,0.09,0.37259999999999999,0.34199999999999997,9.083999999999999E-2,1.8643387171823664,2.0167098313287943,2.0167098313287943,27.599999999999998,0.93190635142072731,12.807938386137131,8.8798251807114816,null,93.190635142072736,0.83428438419331663,0.98630423485675522,0.58217901755168777,0.40362841730506738,1.820588619050072]
["Diode Current",{"$f":"Deadtime*Fsw*(Iripple_Vinnom/2)*(Vsd_Q2)/Vin","v":2.8492041840404457E-4},null,null,null,null,70,24,1,5.6,5.6,1.2962962962962963,0.21868332724070319,2.4645580842112897,6.832279042105645,4.3677209578943543,0,5.6450128915593218,0.42063345120549633,0.39590702674761175,0.84735713529616852,0.71145663667642833,1.0123410917418708E-3,1.0123410917418708E-3,2.3333845639200557,5.4446835231403883E-3,5.4446835231403883E-3,2.63981063741147,0.14634060422920578,0.36720635855166317,3.8400000000000011E-2,0,0.55914765123272592,4.9897465210649914,0.32366841447824235,6.2719999999999998E-2,0.39771650221027888,5.04E-2,8.3999999999999993E-4,0.09,0.37259999999999999,0.34199999999999997,9.083999999999999E-2,1.8961158552122195,2.0559199688260219,2.0559199688260219,28,0.93159683779573477,13.033056327119969,9.1156670486261344,null,93.15968377957347,0.84735713529616852,1.0072641534430047,0.59241165123272588,0.41434850221027886,1.8546212887391733]
["Total",{"$f":"SUM(B77:B79)","v":2.1319920418404043E-2},"A",null,null,null,71,24,1,5.68,5.68,1.3148148148148147,0.21883073078495163,2.4658605683232788,6.9129302841616393,4.4470697158383601,0,5.7244306000860004,0.43255219517665272,0.39590702674761175,0.86064606164015411,0.71183263145276432,1.013411390401934E-3,1.013411390401934E-3,2.3667861813120972,5.6016768280498994E-3,5.6016768280498994E-3,2.6778512554752081,0.15058863427545313,0.37245216367382988,3.8400000000000011E-2,0,0.56898081784666754,5.0594681883327244,0.33277683853376061,6.3615999999999992E-2,0.4083511410871114,5.1119999999999999E-2,8.3999999999999993E-4,0.09,0.37259999999999999,0.34199999999999997,9.083999999999999E-2,1.928252858407308,2.0957780931104155,2.0957780931104155,28.4,0.93127645122837865,13.259840392626685,9.354856303916451,null,93.127645122837862,0.86064606164015411,1.0284519589337791,0.60272001784666751,0.42522074108711139,1.8890980205739332]
[null,null,null,null,null,null,72,24,1,5.76,5.76,1.333333333333333,0.21897812159396018,2.4671624256433615,6.993581212821681,4.5264187871783186,0,5.803864304887064,0.44463989947795701,0.39590702674761175,0.87415246391151669,0.71220844528986249,1.0144817390844061E-3,1.0144817390844061E-3,2.400209845798928,5.7610073038701142E-3,5.7610073038701142E-3,2.7159240011097165,0.15490110677588004,0.37769796879599649,3.8400000000000011E-2,0,0.57889009866656083,5.1291907441367783,0.34201176996659916,6.4512E-2,0.41913859937928172,5.1839999999999997E-2,8.3999999999999993E-4,0.09,0.37259999999999999,0.34199999999999997,9.083999999999999E-2,1.9607497717640445,2.1362930262577224,2.1362930262577224,28.799999999999997,0.93094541015484611,13.488298970664339,9.5974075863441968,null,93.094541015484609,0.87415246391151669,1.0498686980458425,0.6131044986665608,0.43624579937928171,1.9240211619573593]
[null,null,null,null,null,null,73,24,1,5.84,5.84,1.3518518518518516,0.21912549966937922,2.4684636562527653,7.0742318281263827,4.605768171873617,0,5.8833133580083992,0.45689656410446489,0.39590702674761175,0.88787766826365322,0.71258407821117098,1.0155521370401287E-3,1.0155521370401287E-3,2.4336552742352739,5.9226779938131666E-3,5.9226779938131666E-3,2.7540285630796557,0.15927813985143047,0.38294377391816314,3.8400000000000011E-2,0,0.58887587856928014,5.1989136117328849,0.35137313564939909,6.5407999999999994E-2,0.43007955500977768,5.2560000000000003E-2,8.3999999999999993E-4,0.09,0.37259999999999999,0.34199999999999997,9.083999999999999E-2,1.9936066402710693,2.1774738118611197,2.1774738118611197,29.2,0.93060391588828273,13.718440528524162,9.8433358102151089,null,93.060391588828267,0.88787766826365322,1.0715154335790578,0.62356547856928013,0.44742435500977767,1.9593931018427111]
[null,null,null,null,null,null,74,24,1,5.92,5.92,1.3703703703703702,0.21927286501285875,2.4697642602327003,7.1548821301163503,4.6851178698836495,0,5.9627771459077881,0.46932218905123502,0.39590702674761175,0.90182302665774305,0.71295953024013325,1.0166225835204631E-3,1.0166225835204631E-3,2.4671221974701179,6.086691937249783E-3,6.086691937249783E-3,2.7921646458705305,0.16371985160263541,0.38818957904032969,3.8400000000000011E-2,0,0.59893854607259012,5.2686362449984072,0.36086086246744187,6.6304000000000002E-2,0.44117469850103275,5.3279999999999994E-2,8.3999999999999993E-4,0.09,0.37259999999999999,0.34199999999999997,9.083999999999999E-2,2.0268235089092537,2.2193297208838407,2.2193297208838407,29.6,0.93025215363266311,13.950273613596982,10.092656167022721,null,93.025215363266312,0.90182302665774305,1.093393244573623,0.63410334607259011,0.45875709850103275,1.9952162712313659]
[null,null,null,null,null,null,75,24,1,6,6,1.3888888888888888,0.21942021762604869,2.4710642376643657,7.2355321188321824,4.7644678811678176,0,6.0422550872078089,0.48191677431333013,0.39590702674761175,0.91598991721152223,0.71333480140018946,1.0176930777772955E-3,1.0176930777772955E-3,2.5006103594344409,6.2530521697108437E-3,6.2530521697108437E-3,2.8303319686635633,0.16822636010961819,0.39343538416249635,3.8400000000000011E-2,0,0.60907849337269482,5.3383581264326656,0.37047487731864581,6.7199999999999996E-2,0.45242473309779457,5.3999999999999992E-2,8.3999999999999993E-4,0.09,0.37259999999999999,0.34199999999999997,9.083999999999999E-2,2.0604004226517016,2.2618702577170708,2.2618702577170708,30,0.92989029341297935,14.183806854199286,10.34538412815148,null,92.989029341297936,0.91598991721152223,1.1155032264704894,0.64471849337269482,0.47024473309779458,2.0314931436820114]
[null,null,null,null,null,null,76,24,1,6.08,6.08,1.4074074074074072,0.21956755751059845,2.4723635886289452,7.3161817943144722,4.8438182056855279,0,6.1217466306219759,0.49468031988581596,0.39590702674761175,0.93037974455637706,0.71370989171477539,1.018763619063033E-3,1.018763619063033E-3,2.5341195162992802,6.4217617228888978E-3,6.4217617228888978E-3,2.8685302643895794,0.17279778343209795,0.39868118928466306,3.8400000000000011E-2,0,0.61929611638226978,5.408078765311445,0.38021510711356332,6.8096000000000004E-2,0.46383037489273138,5.4719999999999998E-2,8.3999999999999993E-4,0.09,0.37259999999999999,0.34199999999999997,9.083999999999999E-2,2.0943374264637522,2.305105166451122,2.305105166451122,30.4,0.92951849092918692,14.419048960409935,10.60153544764009,null,92.951849092918692,0.93037974455637706,1.1378464912750013,0.65541131638226979,0.48188797489273139,2.0682262358313785]
[null,null,null,null,null,null,77,24,1,6.16,6.16,1.4259259259259258,0.21971488466815728,2.4736623132076092,7.3968311566038043,4.923168843396196,0,6.2012512530388015,0.5076128257637621,0.39590702674761175,0.94499394020293925,0.71408480120732276,1.0198342066306035E-3,1.0198342066306035E-3,2.5676494356978976,6.5928236246397326E-3,6.5928236246397326E-3,2.9067592788549366,0.17743423960939472,0.40392699440682961,3.8400000000000011E-2,0,0.62959181476899384,5.47779769598203,0.39008147877537847,6.8991999999999998E-2,0.4753923529548213,5.5440000000000003E-2,8.3999999999999993E-4,0.09,0.37259999999999999,0.34199999999999997,9.083999999999999E-2,2.1286345653029763,2.3490444373682853,2.3490444373682853,30.8,0.9291368883405805,14.656008724917864,10.861126165006068,null,92.91368883405805,0.94499394020293925,1.1604241677238152,0.66618221476899386,0.49368755295482131,2.1054181079267544]
[null,null,null,null,null,null,78,24,1,6.24,6.24,1.4444444444444444,0.21986219910037408,2.4749604114815118,7.4774802057407559,5.0025197942592445,0,6.2807684577499536,0.52071429194224084,0.39590702674761175,0.95983396291536494,0.71445952990125894,1.0209048397334559E-3,1.0209048397334559E-3,2.6011998960064378,6.7662408989839027E-3,6.7662408989839027E-3,2.9450187699331787,0.18213584666043342,0.40917279952899621,3.8400000000000011E-2,0,0.6399659919945816,5.5475144762864748,0.40007391923990399,6.9888000000000006E-2,0.48711140946056791,5.6160000000000002E-2,8.3999999999999993E-4,0.09,0.37259999999999999,0.34199999999999997,9.083999999999999E-2,2.1632918841191868,2.3936983136661443,2.3936983136661443,31.200000000000003,0.92874561498659503,14.894695023880796,11.124172608132493,null,92.874561498659503,0.95983396291536494,1.1832374014551494,0.67703159199458163,0.50564420946056787,2.1430713643705142]
[null,null,null,null,null,null,79,24,1,6.32,6.32,1.462962962962963,0.22000950080889753,2.4762578835317965,7.558128941765899,5.0818710582341016,0,6.3602977728100738,0.53398471841632877,0.39590702674761175,0.97490129909449263,0.71483407782000785,1.021975517625562E-3,1.021975517625562E-3,2.6347706856780331,6.9420165661082927E-3,6.9420165661082927E-3,2.9833085068167469,0.18690272258374852,0.41441860465116281,3.8400000000000011E-2,0,0.65041905535432576,5.6172286861020373,0.41019235545557903,7.0784E-2,0.49898829982808984,5.688E-2,8.3999999999999993E-4,0.09,0.37259999999999999,0.34199999999999997,9.083999999999999E-2,2.1983094278544311,2.4390772984205316,2.4390772984205316,31.6,0.92834478804941911,15.135116817795168,11.390691396217978,null,92.834478804941909,0.97490129909449263,1.2062873551824156,0.6879598553543258,0.51775869982808986,2.1811886542769083]
[null,null,null,null,null,null,80,24,1,6.4,6.4,1.4814814814814814,0.22015678979537603,2.477554729439591,7.6387773647197958,5.1612226352802049,0,6.4398387495170031,0.54742410518110551,0.39590702674761175,0.99019746317007129,0.71520844498698921,1.0230462395614144E-3,1.0230462395614144E-3,2.668361602625783,7.120153642367638E-3,7.120153642367638E-3,3.0216282693236178,0.19173498535748851,0.41966440977332953,3.8400000000000011E-2,0,0.66095141601715957,5.6869399259887627,0.42043671438346591,7.1680000000000008E-2,0.51102379285413024,5.7599999999999998E-2,8.3999999999999993E-4,0.09,0.37259999999999999,0.34199999999999997,9.083999999999999E-2,2.2336872414430013,2.4851921617977597,2.4851921617977597,32,0.92793451316328102,15.377283152377512,11.660699442790866,null,92.793451316328103,0.99019746317007129,1.2295752088712899,0.69896741601715962,0.53003179285413027,2.2197726720413611]
[null,null,null,null,null,null,81,24,1,6.48,6.48,1.5000000000000002,0.22030406606145761,2.478850949286008,7.7194254746430042,5.2405745253569966,0,6.519390961002264,0.56103245223165388,0.39590702674761175,1.0057239980022639,0.71558263142561807,1.024117004796024E-3,1.024117004796024E-3,2.7019724536504945,7.3006551402860741E-3,7.3006551402860741E-3,3.0599778472542338,0.19663275293941976,0.42491021489549607,3.8400000000000011E-2,0,0.67156348906624119,5.7566478159351879,0.43080692299724777,7.2576000000000002E-2,0.52321867085403739,5.8320000000000011E-2,8.3999999999999993E-4,0.09,0.37259999999999999,0.34199999999999997,9.083999999999999E-2,2.2694253698114295,2.5320539485261957,2.5320539485261957,32.400000000000006,0.92751488497477752,15.621203159457307,11.934213958788822,null,92.751488497477752,1.0057239980022639,1.2531021599202785,0.71005468906624125,0.54246427085403737,2.2588261579225426]
[null,null,null,null,null,null,82,24,1,6.56,6.56,1.5185185185185184,0.22045132960879008,2.4801465431521481,7.8000732715760739,5.3199267284239253,0,6.5989540009226051,0.57480975956306046,0.39590702674761175,1.0214824752926339,0.71595663715930624,1.025187812584925E-3,1.025187812584925E-3,2.735603053909446,7.4835240685586875E-3,7.4835240685586875E-3,3.0983570397945366,0.20159614326693165,0.43015602001766268,3.8400000000000011E-2,0,0.68225569354007787,5.8263519941939732,0.4413029082832251,7.3471999999999996E-2,0.53557372980476348,5.9039999999999995E-2,8.3999999999999993E-4,0.09,0.37259999999999999,0.34199999999999997,9.083999999999999E-2,2.3055238578784918,2.5796739856377355,2.5796739856377355,32.799999999999997,0.92708598765819761,15.866886057881713,12.211252455704797,null,92.708598765819758,1.0214824752926339,1.2768694233448414,0.72122209354007782,0.55505692980476351,2.2983518986374754]
[null,null,null,null,null,null,83,24,1,6.64,6.64,1.5370370370370368,0.22059858043902097,2.4814415111190984,7.8807207555595493,5.39927924444045,0,6.6785274822442773,0.58875602717041553,0.39590702674761175,1.0374744960048292,0.71633046221146168,1.0262586621841727E-3,1.0262586621841727E-3,2.7692532264227943,7.668763432053056E-3,7.668763432053056E-3,3.1367656549613008,0.20662527425704075,0.43540182513982933,3.8400000000000011E-2,0,0.69302845247418632,5.8960521162000674,0.45192459724031475,7.436799999999999E-2,0.54808977949093651,5.9760000000000001E-2,8.3999999999999993E-4,0.09,0.37259999999999999,0.34199999999999997,9.083999999999999E-2,2.3419827505552115,2.6280638904902407,2.6280638904902407,33.199999999999996,0.92664789538940728,16.114341154432097,12.491832748800602,null,92.664789538940724,1.0374744960048292,1.3008782319651229,0.73247005247418628,0.5678105794909365,2.3383527279699523]
[null,null,null,null,null,null,84,24,1,6.72,6.72,1.5555555555555556,0.22074581855379752,2.4827358532679282,7.9613679266339634,5.4786320733660361,0,6.7581110361124699,0.60287125504881212,0.39590702674761175,1.0537016907951815,0.71670410660548678,1.027329552850338E-3,1.027329552850338E-3,2.8029228016145522,7.8563762318107702E-3,7.8563762318107702E-3,3.1752035090863129,0.21172026380639478,0.44064763026199594,3.8400000000000011E-2,0,0.70388219294330578,5.9657478535646415,0.46267191688004466,7.5263999999999998E-2,0.56076764365405252,6.0480000000000006E-2,8.3999999999999993E-4,0.09,0.37259999999999999,0.34199999999999997,9.083999999999999E-2,2.3788020927448592,2.677235579082498,2.677235579082498,33.6,0.92620067278152263,16.363577844752726,12.775972960389156,null,92.620067278152263,1.0537016907951815,1.3251298365973585,0.74379899294330576,0.58072604365405256,2.3788315273925402]
[null,null,null,null,null,null,85,24,1,6.8,6.8,1.574074074074074,0.22089304395476661,2.4840295696796968,8.0420147848398482,5.5579852151601514,0,6.8377043107990749,0.61715544319334736,0.39590702674761175,1.0701657204534505,0.71707757036478159,1.0284004838405165E-3,1.0284004838405165E-3,2.8366116168853641,8.0463654650490008E-3,8.0463654650490008E-3,3.2136704263362863,0.21688122979127744,0.44589343538416254,3.8400000000000011E-2,0,0.71481734610417047,6.0354388931387417,0.47354479422655332,7.6159999999999992E-2,0.57360816014485017,6.1200000000000004E-2,8.3999999999999993E-4,0.09,0.37259999999999999,0.34199999999999997,9.083999999999999E-2,2.4159819293429523,2.7272012746738832,2.7272012746738832,34,0.92574437528528786,16.614605614291751,13.063691523186703,null,92.57443752852879,1.0701657204534505,1.3496255062490206,0.75520934610417045,0.59380416014485016,2.419791226702471]
[null,null,null,null,null,null,86,24,1,6.88,6.88,1.5925925925925923,0.22104025664357493,2.4853226604354468,8.1226613302177242,5.6373386697822765,0,6.917306970722505,0.63160859159912131,0.39590702674761175,1.0868682763539472,0.71745085351274107,1.0294714544123215E-3,1.0294714544123215E-3,2.8703195162145287,8.2387341251620068E-3,8.2387341251620068E-3,3.2521662382656427,0.22210829006761293,0.45113924050632914,3.8400000000000011E-2,0,0.72583434723884754,6.10512493614105,0.48454315631658634,7.7055999999999999E-2,0.58661218107891488,6.1919999999999996E-2,8.3999999999999993E-4,0.09,0.37259999999999999,0.34199999999999997,9.083999999999999E-2,2.4535223052372617,2.7779735167214281,2.7779735167214281,34.4,0.92527904955680307,16.867434039254647,13.355007183736129,null,92.527904955680313,1.0868682763539472,1.3743665283177624,0.76670154723884754,0.60704578107891494,2.4612348046717099]
[null,null,null,null,null,null,87,24,1,6.96,6.96,1.6111111111111109,0.22118745662186889,2.4866151256162099,8.2033075628081047,5.7166924371918952,0,6.9969186955339095,0.64623070026123774,0.39590702674761175,1.1038110809172734,0.71782395607275695,1.0305424638238868E-3,1.0305424638238868E-3,2.9040463497889824,8.4334852017227124E-3,8.4334852017227124E-3,3.2906907833995804,0.22740156247096982,0.4563850456284958,3.8400000000000011E-2,0,0.7369336357986519,6.1748056973447349,0.49566693019949293,7.7951999999999994E-2,0.59978057299557375,6.2640000000000001E-2,8.3999999999999993E-4,0.09,0.37259999999999999,0.34199999999999997,9.083999999999999E-2,2.4914232653078079,2.8295651701476592,2.8295651701476592,34.799999999999997,0.92480473379499972,17.122072787570342,13.649939005902622,null,92.480473379499969,1.1038110809172734,1.3993542087942257,0.7782760357986519,0.62045177299557375,2.5031652897114993]
[null,null,null,null,null,null,88,24,1,7.04,7.04,1.6296296296296298,0.22133464389129454,2.4879069653030004,8.2839534826514996,5.7960465173484996,0,7.0765391792646017,0.66102176917480338,0.39590702674761175,1.1209958880829272,0.71819687806821608,1.0316135113338642E-3,1.0316135113338642E-3,2.9377919736571223,8.6306216804842104E-3,8.6306216804842104E-3,3.3292439068450732,0.232761164816566,0.4616308507506624,3.8400000000000011E-2,0,0.74811565544864522,6.2444809043187792,0.50691604293722436,7.8848000000000001E-2,0.61311421702013991,6.336E-2,8.3999999999999993E-4,0.09,0.37259999999999999,0.34199999999999997,9.083999999999999E-2,2.5296848544268675,2.8819894349532151,2.8819894349532151,35.200000000000003,0.92432145805103338,17.378531619870195,13.948506374443078,null,92.432145805103332,1.1209958880829272,1.4245898724687851,0.78993325544864523,0.63402301702013986,2.5455857605517123]
[null,null,null,null,null,null,89,24,1,7.12,7.12,1.6481481481481481,0.22148181845349771,2.4891981795768205,8.3645990897884097,5.8754009102115896,0,7.1561681295299868,0.67598179833492944,0.39590702674761175,1.1384244837930313,0.71856961952250187,1.0326845962014262E-3,1.0326845962014262E-3,2.9715562494055741,8.8301465433813231E-3,8.8301465433813231E-3,3.3678254599276367,0.23818721489927275,0.46687665587282901,3.8400000000000011E-2,0,0.7593808541127286,6.3141502967195766,0.51829042160433081,7.9743999999999995E-2,0.62661400902956477,6.4079999999999998E-2,8.3999999999999993E-4,0.09,0.37259999999999999,0.34199999999999997,9.083999999999999E-2,2.5683071174589736,2.935259856188932,2.935259856188932,35.6,0.92382924451156856,17.636820390480029,14.250728998650425,null,92.382924451156853,1.1384244837930313,1.4500748631422933,0.80167365411272862,0.64776040902956478,2.5884993469353246]
[null,null,null,null,null,null,90,24,1,7.2,7.2,1.6666666666666665,0.22162898031012385,2.4904887685186581,8.445244384259329,5.9547556157406714,0,7.2358052667856629,0.69111078773672951,0.39590702674761175,1.1560986864874414,0.7189421804589935,1.0337557176862641E-3,1.0337557176862641E-3,3.0053390438571355,9.032062768532122E-3,9.032062768532122E-3,3.4064352998519003,0.24367983049361921,0.47212246099499566,3.8400000000000011E-2,0,0.77072968401933939,6.3838136256289646,0.52978999328795828,8.0640000000000003E-2,0.64028085982155825,6.4799999999999996E-2,8.3999999999999993E-4,0.09,0.37259999999999999,0.34199999999999997,9.083999999999999E-2,2.607290099260914,2.989390334302827,2.989390334302827,36,0.92332810775774654,17.896949048425466,14.556626916074281,null,92.332810775774661,1.1560986864874414,1.4758105438408977,0.81349768401933942,0.6616648598215582,2.6319092303283389]
[null,null,null,null,null,null,91,24,1,7.28,7.28,1.6851851851851851,0.2217761294628183,2.4917787322094873,8.5258893661047441,6.0341106338952564,0,7.3154503236317785,0.70640873737532073,0.39590702674761175,1.1740203476105091,0.71931456090106605,1.034826875048587E-3,1.034826875048587E-3,3.0391402287883129,9.236373330239479E-3,9.236373330239479E-3,3.445073289384192,0.24923912935379677,0.47736826611716227,3.8400000000000011E-2,0,0.78216260174775765,6.4534706529351995,0.54141468508784629,8.1535999999999997E-2,0.65411569528724289,6.5519999999999995E-2,8.3999999999999993E-4,0.09,0.37259999999999999,0.34199999999999997,9.083999999999999E-2,2.6466338446817375,3.0443951358781769,3.0443951358781769,36.4,0.92281805500145619,18.15892763845067,14.866220496319343,null,92.281805500145623,1.1740203476105091,1.5017982970350006,0.82540580174775768,0.67573729528724291,2.6758186446455099]
[null,null,null,null,null,null,92,24,1,7.36,7.36,1.7037037037037037,0.22192326591322592,2.493068070730267,8.606534035365133,6.1134659646348668,0,7.3951030441620329,0.72187564724582431,0.39590702674761175,1.1921913521297796,0.71968676087209038,1.0358980675491227E-3,1.0358980675491227E-3,3.0729596806649764,9.443081198992594E-3,9.443081198992594E-3,3.483739296555489,0.25486522921366361,0.48261407123932887,3.8400000000000011E-2,0,0.79368006827503701,6.5231211507536502,0.55316442411632505,8.2432000000000005E-2,0.66811945658740435,6.6239999999999993E-2,8.3999999999999993E-4,0.09,0.37259999999999999,0.34199999999999997,9.083999999999999E-2,2.6863383985627536,3.1002889047797004,3.1002889047797004,36.800000000000004,0.92229908630039226,18.422766302050814,15.179530444922895,null,92.229908630039219,1.1921913521297796,1.5280395248624414,0.83739846827503706,0.68997865658740432,2.720230876992221]
[null,null,null,null,null,null,93,24,1,7.44,7.44,1.7222222222222223,0.22207038966299147,2.494356784161945,8.6871783920809733,6.1928216079190275,0,7.4747631833540096,0.73751151734336429,0.39590702674761175,1.2106136190669019,0.72005878039543414,1.03696929444912E-3,1.03696929444912E-3,3.1067972803948019,9.6521893414685377E-3,9.6521893414685377E-3,3.5224331943832241,0.26055824778674891,0.48785987636149547,3.8400000000000011E-2,0,0.80528254902356511,6.5927649008842844,0.56503913749831292,8.3327999999999999E-2,0.68229310033240564,6.6959999999999992E-2,8.3999999999999993E-4,0.09,0.37259999999999999,0.34199999999999997,9.083999999999999E-2,2.726403805737533,3.1570866737257002,3.1570866737257002,37.200000000000003,0.9217711947532351,18.688475278518432,15.496577807312924,null,92.177119475323508,1.2106136190669019,1.5545356493559708,0.84947614902356516,0.70438990033240567,2.7651492684228725]
[null,null,null,null,null,null,94,24,1,7.52,7.52,1.7407407407407403,0.22221750071375926,2.495644872585451,8.7678224362927253,6.2721775637072739,0,7.5544305064978374,0.75331634766306832,0.39590702674761175,1.2292891020410592,0.72043061949445975,1.038040555010342E-3,1.038040555010342E-3,3.1406529130952641,9.8637007205337676E-3,9.8637007205337676E-3,3.5611548606105763,0.26631830276625701,0.49310568148366213,3.8400000000000011E-2,0,0.81697051390926567,6.6624016943032522,0.57703875237131297,8.4223999999999993E-2,0.69663759876582976,6.767999999999999E-2,8.3999999999999993E-4,0.09,0.37259999999999999,0.34199999999999997,9.083999999999999E-2,2.7668301110319122,3.2148038763049573,3.2148038763049573,37.599999999999994,0.92123436667617287,18.956064906003842,15.817383972848255,null,92.123436667617284,1.2292891020410592,1.5812881126750955,0.86163931390926563,0.71897199876582973,2.8105772147161545]
[null,null,null,null,null,null,95,24,1,7.6,7.6,1.7592592592592591,0.22236459906717346,2.4969323360817044,8.8484661680408525,6.3515338319591477,0,7.6341047886603919,0.76929013820006731,0.39590702674761175,1.2482197898252114,0.72080227819252662,1.0391118484950729E-3,1.0391118484950729E-3,3.1745264678760661,1.0077618295245692E-2,1.0077618295245692E-2,3.5999041774619802,0.27214551182507257,0.49835148660582868,3.8400000000000011E-2,0,0.82874443739045234,6.7320313306861044,0.58916319588541111,8.5120000000000001E-2,0.711153939951926,6.8399999999999989E-2,8.3999999999999993E-4,0.09,0.37259999999999999,0.34199999999999997,9.083999999999999E-2,2.8076173592639915,3.2734563594580859,3.2734563594580859,38,0.9206885817618724,19.225545622589951,16.141970678942371,null,92.068858176187234,1.2482197898252114,1.6082983773423782,0.8738884373904523,0.73372593995192603,2.8565181671675894]
[null,null,null,null,null,null,96,24,1,7.68,7.68,{"$f":"Vout*K105/(Vin*Efficiency)","v":1.7777777777777777},0.22251168472487784,{"$f":"(Vin-(Rdson1+Rdcr)*K105-Vout)*M105/(Fsw*Lf)","v":2.4982191747316085},8.9291095873658044,6.430890412634195,{"$f":"IF(MIN(Vin, -P105/(Coss_Q1+Coss_Q2)*0.00000002)<0, 0, MIN(Vin, -P105/(Coss_Q1+Coss_Q2)*0.00000002))","v":0},7.7137858141824927,{"$f":"R105^2*Rdcr","v":0.78543288894949648},0.39590702674761175,{"$f":"(T105+S105*(1+Ltc*(Ta-25)))/(1-S105*Ltc*ThetaCa)","v":1.2674077069154743},0.72117375651298943,1.0401831741661133E-3,1.0401831741661133E-3,3.2084178376349586,1.0293945020854183E-2,1.0293945020854183E-2,3.6386810314136802,{"$f":"Rdson1*AB105^2","v":0.27803999261576423},0.50359729172799539,3.8400000000000011E-2,0,{"$f":"(AF105+AE105+AD105+AC105*(1+RdsonTopTc*Ta-RdsonTopTc*25))/(1-AC105*RdsonTopTc*ThetaJA_Q1)","v":0.84060479851734282},6.8016536179603655,{"$f":"Rdson2*AH105^2","v":0.60141239520327328},8.6015999999999995E-2,{"$f":"(AJ105+AI105*(1+RdsonBotTc*Ta-RdsonBotTc*25))/(1-AI105*RdsonBotTc*ThetaJA_Q2)","v":0.72584312796692674},6.9120000000000001E-2,8.3999999999999993E-4,0.09,0.37259999999999999,0.34199999999999997,9.083999999999999E-2,2.8487655952441413,3.3330603964441301,3.3330603964441301,38.4,0.92013381322190002,19.496927967381541,16.470360015272387,null,92.01338132219,1.2674077069154743,1.6355679264842695,0.88622399851734279,0.74865272796692672,2.9029756333997438]
[null,null,null,null,null,null,97,24,1,7.76,7.76,{"$f":"Vout*K106/(Vin*Efficiency)","v":1.7962962962962961},0.22265875768851595,{"$f":"(Vin-(Rdson1+Rdcr)*K106-Vout)*M106/(Fsw*Lf)","v":2.4995053886160545},9.0097526943080268,6.5102473056919727,{"$f":"IF(MIN(Vin, -P106/(Coss_Q1+Coss_Q2)*0.00000002)<0, 0, MIN(Vin, -P106/(Coss_Q1+Coss_Q2)*0.00000002))","v":0},7.7934733762067472,{"$f":"R106^2*Rdcr","v":0.80174459990649283},0.39590702674761175,{"$f":"(T106+S106*(1+Ltc*(Ta-25)))/(1-S106*Ltc*ThetaCa)","v":1.2868549141139445},0.7215450544791997,1.0412545312867825E-3,1.0412545312867825E-3,3.2423269188660027,1.0512683848803108E-2,1.0512683848803108E-2,3.677485312978273,{"$f":"Rdson1*AB106^2","v":0.28400186277058909},0.50884309685016194,3.8400000000000011E-2,0,{"$f":"(AF106+AE106+AD106+AC106*(1+RdsonTopTc*Ta-RdsonTopTc*25))/(1-AC106*RdsonTopTc*ThetaJA_Q1)","v":0.85255208098224622},6.8712683718853897,{"$f":"Rdson2*AH106^2","v":0.61378627750014236},8.6912000000000003E-2,{"$f":"(AJ106+AI106*(1+RdsonBotTc*Ta-RdsonBotTc*25))/(1-AI106*RdsonBotTc*ThetaJA_Q2)","v":0.74070618309430825},6.9840000000000013E-2,8.3999999999999993E-4,0.09,0.37259999999999999,0.34199999999999997,9.083999999999999E-2,2.890274863774998,3.393632700314182,3.393632700314182,38.799999999999997,0.91957002791350284,19.770222581609417,16.802574428074781,null,91.957002791350277,1.2868549141139445,1.6630982640765546,0.8986464809822462,0.76375338309430829,2.9499531781904991]
[null,null,null,null,null,null,98,24,1,7.84,7.84,{"$f":"Vout*K107/(Vin*Efficiency)","v":1.8148148148148149},0.22280581795973101,{"$f":"(Vin-(Rdson1+Rdcr)*K107-Vout)*M107/(Fsw*Lf)","v":2.5007909778159165},9.0903954889079586,6.5896045110920412,{"$f":"IF(MIN(Vin, -P107/(Coss_Q1+Coss_Q2)*0.00000002)<0, 0, MIN(Vin, -P107/(Coss_Q1+Coss_Q2)*0.00000002))","v":0},7.8731672762339082,{"$f":"R107^2*Rdcr","v":0.81822527106619802},0.39590702674761175,{"$f":"(T107+S107*(1+Ltc*(Ta-25)))/(1-S107*Ltc*ThetaCa)","v":1.3065635091253196},0.72191617211450343,1.0423259191209148E-3,1.0423259191209148E-3,3.276253611479409,1.073383772673187E-2,1.073383772673187E-2,3.7163169165022545,{"$f":"Rdson1*AB107^2","v":0.29003123990149732},0.51408890197232859,3.8400000000000011E-2,0,{"$f":"(AF107+AE107+AD107+AC107*(1+RdsonTopTc*Ta-RdsonTopTc*25))/(1-AC107*RdsonTopTc*ThetaJA_Q1)","v":0.86458677317043076},6.9408754156575689,{"$f":"Rdson2*AH107^2","v":0.6262847699638352},8.7807999999999997E-2,{"$f":"(AJ107+AI107*(1+RdsonBotTc*Ta-RdsonBotTc*25))/(1-AI107*RdsonBotTc*ThetaJA_Q2)","v":0.7557441420240727},7.0559999999999998E-2,8.3999999999999993E-4,0.09,0.37259999999999999,0.34199999999999997,9.083999999999999E-2,2.9321452096514711,3.4551904379150202,3.4551904379150202,39.200000000000003,0.91899718645157424,20.045440209749476,17.138636724529601,null,91.899718645157421,1.3065635091253196,1.6908909151945033,0.91115637317043074,0.77902894202407269,2.9974544243198231]
[null,null,null,null,null,null,99,24,1,7.92,7.92,{"$f":"Vout*K108/(Vin*Efficiency)","v":1.8333333333333333},0.22295286554016602,{"$f":"(Vin-(Rdson1+Rdcr)*K108-Vout)*M108/(Fsw*Lf)","v":2.5020759424120578},9.1710379712060295,6.6689620287939713,{"$f":"IF(MIN(Vin, -P108/(Coss_Q1+Coss_Q2)*0.00000002)<0, 0, MIN(Vin, -P108/(Coss_Q1+Coss_Q2)*0.00000002))","v":0},7.9528673237057355,{"$f":"R108^2*Rdcr","v":0.83487490242375684},0.39590702674761175,{"$f":"(T108+S108*(1+Ltc*(Ta-25)))/(1-S108*Ltc*ThetaCa)","v":1.3265356271676405},0.72228710944224406,1.0433973369328644E-3,1.0433973369328644E-3,3.3101978186321337,1.0957409598476936E-2,1.0957409598476936E-2,3.7551757399756607,{"$f":"Rdson1*AB108^2","v":0.29612824160013679},0.51933470709449514,3.8400000000000011E-2,0,{"$f":"(AF108+AE108+AD108+AC108*(1+RdsonTopTc*Ta-RdsonTopTc*25))/(1-AC108*RdsonTopTc*ThetaJA_Q1)","v":0.87670936821168644},7.0104745795391539,{"$f":"Rdson2*AH108^2","v":0.63890779979474077},8.8704000000000005E-2,{"$f":"(AJ108+AI108*(1+RdsonBotTc*Ta-RdsonBotTc*25))/(1-AI108*RdsonBotTc*ThetaJA_Q2)","v":0.77095805805612738},7.1279999999999996E-2,8.3999999999999993E-4,0.09,0.37259999999999999,0.34199999999999997,9.083999999999999E-2,2.9743766776607412,3.5177512444469059,3.5177512444469059,39.6,0.91841524330654989,20.322591700657103,17.478570077234799,null,91.841524330654991,1.3265356271676405,1.7189474262678137,0.92375416821168643,0.79448045805612733,3.0454830534354542]
[null,null,null,null,null,null,100,24,1,8,8,{"$f":"Vout*K109/(Vin*Efficiency)","v":1.8518518518518516},0.22309990043146366,{"$f":"(Vin-(Rdson1+Rdcr)*K109-Vout)*M109/(Fsw*Lf)","v":2.5033602824853269},9.2516801412426641,6.7483198587573368,{"$f":"IF(MIN(Vin, -P109/(Coss_Q1+Coss_Q2)*0.00000002)<0, 0, MIN(Vin, -P109/(Coss_Q1+Coss_Q2)*0.00000002))","v":0},8.0325733356125522,{"$f":"R109^2*Rdcr","v":0.85169349397431771},0.39590702674761175,{"$f":"(T109+S109*(1+Ltc*(Ta-25)))/(1-S109*Ltc*ThetaCa)","v":1.3467734415975161},0.72265786648576058,1.0444687839875027E-3,1.0444687839875027E-3,3.3441594465685069,1.1183402404073383E-2,1.1183402404073383E-2,3.7940616848529714,{"$f":"Rdson1*AB109^2","v":0.30229298543785671},0.5245805122166618,3.8400000000000011E-2,0,{"$f":"(AF109+AE109+AD109+AC109*(1+RdsonTopTc*Ta-RdsonTopTc*25))/(1-AC109*RdsonTopTc*ThetaJA_Q1)","v":0.88892036403259134},7.0800657005090279,{"$f":"Rdson2*AH109^2","v":0.65165529420581703},8.9599999999999999E-2,{"$f":"(AJ109+AI109*(1+RdsonBotTc*Ta-RdsonBotTc*25))/(1-AI109*RdsonBotTc*ThetaJA_Q2)","v":0.78634900130783958},7.2000000000000008E-2,8.3999999999999993E-4,0.09,0.37259999999999999,0.34199999999999997,9.083999999999999E-2,3.016969312582265,3.5813332386009749,3.5813332386009749,40,0.91782414688890457,20.601688008717009,17.822398028772472,null,91.782414688890455,1.3467734415975161,1.747269365340431,0.93644036403259134,0.81010900130783958,3.0940428069379471]

{"sheet":"Efficiency Plot Management","index":9,"n_rows":3,"n_cols":1,"rows_kept":3,"cut":false,"hidden":false,"merged":[]}
[]
[{"$f":"\"EFF_Ch1\"","v":"EFF_Ch1"}]
[{"$f":"\"EFF_Ch2\"","v":"EFF_Ch2"}]

{"sheet":"Standard Value Calculator","index":10,"n_rows":159,"n_cols":16,"rows_kept":159,"cut":false,"hidden":true,"merged":[]}
[]
["Capacitors","Css","Cc1ea","Cc2ea","Cout","Cin","Cres","Cdither","Cc3ea","Cc4ea"]
["Inputs",{"$f":"Css","v":{"$error":"#NAME?"}},{"$f":"Cc1ea","v":3.7032596445135381E-11},{"$f":"Cc2ea","v":-2.7561393733037075E-14},{"$f":"Cout","v":7.2000000000000002E-5},{"$f":"Cin","v":2.5000000000000001E-5},{"$f":"Cres","v":{"$error":"#NAME?"}},{"$f":"Cdither_init","v":{"$error":"#NAME?"}},{"$f":"Cc3ea","v":{"$error":"#NAME?"}},{"$f":"Cc4ea","v":{"$error":"#NAME?"}},null,null,"Resistors","inputs","Standard Result"]
["Standard Result",{"$f":"SUM(B6:B158)/1000000000000","v":{"$error":"#NAME?"}},{"$f":"IF(C3=\"OPEN\",\"OPEN\",SUM(C6:C158)/1000000000000)","v":3.9000000000000001E-11},{"$f":"SUM(D6:D158)/1000000000000","v":0},{"$f":"SUM(E6:E158)/1000000000000","v":6.7999999999999999E-5},{"$f":"SUM(F6:F158)/1000000000000","v":2.6999999999999999E-5},{"$f":"SUM(G6:G158)/1000000000000","v":{"$error":"#NAME?"}},{"$f":"IF(H3=\"OPEN\",\"OPEN\",SUM(H6:H158)/1000000000000)","v":{"$error":"#NAME?"}},{"$f":"IF(I3=\"OPEN\",\"OPEN\",SUM(I6:I158)/1000000000000)","v":{"$error":"#NAME?"}},{"$f":"IF(J3=\"OPEN\",\"OPEN\",SUM(J6:J158)/1000000000000)","v":{"$error":"#NAME?"}},null,null,"Rt",{"$f":"Rfadj","v":15.8},{"$f":"IF(N4>(INT(0.5+100*POWER(10,IF(96*(LOG(N4)-INT(LOG(N4)))-ROUND(96*(LOG(N4)-INT(LOG(N4))),0)<0,ROUND(96*(LOG(N4)-INT(LOG(N4))),0)-1,ROUND(96*(LOG(N4)-INT(LOG(N4))),0))/96))*POWER(10,INT(LOG(N4))-2)+INT(0.5+100*POWER(10,(IF(96*(LOG(N4)-INT(LOG(N4)))-ROUND(96*(LOG(N4)-INT(LOG(N4))),0)<0,ROUND(96*(LOG(N4)-INT(LOG(N4))),0)-1,ROUND(96*(LOG(N4)-INT(LOG(N4))),0))+1)/96))*POWER(10,INT(LOG(N4))-2))/2,INT(0.5+100*POWER(10,(IF(96*(LOG(N4)-INT(LOG(N4)))-ROUND(96*(LOG(N4)-INT(LOG(N4))),0)<0,ROUND(96*(LOG(N4)-INT(LOG(N4))),0)-1,ROUND(96*(LOG(N4)-INT(LOG(N4))),0))+1)/96))*POWER(10,INT(LOG(N4))-2),INT(0.5+100*POWER(10,IF(96*(LOG(N4)-INT(LOG(N4)))-ROUND(96*(LOG(N4)-INT(LOG(N4))),0)<0,ROUND(96*(LOG(N4)-INT(LOG(N4))),0)-1,ROUND(96*(LOG(N4)-INT(LOG(N4))),0))/96))*POWER(10,INT(LOG(N4))-2))","v":15.8},"Ω"]
["(pF)"]
[0.47,{"$f":"IF(IF((B$3*10^12-$A7)*(B$3*10^12-$A6)*-1<0,0,1)*IF(ABS(B$3*10^12-$A7)>(B$3*10^12-$A6),$A6,$A7)=B7,0,IF((B$3*10^12-$A7)*(B$3*10^12-$A6)*-1<0,0,1)*IF(ABS(B$3*10^12-$A7)>(B$3*10^12-$A6),$A6,$A7))","v":{"$error":"#NAME?"}},0,0,0,0,{"$error":"#NAME?"},{"$error":"#NAME?"},{"$error":"#NAME?"},{"$error":"#NAME?"}]
[0.56000000000000005,{"$f":"IF(IF((B$3*10^12-$A8)*(B$3*10^12-$A7)*-1<0,0,1)*IF(ABS(B$3*10^12-$A8)>(B$3*10^12-$A7),$A7,$A8)=B8,0,IF((B$3*10^12-$A8)*(B$3*10^12-$A7)*-1<0,0,1)*IF(ABS(B$3*10^12-$A8)>(B$3*10^12-$A7),$A7,$A8))","v":{"$error":"#NAME?"}},{"$f":"IF(IF((C$3*10^12-$A8)*(C$3*10^12-$A7)*-1<0,0,1)*IF(ABS(C$3*10^12-$A8)>(C$3*10^12-$A7),$A7,$A8)=C8,0,IF((C$3*10^12-$A8)*(C$3*10^12-$A7)*-1<0,0,1)*IF(ABS(C$3*10^12-$A8)>(C$3*10^12-$A7),$A7,$A8))","v":0},{"$f":"IF(IF((D$3*10^12-$A8)*(D$3*10^12-$A7)*-1<0,0,1)*IF(ABS(D$3*10^12-$A8)>(D$3*10^12-$A7),$A7,$A8)=D8,0,IF((D$3*10^12-$A8)*(D$3*10^12-$A7)*-1<0,0,1)*IF(ABS(D$3*10^12-$A8)>(D$3*10^12-$A7),$A7,$A8))","v":0},{"$f":"IF(IF((E$3*10^12-$A8)*(E$3*10^12-$A7)*-1<0,0,1)*IF(ABS(E$3*10^12-$A8)>(E$3*10^12-$A7),$A7,$A8)=E8,0,IF((E$3*10^12-$A8)*(E$3*10^12-$A7)*-1<0,0,1)*IF(ABS(E$3*10^12-$A8)>(E$3*10^12-$A7),$A7,$A8))","v":0},{"$f":"IF(IF((F$3*10^12-$A8)*(F$3*10^12-$A7)*-1<0,0,1)*IF(ABS(F$3*10^12-$A8)>(F$3*10^12-$A7),$A7,$A8)=F8,0,IF((F$3*10^12-$A8)*(F$3*10^12-$A7)*-1<0,0,1)*IF(ABS(F$3*10^12-$A8)>(F$3*10^12-$A7),$A7,$A8))","v":0},{"$f":"IF(IF((G$3*10^12-$A8)*(G$3*10^12-$A7)*-1<0,0,1)*IF(ABS(G$3*10^12-$A8)>(G$3*10^12-$A7),$A7,$A8)=G8,0,IF((G$3*10^12-$A8)*(G$3*10^12-$A7)*-1<0,0,1)*IF(ABS(G$3*10^12-$A8)>(G$3*10^12-$A7),$A7,$A8))","v":{"$error":"#NAME?"}},{"$error":"#NAME?"},{"$error":"#NAME?"},{"$error":"#NAME?"},null,null,"Renb",{"$f":"Renb","v":49858.771374287513},{"$f":"IF(N7>(INT(0.5+100*POWER(10,IF(96*(LOG(N7)-INT(LOG(N7)))-ROUND(96*(LOG(N7)-INT(LOG(N7))),0)<0,ROUND(96*(LOG(N7)-INT(LOG(N7))),0)-1,ROUND(96*(LOG(N7)-INT(LOG(N7))),0))/96))*POWER(10,INT(LOG(N7))-2)+INT(0.5+100*POWER(10,(IF(96*(LOG(N7)-INT(LOG(N7)))-ROUND(96*(LOG(N7)-INT(LOG(N7))),0)<0,ROUND(96*(LOG(N7)-INT(LOG(N7))),0)-1,ROUND(96*(LOG(N7)-INT(LOG(N7))),0))+1)/96))*POWER(10,INT(LOG(N7))-2))/2,INT(0.5+100*POWER(10,(IF(96*(LOG(N7)-INT(LOG(N7)))-ROUND(96*(LOG(N7)-INT(LOG(N7))),0)<0,ROUND(96*(LOG(N7)-INT(LOG(N7))),0)-1,ROUND(96*(LOG(N7)-INT(LOG(N7))),0))+1)/96))*POWER(10,INT(LOG(N7))-2),INT(0.5+100*POWER(10,IF(96*(LOG(N7)-INT(LOG(N7)))-ROUND(96*(LOG(N7)-INT(LOG(N7))),0)<0,ROUND(96*(LOG(N7)-INT(LOG(N7))),0)-1,ROUND(96*(LOG(N7)-INT(LOG(N7))),0))/96))*POWER(10,INT(LOG(N7))-2))","v":49900},"Ω"]
[0.68,{"$error":"#NAME?"},0,0,0,0,{"$error":"#NAME?"},{"$error":"#NAME?"},{"$error":"#NAME?"},{"$error":"#NAME?"},null,null,"Rc1ea",{"$f":"Rcea2","v":0},{"$f":"IF(N8>(INT(0.5+100*POWER(10,IF(96*(LOG(N8)-INT(LOG(N8)))-ROUND(96*(LOG(N8)-INT(LOG(N8))),0)<0,ROUND(96*(LOG(N8)-INT(LOG(N8))),0)-1,ROUND(96*(LOG(N8)-INT(LOG(N8))),0))/96))*POWER(10,INT(LOG(N8))-2)+INT(0.5+100*POWER(10,(IF(96*(LOG(N8)-INT(LOG(N8)))-ROUND(96*(LOG(N8)-INT(LOG(N8))),0)<0,ROUND(96*(LOG(N8)-INT(LOG(N8))),0)-1,ROUND(96*(LOG(N8)-INT(LOG(N8))),0))+1)/96))*POWER(10,INT(LOG(N8))-2))/2,INT(0.5+100*POWER(10,(IF(96*(LOG(N8)-INT(LOG(N8)))-ROUND(96*(LOG(N8)-INT(LOG(N8))),0)<0,ROUND(96*(LOG(N8)-INT(LOG(N8))),0)-1,ROUND(96*(LOG(N8)-INT(LOG(N8))),0))+1)/96))*POWER(10,INT(LOG(N8))-2),INT(0.5+100*POWER(10,IF(96*(LOG(N8)-INT(LOG(N8)))-ROUND(96*(LOG(N8)-INT(LOG(N8))),0)<0,ROUND(96*(LOG(N8)-INT(LOG(N8))),0)-1,ROUND(96*(LOG(N8)-INT(LOG(N8))),0))/96))*POWER(10,INT(LOG(N8))-2))","v":{"$error":"#NUM!"}},"Ω"]
[0.82,{"$error":"#NAME?"},0,0,0,0,{"$error":"#NAME?"},{"$error":"#NAME?"},{"$error":"#NAME?"},{"$error":"#NAME?"}]
[1,{"$error":"#NAME?"},0,0,0,0,{"$error":"#NAME?"},{"$error":"#NAME?"},{"$error":"#NAME?"},{"$error":"#NAME?"},null,null,"Rfb1",{"$f":"Rfb1_","v":100000},{"$f":"IF(N10>(INT(0.5+100*POWER(10,IF(96*(LOG(N10)-INT(LOG(N10)))-ROUND(96*(LOG(N10)-INT(LOG(N10))),0)<0,ROUND(96*(LOG(N10)-INT(LOG(N10))),0)-1,ROUND(96*(LOG(N10)-INT(LOG(N10))),0))/96))*POWER(10,INT(LOG(N10))-2)+INT(0.5+100*POWER(10,(IF(96*(LOG(N10)-INT(LOG(N10)))-ROUND(96*(LOG(N10)-INT(LOG(N10))),0)<0,ROUND(96*(LOG(N10)-INT(LOG(N10))),0)-1,ROUND(96*(LOG(N10)-INT(LOG(N10))),0))+1)/96))*POWER(10,INT(LOG(N10))-2))/2,INT(0.5+100*POWER(10,(IF(96*(LOG(N10)-INT(LOG(N10)))-ROUND(96*(LOG(N10)-INT(LOG(N10))),0)<0,ROUND(96*(LOG(N10)-INT(LOG(N10))),0)-1,ROUND(96*(LOG(N10)-INT(LOG(N10))),0))+1)/96))*POWER(10,INT(LOG(N10))-2),INT(0.5+100*POWER(10,IF(96*(LOG(N10)-INT(LOG(N10)))-ROUND(96*(LOG(N10)-INT(LOG(N10))),0)<0,ROUND(96*(LOG(N10)-INT(LOG(N10))),0)-1,ROUND(96*(LOG(N10)-INT(LOG(N10))),0))/96))*POWER(10,INT(LOG(N10))-2))","v":100000},"Ω"]
[1.2,{"$error":"#NAME?"},0,0,0,0,{"$error":"#NAME?"},{"$error":"#NAME?"},{"$error":"#NAME?"},{"$error":"#NAME?"},null,null,"Rfb2",{"$f":"Rfb2_","v":25000},{"$f":"IF(N11=\"OPEN\",\"OPEN\",IF(N11>(INT(0.5+100*POWER(10,IF(96*(LOG(N11)-INT(LOG(N11)))-ROUND(96*(LOG(N11)-INT(LOG(N11))),0)<0,ROUND(96*(LOG(N11)-INT(LOG(N11))),0)-1,ROUND(96*(LOG(N11)-INT(LOG(N11))),0))/96))*POWER(10,INT(LOG(N11))-2)+INT(0.5+100*POWER(10,(IF(96*(LOG(N11)-INT(LOG(N11)))-ROUND(96*(LOG(N11)-INT(LOG(N11))),0)<0,ROUND(96*(LOG(N11)-INT(LOG(N11))),0)-1,ROUND(96*(LOG(N11)-INT(LOG(N11))),0))+1)/96))*POWER(10,INT(LOG(N11))-2))/2,INT(0.5+100*POWER(10,(IF(96*(LOG(N11)-INT(LOG(N11)))-ROUND(96*(LOG(N11)-INT(LOG(N11))),0)<0,ROUND(96*(LOG(N11)-INT(LOG(N11))),0)-1,ROUND(96*(LOG(N11)-INT(LOG(N11))),0))+1)/96))*POWER(10,INT(LOG(N11))-2),INT(0.5+100*POWER(10,IF(96*(LOG(N11)-INT(LOG(N11)))-ROUND(96*(LOG(N11)-INT(LOG(N11))),0)<0,ROUND(96*(LOG(N11)-INT(LOG(N11))),0)-1,ROUND(96*(LOG(N11)-INT(LOG(N11))),0))/96))*POWER(10,INT(LOG(N11))-2)))","v":24900},"Ω"]
[1.5,{"$error":"#NAME?"},0,0,0,0,{"$error":"#NAME?"},{"$error":"#NAME?"},{"$error":"#NAME?"},{"$error":"#NAME?"},null,null,"Rt1",{"$f":"'Variable Management'!B25*1000","v":15767},{"$f":"IF(N12>(INT(0.5+100*POWER(10,IF(96*(LOG(N12)-INT(LOG(N12)))-ROUND(96*(LOG(N12)-INT(LOG(N12))),0)<0,ROUND(96*(LOG(N12)-INT(LOG(N12))),0)-1,ROUND(96*(LOG(N12)-INT(LOG(N12))),0))/96))*POWER(10,INT(LOG(N12))-2)+INT(0.5+100*POWER(10,(IF(96*(LOG(N12)-INT(LOG(N12)))-ROUND(96*(LOG(N12)-INT(LOG(N12))),0)<0,ROUND(96*(LOG(N12)-INT(LOG(N12))),0)-1,ROUND(96*(LOG(N12)-INT(LOG(N12))),0))+1)/96))*POWER(10,INT(LOG(N12))-2))/2,INT(0.5+100*POWER(10,(IF(96*(LOG(N12)-INT(LOG(N12)))-ROUND(96*(LOG(N12)-INT(LOG(N12))),0)<0,ROUND(96*(LOG(N12)-INT(LOG(N12))),0)-1,ROUND(96*(LOG(N12)-INT(LOG(N12))),0))+1)/96))*POWER(10,INT(LOG(N12))-2),INT(0.5+100*POWER(10,IF(96*(LOG(N12)-INT(LOG(N12)))-ROUND(96*(LOG(N12)-INT(LOG(N12))),0)<0,ROUND(96*(LOG(N12)-INT(LOG(N12))),0)-1,ROUND(96*(LOG(N12)-INT(LOG(N12))),0))/96))*POWER(10,INT(LOG(N12))-2))","v":15800},"Ω"]
[1.8,{"$error":"#NAME?"},0,0,0,0,{"$error":"#NAME?"},{"$error":"#NAME?"},{"$error":"#NAME?"},{"$error":"#NAME?"},null,null,"Rt2",{"$f":"'Variable Management'!#REF!*1000","v":{"$error":"#REF!"}},{"$f":"IF(N13=\"OPEN\",\"OPEN\",IF(N13>(INT(0.5+100*POWER(10,IF(96*(LOG(N13)-INT(LOG(N13)))-ROUND(96*(LOG(N13)-INT(LOG(N13))),0)<0,ROUND(96*(LOG(N13)-INT(LOG(N13))),0)-1,ROUND(96*(LOG(N13)-INT(LOG(N13))),0))/96))*POWER(10,INT(LOG(N13))-2)+INT(0.5+100*POWER(10,(IF(96*(LOG(N13)-INT(LOG(N13)))-ROUND(96*(LOG(N13)-INT(LOG(N13))),0)<0,ROUND(96*(LOG(N13)-INT(LOG(N13))),0)-1,ROUND(96*(LOG(N13)-INT(LOG(N13))),0))+1)/96))*POWER(10,INT(LOG(N13))-2))/2,INT(0.5+100*POWER(10,(IF(96*(LOG(N13)-INT(LOG(N13)))-ROUND(96*(LOG(N13)-INT(LOG(N13))),0)<0,ROUND(96*(LOG(N13)-INT(LOG(N13))),0)-1,ROUND(96*(LOG(N13)-INT(LOG(N13))),0))+1)/96))*POWER(10,INT(LOG(N13))-2),INT(0.5+100*POWER(10,IF(96*(LOG(N13)-INT(LOG(N13)))-ROUND(96*(LOG(N13)-INT(LOG(N13))),0)<0,ROUND(96*(LOG(N13)-INT(LOG(N13))),0)-1,ROUND(96*(LOG(N13)-INT(LOG(N13))),0))/96))*POWER(10,INT(LOG(N13))-2)))","v":{"$error":"#REF!"}},"Ω"]
[2.2000000000000002,{"$f":"IF(IF((B$3*10^12-$A15)*(B$3*10^12-$A14)*-1<0,0,1)*IF(ABS(B$3*10^12-$A15)>(B$3*10^12-$A14),$A14,$A15)=B15,0,IF((B$3*10^12-$A15)*(B$3*10^12-$A14)*-1<0,0,1)*IF(ABS(B$3*10^12-$A15)>(B$3*10^12-$A14),$A14,$A15))","v":{"$error":"#NAME?"}},0,0,0,0,{"$error":"#NAME?"},{"$error":"#NAME?"},{"$error":"#NAME?"},{"$error":"#NAME?"}]
[2.7,{"$error":"#NAME?"},0,0,0,0,{"$error":"#NAME?"},{"$error":"#NAME?"},{"$error":"#NAME?"},{"$error":"#NAME?"}]
[3.3,{"$error":"#NAME?"},0,0,0,0,{"$error":"#NAME?"},{"$error":"#NAME?"},{"$error":"#NAME?"},{"$error":"#NAME?"},null,null,"Rs",{"$f":"Rs_ideal*1000","v":{"$error":"#NAME?"}},{"$f":"IF(N16=0,0,IF(N16>(INT(0.5+100*POWER(10,IF(96*(LOG(N16)-INT(LOG(N16)))-ROUND(96*(LOG(N16)-INT(LOG(N16))),0)<0,ROUND(96*(LOG(N16)-INT(LOG(N16))),0)-1,ROUND(96*(LOG(N16)-INT(LOG(N16))),0))/96))*POWER(10,INT(LOG(N16))-2)+INT(0.5+100*POWER(10,(IF(96*(LOG(N16)-INT(LOG(N16)))-ROUND(96*(LOG(N16)-INT(LOG(N16))),0)<0,ROUND(96*(LOG(N16)-INT(LOG(N16))),0)-1,ROUND(96*(LOG(N16)-INT(LOG(N16))),0))+1)/96))*POWER(10,INT(LOG(N16))-2))/2,INT(0.5+100*POWER(10,(IF(96*(LOG(N16)-INT(LOG(N16)))-ROUND(96*(LOG(N16)-INT(LOG(N16))),0)<0,ROUND(96*(LOG(N16)-INT(LOG(N16))),0)-1,ROUND(96*(LOG(N16)-INT(LOG(N16))),0))+1)/96))*POWER(10,INT(LOG(N16))-2),INT(0.5+100*POWER(10,IF(96*(LOG(N16)-INT(LOG(N16)))-ROUND(96*(LOG(N16)-INT(LOG(N16))),0)<0,ROUND(96*(LOG(N16)-INT(LOG(N16))),0)-1,ROUND(96*(LOG(N16)-INT(LOG(N16))),0))/96))*POWER(10,INT(LOG(N16))-2)))","v":{"$error":"#NAME?"}},"mΩ"]
[3.9,{"$error":"#NAME?"},0,0,0,0,{"$error":"#NAME?"},{"$error":"#NAME?"},{"$error":"#NAME?"},{"$error":"#NAME?"},null,null,"Cres",{"$f":"Cres","v":{"$error":"#NAME?"}},{"$f":"G4*1000000000000","v":{"$error":"#NAME?"}},"pF"]
[4.7,{"$error":"#NAME?"},0,0,0,0,{"$error":"#NAME?"},{"$error":"#NAME?"},{"$error":"#NAME?"},{"$error":"#NAME?"}]
[5.6,{"$error":"#NAME?"},0,0,0,0,{"$error":"#NAME?"},{"$error":"#NAME?"},{"$error":"#NAME?"},{"$error":"#NAME?"}]
[6.8,{"$error":"#NAME?"},0,0,0,0,{"$error":"#NAME?"},{"$error":"#NAME?"},{"$error":"#NAME?"},{"$error":"#NAME?"}]
[8.1999999999999993,{"$error":"#NAME?"},0,0,0,0,{"$error":"#NAME?"},{"$error":"#NAME?"},{"$error":"#NAME?"},{"$error":"#NAME?"}]
[10,{"$error":"#NAME?"},0,0,0,0,{"$error":"#NAME?"},{"$error":"#NAME?"},{"$error":"#NAME?"},{"$error":"#NAME?"},null,null,"Cdither",{"$f":"Cdither_init","v":{"$error":"#NAME?"}},{"$f":"H4","v":{"$error":"#NAME?"}}]
[12,{"$error":"#NAME?"},0,0,0,0,{"$error":"#NAME?"},{"$error":"#NAME?"},{"$error":"#NAME?"},{"$error":"#NAME?"}]
[15,{"$error":"#NAME?"},0,0,0,0,{"$error":"#NAME?"},{"$error":"#NAME?"},{"$error":"#NAME?"},{"$error":"#NAME?"}]
[18,{"$error":"#NAME?"},0,0,0,0,{"$error":"#NAME?"},{"$error":"#NAME?"},{"$error":"#NAME?"},{"$error":"#NAME?"}]
[22,{"$error":"#NAME?"},0,0,0,0,{"$error":"#NAME?"},{"$error":"#NAME?"},{"$error":"#NAME?"},{"$error":"#NAME?"}]
[27,{"$error":"#NAME?"},0,0,0,0,{"$error":"#NAME?"},{"$error":"#NAME?"},{"$error":"#NAME?"},{"$error":"#NAME?"}]
[33,{"$error":"#NAME?"},39,0,0,0,{"$error":"#NAME?"},{"$error":"#NAME?"},{"$error":"#NAME?"},{"$error":"#NAME?"}]
[39,{"$error":"#NAME?"},0,0,0,0,{"$error":"#NAME?"},{"$error":"#NAME?"},{"$error":"#NAME?"},{"$error":"#NAME?"}]
[47,{"$error":"#NAME?"},0,0,0,0,{"$error":"#NAME?"},{"$error":"#NAME?"},{"$error":"#NAME?"},{"$error":"#NAME?"},null,null,"Rc1",{"$f":"O7/1000&\" kΩ\"","v":"49.9 kΩ"},{"$f":"O7/1000","v":49.9},"kΩ"]
[56,{"$error":"#NAME?"},0,0,0,0,{"$error":"#NAME?"},{"$error":"#NAME?"},{"$error":"#NAME?"},{"$error":"#NAME?"},null,null,"Cc1",{"$f":"C4*1000000000&\" nF\"","v":"0.039 nF"},{"$f":"C4*1000000000","v":3.9E-2},"nF"]
[68,{"$error":"#NAME?"},0,0,0,0,{"$error":"#NAME?"},{"$error":"#NAME?"},{"$error":"#NAME?"},{"$error":"#NAME?"},null,null,"Cc2",{"$f":"D4*1000000000000&\" pF\"","v":"0 pF"},{"$f":"D4*1000000000000","v":0},"pF"]
[82,{"$error":"#NAME?"},0,0,0,0,{"$error":"#NAME?"},{"$error":"#NAME?"},{"$error":"#NAME?"},{"$error":"#NAME?"}]
[{"$f":"A22*10","v":100},{"$error":"#NAME?"},0,0,0,0,{"$error":"#NAME?"},{"$error":"#NAME?"},{"$error":"#NAME?"},{"$error":"#NAME?"},null,null,"Rc2",{"$f":"O8/1000&\" kΩ\"","v":{"$error":"#NUM!"}},{"$f":"O8/1000","v":{"$error":"#NUM!"}},"kΩ"]
[{"$f":"A23*10","v":120},{"$error":"#NAME?"},0,0,0,0,{"$error":"#NAME?"},{"$error":"#NAME?"},{"$error":"#NAME?"},{"$error":"#NAME?"},null,null,"Cc3",{"$f":"I4*1000000000&\" nF\"","v":{"$error":"#NAME?"}},{"$f":"I4*1000000000","v":{"$error":"#NAME?"}},"nF"]
[150,{"$error":"#NAME?"},0,0,0,0,{"$error":"#NAME?"},{"$error":"#NAME?"},{"$error":"#NAME?"},{"$error":"#NAME?"},null,null,"Cc4",{"$f":"J4*1000000000000&\" pF\"","v":{"$error":"#NAME?"}},{"$f":"J4*1000000000000","v":{"$error":"#NAME?"}},"pF"]
[180,{"$error":"#NAME?"},0,0,0,0,{"$error":"#NAME?"},{"$error":"#NAME?"},{"$error":"#NAME?"},{"$error":"#NAME?"}]
[220,{"$error":"#NAME?"},0,0,0,0,{"$error":"#NAME?"},{"$error":"#NAME?"},{"$error":"#NAME?"},{"$error":"#NAME?"}]
[270,{"$error":"#NAME?"},{"$f":"IF(IF((C$3*10^12-$A40)*(C$3*10^12-$A39)*-1<0,0,1)*IF(ABS(C$3*10^12-$A40)>(C$3*10^12-$A39),$A39,$A40)=C40,0,IF((C$3*10^12-$A40)*(C$3*10^12-$A39)*-1<0,0,1)*IF(ABS(C$3*10^12-$A40)>(C$3*10^12-$A39),$A39,$A40))","v":0},0,0,0,{"$error":"#NAME?"},{"$error":"#NAME?"},{"$error":"#NAME?"},{"$error":"#NAME?"}]
[330,{"$error":"#NAME?"},0,0,0,0,{"$error":"#NAME?"},{"$error":"#NAME?"},{"$error":"#NAME?"},{"$error":"#NAME?"}]
[390,{"$error":"#NAME?"},0,0,0,0,{"$error":"#NAME?"},{"$error":"#NAME?"},{"$error":"#NAME?"},{"$error":"#NAME?"}]
[470,{"$error":"#NAME?"},0,0,0,0,{"$error":"#NAME?"},{"$error":"#NAME?"},{"$error":"#NAME?"},{"$error":"#NAME?"}]
[560,{"$error":"#NAME?"},0,0,0,0,{"$error":"#NAME?"},{"$error":"#NAME?"},{"$error":"#NAME?"},{"$error":"#NAME?"}]
[680,{"$error":"#NAME?"},0,0,0,0,{"$error":"#NAME?"},{"$error":"#NAME?"},{"$error":"#NAME?"},{"$error":"#NAME?"}]
[{"$f":"A33*10","v":820},{"$error":"#NAME?"},0,0,0,0,{"$error":"#NAME?"},{"$error":"#NAME?"},{"$error":"#NAME?"},{"$error":"#NAME?"}]
[1000,{"$error":"#NAME?"},0,0,0,0,{"$error":"#NAME?"},{"$error":"#NAME?"},{"$error":"#NAME?"},{"$error":"#NAME?"}]
[1200,{"$error":"#NAME?"},0,0,0,0,{"$error":"#NAME?"},{"$error":"#NAME?"},{"$error":"#NAME?"},{"$error":"#NAME?"}]
[1500,{"$error":"#NAME?"},0,0,0,0,{"$error":"#NAME?"},{"$error":"#NAME?"},{"$error":"#NAME?"},{"$error":"#NAME?"}]
[1800,{"$error":"#NAME?"},0,0,0,0,{"$error":"#NAME?"},{"$error":"#NAME?"},{"$error":"#NAME?"},{"$error":"#NAME?"}]
[2200,{"$error":"#NAME?"},0,0,0,0,{"$error":"#NAME?"},{"$error":"#NAME?"},{"$error":"#NAME?"},{"$error":"#NAME?"}]
[2700,{"$error":"#NAME?"},0,0,0,0,{"$error":"#NAME?"},{"$error":"#NAME?"},{"$error":"#NAME?"},{"$error":"#NAME?"}]
[3300,{"$error":"#NAME?"},0,0,0,0,{"$error":"#NAME?"},{"$error":"#NAME?"},{"$error":"#NAME?"},{"$error":"#NAME?"}]
[3900,{"$error":"#NAME?"},0,0,0,0,{"$error":"#NAME?"},{"$error":"#NAME?"},{"$error":"#NAME?"},{"$error":"#NAME?"}]
[4700,{"$error":"#NAME?"},0,0,0,0,{"$error":"#NAME?"},{"$error":"#NAME?"},{"$error":"#NAME?"},{"$error":"#NAME?"}]
[5600,{"$error":"#NAME?"},0,0,0,0,{"$error":"#NAME?"},{"$error":"#NAME?"},{"$error":"#NAME?"},{"$error":"#NAME?"}]
[6800,{"$error":"#NAME?"},0,0,0,0,{"$error":"#NAME?"},{"$error":"#NAME?"},{"$error":"#NAME?"},{"$error":"#NAME?"}]
[8200,{"$error":"#NAME?"},0,0,0,0,{"$error":"#NAME?"},{"$error":"#NAME?"},{"$error":"#NAME?"},{"$error":"#NAME?"}]
[10000,{"$error":"#NAME?"},0,0,0,0,{"$error":"#NAME?"},{"$error":"#NAME?"},{"$error":"#NAME?"},{"$error":"#NAME?"}]
[12000,{"$error":"#NAME?"},0,0,0,0,{"$error":"#NAME?"},{"$error":"#NAME?"},{"$error":"#NAME?"},{"$error":"#NAME?"}]
[15000,{"$error":"#NAME?"},0,0,0,0,{"$error":"#NAME?"},{"$error":"#NAME?"},{"$error":"#NAME?"},{"$error":"#NAME?"}]
[18000,{"$error":"#NAME?"},0,0,0,0,{"$error":"#NAME?"},{"$error":"#NAME?"},{"$error":"#NAME?"},{"$error":"#NAME?"}]
[22000,{"$error":"#NAME?"},0,0,0,0,{"$error":"#NAME?"},{"$error":"#NAME?"},{"$error":"#NAME?"},{"$error":"#NAME?"}]
[27000,{"$error":"#NAME?"},0,0,0,0,{"$error":"#NAME?"},{"$error":"#NAME?"},{"$error":"#NAME?"},{"$error":"#NAME?"}]
[33000,{"$error":"#NAME?"},0,0,0,0,{"$error":"#NAME?"},{"$error":"#NAME?"},{"$error":"#NAME?"},{"$error":"#NAME?"}]
[39000,{"$error":"#NAME?"},0,0,0,0,{"$error":"#NAME?"},{"$error":"#NAME?"},{"$error":"#NAME?"},{"$error":"#NAME?"}]
[47000,{"$error":"#NAME?"},0,0,0,0,{"$error":"#NAME?"},{"$error":"#NAME?"},{"$error":"#NAME?"},{"$error":"#NAME?"}]
[56000,{"$error":"#NAME?"},0,0,0,0,{"$error":"#NAME?"},{"$error":"#NAME?"},{"$error":"#NAME?"},{"$error":"#NAME?"}]
[68000,{"$error":"#NAME?"},0,0,0,0,{"$error":"#NAME?"},{"$error":"#NAME?"},{"$error":"#NAME?"},{"$error":"#NAME?"}]
[82000,{"$error":"#NAME?"},0,0,0,0,{"$error":"#NAME?"},{"$error":"#NAME?"},{"$error":"#NAME?"},{"$f":"IF(IF((J$3*10^12-$A70)*(J$3*10^12-$A69)*-1<0,0,1)*IF(ABS(J$3*10^12-$A70)>(J$3*10^12-$A69),$A69,$A70)=J70,0,IF((J$3*10^12-$A70)*(J$3*10^12-$A69)*-1<0,0,1)*IF(ABS(J$3*10^12-$A70)>(J$3*10^12-$A69),$A69,$A70))","v":{"$error":"#NAME?"}}]
[100000,{"$error":"#NAME?"},0,{"$f":"IF(IF((D$3*10^12-$A71)*(D$3*10^12-$A70)*-1<0,0,1)*IF(ABS(D$3*10^12-$A71)>(D$3*10^12-$A70),$A70,$A71)=D71,0,IF((D$3*10^12-$A71)*(D$3*10^12-$A70)*-1<0,0,1)*IF(ABS(D$3*10^12-$A71)>(D$3*10^12-$A70),$A70,$A71))","v":0},0,0,{"$error":"#NAME?"},{"$error":"#NAME?"},{"$error":"#NAME?"},{"$error":"#NAME?"}]
[120000,{"$f":"IF(IF((B$3*10^12-$A72)*(B$3*10^12-$A71)*-1<0,0,1)*IF(ABS(B$3*10^12-$A72)>(B$3*10^12-$A71),$A71,$A72)=B72,0,IF((B$3*10^12-$A72)*(B$3*10^12-$A71)*-1<0,0,1)*IF(ABS(B$3*10^12-$A72)>(B$3*10^12-$A71),$A71,$A72))","v":{"$error":"#NAME?"}},{"$f":"IF(IF((C$3*10^12-$A72)*(C$3*10^12-$A71)*-1<0,0,1)*IF(ABS(C$3*10^12-$A72)>(C$3*10^12-$A71),$A71,$A72)=C72,0,IF((C$3*10^12-$A72)*(C$3*10^12-$A71)*-1<0,0,1)*IF(ABS(C$3*10^12-$A72)>(C$3*10^12-$A71),$A71,$A72))","v":0},0,0,{"$f":"IF(IF((F$3*10^12-$A72)*(F$3*10^12-$A71)*-1<0,0,1)*IF(ABS(F$3*10^12-$A72)>(F$3*10^12-$A71),$A71,$A72)=F72,0,IF((F$3*10^12-$A72)*(F$3*10^12-$A71)*-1<0,0,1)*IF(ABS(F$3*10^12-$A72)>(F$3*10^12-$A71),$A71,$A72))","v":0},{"$f":"IF(IF((G$3*10^12-$A72)*(G$3*10^12-$A71)*-1<0,0,1)*IF(ABS(G$3*10^12-$A72)>(G$3*10^12-$A71),$A71,$A72)=G72,0,IF((G$3*10^12-$A72)*(G$3*10^12-$A71)*-1<0,0,1)*IF(ABS(G$3*10^12-$A72)>(G$3*10^12-$A71),$A71,$A72))","v":{"$error":"#NAME?"}},{"$f":"IF(IF((H$3*10^12-$A72)*(H$3*10^12-$A71)*-1<0,0,1)*IF(ABS(H$3*10^12-$A72)>(H$3*10^12-$A71),$A71,$A72)=H72,0,IF((H$3*10^12-$A72)*(H$3*10^12-$A71)*-1<0,0,1)*IF(ABS(H$3*10^12-$A72)>(H$3*10^12-$A71),$A71,$A72))","v":{"$error":"#NAME?"}},{"$f":"IF(IF((I$3*10^12-$A72)*(I$3*10^12-$A71)*-1<0,0,1)*IF(ABS(I$3*10^12-$A72)>(I$3*10^12-$A71),$A71,$A72)=I72,0,IF((I$3*10^12-$A72)*(I$3*10^12-$A71)*-1<0,0,1)*IF(ABS(I$3*10^12-$A72)>(I$3*10^12-$A71),$A71,$A72))","v":{"$error":"#NAME?"}},{"$error":"#NAME?"}]
[150000,{"$error":"#NAME?"},0,0,0,0,{"$error":"#NAME?"},{"$error":"#NAME?"},{"$error":"#NAME?"},{"$error":"#NAME?"}]
[180000,{"$error":"#NAME?"},0,0,0,0,{"$error":"#NAME?"},{"$error":"#NAME?"},{"$error":"#NAME?"},{"$error":"#NAME?"}]
[220000,{"$error":"#NAME?"},0,0,0,0,{"$error":"#NAME?"},{"$error":"#NAME?"},{"$error":"#NAME?"},{"$error":"#NAME?"}]
[270000,{"$error":"#NAME?"},0,0,0,0,{"$error":"#NAME?"},{"$error":"#NAME?"},{"$error":"#NAME?"},{"$error":"#NAME?"}]
[330000,{"$error":"#NAME?"},0,0,0,0,{"$error":"#NAME?"},{"$error":"#NAME?"},{"$error":"#NAME?"},{"$error":"#NAME?"}]
[390000,{"$error":"#NAME?"},0,0,0,0,{"$error":"#NAME?"},{"$error":"#NAME?"},{"$error":"#NAME?"},{"$error":"#NAME?"}]
[470000,{"$error":"#NAME?"},0,0,0,0,{"$error":"#NAME?"},{"$error":"#NAME?"},{"$error":"#NAME?"},{"$error":"#NAME?"}]
[560000,{"$error":"#NAME?"},0,0,0,0,{"$error":"#NAME?"},{"$error":"#NAME?"},{"$error":"#NAME?"},{"$error":"#NAME?"}]
[680000,{"$error":"#NAME?"},0,0,0,0,{"$error":"#NAME?"},{"$error":"#NAME?"},{"$error":"#NAME?"},{"$error":"#NAME?"}]
[820000,{"$error":"#NAME?"},0,0,0,0,{"$error":"#NAME?"},{"$error":"#NAME?"},{"$error":"#NAME?"},{"$error":"#NAME?"}]
[1000000,{"$error":"#NAME?"},0,0,0,0,{"$error":"#NAME?"},{"$error":"#NAME?"},{"$error":"#NAME?"},{"$error":"#NAME?"}]
[1200000,{"$error":"#NAME?"},0,0,0,0,{"$error":"#NAME?"},{"$error":"#NAME?"},{"$error":"#NAME?"},{"$error":"#NAME?"}]
[1500000,{"$error":"#NAME?"},0,0,0,0,{"$error":"#NAME?"},{"$error":"#NAME?"},{"$error":"#NAME?"},{"$error":"#NAME?"}]
[1800000,{"$error":"#NAME?"},0,0,0,0,{"$error":"#NAME?"},{"$error":"#NAME?"},{"$error":"#NAME?"},{"$error":"#NAME?"}]
[2200000,{"$error":"#NAME?"},0,0,0,0,{"$error":"#NAME?"},{"$error":"#NAME?"},{"$error":"#NAME?"},{"$error":"#NAME?"}]
[2700000,{"$error":"#NAME?"},0,0,0,0,{"$error":"#NAME?"},{"$error":"#NAME?"},{"$error":"#NAME?"},{"$error":"#NAME?"}]
[3300000,{"$error":"#NAME?"},0,0,0,0,{"$error":"#NAME?"},{"$error":"#NAME?"},{"$error":"#NAME?"},{"$error":"#NAME?"}]
[3900000,{"$error":"#NAME?"},0,0,0,0,{"$error":"#NAME?"},{"$error":"#NAME?"},{"$error":"#NAME?"},{"$error":"#NAME?"}]
[4700000,{"$error":"#NAME?"},0,0,0,0,{"$error":"#NAME?"},{"$error":"#NAME?"},{"$error":"#NAME?"},{"$error":"#NAME?"}]
[5600000,{"$error":"#NAME?"},0,0,0,0,{"$error":"#NAME?"},{"$error":"#NAME?"},{"$error":"#NAME?"},{"$error":"#NAME?"}]
[6800000,{"$error":"#NAME?"},0,0,0,0,{"$error":"#NAME?"},{"$error":"#NAME?"},{"$error":"#NAME?"},{"$error":"#NAME?"}]
[8200000,{"$error":"#NAME?"},0,0,0,0,{"$error":"#NAME?"},{"$error":"#NAME?"},{"$error":"#NAME?"},{"$error":"#NAME?"}]
[10000000,{"$error":"#NAME?"},0,0,0,0,{"$error":"#NAME?"},{"$error":"#NAME?"},{"$error":"#NAME?"},{"$error":"#NAME?"}]
[12000000,{"$error":"#NAME?"},0,0,0,0,{"$error":"#NAME?"},{"$error":"#NAME?"},{"$error":"#NAME?"},{"$error":"#NAME?"}]
[15000000,{"$error":"#NAME?"},0,0,0,0,{"$error":"#NAME?"},{"$error":"#NAME?"},{"$error":"#NAME?"},{"$error":"#NAME?"}]
[18000000,{"$error":"#NAME?"},0,0,0,0,{"$error":"#NAME?"},{"$error":"#NAME?"},{"$error":"#NAME?"},{"$error":"#NAME?"}]
[22000000,{"$error":"#NAME?"},0,0,0,27000000,{"$error":"#NAME?"},{"$error":"#NAME?"},{"$error":"#NAME?"},{"$error":"#NAME?"}]
[{"$f":"A87*10","v":27000000},{"$error":"#NAME?"},0,0,0,0,{"$error":"#NAME?"},{"$error":"#NAME?"},{"$error":"#NAME?"},{"$error":"#NAME?"}]
[33000000,{"$error":"#NAME?"},0,0,0,0,{"$error":"#NAME?"},{"$error":"#NAME?"},{"$error":"#NAME?"},{"$error":"#NAME?"}]
[39000000,{"$error":"#NAME?"},0,0,0,0,{"$error":"#NAME?"},{"$error":"#NAME?"},{"$error":"#NAME?"},{"$error":"#NAME?"}]
[47000000,{"$error":"#NAME?"},0,0,0,0,{"$error":"#NAME?"},{"$error":"#NAME?"},{"$error":"#NAME?"},{"$error":"#NAME?"}]
[56000000,{"$error":"#NAME?"},0,0,0,{"$f":"IF(IF((F$3*10^12-$A104)*(F$3*10^12-$A103)*-1<0,0,1)*IF(ABS(F$3*10^12-$A104)>(F$3*10^12-$A103),$A103,$A104)=F104,0,IF((F$3*10^12-$A104)*(F$3*10^12-$A103)*-1<0,0,1)*IF(ABS(F$3*10^12-$A104)>(F$3*10^12-$A103),$A103,$A104))","v":0},{"$f":"IF(IF((G$3*10^12-$A104)*(G$3*10^12-$A103)*-1<0,0,1)*IF(ABS(G$3*10^12-$A104)>(G$3*10^12-$A103),$A103,$A104)=G104,0,IF((G$3*10^12-$A104)*(G$3*10^12-$A103)*-1<0,0,1)*IF(ABS(G$3*10^12-$A104)>(G$3*10^12-$A103),$A103,$A104))","v":{"$error":"#NAME?"}},{"$f":"IF(IF((H$3*10^12-$A104)*(H$3*10^12-$A103)*-1<0,0,1)*IF(ABS(H$3*10^12-$A104)>(H$3*10^12-$A103),$A103,$A104)=H104,0,IF((H$3*10^12-$A104)*(H$3*10^12-$A103)*-1<0,0,1)*IF(ABS(H$3*10^12-$A104)>(H$3*10^12-$A103),$A103,$A104))","v":{"$error":"#NAME?"}},{"$f":"IF(IF((I$3*10^12-$A104)*(I$3*10^12-$A103)*-1<0,0,1)*IF(ABS(I$3*10^12-$A104)>(I$3*10^12-$A103),$A103,$A104)=I104,0,IF((I$3*10^12-$A104)*(I$3*10^12-$A103)*-1<0,0,1)*IF(ABS(I$3*10^12-$A104)>(I$3*10^12-$A103),$A103,$A104))","v":{"$error":"#NAME?"}},{"$error":"#NAME?"}]
[68000000,{"$error":"#NAME?"},0,0,68000000,0,{"$error":"#NAME?"},{"$error":"#NAME?"},{"$error":"#NAME?"},{"$error":"#NAME?"}]
[82000000,{"$error":"#NAME?"},0,0,0,0,{"$error":"#NAME?"},{"$error":"#NAME?"},{"$error":"#NAME?"},{"$error":"#NAME?"}]
[100000000,{"$error":"#NAME?"},0,0,0,0,{"$error":"#NAME?"},{"$error":"#NAME?"},{"$error":"#NAME?"},{"$error":"#NAME?"}]
[120000000,{"$error":"#NAME?"},0,0,0,0,{"$error":"#NAME?"},{"$error":"#NAME?"},{"$error":"#NAME?"},{"$error":"#NAME?"}]
[150000000,{"$error":"#NAME?"},0,0,0,0,{"$error":"#NAME?"},{"$error":"#NAME?"},{"$error":"#NAME?"},{"$error":"#NAME?"}]
[180000000,{"$error":"#NAME?"},0,0,0,0,{"$error":"#NAME?"},{"$error":"#NAME?"},{"$error":"#NAME?"},{"$error":"#NAME?"}]
[220000000,{"$error":"#NAME?"},0,0,0,0,{"$error":"#NAME?"},{"$error":"#NAME?"},{"$error":"#NAME?"},{"$error":"#NAME?"}]
[270000000,{"$error":"#NAME?"},0,0,0,0,{"$error":"#NAME?"},{"$error":"#NAME?"},{"$error":"#NAME?"},{"$error":"#NAME?"}]
[330000000,{"$error":"#NAME?"},0,0,0,0,{"$error":"#NAME?"},{"$error":"#NAME?"},{"$error":"#NAME?"},{"$error":"#NAME?"}]
[390000000,{"$error":"#NAME?"},0,0,0,0,{"$error":"#NAME?"},{"$error":"#NAME?"},{"$error":"#NAME?"},{"$error":"#NAME?"}]
[470000000,{"$error":"#NAME?"},0,0,0,0,{"$error":"#NAME?"},{"$error":"#NAME?"},{"$error":"#NAME?"},{"$error":"#NAME?"}]
[560000000,{"$error":"#NAME?"},0,0,0,0,{"$error":"#NAME?"},{"$error":"#NAME?"},{"$error":"#NAME?"},{"$error":"#NAME?"}]
[680000000,{"$error":"#NAME?"},0,0,0,0,{"$error":"#NAME?"},{"$error":"#NAME?"},{"$error":"#NAME?"},{"$error":"#NAME?"}]
[820000000,{"$error":"#NAME?"},0,0,0,0,{"$error":"#NAME?"},{"$error":"#NAME?"},{"$error":"#NAME?"},{"$error":"#NAME?"}]
[1000000000,{"$error":"#NAME?"},0,0,0,0,{"$error":"#NAME?"},{"$error":"#NAME?"},{"$error":"#NAME?"},{"$error":"#NAME?"}]
[1200000000,{"$error":"#NAME?"},0,0,0,0,{"$error":"#NAME?"},{"$error":"#NAME?"},{"$error":"#NAME?"},{"$error":"#NAME?"}]
[1500000000,{"$error":"#NAME?"},0,0,0,0,{"$error":"#NAME?"},{"$error":"#NAME?"},{"$error":"#NAME?"},{"$error":"#NAME?"}]
[1800000000,{"$error":"#NAME?"},0,0,0,0,{"$error":"#NAME?"},{"$error":"#NAME?"},{"$error":"#NAME?"},{"$error":"#NAME?"}]
[2200000000,{"$error":"#NAME?"},0,0,0,0,{"$error":"#NAME?"},{"$error":"#NAME?"},{"$error":"#NAME?"},{"$error":"#NAME?"}]
[2700000000,{"$error":"#NAME?"},0,0,0,0,{"$error":"#NAME?"},{"$error":"#NAME?"},{"$error":"#NAME?"},{"$error":"#NAME?"}]
[3300000000,{"$error":"#NAME?"},0,0,0,0,{"$error":"#NAME?"},{"$error":"#NAME?"},{"$error":"#NAME?"},{"$error":"#NAME?"}]
[3900000000,{"$error":"#NAME?"},0,0,0,0,{"$error":"#NAME?"},{"$error":"#NAME?"},{"$error":"#NAME?"},{"$error":"#NAME?"}]
[4700000000,{"$error":"#NAME?"},0,0,0,0,{"$error":"#NAME?"},{"$error":"#NAME?"},{"$error":"#NAME?"},{"$error":"#NAME?"}]
[5600000000,{"$error":"#NAME?"},0,0,0,0,{"$error":"#NAME?"},{"$error":"#NAME?"},{"$error":"#NAME?"},{"$error":"#NAME?"}]
[6800000000,{"$error":"#NAME?"},0,0,0,0,{"$error":"#NAME?"},{"$error":"#NAME?"},{"$error":"#NAME?"},{"$error":"#NAME?"}]
[8200000000,{"$error":"#NAME?"},0,0,0,0,{"$error":"#NAME?"},{"$error":"#NAME?"},{"$error":"#NAME?"},{"$error":"#NAME?"}]
[10000000000,{"$error":"#NAME?"},0,0,0,0,{"$error":"#NAME?"},{"$error":"#NAME?"},{"$error":"#NAME?"},{"$error":"#NAME?"}]
[12000000000,{"$error":"#NAME?"},0,0,0,0,{"$error":"#NAME?"},{"$error":"#NAME?"},{"$error":"#NAME?"},{"$error":"#NAME?"}]
[15000000000,{"$error":"#NAME?"},0,0,0,0,{"$error":"#NAME?"},{"$error":"#NAME?"},{"$error":"#NAME?"},{"$error":"#NAME?"}]
[18000000000,{"$error":"#NAME?"},0,0,0,0,{"$error":"#NAME?"},{"$error":"#NAME?"},{"$error":"#NAME?"},{"$f":"IF(IF((J$3*10^12-$A134)*(J$3*10^12-$A133)*-1<0,0,1)*IF(ABS(J$3*10^12-$A134)>(J$3*10^12-$A133),$A133,$A134)=J134,0,IF((J$3*10^12-$A134)*(J$3*10^12-$A133)*-1<0,0,1)*IF(ABS(J$3*10^12-$A134)>(J$3*10^12-$A133),$A133,$A134))","v":{"$error":"#NAME?"}}]
[22000000000,{"$error":"#NAME?"},0,0,{"$f":"IF(IF((E$3*10^12-$A135)*(E$3*10^12-$A134)*-1<0,0,1)*IF(ABS(E$3*10^12-$A135)>(E$3*10^12-$A134),$A134,$A135)=E135,0,IF((E$3*10^12-$A135)*(E$3*10^12-$A134)*-1<0,0,1)*IF(ABS(E$3*10^12-$A135)>(E$3*10^12-$A134),$A134,$A135))","v":0},0,{"$error":"#NAME?"},{"$error":"#NAME?"},{"$error":"#NAME?"},{"$f":"IF(IF((J$3*10^12-$A135)*(J$3*10^12-$A134)*-1<0,0,1)*IF(ABS(J$3*10^12-$A135)>(J$3*10^12-$A134),$A134,$A135)=J135,0,IF((J$3*10^12-$A135)*(J$3*10^12-$A134)*-1<0,0,1)*IF(ABS(J$3*10^12-$A135)>(J$3*10^12-$A134),$A134,$A135))","v":{"$error":"#NAME?"}}]
[27000000000,{"$f":"IF(IF((B$3*10^12-$A136)*(B$3*10^12-$A135)*-1<0,0,1)*IF(ABS(B$3*10^12-$A136)>(B$3*10^12-$A135),$A135,$A136)=B136,0,IF((B$3*10^12-$A136)*(B$3*10^12-$A135)*-1<0,0,1)*IF(ABS(B$3*10^12-$A136)>(B$3*10^12-$A135),$A135,$A136))","v":{"$error":"#NAME?"}},{"$f":"IF(IF((C$3*10^12-$A136)*(C$3*10^12-$A135)*-1<0,0,1)*IF(ABS(C$3*10^12-$A136)>(C$3*10^12-$A135),$A135,$A136)=C136,0,IF((C$3*10^12-$A136)*(C$3*10^12-$A135)*-1<0,0,1)*IF(ABS(C$3*10^12-$A136)>(C$3*10^12-$A135),$A135,$A136))","v":0},0,0,0,{"$error":"#NAME?"},{"$error":"#NAME?"},{"$error":"#NAME?"},{"$error":"#NAME?"}]
[33000000000,{"$error":"#NAME?"},0,0,0,0,{"$error":"#NAME?"},{"$error":"#NAME?"},{"$error":"#NAME?"},{"$error":"#NAME?"}]
[39000000000,{"$error":"#NAME?"},0,0,0,0,{"$error":"#NAME?"},{"$error":"#NAME?"},{"$error":"#NAME?"},{"$error":"#NAME?"}]
[47000000000,{"$error":"#NAME?"},0,0,0,0,{"$error":"#NAME?"},{"$error":"#NAME?"},{"$error":"#NAME?"},{"$error":"#NAME?"}]
[56000000000,{"$error":"#NAME?"},0,0,0,0,{"$error":"#NAME?"},{"$error":"#NAME?"},{"$error":"#NAME?"},{"$error":"#NAME?"}]
[68000000000,{"$error":"#NAME?"},0,0,0,0,{"$error":"#NAME?"},{"$error":"#NAME?"},{"$error":"#NAME?"},{"$error":"#NAME?"}]
[82000000000,{"$error":"#NAME?"},0,0,0,0,{"$error":"#NAME?"},{"$error":"#NAME?"},{"$error":"#NAME?"},{"$error":"#NAME?"}]
[100000000000,{"$error":"#NAME?"},0,0,0,0,{"$error":"#NAME?"},{"$error":"#NAME?"},{"$error":"#NAME?"},{"$error":"#NAME?"}]
[120000000000,{"$error":"#NAME?"},0,0,0,0,{"$error":"#NAME?"},{"$error":"#NAME?"},{"$error":"#NAME?"},{"$error":"#NAME?"}]
[150000000000,{"$error":"#NAME?"},0,0,0,0,{"$error":"#NAME?"},{"$error":"#NAME?"},{"$error":"#NAME?"},{"$error":"#NAME?"}]
[180000000000,{"$error":"#NAME?"},0,0,0,0,{"$error":"#NAME?"},{"$error":"#NAME?"},{"$error":"#NAME?"},{"$error":"#NAME?"}]
[220000000000,{"$error":"#NAME?"},0,0,0,0,{"$error":"#NAME?"},{"$error":"#NAME?"},{"$error":"#NAME?"},{"$error":"#NAME?"}]
[270000000000,{"$error":"#NAME?"},0,0,0,0,{"$error":"#NAME?"},{"$error":"#NAME?"},{"$error":"#NAME?"},{"$error":"#NAME?"}]
[330000000000,{"$error":"#NAME?"},0,0,0,0,{"$error":"#NAME?"},{"$error":"#NAME?"},{"$error":"#NAME?"},{"$error":"#NAME?"}]
[390000000000,{"$error":"#NAME?"},0,0,0,0,{"$error":"#NAME?"},{"$error":"#NAME?"},{"$error":"#NAME?"},{"$error":"#NAME?"}]
[470000000000,{"$error":"#NAME?"},0,0,0,0,{"$error":"#NAME?"},{"$error":"#NAME?"},{"$error":"#NAME?"},{"$error":"#NAME?"}]
[560000000000,{"$error":"#NAME?"},0,0,0,0,{"$error":"#NAME?"},{"$error":"#NAME?"},{"$error":"#NAME?"},{"$error":"#NAME?"}]
[680000000000,{"$error":"#NAME?"},0,0,0,0,{"$error":"#NAME?"},{"$error":"#NAME?"},{"$error":"#NAME?"},{"$error":"#NAME?"}]
[820000000000,{"$error":"#NAME?"},0,0,0,0,{"$error":"#NAME?"},{"$error":"#NAME?"},{"$error":"#NAME?"},{"$error":"#NAME?"}]
[1000000000000,{"$error":"#NAME?"},0,0,0,0,{"$error":"#NAME?"},{"$error":"#NAME?"},{"$error":"#NAME?"},{"$error":"#NAME?"}]
[1200000000000,{"$error":"#NAME?"},0,0,0,0,{"$error":"#NAME?"},{"$error":"#NAME?"},{"$error":"#NAME?"},{"$error":"#NAME?"}]
[1500000000000,{"$error":"#NAME?"},0,0,0,0,{"$error":"#NAME?"},{"$error":"#NAME?"},{"$error":"#NAME?"},{"$error":"#NAME?"}]
[1800000000000,{"$error":"#NAME?"},0,0,0,0,{"$error":"#NAME?"},{"$error":"#NAME?"},{"$error":"#NAME?"},{"$error":"#NAME?"}]
[2200000000000,{"$error":"#NAME?"},0,0,0,0,{"$error":"#NAME?"},{"$error":"#NAME?"},{"$error":"#NAME?"},{"$error":"#NAME?"}]
[2700000000000,{"$error":"#NAME?"},2700000000000,0,2700000000000,2700000000000,{"$error":"#NAME?"},{"$error":"#NAME?"},{"$error":"#NAME?"},{"$error":"#NAME?"}]

{"sheet":"Snubber","index":11,"n_rows":6,"n_cols":5,"rows_kept":6,"cut":false,"hidden":true,"merged":[]}
[null,null,"UNITS","STD UNITS"]
["Frequency of Ringing",85,"MHz",{"$f":"B2*1000000","v":85000000},"Hz"]
["SW capacitance",3000,"pF",{"$f":"B3*0.000000000001","v":3E-9},"F"]
["Lpar",{"$f":"1000000000*1/((D2*2*3.14159)^2*D3)","v":1.1686430773614742},"nH",{"$f":"B4/1000000000","v":1.1686430773614743E-9},"H"]
["Csnub",{"$f":"4*B3","v":12000},"pF",{"$f":"B5*0.000000000001","v":1.2E-8},"F"]
["Rsnub",{"$f":"SQRT(D4/D3)","v":0.62413755891936573},"Ω",{"$f":"B6","v":0.62413755891936573},"Ω"]

{"sheet":"Parallel Output Caps","index":12,"n_rows":17,"n_cols":5,"rows_kept":17,"cut":false,"hidden":true,"merged":[]}
[]
[]
[]
["Fsw",{"$f":"Fsw","v":1000000}]
[]
["C1",20,"uF",{"$f":"B6/1000000","v":2.0000000000000002E-5},"F"]
["R1",0.5,"mOhms",{"$f":"B7/1000","v":5.0000000000000001E-4},"Ohms"]
[]
["C2",68,"uF",{"$f":"B9/1000000","v":6.7999999999999999E-5},"F"]
["R2",20,"mOhms",{"$f":"B10/1000","v":0.02},"Ohms"]
[]
[]
["I1 ",{"$f":"(D6/(D6+D9))*SQRT((D10*D9*B4)^2+1)/SQRT((((D7+D10)*D6*D9/(D9+D6))*B4)^2+1)","v":0.36573722195300923},"%"]
["I2 ",{"$f":"1-B13","v":0.63426277804699072},"%"]
[]
["I1 ",{"$f":"B13*(Iripple1/(2*SQRT(3)))","v":{"$error":"#NAME?"}},"A"]
["I2 ",{"$f":"B14*(Iripple1/(2*SQRT(3)))","v":{"$error":"#NAME?"}},"A"]