{"text_format":"1","workbook":"xlsx","n_sheets":11,"sheets":["InputSheet","DeviceCalculator","Sheet1","partData","Layout Checklist","Schematic Checklist","revisionNotes","Disclaimer","DeviceCalculator_old","Std. R and C Values","Extra"],"not_rendered":{"charts":0,"images":2,"macros":1,"external_links":1,"defined_names":284,"comments":1,"pivot_tables":0},"unopened":[],"bounds":{"document_bytes":16777216,"sheet_cells":100000,"rows_first":2000,"rows_last":500,"rows_between":2000,"halvings":0,"cell_chars":16384,"cell_head_chars":4096},"cells_cut":0,"cells_raw":0,"read":"whole","date_system":"1900"}

{"sheet":"InputSheet","index":0,"n_rows":61,"n_cols":7,"rows_kept":61,"cut":false,"hidden":false,"merged":[]}
["Parameter","Units","Type","Default","*selected*","end"]
["Rail Name",null,"Req",null,"tes"]
["Part Number",null,"Req",null,"TPSM843B22"]
["Vin_min","V","Opt","Vin_nom*0.8",10]
["Vin_nom","V","Req",null,12,null,"Sheet Descriptions:"]
["Vin_max","V","Opt","Vin_nom*1.1",13.2,null,"InputSheet = sheet with simplified input for checking component values with the macros described below"]
["Vout","V","Req",null,1.2,null,"DeviceCalculator = sheet where all calculations are done. This sheet can be used by itself to select or check component values."]
["Iout","A","Opt","Io_max_IC",12]
["dVo_trans",null,"Opt","Vout*0.05",2.4E-2,null,"Macro Directions:"]
["dVo_dc",null,"Opt","Vout*0.01",1.2E-2,null,"Check/Calculate Selected Column"]
["Io_step","A","Opt","Iout*0.5",6,null,"Select any cell in the column of the design you would like to check."]
["R_fsel",null,"Opt","R_fsel_rec",11.8,null,"Click on the Check/Calculate to send the input values to the DeviceCalculator worksheet."]
["fsw_select",null,"Calc",null,1000,null,"The calculated results on the DeviceCalculator worksheet are then pulled back to this sheet to check the component values used."]
["Isat",null,"Opt",null,20]
["Inductor_Part_Number",null,"Opt",null,"TBD"]
["Ipeak_max","A","Calc",null,14.066115702479339,null,"To delete a design that is no longer needed, right click on the column letter then select delete."]
["N_Cout_cer",null,"Opt",1,6]
["Cout_single_cer","mΩ","Opt","Cout_min",100,null,"Pull Values from DeviceCalculator Sheet"]
["Cer_derating",null,"Opt",0.8,0.8,null,"The DeviceCalculator worksheet has more details to aid in the design."]
["Cer_Voltage_Rating",null,"Opt",null,6.3]
{"$rows_left_out":42}
{"sheet":"DeviceCalculator","index":1,"n_rows":222,"n_cols":10,"rows_kept":222,"cut":false,"hidden":false,"merged":[[60,1,60,7],[194,1,194,7],[209,1,209,7],[73,1,73,7],[141,1,141,7],[148,1,148,7],[153,1,153,7],[154,1,154,7],[168,1,168,7],[72,1,72,7],[0,1,0,7],[1,1,6,1],[1,2,6,2],[1,3,6,3],[1,4,6,4],[1,5,6,5],[1,6,6,6],[1,7,6,7],[7,1,7,7],[26,1,26,7],[34,1,34,7],[43,1,43,7],[44,1,44,7]]}
[null,"Design Calculations",null,null,null,null,null,null,null,"Key"]
[null,"Parameter","Input","Recommended","Selected Value","Calculated with Selected Value","Units","Description",null,"User Entered Value"]
[null,null,null,null,null,null,null,null,null,"Fixed IC Parameter"]
[null,null,null,null,null,null,null,null,null,"Calculated Parameter"]
[null,null,null,null,null,null,null,null,null,"Recommended Component Value"]
[null,null,null,null,null,null,null,null,null,"Design Caution"]
[null,null,null,null,null,null,null,null,null,"Design Warning"]
[null,"Choose Device"]
[null,"Part number","TPSM843B22",null,null,null,null,"Select IC part number"]
[null,"Vin_min_IC",{"$f":"VLOOKUP($C$9,partData!$A$3:$AAA$17,2,FALSE)","v":4},null,null,null,"V","IC rated minimum input voltage"]
[null,"Vin_max_IC",{"$f":"VLOOKUP($C$9,partData!$A$3:$AAA$17,3,FALSE)","v":18},null,null,null,"V","IC rated maximum input voltage"]
[null,"Vref",{"$f":"VLOOKUP($C$9,partData!$A$3:$AAA$17,9,FALSE)","v":0.5},null,null,null,"V","Internal voltage reference"]
[null,"Io_max_IC",{"$f":"VLOOKUP($C$9,partData!$A$3:$AAA$17,4,FALSE)","v":20},null,null,null,"A","IC rated maximum output current"]
[null,"EN_rise",{"$f":"VLOOKUP($C$9,partData!$A$3:$AAA$17,12,FALSE)","v":1.2},null,null,null,"V","EN rising voltage threshold"]
[null,"EN_rise_max",{"$f":"VLOOKUP($C$9,partData!$A$3:$AAA$17,17,FALSE)","v":1.25},null,null,null,"V","EN rising voltage threshold (maximum spec)"]
[null,"EN_fall",{"$f":"VLOOKUP($C$9,partData!$A$3:$AAA$17,13,FALSE)","v":1.1000000000000001},null,null,null,"V","EN falling voltage threshold"]
[null,"Ip ",{"$f":"VLOOKUP($C$9,partData!$A$3:$AAA$17,14,FALSE)","v":1.5E-6},null,null,null,"A","EN pull up current "]
[null,"Ip2",{"$f":"VLOOKUP($C$9,partData!$A$3:$AAA$17,15,FALSE)","v":1.1600000000000001E-5},null,null,null,"A","EN pul up + hystersis current"]
[null,"Ih",{"$f":"VLOOKUP($C$9,partData!$A$3:$AAA$17,16,FALSE)","v":1.01E-5},null,null,null,"A","EN hystersis current"]
[null,"OC_high_min",{"$f":"VLOOKUP($C$9,partData!$A$3:$AAA$17,5,FALSE)","v":26.1},null,null,null,"A","Minimum peak current limit for High current limits"]
{"$rows_left_out":203}
{"sheet":"Sheet1","index":2,"n_rows":24,"n_cols":13,"rows_kept":24,"cut":false,"hidden":true,"merged":[]}
[]
[]
[]
[]
[null,null,null,null,null,null,null,null,null,null,"fsw","lookup1","lookup2"]
[null,null,null,null,null,null,null,null,null,null,500,0.372,0.29699999999999999]
[null,null,null,null,null,null,null,null,null,null,1000,0.71899999999999997,0.59399999999999997]
[]
[]
[null,null,null,null,"tcramp",{"$f":"F11*10^6/(F12-F13*F14/F15)","v":2.0125786163522009E-5}]
[null,null,null,null,"Cramp (F)",3.9999999999999999E-12]
[null,null,null,null,"lookup1",{"$f":"L6","v":0.372}]
[null,null,null,null,"lookup2",{"$f":"M6","v":0.29699999999999999}]
[null,null,null,null,"vout V",7]
[null,null,null,null,"vin V",12]
[]
[]
[null,null,null,null,"vcramp",{"$f":"F19*(F20+F21)/(F22)","v":0.75525000000000009}]
[null,null,null,null,{"$f":"E15","v":"vin V"},{"$f":"F15","v":12}]
[null,null,null,null,"ton s",{"$f":"(F14/F19)*(1/F24)","v":1.1666666666666668E-6}]
{"$rows_left_out":5}
{"sheet":"partData","index":3,"n_rows":103,"n_cols":33,"rows_kept":103,"cut":false,"hidden":true,"merged":[]}
[1,2,3,4,5,6,7,8,9,10,11,12,13,14,15,16,17,18,19,20,21,22,23,24,25]
["Part #","VIN_min","VIN_max","Io,rated","OC high min","OC low min","tonmin max","toffmin max","Vref","R_HS","R_LS","EN_rise","EN_fall","I_p1","I_p2","I_h","EN_rise_max","OC high valley","OC low_valley","VoutMax","Lout","DCR","Tol_L"]
["TPS543320",4,18,3,4,2.6,40,140,0.5,25,13.9,1.2,1.1000000000000001,1.5E-6,{"$f":"0.0000116","v":1.1600000000000001E-5},{"$f":"I_p2-I_p1","v":1.0100000000000002E-5},1.25,null,null,5.5]
["TPS543620",4,18,6,8.3699999999999992,4,40,140,0.5,25,6.5,1.2,1.1000000000000001,1.5E-6,{"$f":"0.0000116","v":1.1600000000000001E-5},{"$f":"I_p2-I_p1","v":1.0100000000000002E-5},1.25,null,null,5.5]
["TPS543820",4,18,8,11.25,8.3699999999999992,40,140,0.5,25,6.5,1.2,1.1000000000000001,1.5E-6,{"$f":"0.0000116","v":1.1600000000000001E-5},{"$f":"I_p2-I_p1","v":1.0100000000000002E-5},1.25,null,null,5.5]
["TPS543B25",4,18,25,32.4,26.1,40,140,0.5,6.5,2,1.2,1.1000000000000001,1.5E-6,1.1600000000000001E-5,1.01E-5,1.25,24.75,19.8,7]
["TPSM843B22",4,18,20,26.1,20.7,40,140,0.5,6.5,2,1.2,1.1000000000000001,1.5E-6,1.1600000000000001E-5,1.01E-5,1.25,21.15,16.739999999999998,7,0.33,3.2,0.2]
["TPSM843A26",4,18,16,20.7,16.2,40,140,0.5,6.5,2,1.2,1.1000000000000001,1.5E-6,1.1600000000000001E-5,1.01E-5,1.25,16.739999999999998,12.51,7,0.6,4.1100000000000003,0.2]
["TPSM843A22",4,18,12,15.75,10.35,40,140,0.5,6.5,2,1.2,1.1000000000000001,1.5E-6,1.1600000000000001E-5,1.01E-5,1.25,11.88,7.92,7,0.6,4.1100000000000003,0.2]
["TPS543B25T",4,18,25,32.4,26.1,40,140,0.5,6.5,2,1.2,1.1000000000000001,1.5E-6,1.1600000000000001E-5,1.01E-5,1.25,24.75,19.8,7]
[]
[]
[]
[null,null,null,null,null,null,null,null,null,null,null,null,null,null,null,null,null,null,null,null,null,null,null,null,null,"Yes"]
[]
[null,null,null,null,null,null,null,null,null,null,null,null,null,null,null,null,null,null,null,null,{"$f":"DeviceCalculator!R_msel","v":102}]
[null,null,null,null,null,null,null,null,null,null,null,null,null,"TPS543820","Current Limit","Cramp","soft start"]
[null,null,null,null,null,null,null,null,null,null,null,null,null,null,null,null,null,null,"Res to GND","E12 Series","Error","In range?","E12 Par","Error","In range?"]
[null,null,null,null,null,null,null,null,null,null,null,null,null,{"$f":"CONCATENATE(O19, P19, Q19)","v":"High11"},{"$f":"AD$20","v":"High"},{"$f":"AE$20","v":1},{"$f":"AF$20","v":1},1,1.78,1.8,{"$f":"(T19-S19)/S19","v":1.1235955056179785E-2},{"$f":"IF(U19>0,AND($U$16>=S19,$U$16<=S19*(1+U19)),AND($U$16<=S19,$U$16>=S19*(1+U19)))","v":false},1.8,{"$f":"(W19-S19)/S19","v":1.1235955056179785E-2},{"$f":"IF(X19>0,AND($U$16>=S19,$U$16<=S19*(1+X19)),AND($U$16<=S19,$U$16>=S19*(1+X19)))","v":false},{"$f":"OR(V19,Y19)","v":false},{"$f":"O19","v":"High"},1,1,null,"ramp","ss",{"$f":"S19*(100+U19)","v":178.02}]
[null,null,null,null,"Frequency selection table",null,null,{"$f":"DeviceCalculator!R_fsel","v":11.8},null,null,null,null,null,"High12",{"$f":"AD$20","v":"High"},1,{"$f":"AF$21","v":2},2,2.21,2.2000000000000002,{"$f":"(T20-S20)/S20","v":-4.5248868778279576E-3},{"$f":"IF(U20>0,AND($U$16>=S20,$U$16<=S20*(1+U20)),AND($U$16<=S20,$U$16>=S20*(1+U20)))","v":false},2.2000000000000002,-4.5248868778279576E-3,false,{"$f":"OR(V20,Y20)","v":false},"High",1,2,"High",1,1]
{"$rows_left_out":84}
{"sheet":"Layout Checklist","index":4,"n_rows":20,"n_cols":8,"rows_kept":20,"cut":false,"hidden":true,"merged":[[1,0,1,6],[6,0,6,6],[13,0,13,6]]}
["Pin","Name","Purpose","Placement or Routing?","Remarks","Reasoning","Status","Comments"]
["Control"]
[null,"FB","Output voltage feedback input.",null,"Place the feedback resistor near the device to minimize the FB trace distance. Avoid routing near noisy signals or power planes.",null,"Open"]
[null,"GOSNS","The return connection for a remote voltage sensing configuratio",null,"The return connection for a remote voltage sensing configuration.  Short to AGND for single-end sense configuration",null,"Open"]
[null,"AGND",null,null,"Return the FSEL and MODE resistors to a quiet AGND island.  Connect AGND to PGND at one point.",null,"Open"]
[]
["Configuration"]
[null,"MSEL",null,null,"Return the FSEL and MSEL resistors to a quiet AGND island",null,"Open"]
[null,"SYNC/FSEL",null,null,"Return the FSEL and MSEL resistors to a quiet AGND island"]
[null,"PGOOD","Open drain power good",null,null,null,"Open"]
[null,"EN","enable pin",null,"The recommended operating condition for EN pin is maximum 5.5-V. DO NOT connect EN pin to VIN pin directly.",null,"Open"]
[]
[]
["Power Stage"]
[7,"BOOT",null,null,"Place the boot circuit as close as possible to the pin. ",null,"Open"]
[6,"SW",null,null,"The PCB trace defined as SW switch node, which connects the SW pins and high-voltage side of the inductor, should be as short and wide as possible. ",null,"Open"]
["4, 9","VIN","Power Input to the Power Stage",null," Place a 1-μF/25-V/X6R or better dielectric ceramic capacitors from each VIN to PGND pins and place them as close as possible to the device on the same side of the PCB. Place the remaining ceramic input capacitance next to these high frequency bypass capacitors. The remaining input capacitance can be placed\non the other side of the board but use as many vias as possible to minimize impedance between the capacitors and the pins of the IC.                                 \n1-μF capacitor from each VIN to PGND close to the IC is required.",null,"Open"]
["16, 17, 8, 5","PGND","These ground pins are connected to the return of the internal low-side MOSFET.",null,"Have a large solid ground plane for GND.    Use vias to help with power dissipation",null,"Open"]
[3,"VDRV","Internal 5-V regulator output and internal connection to drivers. ",null,"Bypass these pins with a 2.2-μF  capacitor to PGND.   Ensure the VDRV capacitor loop is smallest",null,"Open"]
[2,"VCC","Supply for analog control circuitry",null,"Connect a 10-Ω resistor from VDRV to this pin and bypass\nwith a 0.1-μF capacitor to AGND",null,"Open"]
{"$rows_left_out":1}
{"sheet":"Schematic Checklist","index":5,"n_rows":43,"n_cols":9,"rows_kept":43,"cut":false,"hidden":true,"merged":[[41,0,41,7],[19,0,19,7],[35,0,35,7],[1,0,1,7],[10,0,10,7]]}
["Pin","Name","Purpose","Connection For Functional Use","Reasoning","Recommended Component Values from Calculator","Component units","Status","Comments"]
["Control"]
[15,"FB","Output voltage feedback input.","Feedback pin and input to the differential remote sense amplifier for output voltage regulation. Place the bottom resistor in the FB divider as close as possible to the FB and GOSNS pins of the IC. Also\nkeep the upper feedback resistor and the feedforward capacitor near the IC. Connect the FB divider to the\noutput voltage at the desired point of regulation\nConnect FB pin to the midpoint of a resistor divider to set the output voltage. ","Placement near device reduces noise pickup                                                           Using Rfb_b between 1kOhm to 20kOhm",{"$f":" CONCATENATE(\"Rfb_t= \",DeviceCalculator!D173,\"                             Rfb_b=\", DeviceCalculator!Rfb_b)","v":"Rfb_t= 11.3                             Rfb_b=8"},{"$f":"DeviceCalculator!G171","v":"kΩ"},"Open"]
[15,"FB","Feedforward Capacitor ","Adding a Cff in parallel with the Rfb_t can be beneficial ","Adding a Cff may help improve transient response"]
[14,"GOSNS","Ground sense return and input to the differential remote sense amplifier","For differential remote sense, connect to remote ground near the load",null,null,null,"Open"]
[14,"GOSNS",null,"For single ended sense, connect GOSNS to AGND"]
[]
[1,"AGND","Reference point for the internal control circuits. ","Use a separate ground symbol for AGND. Use vias on the AGND islands on top layer to connect to AGND layer island on an internal layer. Connect the\ninternal AGND island to PGND at one point","AGND  is expected to be a  quiet ground",null,null,"Open"]
[]
[]
["Configuration"]
[10,"EN",null,"Floating EN pin before startup enables the converter. DO NOT connect EN pin to VIN pin directly. If an application requires digital control of the ENABLE function, an open-drain or open-collector output logic can be interfaced with the pin.                                                                          An external resistor divider can be added from VIN to the EN pin for adjustable UVLO","The recommended max voltage on the EN pin is 5.5V. Typical turn on threshold voltage is 1.2 V for the converter.   The VDRV  turns on at 0.7V enable threshold",{"$f":" CONCATENATE(\"Ren_t= \", DeviceCalculator!E201,\"                             Ren_b=\", DeviceCalculator!E204)","v":"Ren_t= 8.06                             Ren_b=10000"},{"$f":"DeviceCalculator!G204","v":"kΩ"},"Open"]
[12,"SYNC/FSEL",null,"Frequency select and external clock synchronization. A resistor to ground sets the switching frequency of the device. An external clock can also be applied to this pin to synchronize the switching frequency.     Return the FSEL and MSEL resistors to a quiet AGND island. Use a 1% tolerance resistor or better",null,{"$f":"CONCATENATE(\"Rfsel= \", DeviceCalculator!R_fsel)","v":"Rfsel= 11.8"},{"$f":"DeviceCalculator!G42","v":"kΩ"},"Open"]
[13,"MSEL",null,"A resistor to ground selects the current limit, soft-start rate, and PWM ramp amplitude. Return the FSEL and MSEL resistors to a quiet AGND island.   Use a 1% tolerance resistor or better",null,{"$f":"CONCATENATE(\"Rmsel= \", DeviceCalculator!R_msel)","v":"Rmsel= 102"},{"$f":"DeviceCalculator!G69","v":"kΩ"},"Open"]
[11,"PG",null,"Open-drain power-good (PG) indicator.  Use a pull up resistor to VDRV, VCC or an external supply. s. A pullup resistor between the values of 10 kΩ and 100 kΩ to a voltage source that is 5.5 V or less is recommended",null,null,null,"Open"]
[2,"VCC",null,"Supply for analog control circuitry. Connect a 10-Ω resistor from VDRV to this pin and bypass\nwith a 0.1-μF capacitor to AGND.    It is not intended to drive VCC with any source other than VDRV","The 10-Ω and 0.1-μF create a low pass filter to the  supply pin VCC",null,null,"Open"]
[null,null,null,null,null,null,null,"Open"]
[]
[]
["Power Stage"]
{"$rows_left_out":24}
{"sheet":"revisionNotes","index":6,"n_rows":2,"n_cols":3,"rows_kept":2,"cut":false,"hidden":false,"merged":[]}
["Rev","Date","Change"]
["A","2023-12-06","Initial"]

{"sheet":"Disclaimer","index":7,"n_rows":6,"n_cols":1,"rows_kept":6,"cut":false,"hidden":false,"merged":[]}
["Important notice and disclaimer"]
["TI PROVIDES TECHNICAL AND RELIABILITY DATA (INCLUDING DATASHEETS), DESIGN RESOURCES (INCLUDING REFERENCE DESIGNS), APPLICATION OR OTHER DESIGN ADVICE, WEB TOOLS, SAFETY INFORMATION, AND OTHER RESOURCES “AS IS” AND WITH ALL FAULTS, AND DISCLAIMS ALL WARRANTIES, EXPRESS AND IMPLIED, INCLUDING WITHOUT LIMITATION ANY IMPLIED WARRANTIES OF MERCHANTABILITY, FITNESS FOR A PARTICULAR PURPOSE OR NON-INFRINGEMENT OF THIRD PARTY INTELLECTUAL PROPERTY RIGHTS."]
["These resources are intended for skilled developers designing with TI products. You are solely responsible for (1) selecting the appropriate TI products for your application, (2) designing, validating and testing your application, and (3) ensuring your application meets applicable standards, and any other safety, security, or other requirements."]
["These resources are subject to change without notice. TI grants you permission to use these resources only for development of an application that uses the TI products described in the resource. Other reproduction and display of these resources is prohibited. No license is granted to any other TI intellectual property right or to any third party intellectual property right. TI disclaims responsibility for, and you will fully indemnify TI and its representatives against, any claims, damages, costs, losses, and liabilities arising out of your use of these resources."]
["TI’s products are provided subject to TI’s Terms of Sale or other applicable terms available either on ti.com or provided in conjunction with such TI products. TI’s provision of these resources does not expand or otherwise alter TI’s applicable warranties or warranty disclaimers for TI products."]
["All information in this document is provided “AS IS” and “with all faults”, and is subject to TI’s Important Notice \n(http://www.ti.com/corp/docs/legal/important-notice.shtml)"]

{"sheet":"DeviceCalculator_old","index":8,"n_rows":164,"n_cols":10,"rows_kept":164,"cut":false,"hidden":true,"merged":[[38,1,38,7],[39,1,39,7],[55,1,55,7],[56,1,56,7],[101,1,101,7],[89,1,89,7],[96,1,96,7],[128,1,128,7],[102,1,102,7],[114,1,114,7],[140,1,140,7],[155,1,155,7],[30,1,30,7],[0,1,0,7],[7,1,7,7],[22,1,22,7],[1,1,6,1],[1,2,6,2],[1,3,6,3],[1,4,6,4],[1,5,6,5],[1,6,6,6],[1,7,6,7]]}
[null,"Design Calculations",null,null,null,null,null,null,null,"Key"]
[null,"Parameter","Input","Recommended","Selected Value","Calculated with Selected Value","Units","Description",null,"User Entered Value"]
[null,null,null,null,null,null,null,null,null,"Fixed IC Parameter"]
[null,null,null,null,null,null,null,null,null,"Calculated Parameter"]
[null,null,null,null,null,null,null,null,null,"Recommended Component Value"]
[null,null,null,null,null,null,null,null,null,"Design Caution"]
[null,null,null,null,null,null,null,null,null,"Design Warning"]
[null,"Choose Device"]
[null,"Part number","TPS543B22",null,null,null,null,"Select IC part number"]
[null,"Vin_min_IC",{"$f":"VLOOKUP($C$9,#REF!,2,FALSE)","v":{"$error":"#REF!"}},null,null,null,"V","IC rated minimum input voltage"]
[null,"Vin_max_IC",{"$f":"VLOOKUP($C$9,#REF!,3,FALSE)","v":{"$error":"#REF!"}},null,null,null,"V","IC rated maximum input voltage"]
[null,"Vref",{"$f":"VLOOKUP($C$9,#REF!,9,FALSE)","v":{"$error":"#REF!"}},null,null,null,"V","Internal voltage reference"]
[null,"Io_max_IC",{"$f":"VLOOKUP($C$9,#REF!,4,FALSE)","v":{"$error":"#REF!"}},null,null,null,"A","IC rated maximum output current"]
[null,"EN_rise",{"$f":"VLOOKUP($C$9,#REF!,12,FALSE)","v":{"$error":"#REF!"}},null,null,null,"V","EN rising voltage threshold"]
[null,"EN_rise_max",{"$f":"VLOOKUP($C$9,#REF!,17,FALSE)","v":{"$error":"#REF!"}},null,null,null,"V","EN rising voltage threshold (maximum spec)"]
[null,"EN_fall",{"$f":"VLOOKUP($C$9,#REF!,13,FALSE)","v":{"$error":"#REF!"}},null,null,null,"V","EN falling voltage threshold"]
[null,"OC_high_min",{"$f":"VLOOKUP($C$9,#REF!,5,FALSE)","v":{"$error":"#REF!"}},null,null,null,"A","Minimum peak current limit for High current limits"]
[null,"OC_low_min",{"$f":"VLOOKUP($C$9,#REF!,6,FALSE)","v":{"$error":"#REF!"}},null,null,null,"A","Minimum peak current limit for Low current limits"]
[null,"ton_min_max",{"$f":"VLOOKUP($C$9,#REF!,7,FALSE)","v":{"$error":"#REF!"}},null,null,null,"ns","Worst case minimum on-time"]
[null,"toff_min_max",{"$f":"VLOOKUP($C$9,#REF!,8,FALSE)","v":{"$error":"#REF!"}},null,null,null,"ns","Worst case minimum off-time"]
{"$rows_left_out":145}
{"sheet":"Std. R and C Values","index":9,"n_rows":99,"n_cols":17,"rows_kept":99,"cut":false,"hidden":true,"merged":[[2,4,2,5],[2,6,2,7],[9,4,9,5],[22,4,22,5],[47,4,47,5]]}
["Hide Sheet"]
[null,null,null,null,"Std. Resistors",null,null,null,null,"Capacitors"]
[null,"Enter resistor value",25,null,"E6",null,"E96",null,null,"Cap value",1500,"pF"]
[null,null,null,null,100,150,100,102,null,null,{"$f":"IF(K3*10^12<10000,IF((10^(LOG(K3*10^12)-INT(LOG(K3*10^12))))-VLOOKUP((10^(LOG(K3*10^12)-INT(LOG(K3*10^12)))),c_s1:C_f1,1)<VLOOKUP((10^(LOG(K3*10^12)-INT(LOG(K3*10^12)))),c_s1:C_f1,2)-(10^(LOG(K3*10^12)-INT(LOG(K3*10^12)))),VLOOKUP((10^(LOG(K3*10^12)-INT(LOG(K3*10^12)))),c_s1:C_f1,1),VLOOKUP((10^(LOG(K3*10^12)-INT(LOG(K3*10^12)))),c_s1:C_f1,2))*10^INT(LOG(K3*10^12)),IF((10^(LOG(K3*10^12)-INT(LOG(K3*10^12))))-VLOOKUP((10^(LOG(K3*10^12)-INT(LOG(K3*10^12)))),C_s2:C_f2,1)<VLOOKUP((10^(LOG(K3*10^12)-INT(LOG(K3*10^12)))),C_s2:C_f2,2)-(10^(LOG(K3*10^12)-INT(LOG(K3*10^12)))),VLOOKUP((10^(LOG(K3*10^12)-INT(LOG(K3*10^12)))),C_s2:C_f2,1),VLOOKUP((10^(LOG(K3*10^12)-INT(LOG(K3*10^12)))),C_s2:C_f2,2))*10^INT(LOG(K3*10^12)))*10^-12","v":1500},"pF"]
[null,"Closest E6 Value",{"$f":"(IF((10^(LOG(C3)-INT(LOG(C3)))*100)-VLOOKUP((10^(LOG(C3)-INT(LOG(C3)))*100),E6_s:E6_f,1)<VLOOKUP((10^(LOG(C3)-INT(LOG(C3)))*100),E6_s:E6_f,2)-(10^(LOG(C3)-INT(LOG(C3)))*100),VLOOKUP((10^(LOG(C3)-INT(LOG(C3)))*100),E6_s:E6_f,1),VLOOKUP((10^(LOG(C3)-INT(LOG(C3)))*100),E6_s:E6_f,2)))*10^INT(LOG(C3))/100","v":22},null,150,220,102,105]
[null,"Closest E12 Value",{"$f":"(IF((10^(LOG(C3)-INT(LOG(C3)))*100)-VLOOKUP((10^(LOG(C3)-INT(LOG(C3)))*100),E12_s:E12_f,1)<VLOOKUP((10^(LOG(C3)-INT(LOG(C3)))*100),E12_s:E12_f,2)-(10^(LOG(C3)-INT(LOG(C3)))*100),VLOOKUP((10^(LOG(C3)-INT(LOG(C3)))*100),E12_s:E12_f,1),VLOOKUP((10^(LOG(C3)-INT(LOG(C3)))*100),E12_s:E12_f,2)))*10^INT(LOG(C3))/100","v":27},null,220,330,105,107,null,"C values up to 10nF"]
[null,"Closest E24 Value",{"$f":"(IF((10^(LOG(C3)-INT(LOG(C3)))*100)-VLOOKUP((10^(LOG(C3)-INT(LOG(C3)))*100),E24_s:E24_f,1)<VLOOKUP((10^(LOG(C3)-INT(LOG(C3)))*100),E24_s:E24_f,2)-(10^(LOG(C3)-INT(LOG(C3)))*100),VLOOKUP((10^(LOG(C3)-INT(LOG(C3)))*100),E24_s:E24_f,1),VLOOKUP((10^(LOG(C3)-INT(LOG(C3)))*100),E24_s:E24_f,2)))*10^INT(LOG(C3))/100","v":24},null,330,470,107,110,null,1,1.2,{"$f":"IF((10^(LOG(K3)-INT(LOG(K3))))-VLOOKUP((10^(LOG(K3)-INT(LOG(K3)))),c_s1:C_f1,1)<VLOOKUP((10^(LOG(K3)-INT(LOG(K3)))),c_s1:C_f1,2)-(10^(LOG(K3)-INT(LOG(K3)))),VLOOKUP((10^(LOG(K3)-INT(LOG(K3)))),c_s1:C_f1,1),VLOOKUP((10^(LOG(K3)-INT(LOG(K3)))),c_s1:C_f1,2))","v":1.5}]
[null,"Closest E48 Value",{"$f":"(IF((10^(LOG(C3)-INT(LOG(C3)))*100)-VLOOKUP((10^(LOG(C3)-INT(LOG(C3)))*100),E48_s:E48_f,1)<VLOOKUP((10^(LOG(C3)-INT(LOG(C3)))*100),E48_s:E48_f,2)-(10^(LOG(C3)-INT(LOG(C3)))*100),VLOOKUP((10^(LOG(C3)-INT(LOG(C3)))*100),E48_s:E48_f,1),VLOOKUP((10^(LOG(C3)-INT(LOG(C3)))*100),E48_s:E48_f,2)))*10^INT(LOG(C3))/100","v":24.9},null,470,680,110,113,null,1.2,1.5]
[null,"Closest E96 Value",{"$f":"(IF((10^(LOG(C3)-INT(LOG(C3)))*100)-VLOOKUP((10^(LOG(C3)-INT(LOG(C3)))*100),E96_s:E96_f,1)<VLOOKUP((10^(LOG(C3)-INT(LOG(C3)))*100),E96_s:E96_f,2)-(10^(LOG(C3)-INT(LOG(C3)))*100),VLOOKUP((10^(LOG(C3)-INT(LOG(C3)))*100),E96_s:E96_f,1),VLOOKUP((10^(LOG(C3)-INT(LOG(C3)))*100),E96_s:E96_f,2)))*10^INT(LOG(C3))/100","v":24.9},null,680,1000,113,115,null,1.5,1.8,null,null,null,null,"Notes:","If I use the value in column K it rounds up"]
[null,null,null,null,"E12",null,115,118,null,1.8,2.2000000000000002,null,null,null,null,null,"If I use the value in column J it rounds down"]
[null,null,null,null,100,120,118,121,null,2.2000000000000002,2.7]
[null,null,null,null,120,150,121,124,null,2.7,3.3]
[null,null,null,null,150,180,124,127,null,3.3,3.9]
[null,null,null,null,180,220,127,130,null,3.9,4.7]
[null,null,null,null,220,270,130,133,null,4.7,5.6]
[null,null,null,null,270,330,133,137,null,5.6,6.8]
[null,null,null,null,330,390,137,140,null,6.8,8.1999999999999993]
[null,null,null,null,390,470,140,143,null,8.1999999999999993,10]
[null,null,null,null,470,560,143,147,null,"C values greater than 10nF"]
[null,null,null,null,560,680,147,150,null,1,1.5,{"$f":"IF((10^(LOG(K3)-INT(LOG(K3))))-VLOOKUP((10^(LOG(K3)-INT(LOG(K3)))),C_s2:C_f2,1)<VLOOKUP((10^(LOG(K3)-INT(LOG(K3)))),C_s2:C_f2,2)-(10^(LOG(K3)-INT(LOG(K3)))),VLOOKUP((10^(LOG(K3)-INT(LOG(K3)))),C_s2:C_f2,1),VLOOKUP((10^(LOG(K3)-INT(LOG(K3)))),C_s2:C_f2,2))","v":1.5}]
{"$rows_left_out":80}
{"sheet":"Extra","index":10,"n_rows":5,"n_cols":2,"rows_kept":5,"cut":false,"hidden":true,"merged":[]}
[]
[null,"Validation Options"]
[null,"Open"]
[null,"Complete"]
[null,"Not Applicable"]