{"text_format":"1","workbook":"xlsx","n_sheets":13,"sheets":["Design Regulator","Input Filters","BOM & Schematic","EVM","Efficiency Calculations","Bode Plot Management","Stability Calculations","Variable Management","Schematic Management","Efficiency Plot Management","Standard Value Calculator","Snubber","Parallel Output Caps"],"not_rendered":{"charts":10,"images":40,"macros":1,"external_links":0,"defined_names":319,"comments":2,"pivot_tables":0},"unopened":[],"bounds":{"document_bytes":16777216,"sheet_cells":100000,"rows_first":2000,"rows_last":500,"rows_between":2000,"halvings":0,"cell_chars":16384,"cell_head_chars":4096},"cells_cut":0,"cells_raw":0,"read":"whole","date_system":"1900"}

{"sheet":"Design Regulator","index":0,"n_rows":106,"n_cols":16,"rows_kept":106,"cut":false,"hidden":false,"merged":[[69,5,69,7],[2,13,2,14],[0,0,0,15],[80,5,80,6],[35,10,36,15]]}
["                      LM70XX0/-Q1 Synchronous Buck Converter Design Tool"]
[null,null,null,null,null,null,null,null,null,null,null,null,null,"http://www.ti.com/product/lm5175"]
["About",null,"xx",null,null,"= Input Box",null,null,null,null,null,null,null,"TERMS OF USE",null,"                "]
[]
["Step 1: Operating Specifications"]
[null,null,null,"Input Voltage – Min, VIN(min) ",42,"V"]
[null,null,null,"Input Voltage – Nom, VIN(nom)",48,"V"]
[null,null,null,"Input Voltage – Max, VIN(max)",54,"V"]
[null,null,null,"Output Voltage, VOUT ",3.3,"V"]
[null,null,null,"Full Load Output Current, IOUT ",8,"A"]
[null,null,null,"Switching Frequency, FSW",400,"kHz"]
[null,null,null,"Frequency Set Resistor, RT ",{"$f":"'Variable Management'!C445","v":54.9},"kΩ"]
[null,null,null,"Ambient Temperature, TA",25,"°C"]
[null,null,null,"IC Junction Temperature (estimate), TJ",{"$f":"'Variable Management'!B366","v":96.66314821670575},"°C"]
[]
["Step 2: Current Sense Resistor"]
[null,null,null,"Required IOCP Setpoint at VIN(nom)",9,"A"]
[null,null,null,"Recommended Sense Resistance",{"$f":"Rs_ideal*1000","v":5.1939095741856764},"mΩ"]
[null,null,null,"Sense Resistance, RS",5,"mΩ"]
[null,null,null,"Min Inductor Sat Current, ILO(SAT)",{"$f":"'Variable Management'!B95","v":11.2},"A"]
[null,null,null,"Max power loss in shunt",{"$f":"'Variable Management'!B105","v":0.45047779877926497},"W"]
[null,null,null,"VIN(min)",{"$f":"'Variable Management'!B97","v":9.4371431969552795},"A"]
[null,null,"IOUT(typ) at OCP Inception:","VIN(nom)",{"$f":"'Variable Management'!B98","v":9.4181411323896747},"A"]
[null,null,null,"VIN(max)",{"$f":"'Variable Management'!B99","v":9.4033586232420419},"A"]
[]
["Step 3: Buck Inductance"]
[null,null,null,"Recommended Starting Inductance",{"$f":"Lopt*1000000","v":1.71875},"µH"]
[null,null,null,"Inductance, LO ",2.2000000000000002,"µH"]
[null,null,null,"Inductor DCR ",3.8,"mΩ"]
[null,null,null,"DIL as a % at VIN(nom)",{"$f":"'Variable Management'!B68*100","v":44.546471690258116},"%"]
[]
["Step 4: Output Capacitors"]
[null,null,null,"Output Voltage Ripple Spec",33,"mVpk-pk"]
[null,null,null,"Maximum Load Step",50,"%"]
[null,null,null,"Minimum Output Capacitance",{"$f":"Total_COUT_with_stead_state_load_step","v":194.55942814868365},"µF"]
[null,null,null,"Output Capacitance (derated), COUT ",325,"µF",null,null,null,null,{"$f":"CHOOSE(SCH_MODE, \"\", \"** For Single-Output Operation in 2-Phase Mode, tie MODE to VDDA and use FB1 to set VOUT **\", \"** For Single-Output Operation in 3-Phase Mode, tie both MODE pins to VDDA. Use FB1 of master IC to set VOUT. Connect FB2 of master IC to AGND. Connect FB2 of slave IC to VDDA to configure it as a slave **\", \"** For Single-Output Operation in 4-Phase Mode, tie both MODE pins to VDDA. Use FB1 of master IC to set VOUT. Connect FB2 of master IC to AGND. Connect FB2 of slave IC to VDDA to configure it as a slave **\")","v":""}]
[null,null,null,"Maximum Permitted ESR",{"$f":"'Variable Management'!B128","v":9.209935259495273},"mΩ"]
[null,null,null,"Output Capacitor ESR",1,"mΩ",null,null,null,null,{"$f":"CHOOSE(SCH_MODE,  \"\", \"** Tie VCCX to GND if not used **\", \"** Slave controller (CNTRL2) not shown **\",\"** Slave controller (CNTRL2) not shown **\")","v":""},null,null,null,null,{"$f":"IF(SCH_MODE=1,  \"** Tie VCCX to GND if not used **\", \"\")","v":"** Tie VCCX to GND if not used **"}]
[null,null,null,"Resulting Output Voltage Ripple (max) ",{"$f":"'Variable Management'!B130*1000","v":4.9438877165073762},"mVpk-pk",null,null,null,null,{"$f":"IF(OR(SCH_MODE=3, SCH_MODE=4),\"** Tie VCCX to GND if not used **\", \"\")","v":""}]
[null,null,null,"Output Capacitor RMS Current (max) ",{"$f":"'Variable Management'!B114","v":1.0372913825084265},"A (rms)"]
[]
["Step 5: Input Capacitors"]
[null,null,null,"Input Voltage Ripple Spec",480,"mVpk-pk"]
[null,null,null,"Minimum Input Capacitance",{"$f":"'Variable Management'!B151","v":3.0165816326530615},"µF"]
[null,null,null,"Input Capacitance (derated), CIN ",15,"µF"]
[null,null,null,"Maximum Permitted ESR",{"$f":"'Variable Management'!B157","v":14.971117245817124},"mΩ",null,null,null,null,null,null,null,null,null," "]
[null,null,null,"Input Capacitor ESR",1,"mΩ"]
[null,null,null,"Resulting Input Voltage Ripple (max)",{"$f":"'Variable Management'!B164*1000","v":108.08796834407475},"mVpk-pk"]
[null,null,null,"Input Capacitor RMS Current (max)",{"$f":"'Variable Management'!B141","v":2.1914957925337322},"A (rms)"]
[]
["Step 6: Enable, CNFG, FPWM/PFM"]
[]
[]
[null,null,null,"Input Voltage UVLO Turn-ON",5.9,"V"]
[null,null,null,"Input Voltage UVLO Turn-OFF",{"$f":"0.9*E54","v":5.3100000000000005},"V"]
[null,null,null,"Upper Enable Resistor RUV1",{"$f":"'Variable Management'!B190","v":100},"kΩ"]
[null,null,null,"Lower Enable Resistor RUV2",20.5,"kΩ"]
[null,null,null,"Configuration Resistor, RCNFG",{"$f":"IF(DITHER=1,\"41.2\",\"29.4\")","v":"29.4"},"kΩ"]
[null,null,null,null,{"$f":"IF(DEMB=1, \"* Tie PFM to GND\", \"* Tie PFM to VDDA\")","v":"* Tie PFM to VDDA"}]
[]
["Step 7: Compensation Design"]
[null,null,null,"Load Pole Frequency",{"$f":"Fp_dominant","v":1472.6742970867483},"Hz"]
[null,null,null,"ESR Zero Frequency",{"$f":"Fesr/1000","v":489.7075177654043},"kHz"]
[null,null,null,"Desired Crossover Frequency",40,{"$f":"\"     kHz \"","v":"     kHz "}]
[null,null,null,"Error Amp Pole Frequency",{"$f":"Fp1_u","v":49.427001016694518},"Hz"]
[null,null,null,{"$f":"CHOOSE(VOUT_setting, \"Upper Feedback Resistor\",\"\",\"\",\"\")","v":""},100,"kΩ"]
[null,null,null,{"$f":"CHOOSE(VOUT_setting, \"Lower Feedback Resistor\", \"PULLUP FB to VDDA with \"&'Variable Management'!D421,\"TIE FB TO VDDA\",\"PULLUP FB to VDDA with \"&'Variable Management'!D421)","v":"TIE FB TO VDDA"},{"$f":"IF(Vout=Vref,\"OPEN\",Rfb2_u/1000)","v":792},{"$f":"IF(Vout=Vref,\"\",\"kΩ\")","v":"kΩ"}]
[]
["Compensation Components"]
[null,"Calculated /","Std Values",{"$f":"C70","v":"Std Values"},null,"Actual P/Z Frequencies"]
["RC1",{"$f":"Rcea1/1000","v":113.38968832363257},{"$f":"'Standard Value Calculator'!S32","v":113},{"$f":"C71","v":113},"kΩ",{"$f":"Fp1_u","v":49.427001016694518},"Hz   (FPEA)"]
["CC1",{"$f":"Cc1ea*1000000000","v":1.7545129723293527},{"$f":"'Standard Value Calculator'!S33","v":1.8},{"$f":"C72","v":1.8},"nF",{"$f":"Fz1_u/1000","v":7.9577471636878192},"kHz (FZCOMP)"]
["CC2",{"$f":"IF(Cc2ea<0, \"N/A\", Cc2ea*1000000000000)","v":6.2222771729486288},{"$f":"'Standard Value Calculator'!S34","v":6.8},{"$f":"C73","v":6.8},"pF",{"$f":"Fp2_u/1000","v":221.56863806889709},"kHz (FPCOMP)"]
[null,null,null,null,null,null,null,null,null,null,null,null,"** Specify Inductor Core Loss **",0.5,"W"]
[]
["Efficiency / Power Loss Analyzer"]
[]
["Step 8: Efficiency"]
[null,null,null,null,null,"Power MOSFETs","(Q1, Q2) "]
[null,null,null,null,"Internal NEXFETs"]
[null,null,null,null,"High-side","  Low-side"]
[null,null,null,"On-State Resistance, RDS(on) ",24,18,"mΩ"]
[null,null,null,"Total Gate Charge, QG ",3,4.0999999999999996,"nC"]
[null,null,null,"Gate-Drain Charge, QGD ",0.7,1,"nC"]
[null,null,null,"Gate-Source Charge, QGS ",0.7,0.9,"nC"]
[null,null,null,"Output Charge, QOSS ",null,3,"nC"]
[null,null,null,"Output Capacitance, COSS ",250,350,"pF"]
[null,null,null,"Gate Resistance, RG ",3.5,3,"Ω"]
[null,null,null,"Transconductance, gFS ",71,90,"S"]
[null,null,null,"Gate-Source Threshold Voltage, VTH ",1.8,1.8,"V"]
[null,null,null,"Body Diode Forward Voltage, VBD ",0.8,0.8,"V"]
[null,null,null,"Body Diode Rev Recovery Charge, QRR ",null,30,"nC"]
[null,null,null,"Thermal Resistance, θJA ",15,15,"°C/W"]
[]
["External Schottky Diode (if applicable)"]
[null,null,null,"Schottky Fwd Voltage, VFWDsch ",null,0,"V"]
[null,null,null,"Schottky Rev Recovery Charge, QRRsch ",null,0,"nC"]
[]
[]
[]
["Step 9: IC Power Loss"]
[null,null,null,null,null,"Ext. Power Supply Voltage",12,"V"]
[null,null,null,null,null,"PCB RθJA",18.600000000000001,"°C/W"]
[null,null,null,null,null,"IC Power Dissipation",{"$f":"'Variable Management'!B364","v":3.8528574310056856},"W"]
[null,null,null,null,null,"IC Junction Temperature (estimate)",{"$f":"'Variable Management'!B366","v":96.66314821670575},"°C"]
[null,null,null,null,null,null,null,{"$f":"CHOOSE(Ext_VCC, \"* Tie BIAS to Ext. Power Supply\", \"* Tie BIAS to VOUT except for Fixed-VOUT = 3.3V\", \"* Tie BIAS to PGND\")","v":"* Tie BIAS to PGND"}]

{"sheet":"Input Filters","index":1,"n_rows":17,"n_cols":17,"rows_kept":17,"cut":false,"hidden":true,"merged":[[0,0,0,16],[2,14,2,15]]}
["                           LM(2)5149-Q1 Synchronous Buck Controller Design Tool"]
[null,null,null,null,null,null,null,null,null,null,null,null,null,null,"http://www.ti.com/product/lm5175"]
["About",null,"xx",null,null,"= Input Box",null,null,null,null,null,null,null,null,"TERMS OF USE",null,"                "]
[]
[]
[]
[null,null,null,null,"AEF",null,null,null,null,null,null,null,"Passive"]
[]
[null,"Design tab - LAEF",{"$f":"'Design Regulator'!E50 & \" µH\"","v":" µH"},null,null,"LAEF",1,"µH",null,"Suggested LIN Inductor","0.1-10","µH",null,"Chosen LIN",0.68,"µH"]
[null,"Design tab - CINJ",{"$f":"'Design Regulator'!#REF! & \" µF\"","v":{"$error":"#REF!"}},null,null,"CINJ",1,"µF",null,"Suggested CF","0.1-10","µF",null,"Chosen CF",0.47,"µF"]
[null,"Design tab - CDAMP",{"$f":"'Design Regulator'!#REF! & \" µF\"","v":{"$error":"#REF!"}},null,null,"CDAMP",1,"µF",null,"Suggested CDAMP","1-10","µF",null,"Chosen CDAMP",1,"µF"]
[null,"Design tab - RDAMP",{"$f":"'Design Regulator'!#REF! & \" Ω\"","v":{"$error":"#REF!"}},null,null,"RDAMP",10,"Ω",null,"Suggested RDAMP",{"$f":"Rdamp_PassiveStd","v":{"$error":"#REF!"}},"Ω",null,"Chosen RDAMP",0.35,"Ω"]
[]
[null,null,"VIN Ripple at Fsw",null,null,{"$f":"VinRipple_dBuV","v":100.67554707562715},"dBµV","VIN Ripple",{"$f":"VinRipple_dBuV","v":100.67554707562715},"dBµV"]
[]
[null,null,null,"AEF Attenuation at Fsw",{"$f":"-#REF!","v":{"$error":"#REF!"}},"dB",null,null,null,null,null,"Passive Attenuation at Fsw",{"$f":"-#REF!","v":{"$error":"#REF!"}},"dB"]
[null,null,null,"AEF EMI at Fsw",{"$f":"VinRipple_dBuV-E16","v":{"$error":"#REF!"}},"dB-µV",null,null,null,null,null,"Passive EMI at Fsw",{"$f":"VinRipple_dBuV-M16","v":{"$error":"#REF!"}},"dB-µV"]

{"sheet":"BOM & Schematic","index":2,"n_rows":71,"n_cols":10,"rows_kept":71,"cut":false,"hidden":true,"merged":[[50,3,50,5],[47,3,47,5],[62,3,62,6],[63,3,63,6],[61,3,61,6],[52,3,52,5],[55,3,55,6],[41,3,41,6],[46,3,46,5],[60,3,60,6],[58,3,58,6],[59,3,59,6],[54,3,54,6],[57,3,57,6],[56,3,56,6],[53,3,53,6],[42,3,42,5],[43,3,43,5],[48,3,48,5],[49,3,49,5],[51,3,51,5],[44,3,44,5],[45,3,45,5],[64,0,65,0],[64,9,65,9],[64,3,65,6],[64,2,65,2],[64,1,65,1],[64,7,65,7],[64,8,65,8]]}
[]
[]
[]
[]
[]
[]
[]
[]
[]
[]
[]
[]
[]
[]
[]
[]
[]
[]
[]
[]
[]
[]
[]
[]
[]
[]
[]
[]
[]
[]
[]
[]
[]
[]
[]
["   ** Tie DEMB to VDDA for FPWM, AGND for DEM **"]
["   ** Tie VCCX to GND if not used **",null,null,null,null,null,null,null,{"$f":"IF(OR(SCH_MODE=3, SCH_MODE=4),\"** Tie VCCX to GND if not used **\", \"\")","v":""}]
["   ** Tie DITH to VDDA to disable spread spectrum **"]
["   ** Tie OSC to VDDA for 2.2MHz, AGND for 440kHz **"]
[{"$f":"\"VIN = \"&VIN_min&\" V to \"&VIN_max&\" V, VOUT = \"& Vout &\" V, IOUT = \" &Iout & \" A,  Fsw = \" & Fsw/1000 &\" kHz, Current Limit = \"&ROUNDUP(Ilimit_DC,0)&\" A\"","v":"VIN = 42 V to 54 V, VOUT = 3.3 V, IOUT = 8 A,  Fsw = 400 kHz, Current Limit = 9 A"}]
["High Efficiency Synchronous Buck Regulator BOM"]
["Count","Ref Des","Value","Description",null,null,null,"Size","Part Number","MFR"]
[1,"CBOOT",0.1,{"$f":"C43","v":0.1},null,null,null,"0603","Std","Std"]
[1,"CC1",{"$f":"'Design Regulator'!D72","v":1.8},1.8,null,null,null,"0603","Std","Std"]
[1,"CC2",{"$f":"'Design Regulator'!D73","v":6.8},6.8,null,null,null,"0603","Std","Std"]
[1,"CRES",{"$f":"Cres_u*1000000000","v":82},{"$f":"C46","v":82},null,null,null,"0603","Std","Std"]
[1,"CDITH",{"$f":"Cdither*1000000000","v":2.7},{"$f":"C47","v":2.7},null,null,null,"0603","Std","Std"]
[{"$f":"ROUNDUP('Design Regulator'!E45/10,0)","v":2},"CIN",10,{"$f":"C48","v":10},null,null,null,1210,"Std","Std"]
[{"$f":"ROUNDUP('Design Regulator'!E36/47,0)","v":7},"COUT",47,{"$f":"C49","v":47},null,null,null,1210,"Std","Std"]
[1,"CSS",{"$f":"'Design Regulator'!#REF!","v":{"$error":"#REF!"}},{"$f":"C50","v":{"$error":"#REF!"}},null,null,null,"0603","Std","Std"]
[2,"CVCC, CVCCX",2.2000000000000002,2.2000000000000002,null,null,null,"0603","Std","Std"]
[1,"CVDDA",0.47,0.47,null,null,null,"0603","Std","Std"]
[1,"DBOOT","See description","Schottky Diode, 60V, 200mA",null,null,null,"-","-","Various"]
[1,"LO",{"$f":"'Design Regulator'!E28","v":2.2000000000000002},{"$f":"\"Inductor, \"&Lf*1000000&\"µH, \"&Rdcr*1000&\"mΩ, >\"&ROUNDUP(Ilimit_DC*1.1,0)&\"A\"","v":"Inductor, 2.2µH, 3.8mΩ, >10A"},null,null,null,"-","-","Various"]
[2,"Q1, Q2","See description",{"$f":"'Design Regulator'!E82","v":24},null,null,null,"Std",{"$f":"'Design Regulator'!E80","v":"Internal NEXFETs"},"-"]
[1,"RC1",{"$f":"'Design Regulator'!D71","v":113},{"$f":"C56","v":113},null,null,null,"0603","Std","Std"]
[1,"RS",{"$f":"Rs*1000","v":5},5,null,null,null,"0508","Std","Std"]
[1,"RT",{"$f":"'Design Regulator'!E12","v":54.9},54.9,null,null,null,"0603","Std","Std"]
[1,"RFB1",{"$f":"'Design Regulator'!E66","v":100},100,null,null,null,"0603","Std","Std"]
[1,"RFB2",{"$f":"'Design Regulator'!E67","v":792},792,null,null,null,"0603","Std","Std"]
[1,"RPGOOD",100,100,null,null,null,"0603","Std","Std"]
[1,"RCS",100,100,null,null,null,"0603","Std","Std"]
[1,"RDEMB",100,100,null,null,null,"0603","Std","Std"]
[1,"RVIN",2.2000000000000002,2.2000000000000002,null,null,null,"0603","Std","Std"]
[1,"U1","LM5141-Q1","IC, LM5141-Q1, Synchronous Buck PWM Controller, 3.8V–65V Input",null,null,null,"VQFN-24","LM5141QRGEQ1","TI"]
[]
[]
["NOTES:"]
["** For information on TI NexFETTM MOSFETs, see **",null,null,"http://www.ti.com/nexfet","   **"]
["** Inductor saturation current should be higher than the peak inductor current at the OCP setpoint for all input voltages and operating temperatures **"]
["** Effective input and output capacitances should be appropriately derated for applied voltage and temperature, particularly with ceramics **"]

{"sheet":"EVM","index":3,"n_rows":6,"n_cols":2,"rows_kept":6,"cut":false,"hidden":true,"merged":[[0,0,0,16]]}
[" LM25149-Q1 Quickstart Design Tool"]
[]
[]
[]
[]
[null,"LM25149-Q1EVM-2100 PCB Layout"]

{"sheet":"Efficiency Calculations","index":4,"n_rows":109,"n_cols":60,"rows_kept":109,"cut":false,"hidden":true,"merged":[[6,24,6,26],[0,0,3,3],[5,0,6,3],[6,6,6,13],[6,17,6,20],[6,21,6,23],[6,52,6,57],[6,27,6,32],[6,33,6,36],[6,40,6,44],[6,45,6,50]]}
["BUCK CONTROLLER POWER DESIGN TOOL"]
[null,null,null,null,null,null,null,{"$f":"AW19","v":0.75456088869987881},"10% load"]
[null,null,null,null,null,null,null,{"$f":"AW59","v":0.86800989145406326},"50% load",null,null,null,null,null,null,null,null,null,null,null,null,null,null,null,null,null,null,null,null,null,null,null,null,null,null,null,null,null,null,null,null,{"$f":"IF(MODE=1, (Qg_Q1+Qg_Q2)*Fsw*Vin, (Qg_Q1+Qg_Q2+Qg_Q3+Qg_Q4)*Fsw*Vin)","v":0.13632}]
[null,null,null,null,null,null,null,{"$f":"AW109","v":0.84217475944991027},"100% load",null,null,null,null,null,null,null,null,null,null,null,null,null,null,null,null,null,null,null,null,null,null,null,null,null,null,null,null,null,null,null,"I_VCC",{"$f":"(Qg_Q1+Qg_Q2)*Fsw*1000","v":2.84},"mA",{"$f":"AP4*5/1000","v":1.4199999999999999E-2}]
[]
["Enter the values of your design and MOSFET datasheet specifications below. Note that thermal resistance (θJA) will change when components are placed on the PCB"]
[null,null,null,null,null,null,"Operating Point Condtions",null,null,null,null,null,null,null,null,null,null,"Filter Inductor",null,null,null,"Cout",null,null,"Cin",null,null,"High-side BUCK \"Control\" MOSFET Losses ",null,null,null,null,null,"Low-side BUCK \"Sync\" MOSFET Losses ",null,null,null,"External Diode","Diode/FET","Sense Rs","Controller IC Losses",null,null,null,null,"RESULTS",null,null,null,null,null,null,"Consolidated Buck/Boost Efficiency & Losses"]
["Input Parameters",null,null,null,null,null,"Step","Vin","Mode","Iout","Iout/ phase","Iin","Duty Cycle BUCK Leg","Ripple Current pk-pk","Peak Inductor Current","Valley Inductor Current","SW node voltage at Q1 turn-on","Irms Lf","DCR    Loss","Core Loss","Total Inductor Loss","Irms Cout","Cout ESR Loss","Total Cout Loss","Irms Cin","Cin ESR Loss","Total Cin Loss","Irms","RDS(on) Loss","Transition Loss (not including capacitive loss)","MOSFET Output Capacitance Loss","Dead Time Loss ","Total Control MOSFET Loss","Irms","RDS(on) Loss","Deadtime Loss","Total Sync MOSFET Loss","Deadtime Loss","Reverse Recovery Loss","Isense Shunt Loss","IQ Loss","Switching Current Loss","Switching Current Diss","LDO Loss Saved from Gate Drive Current (ext VCC)","Total IC Bias Power","Total Loss","Total IC Loss ","Pout","EFF, h",{"$f":"IF(Vin>Vout, \"High-side MOSFET Temp Rise\", \"Boost ''CONTROL'' MOSFET Temp Rise\")","v":"High-side MOSFET Temp Rise"},{"$f":"IF(Vin>Vout, \"Low-side MOSFET Temp Rise\", \"Boost ''SYNC'' MOSFET Temp Rise\")","v":"Low-side MOSFET Temp Rise"},null,"h","Inductor Cu & Core Loss","Total MOSFET Loss","Control MOSFET Loss","SYNC MOSFET Loss","Shunt Loss","FETs+IC Losses","Temp rise"]
["Design","Input Value","Units","Description",null,null,0,{"$f":"Vin","v":48},{"$f":"MODE","v":1},0,{"$f":"Iout*G9/100/Number_of_Phases","v":0},{"$f":"Vout*K9/(Vin*Efficiency)","v":0},{"$f":"(Vout+(Rdson2+Rs+Rdcr)*K9)/(Vin+(Rs+Rdson2-Rdson1)*K9)","v":6.8749999999999992E-2},{"$f":"(Vin-(Rdson1+Rdcr)*K9-Vout)*M9/(Fsw*Lf)","v":3.4921874999999996},{"$f":"K9+N9/2","v":1.7460937499999998},{"$f":"K9-N9/2","v":-1.7460937499999998},{"$f":"IF(MIN(Vin, -P9/(Coss_Q1+Coss_Q2)*0.00000002)<0, 0, MIN(Vin, -P9/(Coss_Q1+Coss_Q2)*0.00000002))","v":48},{"$f":"SQRT(K9^2+(N9^2)/12)","v":1.0081076965928231},{"$f":"R9^2*Rdcr","v":3.8618682861328124E-3},{"$f":"Core_Loss_Ch1","v":0.5},{"$f":"(T9+S9*(1+Ltc*(Ta-25)))/(1-S9*Ltc*ThetaCa)","v":0.50401758424807364},{"$f":"N9/SQRT(12)","v":1.0081076965928231},{"$f":"RCoutEsr*V9^2","v":1.0162811279296874E-3},{"$f":"W9","v":1.0162811279296874E-3},{"$f":"SQRT(M9*(1-M9))*SQRT(K9^2+(N9^2)/12)","v":0.25508000955863991},{"$f":"RCinEsr*Y9^2","v":6.5065811276435829E-5},{"$f":"Z9","v":6.5065811276435829E-5},{"$f":"SQRT(M9)*SQRT(K9^2+(N9^2)/12)","v":0.26432806802374581},{"$f":"Rdson1*AB9^2","v":2.7947731018066395E-3},{"$f":"(Vin*K9/2)*Fsw*(Tr_buck+Tf_buck)","v":0},{"$f":"(0.5*Coss_Q1*(Vin-Q9)^2-0.5*Coss_Q2*(Vin-Q9)^2+(Qoss_Q2*(Vin-Q9)/Vin)*Vin)*Fsw","v":0},{"$f":"IF(K9>N9/2,0,ABS(K9-N9/2)*Vsd_Q1*Deadtime*Fsw)","v":7.8224999999999996E-3},{"$f":"(AF9+AE9+AD9+AC9*(1+RdsonTopTc*Ta-RdsonTopTc*25))/(1-AC9*RdsonTopTc*ThetaJA_Q1)","v":1.0620389667640891E-2},{"$f":"SQRT((1-M9))*SQRT(K9^2+(N9^2)/12)","v":0.97283698551428521},{"$f":"Rdson2*AH9^2","v":2.7445942211151125E-2},{"$f":"IF(K9<N9/2,Deadtime*Fsw*IF(VfdSky_Q2>0,0,Vsd_Q2)*(K9+N9/2),2*Deadtime*Fsw*IF(VfdSky_Q2>0,0,Vsd_Q2)*K9)","v":7.8224999999999996E-3},{"$f":"(AJ9+AI9*(1+RdsonBotTc*Ta-RdsonBotTc*25))/(1-AI9*RdsonBotTc*ThetaJA_Q2)","v":3.5370373399704211E-2},{"$f":"2*Deadtime*Fsw*IF(VfdSky_Q2>0,VfdSky_Q2,Vsd_Q2)*K9","v":0},{"$f":"IF(QrrSky_Q2>0,QrrSky_Q2,Qrr_Q2*K9/(Iout/Number_of_Phases))*Fsw*Vin","v":0},{"$f":"Rs*R9^2","v":5.0814056396484373E-3},{"$f":"Iq*Vin","v":1.0560000000000001E-4},{"$f":"CHOOSE(Ext_VCC, (Qg_Q1+Qg_Q2)*Fsw*'Design Regulator'!$G$102, (Qg_Q1+Qg_Q2)*Fsw*Vout, (Qg_Q1+Qg_Q2)*Fsw*Vin)","v":0.13632},{"$f":"(Vin-VCC)*Fsw*(Qg_Q1+Qg_Q2)+(RdsonDRT+RdsonDRT2)*Fsw*Qg_Q1*VCC/(RdsonDRT+2*Rgate1+RdsonDRT2)+(RdsonDRB+RdsonDRB2)*Fsw*Qg_Q2*VCC/(RdsonDRB+2*Rgate2+RdsonDRB2)","v":0.12758181818181816},{"$f":"(Qg_Q1+Qg_Q2)*Fsw*(Vin-VCC)","v":0.12211999999999998},{"$f":"SUM(AO9:AP9)","v":0.13642560000000001},{"$f":" SUM(U9,X9,AA9,AG9,AK9,AL9,AM9,AS9,AN9)","v":0.6925966998942733},{"$f":" SUM(AG9,AK9,AL9,AM9,AS9)","v":0.1824163630673451},{"$f":"Vout*K9","v":0},{"$f":"AV9/(AV9+AT9)","v":0},{"$f":"ThetaJA_Q1*BD9","v":0.15930584501461337},{"$f":"ThetaJA_Q2*BE9","v":0.5305556009955632},null,{"$f":"AW9*100","v":0},{"$f":"U9","v":0.50401758424807364},{"$f":"AG9+AK9+AM9","v":4.5990763067345106E-2},{"$f":"AG9+AM9*0.66","v":1.0620389667640891E-2},{"$f":"AK9+AM9*0.33","v":3.5370373399704211E-2},{"$f":"AN9","v":5.0814056396484373E-3},{"$f":"BC9+AS9","v":0.1824163630673451},{"$f":"BG9*$B$63","v":3.5753607161199641}]
[null,null,null,null,null,null,1,48,1,{"$f":"Iout*G10/100","v":0.08},0.08,6.1111111111111106E-3,6.8813688136881365E-2,3.4951485642674611,{"$f":"K10+N10/2","v":1.8275742821337306},{"$f":"K10-N10/2","v":-1.6675742821337305},48,{"$f":"SQRT(K10^2+(N10^2)/12)","v":1.0121290878761831},3.892740103995282E-3,0.5,0.50404971086590689,{"$f":"N10/SQRT(12)","v":1.0089624822187764},1.0180052905250747E-3,{"$f":"W10","v":1.0180052905250747E-3},{"$f":"SQRT(M10*(1-M10))*SQRT(K10^2+(N10^2)/12)","v":0.25620736828386725},6.5642215562945199E-5,{"$f":"Z10","v":6.5642215562945199E-5},{"$f":"SQRT(M10)*SQRT(K10^2+(N10^2)/12)","v":0.26550537883056874},2.819724247518553E-3,6.1440000000000002E-3,0,7.4707327839591128E-3,1.6439324239400588E-2,0.97668428078735381,2.7663453345776207E-2,8.1875327839591137E-3,3.5955424506613778E-2,7.1680000000000008E-4,5.7600000000000004E-3,5.1220264526253712E-3,1.0560000000000001E-4,{"$f":"CHOOSE(Ext_VCC, (Qg_Q1+Qg_Q2)*Fsw*'Design Regulator'!$G$102, (Qg_Q1+Qg_Q2)*Fsw*Vout, (Qg_Q1+Qg_Q2)*Fsw*Vin)","v":0.13632},0.12758181818181816,0.12211999999999998,0.13642560000000001,0.70555253357063474,0.19529714874601439,0.26400000000000001,{"$f":"AV10/(AV10+AT10)","v":0.27229055761192217},0.30361386359100884,0.56784336759920673,null,{"$f":"AW10*100","v":27.229055761192217},0.50404971086590689,5.8154748746014367E-2,2.024092423940059E-2,3.785622450661378E-2,5.1220264526253712E-3,{"$f":"BC10+AS10","v":0.19458034874601438},{"$f":"BG10*$B$63","v":3.8137748354218819}]
["Vin",{"$f":"Vin","v":48},"V","Vin",null,null,2,48,1,0.16,0.16,1.2222222222222221E-2,6.8877377547550939E-2,3.498109186038266,1.9090545930191329,-1.5890545930191331,48,1.0224141315796527,3.9722564945243455E-3,0.5,0.50413245996958156,1.0098171401069478,1.019730656453775E-3,1.019730656453775E-3,0.25892178025912088,6.7040488292552478E-5,6.7040488292552478E-5,0.26832747583241628,2.8799853714638378E-3,1.2288E-2,0,7.1189645767257177E-3,2.2293691526264071E-2,0.98657540115653575,2.8226599642848207E-2,8.5525645767257161E-3,3.6888494078721627E-2,1.4336000000000002E-3,1.1520000000000001E-2,5.2266532822688762E-3,1.0560000000000001E-4,{"$f":"CHOOSE(Ext_VCC, (Qg_Q1+Qg_Q2)*Fsw*'Design Regulator'!$G$102, (Qg_Q1+Qg_Q2)*Fsw*Vout, (Qg_Q1+Qg_Q2)*Fsw*Vin)","v":0.13632},0.12758181818181816,0.12211999999999998,0.13642560000000001,0.71900727000158249,0.20856138560498572,0.52800000000000002,0.42341373037811558,0.44845337289396109,0.61035141118082448,null,42.341373037811557,0.50413245996958156,7.0702185604985701E-2,2.9896891526264072E-2,4.0690094078721629E-2,5.2266532822688762E-3,0.20712778560498571,{"$f":"BG11*$B$63","v":4.0597045978577198}]
["Vout",{"$f":"Vout","v":3.3},"V","Vout",null,null,3,48,1,0.24,0.24,1.833333333333333E-2,6.8941068232046959E-2,3.5010693652991409,1.9905346826495705,-1.5105346826495705,48,1.038776792700439,4.1004174552014411E-3,0.5,0.50426583348925746,1.0106716702535057,1.0214572250530109E-3,1.0214572250530109E-3,0.26317814899069691,6.9262738106169462E-5,6.9262738106169462E-5,0.27274779151931344,2.9756543111465151E-3,1.8432E-2,0,6.7671953782700751E-3,2.8183655495094266E-2,1.0023302186776313,2.9135310150956096E-2,8.9175953782700771E-3,3.8169674486200407E-2,2.1504000000000002E-3,1.7279999999999997E-2,5.3952861252650544E-3,1.0560000000000001E-4,{"$f":"CHOOSE(Ext_VCC, (Qg_Q1+Qg_Q2)*Fsw*'Design Regulator'!$G$102, (Qg_Q1+Qg_Q2)*Fsw*Vout, (Qg_Q1+Qg_Q2)*Fsw*Vin)","v":0.13632},0.12758181818181816,0.12211999999999998,0.13642560000000001,0.73296116955897639,0.22220932998129467,0.79199999999999993,0.51935748647885172,0.59382683242641399,0.658081117293006,null,51.93574864788517,0.50426583348925746,8.3633329981294663E-2,3.9588455495094266E-2,4.3872074486200403E-2,5.3952861252650544E-3,0.22005892998129467,4.3131550276333757]
["Fsw",{"$f":"Fsw/1000","v":400},"kHz","Switching Frequency",null,null,4,48,1,0.32,0.32,2.4444444444444442E-2,6.9004760190407619E-2,3.5040291020368093,2.0720145510184045,-1.4320145510184046,47.733818367280151,1.0609359055381593,4.2772229835082816E-3,0.5,0.50444983453761316,1.0115260726546174,1.0231849956600743E-3,1.0231849956600743E-3,0.26890718306834721,7.2311073105753607E-5,7.2311073105753607E-5,0.27869467648206775,3.1068289079777761E-3,2.4576000000000001E-2,3.180009060318712E-4,6.4154251885624528E-3,3.4427485834935302E-2,1.0236768401017138,3.0389513915858261E-2,9.2826251885624531E-3,3.979913412013994E-2,2.8672000000000003E-3,2.3040000000000001E-2,5.6279249783003707E-3,1.0560000000000001E-4,{"$f":"CHOOSE(Ext_VCC, (Qg_Q1+Qg_Q2)*Fsw*'Design Regulator'!$G$102, (Qg_Q1+Qg_Q2)*Fsw*Vout, (Qg_Q1+Qg_Q2)*Fsw*Vin)","v":0.13632},0.12758181818181816,0.12211999999999998,0.13642560000000001,0.74773267553975453,0.23655941995507523,1.056,0.58545260853801373,0.74450828752402953,0.71103501180209916,null,58.545260853801373,0.50444983453761316,9.726661995507524E-2,4.9633885834935304E-2,4.7402334120139944E-2,5.6279249783003707E-3,0.23369221995507525,4.5803675111194755]
["Iout",{"$f":"Iout","v":8},"A","Max Output Current",null,null,5,48,1,0.4,0.4,3.0555555555555555E-2,6.9068453422671136E-2,3.5069883962379942,2.153494198118997,-1.3534941981189972,45.116473270633243,1.088537536152212,4.5026730769268481E-3,0.5,0.50468446741002693,1.0123803473064501,1.0249139676123285E-3,1.0249139676123285E-3,0.27602101524023481,7.6187600854249948E-5,7.6187600854249948E-5,0.28607721891458704,3.2736070072761827E-3,3.0720000000000004E-2,3.2939375472606576E-3,6.063654007573107E-3,4.3366104738466721E-2,1.0502731989489325,3.1989139980482292E-2,9.6476540075731074E-3,4.1777117464202464E-2,3.5840000000000004E-3,2.8799999999999999E-2,5.924569838061642E-3,1.0560000000000001E-4,{"$f":"CHOOSE(Ext_VCC, (Qg_Q1+Qg_Q2)*Fsw*'Design Regulator'!$G$102, (Qg_Q1+Qg_Q2)*Fsw*Vout, (Qg_Q1+Qg_Q2)*Fsw*Vin)","v":0.13632},0.12758181818181816,0.12211999999999998,0.13642560000000001,0.76566296101922438,0.25395282220266918,1.32,0.63289228637159134,0.93561157107700077,0.7692167619630369,null,63.289228637159134,0.50468446741002693,0.11394322220266917,6.2374104738466718E-2,5.1281117464202462E-2,5.924569838061642E-3,0.25036882220266921,4.9072289151723165]
["Ta",{"$f":"Ta","v":25},"°C","Ambient Temperature",null,null,6,48,1,0.48,0.48,3.666666666666666E-2,6.9132147928875717E-2,3.5099472478894187,2.2349736239447093,-1.2749736239447094,42.49912079815698,1.121179798358501,4.7767677329393944E-3,0.5,0.50496973758482788,1.013234494205171,1.0266441402472085E-3,1.0266441402472085E-3,0.28441945850369144,8.0894428375533059E-5,8.0894428375533059E-5,0.29479172555669952,3.4760864582678579E-3,3.6864000000000001E-2,5.9958616023462414E-3,5.7118818352722978E-3,5.2066833721526942E-2,1.0817310103674169,3.393411738492487E-2,1.0012681835272298E-2,4.4103945207848418E-2,4.3008000000000005E-3,3.4559999999999994E-2,6.2852207012360451E-3,1.0560000000000001E-4,{"$f":"CHOOSE(Ext_VCC, (Qg_Q1+Qg_Q2)*Fsw*'Design Regulator'!$G$102, (Qg_Q1+Qg_Q2)*Fsw*Vout, (Qg_Q1+Qg_Q2)*Fsw*Vin)","v":0.13632},0.12758181818181816,0.12211999999999998,0.13642560000000001,0.7838196757840622,0.27145717892937538,1.5839999999999999,0.66896986126086055,1.1231465058229042,0.83263117811772624,null,66.896986126086063,0.50496973758482788,0.13073077892937535,7.4876433721526942E-2,5.5508745207848417E-2,6.2852207012360451E-3,0.26715637892937538,5.236265027015758]
["Vcc",{"$f":"VCC","v":5},"V","Subregulated VCC Voltage",null,null,7,48,1,0.56000000000000005,0.56000000000000005,4.2777777777777776E-2,6.9195843709059623E-2,3.5129056569778063,2.3164528284889032,-1.1964528284889031,39.881760949630106,1.1584366676267732,5.099506949028448E-3,0.5,0.5053056517236163,1.0140885133469479,1.0283755129022231E-3,1.0283755129022231E-3,0.29399602404513769,8.6433662154349178E-5,8.6433662154349178E-5,0.30472795712268896,3.7143651140866948E-3,4.3008000000000011E-2,8.4237707548648604E-3,5.3601086716302858E-3,6.0529851687376041E-2,1.1176387542717261,3.6224375166451619E-2,1.0377708671630287E-2,4.6780014401237961E-2,5.0176000000000014E-3,4.0320000000000002E-2,6.7098775645111153E-3,1.0560000000000001E-4,{"$f":"CHOOSE(Ext_VCC, (Qg_Q1+Qg_Q2)*Fsw*'Design Regulator'!$G$102, (Qg_Q1+Qg_Q2)*Fsw*Vout, (Qg_Q1+Qg_Q2)*Fsw*Vin)","v":0.13632},0.12758181818181816,0.12211999999999998,0.13642560000000001,0.80220340455179795,0.28907306608861405,1.8480000000000001,0.69730496792284269,1.3071157753106406,0.90128421601856945,null,69.730496792284271,0.5053056517236163,0.147629866088614,8.7141051687376042E-2,6.0085614401237962E-2,6.7098775645111153E-3,0.28405546608861398,5.5674871353368349]
["Components","Input Value","Units","Description",null,null,8,48,1,0.64,0.64,4.8888888888888885E-2,6.925954076326106E-2,3.5158636234898792,2.3979318117449395,-1.1179318117449397,37.264393724831322,1.1998783625496998,5.4708907226768055E-3,0.5,0.50569221767165196,1.0149424047279474,1.0301080849149486E-3,1.0301080849149486E-3,0.30464308319122874,9.2807408136257911E-5,9.2807408136257911E-5,0.31577447774379014,3.988540831774536E-3,4.9152000000000001E-2,1.0577662688293592E-2,5.0083345166173302E-3,6.8755332549069251E-2,1.1575813423343457,3.8859842359496986E-2,1.0742734516617331E-2,4.9805798651955717E-2,5.7344000000000006E-3,4.6080000000000003E-2,7.1985404245747441E-3,1.0560000000000001E-4,{"$f":"CHOOSE(Ext_VCC, (Qg_Q1+Qg_Q2)*Fsw*'Design Regulator'!$G$102, (Qg_Q1+Qg_Q2)*Fsw*Vout, (Qg_Q1+Qg_Q2)*Fsw*Vin)","v":0.13632},0.12758181818181816,0.12211999999999998,0.13642560000000001,0.820814804790303,0.30680113120102498,2.1120000000000001,0.72012729769038675,1.4875219882360389,0.97518297977933577,null,72.012729769038671,0.50569221767165196,0.16464113120102497,9.9168132549069254E-2,6.5012198651955719E-2,7.1985404245747441E-3,0.30106673120102501,5.9009079315400905]
["L",{"$f":"Lf*1000000","v":2.2000000000000002},"uH","Filter Inductance",null,null,9,48,1,0.72,0.72,5.4999999999999993E-2,6.9323239091518232E-2,3.5188211474123579,2.4794105737061791,-1.039410573706179,34.647019123539302,1.2450870875657796,5.890919051367534E-3,0.5,0.50612944445831287,1.0157961683443364,1.0318418556230352E-3,1.0318418556230352E-3,0.31625586433704939,1.0001777172757419E-4,1.0001777172757419E-4,0.32782279787567337,4.2987114722813835E-3,5.5296000000000005E-2,1.245753508601034E-2,4.6565593702036813E-3,7.6743445210972233E-2,1.2011553058684796,4.1840447995664026E-2,1.1107759370203684E-2,5.3181848363749264E-2,6.4512000000000007E-3,5.1839999999999997E-2,7.7512092781151769E-3,1.0560000000000001E-4,{"$f":"CHOOSE(Ext_VCC, (Qg_Q1+Qg_Q2)*Fsw*'Design Regulator'!$G$102, (Qg_Q1+Qg_Q2)*Fsw*Vout, (Qg_Q1+Qg_Q2)*Fsw*Vin)","v":0.13632},0.12758181818181816,0.12211999999999998,0.13642560000000001,0.83965460693850003,0.32464209357472151,2.3759999999999999,0.73888532520664496,1.6643676781645835,1.0543357254562389,null,73.888532520664498,0.50612944445831287,0.18176529357472149,0.11095784521097224,7.028904836374926E-2,7.7512092781151769E-3,0.31819089357472152,6.2365415140645419]
["Rdcr",{"$f":"Rdcr*1000","v":3.8},"mW","Inductor DCR at 25°C",null,null,10,48,1,0.8,0.8,6.1111111111111109E-2,6.9386938693869388E-2,3.5217782287319643,2.560889114365982,-0.96088911436598212,32.029637145532739,1.2936679729993334,6.3595919325839757E-3,0.5,0.50661734229762256,1.0166498041922816,1.0335768243642045E-3,1.0335768243642045E-3,0.32873523966151008,1.0806685779531047E-4,1.0806685779531047E-4,0.34077026353782641,4.6449749004655863E-3,6.1440000000000008E-2,1.4063385631293761E-2,4.3047832323595998E-3,8.4494353550023396E-2,1.2479793475264582,4.5166121103724366E-2,1.1472783232359601E-2,5.6908791017515149E-2,7.1680000000000008E-3,5.7599999999999998E-2,8.3678841218210211E-3,1.0560000000000001E-4,{"$f":"CHOOSE(Ext_VCC, (Qg_Q1+Qg_Q2)*Fsw*'Design Regulator'!$G$102, (Qg_Q1+Qg_Q2)*Fsw*Vout, (Qg_Q1+Qg_Q2)*Fsw*Vin)","v":0.13632},0.12758181818181816,0.12211999999999998,0.13642560000000001,0.8587236146691416,0.34259674456753852,2.64,0.75456088869987881,1.8376553032503511,1.1387518652627273,null,75.45608886998788,0.50661734229762256,0.19900314456753854,0.1225103535500234,7.5916791017515153E-2,8.3678841218210211E-3,0.33542874456753857,6.5744033935237569]
["LTc",{"$f":"Ltc*1000000","v":4000},"ppm","Inductor Series Resistance Temp Co",null,null,11,48,1,0.88,0.88,6.7222222222222211E-2,6.9450639570352732E-2,3.5247348674354173,2.6423674337177085,-0.88236743371770865,29.412247790590285,1.3452557342290898,6.8769093638097415E-3,0.5,0.50715592258884667,1.0175033122679491,1.0353129904762475E-3,1.0353129904762475E-3,0.34198943063655968,1.1695677066711827E-4,1.1695677066711827E-4,0.35452182531876802,5.0274289850940424E-3,6.7584000000000005E-2,1.5395212007323342E-2,3.9530061030553353E-3,9.2008216396740602E-2,1.2977007612885556,4.8836790709618008E-2,1.1837806103055336E-2,6.0987331494809102E-2,7.8848000000000008E-3,6.336E-2,9.0485649523812384E-3,1.0560000000000001E-4,{"$f":"CHOOSE(Ext_VCC, (Qg_Q1+Qg_Q2)*Fsw*'Design Regulator'!$G$102, (Qg_Q1+Qg_Q2)*Fsw*Vout, (Qg_Q1+Qg_Q2)*Fsw*Vin)","v":0.13632},0.12758181818181816,0.12211999999999998,0.13642560000000001,0.878022705193921,0.36066594789154971,2.9039999999999999,0.76784308989258143,2.0073872459511088,1.2284419724221367,null,76.784308989258136,0.50715592258884667,0.2163555478915497,0.1338258163967406,8.1896131494809107E-2,9.0485649523812384E-3,0.35278114789154968,6.9145104986743746]
["ThetaCa",{"$f":"ThetaCa","v":20},"°C/W","Core to Ambient Thermal Resistance",null,null,12,48,1,0.96,0.96,7.333333333333332E-2,6.9514341721006512E-2,3.527691063509439,2.7238455317547192,-0.80384553175471951,26.79485105849065,1.3995179003131863,7.4428713425287131E-3,0.5,0.50774519791715955,1.018356692567506,1.0370503532970302E-3,1.0370503532970302E-3,0.35593484534564834,1.2668961413123063E-4,1.2668961413123063E-4,0.36899090770784565,5.4461715988423946E-3,7.3728000000000002E-2,1.645301189717932E-2,3.6012279822611438E-3,9.9285187515968557E-2,1.3499985419717941,5.2852385836453138E-2,1.2202827982261143E-2,6.5418252444201658E-2,8.6016000000000009E-3,6.9119999999999987E-2,9.793251766485149E-3,1.0560000000000001E-4,{"$f":"CHOOSE(Ext_VCC, (Qg_Q1+Qg_Q2)*Fsw*'Design Regulator'!$G$102, (Qg_Q1+Qg_Q2)*Fsw*Vout, (Qg_Q1+Qg_Q2)*Fsw*Vin)","v":0.13632},0.12758181818181816,0.12211999999999998,0.13642560000000001,0.89755282961124316,0.37885063996017021,3.1679999999999997,0.779229820093847,2.1735658127395281,1.3234177866630248,null,77.922982009384697,0.50774519791715955,0.23382343996017022,0.14490438751596854,8.8227852444201657E-2,9.793251766485149E-3,0.37024903996017022,7.2568811832193365]
["Cin",{"$f":"Cin*1000000","v":15},"μF","Input Capacitance",null,null,13,48,1,1.04,1.04,7.9444444444444443E-2,6.9578045145868947E-2,3.5306468169407474,2.8053234084703735,-0.72532340847037369,24.177446949012456,1.4561555247172213,8.0574778662250487E-3,0.5,0.50838518205437855,1.0192099450871179,1.038788912164486E-3,1.038788912164486E-3,0.37049627722340656,1.3726749143640332E-4,1.3726749143640332E-4,0.38409961658062164,5.9013006182952223E-3,7.9871999999999999E-2,1.7236782983842736E-2,3.2494488699472742E-3,0.10632541558736358,1.4045840653756205,5.7212835504506059E-2,1.2567848869947275E-2,7.0202414690844608E-2,9.318400000000001E-3,7.4880000000000002E-2,1.0601944560822432E-2,1.0560000000000001E-4,{"$f":"CHOOSE(Ext_VCC, (Qg_Q1+Qg_Q2)*Fsw*'Design Regulator'!$G$102, (Qg_Q1+Qg_Q2)*Fsw*Vout, (Qg_Q1+Qg_Q2)*Fsw*Vin)","v":0.13632},0.12758181818181816,0.12211999999999998,0.13642560000000001,0.91731501329701004,0.39715183027820822,3.4319999999999999,0.78908977379368128,2.3361932338104534,1.4236922203626692,null,78.908977379368125,0.50838518205437855,0.25140783027820818,0.15574621558736357,9.4912814690844616E-2,1.0601944560822432E-2,0.38783343027820816,7.6015352334528803]
["RCinEsr",{"$f":"RCinEsr*1000","v":1},"mW","Input Capacitor ESR",null,null,14,48,1,1.1200000000000001,1.1200000000000001,8.5555555555555551E-2,6.9641749844978298E-2,3.5336021277160623,2.886801063858031,-0.64680106385803104,21.560035461934365,1.5149021969805918,8.7207289323831694E-3,0.5,0.50907588995977127,1.0200630698229516,1.0405286664166239E-3,1.0405286664166239E-3,0.38560667174188984,1.4869250529185761E-4,1.4869250529185761E-4,0.39977849879484034,6.392913923946246E-3,8.6016000000000023E-2,1.7746522950195395E-2,2.8976687660839796E-3,0.11312904418561222,1.4612001294545411,6.191806873122107E-2,1.2932868766083981E-2,7.5340757689658561E-2,1.0035200000000003E-2,8.0640000000000003E-2,1.1474643332083119E-2,1.0560000000000001E-4,{"$f":"CHOOSE(Ext_VCC, (Qg_Q1+Qg_Q2)*Fsw*'Design Regulator'!$G$102, (Qg_Q1+Qg_Q2)*Fsw*Vout, (Qg_Q1+Qg_Q2)*Fsw*Vin)","v":0.13632},0.12758181818181816,0.12211999999999998,0.13642560000000001,0.93731035633883364,0.41557060187527084,3.6960000000000002,0.79770179758053572,2.4952716627841829,1.5292793653448784,null,79.770179758053573,0.50907588995977127,0.26910980187527078,0.16635144418561221,0.10195195768965856,1.1474643332083119E-2,0.40553540187527082,7.9484938767553084]
["Cout",{"$f":"Cout*1000000","v":325},"μF","Output Capcitance",null,null,15,48,1,1.2,1.2,9.1666666666666646E-2,6.9705455818372744E-2,3.5365569958221004,2.9682784979110499,-0.56827849791105023,18.942616597035009,1.5755220136169217,9.432624538487774E-3,0.5,0.50981733778092775,1.0209160667711721,1.0422696153915203E-3,1.0422696153915203E-3,0.40120662739693264,1.6096675786722114E-4,1.6096675786722114E-4,0.41596602626291812,6.921109400198508E-3,9.2159999999999992E-2,1.7982229479019882E-2,2.5458876706415052E-3,0.11969621176038009,1.5196189918484688,6.6968014531210152E-2,1.3297887670641505E-2,8.0834300022597685E-2,1.0752000000000001E-2,8.6400000000000005E-2,1.2411348076957597E-2,1.0560000000000001E-4,{"$f":"CHOOSE(Ext_VCC, (Qg_Q1+Qg_Q2)*Fsw*'Design Regulator'!$G$102, (Qg_Q1+Qg_Q2)*Fsw*Vout, (Qg_Q1+Qg_Q2)*Fsw*Vin)","v":0.13632},0.12758181818181816,0.12211999999999998,0.13642560000000001,0.95754003401412202,0.43410811178297781,3.9599999999999995,0.80528068355500593,2.6508031764057014,1.6401945003389653,null,80.528068355500594,0.50981733778092775,0.28693051178297779,0.17672021176038011,0.10934630002259768,1.2411348076957597E-2,0.42335611178297783,8.2977797909463664]
["RCoutEsr",{"$f":"Cout_ESR*1000","v":1},"mW","Output Capacitor ESR",null,null,16,48,1,1.28,1.28,9.7777777777777769E-2,6.9769163066090573E-2,3.5395114212455812,3.0497557106227906,-0.48975571062279055,16.325190354093017,1.6378069966962916,1.019316468202384E-2,0.5,0.51060954285470628,1.0217689359279456,1.0440117584273262E-3,1.0440117584273262E-3,0.4172437546476534,1.7409235079247117E-4,1.7409235079247117E-4,0.43260793264122521,7.4859849353645933E-3,9.8304000000000002E-2,1.7943900252999558E-2,2.1941055835901016E-3,0.12602705161598807,1.5796398751117964,7.2362601916253141E-2,1.3662905583590103E-2,8.6684139940494759E-2,1.1468800000000001E-2,9.2160000000000006E-2,1.3412058792136632E-2,1.0560000000000001E-4,{"$f":"CHOOSE(Ext_VCC, (Qg_Q1+Qg_Q2)*Fsw*'Design Regulator'!$G$102, (Qg_Q1+Qg_Q2)*Fsw*Vout, (Qg_Q1+Qg_Q2)*Fsw*Vin)","v":0.13632},0.12758181818181816,0.12211999999999998,0.13642560000000001,0.97800529731254549,0.45276559155648288,4.2240000000000002,0.81199455951769184,2.8027897742398213,1.7564540991074213,null,81.199455951769181,0.51060954285470628,0.30487119155648285,0.18685265161598807,0.11709693994049476,1.3412058792136632E-2,0.44129679155648283,8.6494171145070649]
["Top Driver","Input Value","Units","Description",null,null,17,48,1,1.36,1.36,0.10388888888888889,6.9832871588169976E-2,3.5424654039732206,3.1312327019866104,-0.41123270198661022,13.707756732887008,1.7015742989544309,1.1002349360476598E-2,0.5,0.51145252370824745,1.0226216772894376,1.0457550948622628E-3,1.0457550948622628E-3,0.43367197875568914,1.8807138515787488E-4,1.8807138515787488E-4,0.44965649171525374,8.0876384216668016E-3,0.10444800000000001,1.763153295471848E-2,1.8423225049000137E-3,0.13212169189081083,1.6410862665687604,7.810175989529719E-2,1.4027922504900016E-2,9.2891455950035284E-2,1.2185600000000003E-2,9.7920000000000007E-2,1.4476775474311315E-2,1.0560000000000001E-4,{"$f":"CHOOSE(Ext_VCC, (Qg_Q1+Qg_Q2)*Fsw*'Design Regulator'!$G$102, (Qg_Q1+Qg_Q2)*Fsw*Vout, (Qg_Q1+Qg_Q2)*Fsw*Vin)","v":0.13632},0.12758181818181816,0.12211999999999998,0.13642560000000001,0.99870747350342504,0.47154434784084609,4.4880000000000004,0.81797690539792511,2.9512333783621627,1.8780758392505292,null,81.797690539792512,0.51145252370824745,0.32293314784084615,0.19674889189081085,0.12520505595003528,1.4476775474311315E-2,0.45935874784084618,9.0034314576805858]
["RdsonDRT",0.7,"W","Drain to Source Resistance of pullup Top FET Driver",null,null,18,48,1,1.44,1.44,0.10999999999999999,6.9896581384649228E-2,3.5454189439917365,3.2127094719958684,-0.33270947199586831,11.090315733195609,1.766663415604292,1.1860178571331568E-2,0.5,0.51234630006005744,1.023474290851814,1.0474996240346236E-3,1.0474996240346236E-3,0.45045084250552003,2.0290596151393281E-4,2.0290596151393281E-4,0.46706979551340527,8.7261677552373691E-3,0.11059200000000001,1.7045125266661524E-2,1.49053843454149E-3,0.13798025553639612,1.7038032251858455,8.4185417474456986E-2,1.4392938434541492E-2,9.9457507446460147E-2,1.2902400000000001E-2,0.10367999999999999,1.5605498120173117E-2,1.0560000000000001E-4,{"$f":"CHOOSE(Ext_VCC, (Qg_Q1+Qg_Q2)*Fsw*'Design Regulator'!$G$102, (Qg_Q1+Qg_Q2)*Fsw*Vout, (Qg_Q1+Qg_Q2)*Fsw*Vin)","v":0.13632},0.12758181818181816,0.12211999999999998,0.13642560000000001,1.0196479667486353,0.49044576298285625,4.7519999999999998,0.82333503834208421,3.0961358330459414,2.0050786116969022,null,82.333503834208415,0.51234630006005744,0.34111776298285623,0.2064090555363961,0.13367190744646015,1.5605498120173117E-2,0.47754336298285627,9.3598499144639842]
["RdsonDRT2",{"$f":"RdsonDRT2","v":1},"W","Drain to Source Resistance of pulldown Top FET Driver",null,null,19,48,1,1.52,1.52,0.11611111111111111,6.9960292455566564E-2,3.5483720412878457,3.2941860206439229,-0.25418602064392282,8.4728673547974278,1.8329335354242315,1.2766652312074536E-2,0.5,0.51329089282116269,1.0243267766112398,1.0492453452827727E-3,1.0492453452827727E-3,0.46754484263150625,2.1859817987131993E-4,2.1859817987131993E-4,0.48481106722409473,9.4016708361186283E-3,0.11673600000000002,1.6184674871214316E-2,1.1387533724847743E-3,0.14360286029629896,1.7676548233124607,9.0613503657014399E-2,1.4757953372484776E-2,0.10638363539264245,1.3619200000000001E-2,0.10944,1.6798226726413863E-2,1.0560000000000001E-4,{"$f":"CHOOSE(Ext_VCC, (Qg_Q1+Qg_Q2)*Fsw*'Design Regulator'!$G$102, (Qg_Q1+Qg_Q2)*Fsw*Vout, (Qg_Q1+Qg_Q2)*Fsw*Vin)","v":0.13632},0.12758181818181816,0.12211999999999998,0.13642560000000001,1.0408282587616722,0.50947129568894145,5.016,0.82815622066614925,3.2374989044444842,2.137482530889637,null,82.815622066614921,0.51329089282116269,0.35942649568894142,0.21583326029629896,0.14249883539264246,1.6798226726413863E-2,0.4958520956889414,9.7187010755032528]
["Bottom Driver","Input Value","Units","Description",null,null,20,48,1,1.6,1.6,0.12222222222222222,7.0024004800960188E-2,3.5513246958482609,3.3756623479241306,-0.17566234792413038,5.8554115974710133,1.9002611025712086,1.3721770580191552E-2,0.5,0.5142863240963339,1.0251791345638797,1.0509922579451452E-3,1.0509922579451452E-3,0.48492281829258876,2.3515013970082707E-4,2.3515013970082707E-4,0.50284802794341443,1.0114245568263236E-2,0.12288000000000002,1.5050179450663182E-2,7.8696731870010403E-4,0.14898961868462884,1.8325217921592543,9.73859474434184E-2,1.5122967318700107E-2,0.11367126304523731,1.4336000000000002E-2,0.1152,1.8054961289725727E-2,1.0560000000000001E-4,{"$f":"CHOOSE(Ext_VCC, (Qg_Q1+Qg_Q2)*Fsw*'Design Regulator'!$G$102, (Qg_Q1+Qg_Q2)*Fsw*Vout, (Qg_Q1+Qg_Q2)*Fsw*Vin)","v":0.13632},0.12758181818181816,0.12211999999999998,0.13642560000000001,1.0622499095135718,0.52862248172986614,5.28,0.83251213297032589,3.3753242802694325,2.2753089456785593,null,83.251213297032592,0.5142863240963339,0.37786088172986609,0.22502161868462883,0.1516872630452373,1.8054961289725727E-2,0.51428648172986613,10.080015041905376]
["RdsonDRB",0.7,"W","Drain to Source Resistance of pullup Bottom FET Driver",null,null,21,48,1,1.68,1.68,0.12833333333333333,7.0087718420868375E-2,3.5542769076596996,3.4571384538298497,-9.7138453829849869E-2,3.2379484609949958,1.9685376200012661,1.4725533373168946E-2,0.5,0.51533261718538059,1.0260313647058992,1.05274036136025E-3,1.05274036136025E-3,0.50255739964038326,2.5256393993330391E-4,2.5256393993330391E-4,0.52115232560966207,1.0863989859534368E-2,0.129024,1.3641636687195228E-2,4.3518027315772747E-4,0.15414063796430491,1.8982994007458072,0.10450267783128483,1.5487980273157729E-2,0.12132189672865262,1.5052800000000002E-2,0.12095999999999998,1.9375701806801246E-2,1.0560000000000001E-4,{"$f":"CHOOSE(Ext_VCC, (Qg_Q1+Qg_Q2)*Fsw*'Design Regulator'!$G$102, (Qg_Q1+Qg_Q2)*Fsw*Vout, (Qg_Q1+Qg_Q2)*Fsw*Vin)","v":0.13632},0.12758181818181816,0.12211999999999998,0.13642560000000001,1.0839145579864329,0.54790093469295753,5.5439999999999996,0.83646220111869884,3.5096135694645731,2.4185804509297895,null,83.64622011186988,0.51533261718538059,0.39642253469295752,0.23397423796430489,0.16123869672865263,1.9375701806801246E-2,0.53284813469295755,10.443823439981969]
["RdsonDRB2",0.5,"W","Drain to Source Resistance of pulldown Bottom FET Driver",null,null,22,48,1,1.76,1.76,0.13444444444444442,7.0151433315329359E-2,3.5572286767088754,3.5386143383544377,-1.8614338354437709E-2,0.62047794514792365,2.0376676998143401,1.5777940688493322E-2,0.5,0.51642979658451593,1.0268834670334628,1.0544896548666648E-3,1.0544896548666648E-3,0.52042451802312339,2.7084167895960026E-4,2.7084167895960026E-4,0.53969902773920908,1.1651001621705903E-2,0.13516800000000001,1.1959044262898224E-2,8.3392235827880936E-5,0.15905602012501599,1.9648955733890838,0.11196362381539648,1.5852992235827881E-2,0.12933712665764271,1.5769600000000002E-2,0.12672,2.0760448274333321E-2,1.0560000000000001E-4,{"$f":"CHOOSE(Ext_VCC, (Qg_Q1+Qg_Q2)*Fsw*'Design Regulator'!$G$102, (Qg_Q1+Qg_Q2)*Fsw*Vout, (Qg_Q1+Qg_Q2)*Fsw*Vin)","v":0.13632},0.12758181818181816,0.12211999999999998,0.13642560000000001,1.1058239229753342,0.56730834678265873,5.8079999999999998,0.84005610566671074,3.64036830187524,2.5673208998646411,null,84.005610566671081,0.51642979658451593,0.4151131467826587,0.24269122012501598,0.17115472665764273,2.0760448274333321E-2,0.55153874678265868,10.810159436940111]
["Deadtime","Input Value","Units","Description",null,null,23,48,1,1.84,1.84,0.14055555555555554,7.0215149484381401E-2,3.5601800029825039,3.6200900014912518,5.9909998508748119E-2,0,2.1075673507157586,1.6878992523651559E-2,0.5,0.51757788798779181,1.0277354415427358,1.0562401378030422E-3,1.0562401378030422E-3,0.53850297550757142,2.8998545463050808E-4,2.8998545463050808E-4,0.5584661755751783,1.2475378770462635E-2,0.14131200000000002,1.1520000000000028E-2,0,0.16552420136677423,2.0322292362185608,0.11976871438770278,1.6486400000000002E-2,0.1379904428714557,1.6486400000000002E-2,0.13247999999999999,2.2209200689015211E-2,1.0560000000000001E-4,{"$f":"CHOOSE(Ext_VCC, (Qg_Q1+Qg_Q2)*Fsw*'Design Regulator'!$G$102, (Qg_Q1+Qg_Q2)*Fsw*Vout, (Qg_Q1+Qg_Q2)*Fsw*Vin)","v":0.13632},0.12758181818181816,0.12211999999999998,0.13642560000000001,1.1300399585074703,0.58890664423822991,6.0720000000000001,0.84309446142789024,3.7944150205016136,2.7256326430718354,null,84.309446142789028,0.51757788798779181,0.43599464423822992,0.25296100136677424,0.18170884287145569,2.2209200689015211E-2,0.5724202442382299,11.219436787069307]
["Deadtime",{"$f":"Deadtime*1000000000","v":14},"ns","Total Deadtime",null,null,24,48,1,1.92,1.92,0.14666666666666664,7.0278866928062733E-2,3.5631308864672979,3.7015654432336489,0.13843455676635097,0,2.1781624846434444,1.8028688876130794E-2,0.5,0.51877691828860617,1.0285872882298823,1.0579918095081032E-3,1.0579918095081032E-3,0.55677406931061613,3.0999736425670277E-4,3.0999736425670277E-4,0.57743439509178074,1.333721922540043E-2,0.147456,1.1520000000000028E-2,0,0.1725548664440287,2.100228875354563,0.1279178785373197,1.7203200000000002E-2,0.14709679102937281,1.7203200000000002E-2,0.13823999999999997,2.3721959047540517E-2,1.0560000000000001E-4,{"$f":"CHOOSE(Ext_VCC, (Qg_Q1+Qg_Q2)*Fsw*'Design Regulator'!$G$102, (Qg_Q1+Qg_Q2)*Fsw*Vout, (Qg_Q1+Qg_Q2)*Fsw*Vin)","v":0.13632},0.12758181818181816,0.12211999999999998,0.13642560000000001,1.155387323983313,0.61152045747340145,6.3359999999999994,0.84577124716480789,3.95689899666043,2.890739865440592,null,84.577124716480796,0.51877691828860617,0.45789165747340149,0.26379326644402867,0.19271599102937281,2.3721959047540517E-2,0.59431725747340147,11.648618246478669]
["IQ","Input Value","Units","Description",null,null,25,48,1,2,2,0.15277777777777776,7.0342585646411604E-2,3.5660813271499694,3.7830406635749849,0.2169593364250153,0,2.2493876209583443,1.9227029743418431E-2,0.5,0.52002691558127911,1.0294390070910664,1.0597446693206406E-3,1.0597446693206406E-3,0.57522126578272981,3.3087950460868585E-4,3.3087950460868585E-4,0.59658655931110427,1.4236620910026469E-2,0.15360000000000001,1.1520000000000028E-2,0,0.17962513267660868,2.1688312858703367,0.13641104525052938,1.7920000000000002E-2,0.15657367501055455,1.7920000000000002E-2,0.14399999999999999,2.52987233466032E-2,1.0560000000000001E-4,{"$f":"CHOOSE(Ext_VCC, (Qg_Q1+Qg_Q2)*Fsw*'Design Regulator'!$G$102, (Qg_Q1+Qg_Q2)*Fsw*Vout, (Qg_Q1+Qg_Q2)*Fsw*Vin)","v":0.13632},0.12758181818181816,0.12211999999999998,0.13642560000000001,1.1812606707889746,0.63454440768716325,6.6,0.84819160791985115,4.1199769901491301,3.0614051251583185,null,84.819160791985112,0.52002691558127911,0.48019880768716328,0.27466513267660869,0.20409367501055456,2.52987233466032E-2,0.61662440768716331,12.085838390668401]
["IQ ",{"$f":"Iq*1000","v":2.2000000000000001E-3},"mA","Quiescent Current Of Controller (Not Switching!)",null,null,26,48,1,2.08,2.08,0.15888888888888889,7.0406305639466246E-2,3.5690313250172312,3.8645156625086159,0.29548433749138447,0,2.3211847657133031,2.0474015123002183E-2,0.5,0.52132790916270144,1.0302905981224526,1.0614987165795211E-3,1.0614987165795211E-3,0.59382991834087195,3.5263397191672666E-4,3.5263397191672666E-4,0.61590749613394513,1.5173681751759425E-2,0.159744,1.1520000000000028E-2,0,0.18673519509609474,2.2379804898134248,0.14524814351078058,1.8636800000000002E-2,0.16642307093022835,1.8636800000000002E-2,0.14976,2.6939493582897611E-2,1.0560000000000001E-4,{"$f":"CHOOSE(Ext_VCC, (Qg_Q1+Qg_Q2)*Fsw*'Design Regulator'!$G$102, (Qg_Q1+Qg_Q2)*Fsw*Vout, (Qg_Q1+Qg_Q2)*Fsw*Vin)","v":0.13632},0.12758181818181816,0.12211999999999998,0.13642560000000001,1.2076622014604186,0.6579806660263231,6.8639999999999999,0.85038246505881854,4.2836519264414212,3.2376580639534249,null,85.038246505881858,0.52132790916270144,0.50291826602632306,0.28557679509609474,0.21584387093022833,2.6939493582897611E-2,0.63934386602632309,12.531139774115934]
["High-side FET","Input Value","Units","Description",null,null,27,48,1,2.16,2.16,0.16499999999999998,7.0470026907264963E-2,3.5719808800557971,3.9459904400278987,0.37400955997210161,0,2.3935024442485289,2.1769645012369991E-2,0.5,0.52267992953405373,1.0311420613202054,1.0632539506236823E-3,1.0632539506236823E-3,0.61258702391644193,3.7526286187080336E-4,3.7526286187080336E-4,0.63538373605895992,1.6148499681929683E-2,0.16588800000000001,1.1520000000000028E-2,0,0.19388525005130208,2.3076268022744579,0.15442910229868778,1.9353600000000002E-2,0.17664704396309625,1.9353600000000002E-2,0.15551999999999999,2.8644269753118411E-2,1.0560000000000001E-4,{"$f":"CHOOSE(Ext_VCC, (Qg_Q1+Qg_Q2)*Fsw*'Design Regulator'!$G$102, (Qg_Q1+Qg_Q2)*Fsw*Vout, (Qg_Q1+Qg_Q2)*Fsw*Vin)","v":0.13632},0.12758181818181816,0.12211999999999998,0.13642560000000001,1.2345942101140648,0.68183149401439846,7.1280000000000001,0.85236707903142117,4.4479267507695308,3.4195296594464435,null,85.236707903142118,0.52267992953405373,0.52605229401439835,0.29652845005130207,0.22796864396309624,2.8644269753118411E-2,0.66247789401439838,12.98456672268221]
["RdsonTop",{"$f":"Rdson1*1000","v":40},"mW","Drain-Source Resistance of Top FET ",null,null,28,48,1,2.2400000000000002,2.2400000000000002,0.1711111111111111,7.0533749449845959E-2,3.5749299922523767,4.0274649961261888,0.45253500387381185,0,2.4662948669597746,2.3113919409010104E-2,0.5,0.52408300840259803,1.0319933966804884,1.0650103707921319E-3,1.0650103707921319E-3,0.63148101287413727,3.9876826962054635E-4,3.9876826962054635E-4,0.6550032945676586,1.716117263577948E-2,0.17203200000000005,1.1520000000000028E-2,0,0.20107549522084209,2.3777260260378288,0.16395385059203174,2.0070400000000006E-2,0.18724774949417936,2.0070400000000006E-2,0.16128000000000001,3.0413051853960666E-2,1.0560000000000001E-4,{"$f":"CHOOSE(Ext_VCC, (Qg_Q1+Qg_Q2)*Fsw*'Design Regulator'!$G$102, (Qg_Q1+Qg_Q2)*Fsw*Vout, (Qg_Q1+Qg_Q2)*Fsw*Vin)","v":0.13632},0.12758181818181816,0.12211999999999998,0.13642560000000001,1.2620590836119929,0.7060992447150215,7.3920000000000003,0.8541656497351714,4.6128044283126322,3.6070522424126903,null,85.41656497351714,0.52408300840259803,0.54960324471502142,0.30752029522084212,0.24047014949417936,3.0413051853960666E-2,0.68602884471502146,13.446165356414422]
["RdsonTopTc",{"$f":"RdsonTopTc*1000000","v":7000},"ppm","Drain to Source Resistance Temp Co",null,null,29,48,1,2.3199999999999998,2.3199999999999998,0.17722222222222217,7.0597473267247496E-2,3.5778786615936804,4.10893933079684,0.53106066920315964,0,2.5395212100756215,2.4506838310411005E-2,0.5,0.52553717868353955,1.0328446041994648,1.066767976423949E-3,1.066767976423949E-3,0.65050156784989999,4.2315228977517807E-4,4.2315228977517807E-4,0.67475548446202227,1.8211798552463136E-2,0.17817599999999997,1.1520000000000028E-2,0,0.20830612962581194,2.44823875727274,0.17382231736575876,2.0787200000000002E-2,0.19822743432575579,2.0787200000000002E-2,0.16703999999999997,3.2245839882119744E-2,1.0560000000000001E-4,{"$f":"CHOOSE(Ext_VCC, (Qg_Q1+Qg_Q2)*Fsw*'Design Regulator'!$G$102, (Qg_Q1+Qg_Q2)*Fsw*Vout, (Qg_Q1+Qg_Q2)*Fsw*Vin)","v":0.13632},0.12758181818181816,0.12211999999999998,0.13642560000000001,1.290059302783426,0.73078636395156771,7.6559999999999988,0.85579580247338127,4.7782879443871789,3.8002595148863367,null,85.579580247338129,0.52553717868353955,0.57357356395156767,0.31855252962581193,0.25335063432575577,3.2245839882119744E-2,0.7099991639515677,13.915983613450727]
["QgTop",{"$f":"Qg_Q1*1000000000","v":3},"nC","Gate Charge Of Top FET",null,null,30,48,1,2.4,2.4,0.18333333333333329,7.0661198359507849E-2,3.58082688806642,4.1904134440332097,0.6095865559667899,0,2.6131449953759334,2.594840171406149E-2,0.5,0.52704247450196151,1.0336956838732989,1.0685267668582871E-3,1.0685267668582871E-3,0.66963946747743075,4.4841701640345704E-4,4.4841701640345704E-4,0.69463075398097818,1.9300475375047289E-2,0.18431999999999998,1.1520000000000028E-2,0,0.21557735364261402,2.5191297867482145,0.18403443159198105,2.1504000000000002E-2,0.2095884379416903,2.1504000000000002E-2,0.17280000000000001,3.414263383429144E-2,1.0560000000000001E-4,{"$f":"CHOOSE(Ext_VCC, (Qg_Q1+Qg_Q2)*Fsw*'Design Regulator'!$G$102, (Qg_Q1+Qg_Q2)*Fsw*Vout, (Qg_Q1+Qg_Q2)*Fsw*Vin)","v":0.13632},0.12758181818181816,0.12211999999999998,0.13642560000000001,1.3185974437038188,0.75589539158430441,7.919999999999999,0.85727298415816855,4.9443803046392105,3.9991865691253548,null,85.727298415816861,0.52704247450196151,0.59796579158430441,0.32962535364261403,0.26661243794169032,3.414263383429144E-2,0.73439139158430444,14.394071275052369]
["QgdTop",{"$f":"Qgd_Q1*1000000000","v":0.7},"nC","Gate to Drain Charge",null,null,31,48,1,2.48,2.48,0.18944444444444442,7.0724924726665264E-2,3.5837746716573049,4.2718873358286524,0.68811266417134753,0,2.6871335548190323,2.74386096174506E-2,0.5,0.52859893119483115,1.0345466356981539,1.0702867414343687E-3,1.0702867414343687E-3,0.68888645148066141,4.7456454303361766E-4,4.7456454303361766E-4,0.71462054704771516,2.0427301050511028E-2,0.19046400000000002,1.1520000000000028E-2,0,0.22288936901590495,2.5903675830220685,0.19459012223997621,2.2220800000000002E-2,0.22133319383051692,2.2220800000000002E-2,0.17855999999999997,3.6103433707171846E-2,1.0560000000000001E-4,{"$f":"CHOOSE(Ext_VCC, (Qg_Q1+Qg_Q2)*Fsw*'Design Regulator'!$G$102, (Qg_Q1+Qg_Q2)*Fsw*Vout, (Qg_Q1+Qg_Q2)*Fsw*Vin)","v":0.13632},0.12758181818181816,0.12211999999999998,0.13642560000000001,1.3476761790328928,0.78142896284642183,8.1839999999999993,0.85861078852034267,5.1110845352385743,4.2038699074577535,null,85.861078852034268,0.52859893119483115,0.62278256284642186,0.34073896901590495,0.28025799383051692,3.6103433707171846E-2,0.7592081628464219,14.880479991789871]
["QgsTop",{"$f":"Qgs_Q1*1000000000","v":0.7},"nC",null,null,null,32,{"$f":"Vin","v":48},{"$f":"MODE","v":1},2.56,{"$f":"Iout*G41/100/Number_of_Phases","v":2.56},{"$f":"Vout*K41/(Vin*Efficiency)","v":0.19555555555555554},{"$f":"(Vout+(Rdson2+Rs+Rdcr)*K41)/(Vin+(Rs+Rdson2-Rdson1)*K41)","v":7.0788652368758004E-2},{"$f":"(Vin-(Rdson1+Rdcr)*K41-Vout)*M41/(Fsw*Lf)","v":3.5867220123530439},4.353361006176522,0.76663899382347811,{"$f":"IF(MIN(Vin, -P41/(Coss_Q1+Coss_Q2)*0.00000002)<0, 0, MIN(Vin, -P41/(Coss_Q1+Coss_Q2)*0.00000002))","v":0},2.761457567932466,{"$f":"R41^2*Rdcr","v":2.8977462018067661E-2},{"$f":"Core_Loss_Ch1","v":0.5},{"$f":"(T41+S41*(1+Ltc*(Ta-25)))/(1-S41*Ltc*ThetaCa)","v":0.53020658531307874},1.0353974596701931,1.0720478994914893E-3,1.0720478994914893E-3,0.70823510408148616,5.015969626533136E-4,5.015969626533136E-4,0.7347171824883727,{"$f":"Rdson1*AB41^2","v":2.159237352974611E-2},{"$f":"(Vin*K41/2)*Fsw*(Tr_buck+Tf_buck)","v":0.196608},{"$f":"(0.5*Coss_Q1*(Vin-Q41)^2-0.5*Coss_Q2*(Vin-Q41)^2+(Qoss_Q2*(Vin-Q41)/Vin)*Vin)*Fsw","v":1.1520000000000028E-2},{"$f":"IF(K41>N41/2,0,ABS(K41-N41/2)*Vsd_Q1*Deadtime*Fsw)","v":0},{"$f":"(AF41+AE41+AD41+AC41*(1+RdsonTopTc*Ta-RdsonTopTc*25))/(1-AC41*RdsonTopTc*ThetaJA_Q1)","v":0.23024237887167848},{"$f":"SQRT((1-M41))*SQRT(K41^2+(N41^2)/12)","v":2.6619238458768573},{"$f":"Rdson2*AH41^2","v":0.20548931827618733},{"$f":"IF(K41<N41/2,Deadtime*Fsw*IF(VfdSky_Q2>0,0,Vsd_Q2)*(K41+N41/2),2*Deadtime*Fsw*IF(VfdSky_Q2>0,0,Vsd_Q2)*K41)","v":2.2937600000000002E-2},{"$f":"(AJ41+AI41*(1+RdsonBotTc*Ta-RdsonBotTc*25))/(1-AI41*RdsonBotTc*ThetaJA_Q2)","v":0.23346423086871135},{"$f":"2*Deadtime*Fsw*IF(VfdSky_Q2>0,VfdSky_Q2,Vsd_Q2)*K41","v":2.2937600000000002E-2},{"$f":"IF(QrrSky_Q2>0,QrrSky_Q2,Qrr_Q2*K41/(Iout/Number_of_Phases))*Fsw*Vin","v":0.18432000000000001},{"$f":"Rs*R41^2","v":3.8128239497457452E-2},{"$f":"Iq*Vin","v":1.0560000000000001E-4},{"$f":"CHOOSE(Ext_VCC, (Qg_Q1+Qg_Q2)*Fsw*'Design Regulator'!$G$102, (Qg_Q1+Qg_Q2)*Fsw*Vout, (Qg_Q1+Qg_Q2)*Fsw*Vin)","v":0.13632},0.12758181818181816,{"$f":"(Qg_Q1+Qg_Q2)*Fsw*(Vin-VCC)","v":0.12211999999999998},{"$f":"SUM(AO41:AP41)","v":0.13642560000000001},{"$f":" SUM(U41,X41,AA41,AG41,AK41,AL41,AM41,AS41,AN41)","v":1.3772982794130706},{"$f":" SUM(AG41,AK41,AL41,AM41,AS41)","v":0.80738980974038987},{"$f":"Vout*K41","v":8.4480000000000004},0.85982122473585143,{"$f":"ThetaJA_Q1*BD41","v":5.2784036830751777},{"$f":"ThetaJA_Q2*BE41","v":4.41434746303067},null,85.98212247358515,{"$f":"U41","v":0.53020658531307874},{"$f":"AG41+AK41+AM41","v":0.64802660974038984},{"$f":"AG41+AM41*0.66","v":0.35189357887167849},{"$f":"AK41+AM41*0.33","v":0.29428983086871136},{"$f":"AN41","v":3.8128239497457452E-2},0.78445220974038987,15.375263310911643]
["RGateTop",{"$f":"Rgate1","v":3.5},"W","Gate Resistance",null,null,33,48,1,{"$f":"Iout*G42/100","v":2.64},2.64,0.20166666666666666,7.0852381285824315E-2,3.5896689101403463,4.434834455070173,0.84516554492982698,0,2.8360906615214216,3.0564958913402256E-2,0.5,0.53186547462374889,1.0362481557855798,1.0738102403690154E-3,1.0738102403690154E-3,0.72767875309751795,5.295163677095585E-4,5.295163677095585E-4,0.75491374950316625,2.279579076755717E-2,0.20275200000000002,1.1520000000000028E-2,0,0.23763658773048235,2.7337731199168824,0.21673194866422249,2.3654400000000003E-2,0.24598417476566237,2.3654400000000003E-2,{"$f":"IF(QrrSky_Q2>0,QrrSky_Q2,Qrr_Q2*K42/(Iout/Number_of_Phases))*Fsw*Vin","v":0.19008},4.0217051201845079E-2,1.0560000000000001E-4,{"$f":"CHOOSE(Ext_VCC, (Qg_Q1+Qg_Q2)*Fsw*'Design Regulator'!$G$102, (Qg_Q1+Qg_Q2)*Fsw*Vout, (Qg_Q1+Qg_Q2)*Fsw*Vin)","v":0.13632},0.12758181818181816,0.12211999999999998,0.13642560000000001,1.4074666149298174,0.83378076249614475,8.7119999999999997,0.86091494063004248,5.4463408159572353,4.6306586214849359,null,86.091494063004248,0.53186547462374889,0.67370076249614474,0.36308938773048238,0.30871057476566238,4.0217051201845079E-2,0.81012636249614478,15.878476704924438]
["GfsTop",{"$f":"Gfs_Q1","v":71},"S","Transconductance of Top FET",null,null,34,48,1,2.72,2.72,0.20777777777777778,7.0916111477902485E-2,3.5926153650059205,4.5163076825029602,0.92369231749703995,0,2.9110090627489269,3.2201100300944266E-2,0.5,0.53357563811222364,1.037098724040477,1.0755737634063854E-3,1.0755737634063854E-3,0.74721138248066632,5.5832485010866859E-4,5.5832485010866859E-4,0.77520401706037889,2.4037650722661931E-2,0.20889600000000003,1.1520000000000028E-2,0,0.24507220152077094,2.8058924596890447,0.22831794236485528,2.4371200000000006E-2,0.25889574957192862,2.4371200000000006E-2,0.19584000000000001,4.2369868817031933E-2,1.0560000000000001E-4,{"$f":"CHOOSE(Ext_VCC, (Qg_Q1+Qg_Q2)*Fsw*'Design Regulator'!$G$102, (Qg_Q1+Qg_Q2)*Fsw*Vout, (Qg_Q1+Qg_Q2)*Fsw*Vin)","v":0.13632},0.12758181818181816,0.12211999999999998,0.13642560000000001,1.4381841566354701,0.86060475109269963,8.9760000000000009,0.86190140917384095,5.6148990228115645,4.8528442435789296,null,86.190140917384099,0.53357563811222364,0.69980795109269955,0.37432660152077096,0.32352294957192862,4.2369868817031933E-2,0.83623355109269959,16.390177601416912]
["VthTop",{"$f":"Vth_Q1","v":1.8},"V","Threshold Voltage of Top FET",null,null,35,48,1,2.8,2.8,0.21388888888888885,7.0979842945030763E-2,3.5955613769364736,4.5977806884682364,1.002219311531763,0,2.9861912979484599,3.3885886178183805E-2,0.5,0.5353371159845205,1.0379491644310472,1.0773384679431091E-3,1.0773384679431091E-3,0.76682755637509803,5.8802450121620421E-4,5.8802450121620421E-4,0.79558235522306742,2.5318051357691322E-2,0.21503999999999998,1.1520000000000028E-2,0,0.25254942759239601,2.8782611389519239,0.24024722833602397,2.5088000000000003E-2,0.27220177925244504,2.5088000000000003E-2,0.20159999999999995,4.4586692339715538E-2,1.0560000000000001E-4,{"$f":"CHOOSE(Ext_VCC, (Qg_Q1+Qg_Q2)*Fsw*'Design Regulator'!$G$102, (Qg_Q1+Qg_Q2)*Fsw*Vout, (Qg_Q1+Qg_Q2)*Fsw*Vin)","v":0.13632},0.12758181818181816,0.12211999999999998,0.13642560000000001,1.4694539781382365,0.88786480684484104,9.2399999999999984,0.86278908512629038,5.7840814138859402,5.0809466887866757,null,86.278908512629044,0.5353371159845205,0.726351206844841,0.38560542759239602,0.33872977925244502,4.4586692339715538E-2,0.86277680684484104,16.910425414158887]
["VspTop",{"$f":"Vsp_Q1","v":1.9126760563380283},"V",null,null,null,36,48,1,2.88,2.88,0.21999999999999997,7.1043575687247409E-2,3.5985069459187127,4.6792534729593562,1.0807465270406436,0,3.0616179306567251,3.5619316542611315E-2,0.5,0.53714994966966179,1.0387994769534534,1.0791043533187686E-3,1.0791043533187686E-3,0.7865223530561043,6.1861741185691122E-4,6.1861741185691122E-4,0.81604366671137463,2.6637090639189804E-2,0.22118400000000002,1.1520000000000028E-2,0,0.26006847473023731,2.9508603978058709,0.25251973553283169,2.5804800000000003E-2,0.28590518932643,2.5804800000000003E-2,0.20735999999999999,4.6867521766593832E-2,1.0560000000000001E-4,{"$f":"CHOOSE(Ext_VCC, (Qg_Q1+Qg_Q2)*Fsw*'Design Regulator'!$G$102, (Qg_Q1+Qg_Q2)*Fsw*Vout, (Qg_Q1+Qg_Q2)*Fsw*Vin)","v":0.13632},0.12758181818181816,0.12211999999999998,0.13642560000000001,1.5012792572580986,0.91556406405666724,9.5039999999999996,0.86358553725313336,5.9538911209535597,5.31500983989645,null,86.358553725313342,0.53714994966966179,0.75333366405666724,0.39692607473023733,0.35433398932643001,4.6867521766593832E-2,0.88975926405666728,17.43928157551068]
["VsdTop",{"$f":"Vsd_Q1","v":0.8},"V",null,null,null,37,48,1,2.96,2.96,0.22611111111111107,7.1107309704590699E-2,3.6014520719393448,4.7607260359696726,1.1592739640303276,0,3.1372713333202493,3.7401391391717456E-2,0.5,0.53901418182211869,1.0396496616038582,1.080871418873017E-3,1.080871418873017E-3,0.80629130735402521,6.5010567231466314E-4,6.5010567231466314E-4,0.83658332725460505,2.7994866537615428E-2,0.22732799999999997,1.1520000000000028E-2,0,0.2676295531679736,3.0236732223295277,0.26513539290754623,2.6521600000000003E-2,0.30000900857582447,2.6521600000000003E-2,0.21311999999999998,4.921235709436507E-2,1.0560000000000001E-4,{"$f":"CHOOSE(Ext_VCC, (Qg_Q1+Qg_Q2)*Fsw*'Design Regulator'!$G$102, (Qg_Q1+Qg_Q2)*Fsw*Vout, (Qg_Q1+Qg_Q2)*Fsw*Vin)","v":0.13632},0.12758181818181816,0.12211999999999998,0.13642560000000001,1.5336632777514694,0.94370576174379806,9.7679999999999989,0.86429756045106665,6.1243312975196034,5.5550791286373666,null,86.429756045106672,0.53901418182211869,0.78075856174379799,0.40828875316797358,0.37033860857582446,4.921235709436507E-2,0.91718416174379802,17.976809570178442]
["θJATop",{"$f":"ThetaJA_Q1","v":15},"°C/W","Junction to Ambient Resistance",null,null,38,48,1,3.04,3.04,0.23222222222222222,7.1171044997098892E-2,3.6043967549850762,4.8421983774925383,1.237801622507462,0,3.2131354879534073,3.9232110722993208E-2,0.5,0.54092985632432822,1.0404997183784237,1.0826396639455791E-3,1.0826396639455791E-3,0.82613036037444076,6.8249137233240332E-4,6.8249137233240332E-4,0.85719713350168414,2.9391477027340164E-2,0.23347200000000004,1.1520000000000028E-2,0,0.27523287460199874,3.0966841521637423,0.27809412940960021,2.7238400000000003E-2,0.31451637082418932,2.7238400000000003E-2,0.21887999999999999,5.1621198319727911E-2,1.0560000000000001E-4,{"$f":"CHOOSE(Ext_VCC, (Qg_Q1+Qg_Q2)*Fsw*'Design Regulator'!$G$102, (Qg_Q1+Qg_Q2)*Fsw*Vout, (Qg_Q1+Qg_Q2)*Fsw*Vin)","v":0.13632},0.12758181818181816,0.12211999999999998,0.13642560000000001,1.5666094311065222,0.97229324542618811,10.032,0.86493127125179303,6.2954051190299811,5.8012015623628397,null,86.493127125179299,0.54092985632432822,0.80862924542618808,0.41969367460199875,0.38674677082418929,5.1621198319727911E-2,0.94505484542618812,18.523074970353289]
["Low-side FET","Input Value","Units","Description",null,null,39,48,1,3.12,3.12,0.23833333333333331,7.1234781564810265E-2,3.6073409950426116,4.9236704975213055,1.3163295024786943,0,3.2891958117260596,4.1111474533929757E-2,0.5,0.54289701828928538,1.0413496472733121,1.0844090878762516E-3,1.0844090878762516E-3,0.84603581550197149,7.15776601112086E-4,7.15776601112086E-4,0.87788125744103285,3.0827020086649962E-2,0.23961600000000002,1.1520000000000028E-2,0,0.28287865220548036,3.1698791121602734,0.29139587398559008,2.7955200000000003E-2,0.32943051678807356,2.7955200000000003E-2,0.22463999999999995,5.4094045439381261E-2,1.0560000000000001E-4,{"$f":"CHOOSE(Ext_VCC, (Qg_Q1+Qg_Q2)*Fsw*'Design Regulator'!$G$102, (Qg_Q1+Qg_Q2)*Fsw*Vout, (Qg_Q1+Qg_Q2)*Fsw*Vin)","v":0.13632},0.12758181818181816,0.12211999999999998,0.13642560000000001,1.6001212184112088,1.0013299689935538,10.295999999999999,0.86549218951007678,6.467115783082205,6.053425751821103,null,86.549218951007674,0.54289701828928538,0.83694916899355387,0.43114105220548032,0.40356171678807351,5.4094045439381261E-2,0.97337476899355391,19.078145472273658]
["RdsonBot",{"$f":"Rdson2*1000","v":29},"mW","Drain-Source Resistance of Low-side FET",null,null,40,48,1,3.2,3.2,0.24444444444444444,7.1298519407763106E-2,3.6102847920986578,5.0051423960493295,1.3948576039506713,0,3.3654390040535436,4.3039482822018651E-2,0.5,0.54491571406320838,1.0421994482846861,1.0861796900049042E-3,1.0861796900049042E-3,0.86600429982455529,7.4996344731461826E-4,7.4996344731461826E-4,0.89863220643577379,3.2301593697745087E-2,0.24576000000000003,1.1520000000000028E-2,0,0.29056710064256841,3.243245264786689,0.30504055557927712,2.8672000000000003E-2,0.34475479600297065,2.8672000000000003E-2,0.23039999999999999,5.6630898450024544E-2,1.0560000000000001E-4,{"$f":"CHOOSE(Ext_VCC, (Qg_Q1+Qg_Q2)*Fsw*'Design Regulator'!$G$102, (Qg_Q1+Qg_Q2)*Fsw*Vout, (Qg_Q1+Qg_Q2)*Fsw*Vin)","v":0.13632},0.12758181818181816,0.12211999999999998,0.13642560000000001,1.6342022522960913,1.0308194966455391,10.56,0.86598530855198985,6.6394665096385257,6.3118019400445595,null,86.598530855198987,0.54491571406320838,0.86572189664553911,0.44263110064256839,0.42078679600297064,5.6630898450024544E-2,1.002147496645539,19.642090934252568]
["RdsonBotTc",{"$f":"RdsonBotTc*1000000","v":7000},"ppm","Drain To Source Resitance Temp Co",null,null,41,48,1,3.28,3.28,0.25055555555555548,7.1362258525995662E-2,3.6132281461399174,5.0866140730699581,1.4733859269300411,0,3.4418529122656407,4.5016135584751593E-2,0.5,0.54698599122827896,1.043049121408707,1.0879514696714755E-3,1.0879514696714755E-3,0.88603273024183593,7.8505399905980198E-4,7.8505399905980198E-4,0.91944678811147329,3.381529584674018E-2,0.25190400000000002,1.1520000000000028E-2,0,0.29829843608274981,3.3167708804653611,0.31902810313158603,2.93888E-2,0.36049266882607056,2.93888E-2,0.23615999999999995,5.923175734835736E-2,1.0560000000000001E-4,{"$f":"CHOOSE(Ext_VCC, (Qg_Q1+Qg_Q2)*Fsw*'Design Regulator'!$G$102, (Qg_Q1+Qg_Q2)*Fsw*Vout, (Qg_Q1+Qg_Q2)*Fsw*Vin)","v":0.13632},0.12758181818181816,0.12211999999999998,0.13642560000000001,1.6688562589541878,1.0607655049088203,10.823999999999998,0.86641515564080518,6.8124605412412471,6.5763820323910576,null,86.641515564080521,0.54698599122827896,0.89495110490882035,0.4541640360827498,0.43842546882607053,5.923175734835736E-2,1.0313767049088203,20.214983416212878]
["QgBot",{"$f":"Qg_Q2*1000000000","v":4.0999999999999996},"nC","Gate Charge Of Top FET",null,null,42,48,1,3.36,3.36,0.25666666666666665,7.1425998919546207E-2,3.6161710571530952,5.1680855285765475,1.5519144714234523,0,3.5184264133581049,4.704143281962072E-2,0.5,0.5491078986054585,1.0438986666415366,1.0897244262159779E-3,1.0897244262159779E-3,0.90611828362873037,8.2105034392627627E-4,8.2105034392627627E-4,0.94032207944491786,3.5368224523664574E-2,0.258048,1.1520000000000028E-2,0,0.30607287621535639,3.3904452234366453,0.33335844558060657,3.0105600000000003E-2,0.37664770851813228,3.0105600000000003E-2,0.24191999999999997,6.1896622131079895E-2,1.0560000000000001E-4,{"$f":"CHOOSE(Ext_VCC, (Qg_Q1+Qg_Q2)*Fsw*'Design Regulator'!$G$102, (Qg_Q1+Qg_Q2)*Fsw*Vout, (Qg_Q1+Qg_Q2)*Fsw*Vin)","v":0.13632},0.12758181818181816,0.12211999999999998,0.13642560000000001,1.7040870802401693,1.0911717847334885,11.087999999999999,0.86678584428396688,6.9861011432303464,6.8472196277719846,null,86.67858442839669,0.5491078986054585,0.92464058473348865,0.4657400762153564,0.45648130851813229,6.1896622131079895E-2,1.0610661847334886,20.796897220776376]
["RGateBot",{"$f":"Rgate2","v":3},"W","Gate Resistance",null,null,43,48,1,3.44,3.44,0.26277777777777772,7.1489740588453032E-2,3.6191135251248947,5.2495567625624471,1.6304432374375526,0,3.5951493096919487,4.9115374524118287E-2,0.5,0.55128148625737783,1.0447480839793368,1.0914985589784954E-3,1.0914985589784954E-3,0.92625837051627102,8.5795456895145763E-4,8.5795456895145763E-4,0.96125539949670014,3.6960477722462422E-2,0.26419200000000004,1.1520000000000028E-2,0,0.31389064026422392,3.4642584510854459,0.34803151186159104,3.0822400000000003E-2,0.39322360340689427,3.0822400000000003E-2,0.24767999999999996,6.4625492794892478E-2,1.0560000000000001E-4,{"$f":"CHOOSE(Ext_VCC, (Qg_Q1+Qg_Q2)*Fsw*'Design Regulator'!$G$102, (Qg_Q1+Qg_Q2)*Fsw*Vout, (Qg_Q1+Qg_Q2)*Fsw*Vin)","v":0.13632},0.12758181818181816,0.12211999999999998,0.13642560000000001,1.7398986758513182,1.1220422436711182,11.351999999999999,0.86710111963663061,7.1603916039633582,7.1243700511034138,null,86.710111963663067,0.55128148625737783,0.95479424367111809,0.47735944026422389,0.47495800340689426,6.4625492794892478E-2,1.091219843671118,21.387908935953913]
["VsdBot",{"$f":"Vsd_Q2","v":0.8},"V","Diode Forward Voltage of Bottom FET Body Diode",null,null,44,48,1,3.52,3.52,0.26888888888888884,7.1553483532754411E-2,3.6220555500420186,5.3310277750210098,1.7089722249789907,0,3.6720122368122876,5.1237960695736884E-2,0.5,0.55350680549130382,1.0455973734182689,1.0932738672991829E-3,1.0932738672991829E-3,0.94645061182899692,8.9576876063148262E-4,8.9576876063148262E-4,0.98224428531034114,3.859215344099292E-2,0.27033600000000002,1.1520000000000028E-2,0,0.32175194900250653,3.5382015249663716,0.3630472309069564,3.1539200000000003E-2,0.41022415913457527,3.1539200000000003E-2,0.25344,6.7418369336495906E-2,1.0560000000000001E-4,{"$f":"CHOOSE(Ext_VCC, (Qg_Q1+Qg_Q2)*Fsw*'Design Regulator'!$G$102, (Qg_Q1+Qg_Q2)*Fsw*Vout, (Qg_Q1+Qg_Q2)*Fsw*Vin)","v":0.13632},0.12758181818181816,0.12211999999999998,0.13642560000000001,1.7762951255928121,1.1533809081370818,11.616,0.86736439804120702,7.335335235037598,7.4078903870186297,null,86.736439804120707,0.55350680549130382,0.9854161081370818,0.48902234900250652,0.49385935913457529,6.7418369336495906E-2,1.1218417081370817,21.988097479486804]
["QrrBot",{"$f":"Qrr_Q2*1000000000","v":29.999999999999996},"nC","Reverse Recovery Charge of Body Diode",null,null,45,48,1,3.6,3.6,0.27499999999999997,7.1617227752488619E-2,3.6249971318911691,5.4124985659455849,1.7875014340544155,0,3.7490065818184779,5.3409191331969419E-2,0.5,0.55578390886218143,1.046446534954494,1.0950503505182672E-3,1.0950503505182672E-3,0.96669281828363163,9.3449500492115043E-4,9.3449500492115043E-4,1.0032864705684821,4.0263349681030472E-2,0.27648,1.1520000000000028E-2,0,0.32965702476764841,3.6122661320136018,0.37840553164628271,3.2256000000000007E-2,0.42765330099211463,3.2256000000000007E-2,0.25919999999999999,7.0275251752591347E-2,1.0560000000000001E-4,{"$f":"CHOOSE(Ext_VCC, (Qg_Q1+Qg_Q2)*Fsw*'Design Regulator'!$G$102, (Qg_Q1+Qg_Q2)*Fsw*Vout, (Qg_Q1+Qg_Q2)*Fsw*Vin)","v":0.13632},0.12758181818181816,0.12211999999999998,0.13642560000000001,1.8132806317299752,1.1851919257597632,11.879999999999999,0.867578801567226,7.5109353715147256,7.6978395148817205,null,86.757880156722607,0.55578390886218143,1.016510325759763,0.50072902476764836,0.51318930099211468,7.0275251752591347E-2,1.1529359257597629,22.597544144891355]
["TrrBot",{"$f":"Trr_Q2*1000000000","v":40},"ns","Reverse Recovery Time of Body Diode",null,null,46,48,1,3.68,3.68,0.28111111111111109,7.1680973247693944E-2,3.6279382706590488,5.4939691353295244,1.8660308646704757,0,3.8261244109380508,5.5629066430308974E-2,0.5,0.55811285017575185,1.0472955685841736,1.0968280079760476E-3,1.0968280079760476E-3,0.98698297210937902,9.7413538723386335E-4,9.7413538723386335E-4,1.0243798666542714,4.197416444826492E-2,0.28262400000000004,1.1520000000000028E-2,0,0.33760609147651394,3.6864446146347327,0.39410634300631325,3.2972800000000003E-2,0.44551507634294124,3.2972800000000003E-2,0.26495999999999997,7.3196140039880231E-2,1.0560000000000001E-4,{"$f":"CHOOSE(Ext_VCC, (Qg_Q1+Qg_Q2)*Fsw*'Design Regulator'!$G$102, (Qg_Q1+Qg_Q2)*Fsw*Vout, (Qg_Q1+Qg_Q2)*Fsw*Vin)","v":0.13632},0.12758181818181816,0.12211999999999998,0.13642560000000001,1.8508595214302972,1.217479567819455,12.144,0.86774718827323127,7.6871953721477091,7.9942781451441194,null,86.774718827323127,0.55811285017575185,1.048081167819455,0.51247969147651395,0.53295187634294128,7.3196140039880231E-2,1.184506767819455,23.216332649261318]
["θJABot",{"$f":"ThetaJA_Q2","v":15},"°C/W","Junction to Ambient Resistance",null,null,47,48,1,3.76,3.76,0.28722222222222221,7.1744720018408648E-2,3.6308789663323582,5.5754394831661784,1.9445605168338207,0,3.9033584051445871,5.7897585988248998E-2,0.5,0.56049368449174752,1.0481444743034687,1.0986068390128948E-3,1.0986068390128948E-3,1.0073192107974356,1.0146919924415685E-3,1.0146919924415685E-3,1.0455225458150308,4.3724695752301729E-2,0.28876800000000002,1.1520000000000028E-2,0,0.34559937464067841,3.7607299085689938,0.41014959391095529,3.36896E-2,0.46381365713918438,3.36896E-2,0.27071999999999996,7.6181034195064473E-2,1.0560000000000001E-4,{"$f":"CHOOSE(Ext_VCC, (Qg_Q1+Qg_Q2)*Fsw*'Design Regulator'!$G$102, (Qg_Q1+Qg_Q2)*Fsw*Vout, (Qg_Q1+Qg_Q2)*Fsw*Vin)","v":0.13632},0.12758181818181816,0.12211999999999998,0.13642560000000001,1.889036249298129,1.2502482317798627,12.407999999999999,0.86787217879573708,7.864118619610176,8.2972688570877651,null,86.787217879573703,0.56049368449174752,1.0801330317798628,0.52427457464067839,0.55315125713918434,7.6181034195064473E-2,1.2165586317798627,23.844549182885309]
["Bottom Schottky","Input Value","Units","Std Units",null,null,48,48,1,3.84,3.84,0.29333333333333328,7.1808468064671047E-2,3.6338192188977985,5.6569096094488991,2.0230903905511006,0,3.9807018028193535,6.0214750003283156E-2,0.5,0.56292646812716385,1.0489932521085399,1.1003868429692507E-3,1.1003868429692507E-3,1.0276998126275496,1.0561669048747007E-3,1.0561669048747007E-3,1.0667127261669633,4.5515041606662192E-2,0.29491200000000001,1.1520000000000028E-2,0,0.35363710138188309,3.8351154875443707,0.42653521328127825,3.4406400000000004E-2,0.48255334253337007,3.4406400000000004E-2,0.27647999999999995,7.9229934214846254E-2,1.0560000000000001E-4,{"$f":"CHOOSE(Ext_VCC, (Qg_Q1+Qg_Q2)*Fsw*'Design Regulator'!$G$102, (Qg_Q1+Qg_Q2)*Fsw*Vout, (Qg_Q1+Qg_Q2)*Fsw*Vin)","v":0.13632},0.12758181818181816,0.12211999999999998,0.13642560000000001,1.9278154000051071,1.2835024439152529,12.671999999999999,0.86795617977440775,8.0417085207282462,8.6068761380005512,null,86.79561797744077,0.56292646812716385,1.112670443915253,0.53611390138188308,0.57379174253337006,7.9229934214846254E-2,1.249096043915253,24.482282460738961]
["VfdSky",{"$f":"VfdSky_Q2","v":0},"V","Diode Forward Voltage",null,null,49,48,1,3.92,3.92,0.2994444444444444,7.1872217386519388E-2,3.6367590283420697,5.7383795141710348,2.1016204858289651,0,4.0581483485926961,6.258055847290539E-2,0.5,0.56541125865960828,1.0498419019955478,1.1021680191856296E-3,1.1021680191856296E-3,1.0481231837537619,1.0985622083221221E-3,1.0985622083221221E-3,1.0879487583152023,4.7345300028783621E-2,0.30105600000000005,1.1520000000000028E-2,0,0.36171950044765411,3.9095953138996413,0.44326313003551504,3.51232E-2,0.5017385615887987,3.51232E-2,0.28223999999999994,8.2342840095928141E-2,1.0560000000000001E-4,{"$f":"CHOOSE(Ext_VCC, (Qg_Q1+Qg_Q2)*Fsw*'Design Regulator'!$G$102, (Qg_Q1+Qg_Q2)*Fsw*Vout, (Qg_Q1+Qg_Q2)*Fsw*Vin)","v":0.13632},0.12758181818181816,0.12211999999999998,0.13642560000000001,1.9672016910194969,1.3172468620364528,12.936,0.86800140454350083,8.2199685067148103,8.9231664238319794,null,86.800140454350085,0.56541125865960828,1.1456980620364527,0.54799790044765406,0.59487776158879868,8.2342840095928141E-2,1.2821236620364527,25.129623775914474]
["QrrSky",{"$f":"QrrSky_Q2*1000000000","v":0},"nC","Diode Reverse Recovery Charge",null,null,50,48,1,4,4,0.30555555555555552,7.1935967983992002E-2,3.6396983946518722,5.8198491973259365,2.1801508026740639,0,4.1356922476173947,6.4995011394609947E-2,0.5,0.5679481149307275,1.0506904239606536,1.103950367002618E-3,1.103950367002618E-3,1.0685878466607548,1.1418799860310688E-3,1.1418799860310688E-3,1.1092291133938419,4.9215569040019544E-2,0.30720000000000003,1.1520000000000028E-2,0,0.36984680222708954,3.9841637944494863,0.46033327308906175,3.5840000000000004E-2,0.52137387609193764,3.5840000000000004E-2,0.28799999999999998,8.5519751835013091E-2,1.0560000000000001E-4,{"$f":"CHOOSE(Ext_VCC, (Qg_Q1+Qg_Q2)*Fsw*'Design Regulator'!$G$102, (Qg_Q1+Qg_Q2)*Fsw*Vout, (Qg_Q1+Qg_Q2)*Fsw*Vin)","v":0.13632},0.12758181818181816,0.12211999999999998,0.13642560000000001,2.0071999754378016,1.3514862783190271,13.2,0.86800989145406326,8.398902033406344,9.2462081413790642,null,86.800989145406334,0.5679481149307275,1.1792206783190271,0.55992680222708957,0.61641387609193765,8.5519751835013091E-2,1.315646278319027,25.786667055052931]
["Ireverse",{"$f":"Ireverse","v":0},"mA","Reverse Leakage Current",null,null,51,48,1,4.08,4.08,0.31166666666666659,7.1999719857127123E-2,3.6426373178139024,5.9013186589069511,2.2586813410930491,0,4.2133281246255763,6.7458108765891325E-2,0.5,0.57053709704971178,1.0515388180000165,1.1057338857608718E-3,1.1057338857608718E-3,1.0890924298272777,1.1861223207070839E-3,1.1861223207070839E-3,1.1305523723565383,5.1125946665639868E-2,0.31334400000000001,1.1520000000000028E-2,0,0.37801923876681659,4.0588157409668009,0.47774557135447659,3.6556800000000007E-2,0.5414639834703211,3.6556800000000007E-2,0.29375999999999997,8.8760669428804381E-2,1.0560000000000001E-4,{"$f":"CHOOSE(Ext_VCC, (Qg_Q1+Qg_Q2)*Fsw*'Design Regulator'!$G$102, (Qg_Q1+Qg_Q2)*Fsw*Vout, (Qg_Q1+Qg_Q2)*Fsw*Vin)","v":0.13632},0.12758181818181816,0.12211999999999998,0.13642560000000001,2.0478152449221216,1.3862256222371376,13.463999999999999,0.86798352013685276,8.5785125815022472,9.5760717520548155,null,86.798352013685275,0.57053709704971178,1.2132432222371377,0.57190083876681652,0.63840478347032104,8.8760669428804381E-2,1.3496688222371376,26.453508915847898]
["Controller","Input Value","Units","Std Units",null,null,52,48,1,4.16,4.16,0.31777777777777777,7.2063473005963094E-2,3.6455757978148635,5.9827878989074321,2.3372121010925682,0,4.2910509872059457,6.9969850584244264E-2,0.5,0.5731782663968783,1.0523870841097982,1.1075185748011234E-3,1.1075185748011234E-3,1.1096356584545981,1.2312912945139697E-3,1.2312912945139697E-3,1.1519172163705071,5.3076530934831112E-2,0.31948799999999999,1.1520000000000028E-2,0,0.38623704378711932,4.1335463347385311,0.49549995374147998,3.7273600000000004E-2,0.56201371981961301,3.7273600000000004E-2,0.29952000000000001,9.2065592874005606E-2,1.0560000000000001E-4,{"$f":"CHOOSE(Ext_VCC, (Qg_Q1+Qg_Q2)*Fsw*'Design Regulator'!$G$102, (Qg_Q1+Qg_Q2)*Fsw*Vout, (Qg_Q1+Qg_Q2)*Fsw*Vin)","v":0.13632},0.12758181818181816,0.12211999999999998,0.13642560000000001,2.0890526327469314,1.4214699636067323,13.728,0.86792402597043594,8.7588036568067906,9.9128297972941954,null,86.792402597043591,0.5731782663968783,1.2477707636067323,0.58392024378711938,0.66085531981961299,9.2065592874005606E-2,1.3841963636067323,27.130248726691953]
["θJA",30,"°C/W","Junction to Ambient Resistance",null,null,53,48,1,4.24,4.24,0.32388888888888884,7.2127227430538191E-2,3.648513834641451,6.0642569173207255,2.415743082679275,0,4.3688561928111316,7.2530236847163865E-2,0.5,0.57587168562733393,1.0532352222861578,1.1093044334641725E-3,1.1093044334641725E-3,1.1302163461363135,1.2773889890737192E-3,1.2773889890737192E-3,1.1733224181858191,5.5067419880696723E-2,0.32563200000000003,1.1520000000000028E-2,0,0.39450045269824202,4.2083510947218699,0.51359634915695607,3.7990400000000007E-2,0.58302806304365995,3.7990400000000007E-2,0.30528,9.5434522167320873E-2,1.0560000000000001E-4,{"$f":"CHOOSE(Ext_VCC, (Qg_Q1+Qg_Q2)*Fsw*'Design Regulator'!$G$102, (Qg_Q1+Qg_Q2)*Fsw*Vout, (Qg_Q1+Qg_Q2)*Fsw*Vin)","v":0.13632},0.12758181818181816,0.12211999999999998,0.13642560000000001,2.1309174169590945,1.4572245157419019,13.991999999999999,0.86783301298078586,8.9397787904736319,10.2565569456549,null,86.783301298078584,0.57587168562733393,1.282808515741902,0.5959852526982421,0.68377046304365996,9.5434522167320873E-2,1.4192341157419019,27.816988668541281]
["Theta Ja",19.600000000000001,"°C/W","Junction to Ambient Resistance",null,null,54,48,1,4.32,4.32,0.32999999999999996,7.2190983130890674E-2,3.6514514282803621,6.1457257141401813,2.4942742858598193,0,4.4467394190677387,7.5139267552145395E-2,0.5,0.57861741867471583,1.0540832325252554,1.1110914610908916E-3,1.1110914610908916E-3,1.1508333873617267,1.3244174854664661E-3,1.3244174854664661E-3,1.1947668343682891,5.7098711540256919E-2,0.33177600000000002,1.1520000000000028E-2,0,0.40280970261686738,4.2832258488882502,0.53203468650494967,3.8707200000000004E-2,0.60451213611152577,3.8707200000000004E-2,0.31103999999999998,9.8867457305454459E-2,1.0560000000000001E-4,{"$f":"CHOOSE(Ext_VCC, (Qg_Q1+Qg_Q2)*Fsw*'Design Regulator'!$G$102, (Qg_Q1+Qg_Q2)*Fsw*Vout, (Qg_Q1+Qg_Q2)*Fsw*Vin)","v":0.13632},0.12758181818181816,0.12211999999999998,0.13642560000000001,2.1734150236551208,1.4934946387283929,14.256,0.86771196536664075,9.121441539253011,10.607330041672887,null,86.771196536664078,0.57861741867471583,1.3183618387283931,0.60809610261686742,0.70715533611152581,9.8867457305454459E-2,1.454787438728393,28.513833799076505]
[null,null,null,null,null,null,55,48,1,4.4000000000000004,4.4000000000000004,0.33611111111111108,7.2254740107058874E-2,3.654388578718295,6.2271942893591481,2.5728057106408526,0,4.5246966370158157,7.7796942696684482E-2,0.5,0.58141553075501329,1.0549311148232507,1.1128796570222266E-3,1.1128796570222266E-3,1.1714857507585923,1.3723788642304227E-3,1.3723788642304227E-3,1.2162493982984057,5.9170503954449359E-2,0.33792,1.1520000000000028E-2,0,0.41116503238277569,4.358166708394827,0.550814894686669,3.9424000000000008E-2,0.6264712104357083,3.9424000000000008E-2,0.31679999999999997,0.10236439828511117,1.0560000000000001E-4,{"$f":"CHOOSE(Ext_VCC, (Qg_Q1+Qg_Q2)*Fsw*'Design Regulator'!$G$102, (Qg_Q1+Qg_Q2)*Fsw*Vout, (Qg_Q1+Qg_Q2)*Fsw*Vin)","v":0.13632},0.12758181818181816,0.12211999999999998,0.13642560000000001,2.2165510303798612,1.5302858428184838,14.52,0.86756225781784901,9.3037954857416363,10.965228156535623,null,86.756225781784906,0.58141553075501329,1.354436242818484,0.62025303238277574,0.73101521043570827,0.10236439828511117,1.4908618428184839,29.220892119242286]
[null,null,null,null,null,null,56,48,1,4.4800000000000004,4.4800000000000004,0.34222222222222221,7.2318498359081079E-2,3.6573252859419454,6.3086626429709733,2.6513373570290275,0,4.6027240869510306,8.0503262278276949E-2,0.5,0.58426608837046823,1.0557788691763037,1.1146690205991946E-3,1.1146690205991946E-3,1.192172472992822,1.4212752053618209E-3,1.4212752053618209E-3,1.2377691138508922,6.1282895168128917E-2,0.34406400000000009,1.1520000000000028E-2,0,0.41956668257568319,4.4331700442680937,0.56993690260048324,4.0140800000000011E-2,0.64891070937591211,4.0140800000000011E-2,0.32256000000000001,0.10592534510299599,1.0560000000000001E-4,{"$f":"CHOOSE(Ext_VCC, (Qg_Q1+Qg_Q2)*Fsw*'Design Regulator'!$G$102, (Qg_Q1+Qg_Q2)*Fsw*Vout, (Qg_Q1+Qg_Q2)*Fsw*Vin)","v":0.13632},0.12758181818181816,0.12211999999999998,0.13642560000000001,2.2603311696510207,1.5676037919515953,14.784000000000001,0.86738516477104455,9.4868442386352481,11.330332640638682,null,86.738516477104454,0.58426608837046823,1.3910373919515953,0.6324562825756832,0.75535550937591212,0.10592534510299599,1.5274629919515952,29.938274642251269]
["Outputs",null,null,null,null,null,57,48,1,4.5599999999999996,4.5599999999999996,0.34833333333333327,7.2382257886995593E-2,3.6602615499380109,6.3901307749690055,2.7298692250309942,0,4.6808182565832315,8.3258226294418952E-2,0.5,0.58716915931355751,1.0566264955805738,1.1164595511628844E-3,1.1164595511628844E-3,1.2128926532528981,1.471108588314855E-3,1.471108588314855E-3,1.2593250496800668,6.3435983230068105E-2,0.35020800000000002,1.1520000000000028E-2,0,0.42801489553226457,4.5082324663232685,0.58940063914192431,4.0857600000000001E-2,0.67183621187296927,4.0857600000000001E-2,0.32831999999999995,0.1095502977558144,1.0560000000000001E-4,{"$f":"CHOOSE(Ext_VCC, (Qg_Q1+Qg_Q2)*Fsw*'Design Regulator'!$G$102, (Qg_Q1+Qg_Q2)*Fsw*Vout, (Qg_Q1+Qg_Q2)*Fsw*Vin)","v":0.13632},0.12758181818181816,0.12211999999999998,0.13642560000000001,2.3047613326140834,1.6054543074052336,15.047999999999998,0.86718186872758152,9.6705914329839686,11.702727178094539,null,86.718186872758153,0.58716915931355751,1.4281711074052337,0.64470609553226454,0.78018181187296931,0.1095502977558144,1.5645967074052336,30.666095465142583]
["Design","Value","Units",null,null,null,58,48,1,4.6399999999999997,4.6399999999999997,0.35444444444444434,7.2446018690840677E-2,3.6631973706931835,6.4715986853465912,2.8084013146534081,0,4.7589758612599047,8.606183474260691E-2,0.5,0.59012481267105554,1.0574739940322195,1.1182512480544546E-3,1.1182512480544546E-3,1.2336454482555446,1.5218810920016234E-3,1.5218810920016234E-3,1.2809163340452536,6.562986619295727E-2,0.35635199999999995,1.1520000000000028E-2,0,0.43650991536336292,4.5833508040766988,0.60920603320368516,4.1574400000000004E-2,0.69525345621770707,4.1574400000000004E-2,0.33407999999999993,0.11323925624027226,1.0560000000000001E-4,{"$f":"CHOOSE(Ext_VCC, (Qg_Q1+Qg_Q2)*Fsw*'Design Regulator'!$G$102, (Qg_Q1+Qg_Q2)*Fsw*Vout, (Qg_Q1+Qg_Q2)*Fsw*Vin)","v":0.13632},0.12758181818181816,0.12211999999999998,0.13642560000000001,2.3498475728324535,1.6438433715810699,15.311999999999998,0.866953467742129,9.8550407304504422,12.082497843265605,null,86.695346774212894,0.59012481267105554,1.4658433715810699,0.65700271536336285,0.80549985621770703,0.11323925624027226,1.6022689715810698,31.404471842988972]
["Dmax",{"$f":"D1_Vinmin","v":7.857142857142857E-2},"index",null,null,null,59,48,1,4.72,4.72,0.36055555555555552,7.2509780770654689E-2,3.6661327481941623,6.5530663740970807,2.8869336259029188,0,4.8371938260333476,8.8914087620337506E-2,0.5,0.59313311882817843,1.0583213645274012,1.1200441106151405E-3,1.1200441106151405E-3,1.2544300677168383,1.5735947947920716E-3,1.5735947947920716E-3,1.3025421501184213,6.7864642113404802E-2,0.36249600000000004,1.1520000000000028E-2,0,0.44505198797138634,4.6585220894378097,0.62935301367562047,4.2291200000000001E-2,0.71916834395979679,4.2291200000000001E-2,0.33983999999999992,0.11699222055307568,1.0560000000000001E-4,{"$f":"CHOOSE(Ext_VCC, (Qg_Q1+Qg_Q2)*Fsw*'Design Regulator'!$G$102, (Qg_Q1+Qg_Q2)*Fsw*Vout, (Qg_Q1+Qg_Q2)*Fsw*Vin)","v":0.13632},0.12758181818181816,0.12211999999999998,0.13642560000000001,2.395596110217844,1.6827771319311831,15.575999999999999,0.86670098217621228,10.040195819570796,12.469733159396952,null,86.670098217621231,0.59313311882817843,1.5040603319311832,0.66934638797138635,0.83131554395979679,0.11699222055307568,1.6404859319311831,32.153524265851189]
["Dprime",{"$f":"1-B68","v":0.92142857142857149},"index",null,null,null,60,48,1,4.8,4.8,0.36666666666666659,7.2573544126475875E-2,3.669067682427638,6.6345338412138188,2.9654661587861808,0,4.9154692693766524,9.1814984925107715E-2,0.5,0.59619414947281046,1.0591686070622766,1.1218381381862433E-3,1.1218381381862433E-3,1.2752457702395767,1.6262517745139313E-3,1.6262517745139313E-3,1.3242017317230885,7.0140409051937067E-2,0.36863999999999997,1.1520000000000028E-2,0,0.45364136106789593,4.7337435409924584,0.64984150944474683,4.3008000000000005E-2,0.74358694396184166,4.3008000000000005E-2,0.34560000000000002,0.12080919069093121,1.0560000000000001E-4,{"$f":"CHOOSE(Ext_VCC, (Qg_Q1+Qg_Q2)*Fsw*'Design Regulator'!$G$102, (Qg_Q1+Qg_Q2)*Fsw*Vout, (Qg_Q1+Qg_Q2)*Fsw*Vin)","v":0.13632},0.12758181818181816,0.12211999999999998,0.13642560000000001,2.4420133351061795,1.7222619050297374,15.839999999999998,0.86642536079891785,10.22606041601844,12.864524159427626,null,86.642536079891784,0.59619414947281046,1.5428283050297376,0.68173736106789595,0.8576349439618417,0.12080919069093121,1.6792539050297375,32.91337653858286]
["Ipp",{"$f":"Iripple_Vinnom","v":3.5637177352206493},"A",null,null,null,61,48,1,4.88,4.88,0.37277777777777771,7.2637308758342595E-2,3.6720021733803079,6.7160010866901541,3.0439989133098457,0,4.9937994883764745,9.4764526654414732E-2,0.5,0.59930797759981158,1.0600157216330059,1.1236333301091425E-3,1.1236333301091425E-3,1.2960918595734883,1.6798541084526628E-3,1.6798541084526628E-3,1.345894359459529,7.245726507299903E-2,0.37478400000000001,1.1520000000000028E-2,0,0.4622782841913895,4.8090125497116514,0.67067144939524059,4.3724800000000001E-2,0.76851549660421725,4.3724800000000001E-2,0.35135999999999995,0.12469016665054569,1.0560000000000001E-4,{"$f":"CHOOSE(Ext_VCC, (Qg_Q1+Qg_Q2)*Fsw*'Design Regulator'!$G$102, (Qg_Q1+Qg_Q2)*Fsw*Vout, (Qg_Q1+Qg_Q2)*Fsw*Vin)","v":0.13632},0.12758181818181816,0.12211999999999998,0.13642560000000001,2.4891058124845253,1.7623041807956064,16.103999999999999,0.86612748630660785,10.412638262870841,13.266964449063257,null,86.612748630660789,0.59930797759981158,1.5821537807956065,0.69417588419138943,0.88446429660421721,0.12469016665054569,1.7185793807956065,33.684155863593887]
["Top FET","Value","Units",null,null,null,62,48,1,4.96,4.96,0.37888888888888883,7.2701074666293108E-2,3.674936221038863,6.7974681105194312,3.1225318894805687,0,5.0721819452505139,9.7762712805756088E-2,0.5,0.60247467751541051,1.0608627082357469,1.1254296857252835E-3,1.1254296857252835E-3,1.3169676812099074,1.7344038733514003E-3,1.7344038733514003E-3,1.3676193571764965,7.4815308244954151E-2,0.38092800000000004,1.1520000000000028E-2,0,0.47096300872527824,4.8843266659388611,0.69184276240844156,4.4441600000000005E-2,0.79396041814644858,4.4441600000000005E-2,0.35711999999999994,0.12863514842862644,1.0560000000000001E-4,{"$f":"CHOOSE(Ext_VCC, (Qg_Q1+Qg_Q2)*Fsw*'Design Regulator'!$G$102, (Qg_Q1+Qg_Q2)*Fsw*Vout, (Qg_Q1+Qg_Q2)*Fsw*Vin)","v":0.13632},0.12758181818181816,0.12211999999999998,0.13642560000000001,2.5368802863748403,1.8029106268717268,16.367999999999999,0.86580818032456797,10.599933130879172,13.677150272196728,null,86.58081803245679,0.60247467751541051,1.6220434268717268,0.70666220872527818,0.91181001814644858,0.12863514842862644,1.7584690268717267,34.465992926685843]
["Tr",{"$f":"(Qgd_Q1+Qgs_Q1/2)*(RdsonDRT+Rgate1)/(VCC-Vsp_Q1)*1000000000","v":2.2106523722627736},"ns","Turn on of MOSFET -> Rise time of current",null,null,63,48,1,5.04,5.04,0.38499999999999995,7.2764841850365719E-2,3.6778698253899953,6.8789349126949979,3.2010650873050022,0,5.1506142550550402,0.10080954337662952,0.5,0.60569432484167796,1.0617095668666579,1.1272272043761863E-3,1.1272272043761863E-3,1.3378726192769186,1.7899031454108828E-3,1.7899031454108828E-3,1.3893760887542699,7.7214636640084516E-2,0.38707200000000003,1.1520000000000028E-2,0,0.47969578791606499,4.9596835875259293,0.71335537736284815,4.5158400000000008E-2,0.81992830525115457,4.5158400000000008E-2,0.36287999999999998,0.13264413602188094,1.0560000000000001E-4,{"$f":"CHOOSE(Ext_VCC, (Qg_Q1+Qg_Q2)*Fsw*'Design Regulator'!$G$102, (Qg_Q1+Qg_Q2)*Fsw*Vout, (Qg_Q1+Qg_Q2)*Fsw*Vin)","v":0.13632},0.12758181818181816,0.12211999999999998,0.13642560000000001,2.5853436843805655,1.8440880931672194,16.631999999999998,0.86546820794583201,10.787948818740976,14.095180578767319,null,86.546820794583198,0.60569432484167796,1.6625040931672195,0.719196587916065,0.9396787052511546,0.13264413602188094,1.7989296931672194,35.259021986077499]
["Tf",{"$f":"(Qgd_Q1+Qgs_Q1/2)*(RdsonDRT2+Rgate1)/(Vsp_Q1)*1000000000","v":2.4703608247422673},"ns","Turn off of MOSFET -> Fall time of current",null,null,64,{"$f":"Vin","v":48},{"$f":"MODE","v":1},5.12,{"$f":"Iout*G73/100/Number_of_Phases","v":5.12},{"$f":"Vout*K73/(Vin*Efficiency)","v":0.39111111111111108},{"$f":"(Vout+(Rdson2+Rs+Rdcr)*K73)/(Vin+(Rs+Rdson2-Rdson1)*K73)","v":7.2828610310598785E-2},{"$f":"(Vin-(Rdson1+Rdcr)*K73-Vout)*M73/(Fsw*Lf)","v":3.6808029864204004},6.9604014932102007,3.2795985067897999,{"$f":"IF(MIN(Vin, -P73/(Coss_Q1+Coss_Q2)*0.00000002)<0, 0, MIN(Vin, -P73/(Coss_Q1+Coss_Q2)*0.00000002))","v":0},5.2290941744630537,{"$f":"R73^2*Rdcr","v":0.10390501836453309},{"$f":"Core_Loss_Ch1","v":0.5},{"$f":"(T73+S73*(1+Ltc*(Ta-25)))/(1-S73*Ltc*ThetaCa)","v":0.60896699652108666},1.0625562975218983,1.1290258854034447E-3,1.1290258854034447E-3,1.3588060937048425,1.8463540002894132E-3,1.8463540002894132E-3,1.411163955167785,{"$f":"Rdson1*AB73^2","v":7.9655348334591466E-2},{"$f":"(Vin*K73/2)*Fsw*(Tr_buck+Tf_buck)","v":0.39321600000000001},{"$f":"(0.5*Coss_Q1*(Vin-Q73)^2-0.5*Coss_Q2*(Vin-Q73)^2+(Qoss_Q2*(Vin-Q73)/Vin)*Vin)*Fsw","v":1.1520000000000028E-2},{"$f":"IF(K73>N73/2,0,ABS(K73-N73/2)*Vsd_Q1*Deadtime*Fsw)","v":0},{"$f":"(AF73+AE73+AD73+AC73*(1+RdsonTopTc*Ta-RdsonTopTc*25))/(1-AC73*RdsonTopTc*ThetaJA_Q1)","v":0.48847687689172287},{"$f":"SQRT((1-M73))*SQRT(K73^2+(N73^2)/12)","v":5.0350811490023331},{"$f":"Rdson2*AH73^2","v":0.73520922313412107},{"$f":"IF(K73<N73/2,Deadtime*Fsw*IF(VfdSky_Q2>0,0,Vsd_Q2)*(K73+N73/2),2*Deadtime*Fsw*IF(VfdSky_Q2>0,0,Vsd_Q2)*K73)","v":4.5875200000000005E-2},{"$f":"(AJ73+AI73*(1+RdsonBotTc*Ta-RdsonBotTc*25))/(1-AI73*RdsonBotTc*ThetaJA_Q2)","v":0.84642593967691671},{"$f":"2*Deadtime*Fsw*IF(VfdSky_Q2>0,VfdSky_Q2,Vsd_Q2)*K73","v":4.5875200000000005E-2},{"$f":"IF(QrrSky_Q2>0,QrrSky_Q2,Qrr_Q2*K73/(Iout/Number_of_Phases))*Fsw*Vin","v":0.36864000000000002},{"$f":"Rs*R73^2","v":0.13671712942701722},{"$f":"Iq*Vin","v":1.0560000000000001E-4},{"$f":"CHOOSE(Ext_VCC, (Qg_Q1+Qg_Q2)*Fsw*'Design Regulator'!$G$102, (Qg_Q1+Qg_Q2)*Fsw*Vout, (Qg_Q1+Qg_Q2)*Fsw*Vin)","v":0.13632},{"$f":"(Vin-VCC)*Fsw*(Qg_Q1+Qg_Q2)+(RdsonDRT+RdsonDRT2)*Fsw*Qg_Q1*VCC/(RdsonDRT+2*Rgate1+RdsonDRT2)+(RdsonDRB+RdsonDRB2)*Fsw*Qg_Q2*VCC/(RdsonDRB+2*Rgate2+RdsonDRB2)","v":0.12758181818181816},{"$f":"(Qg_Q1+Qg_Q2)*Fsw*(Vin-VCC)","v":0.12211999999999998},{"$f":"SUM(AO73:AP73)","v":0.13642560000000001},{"$f":" SUM(U73,X73,AA73,AG73,AK73,AL73,AM73,AS73,AN73)","v":2.6345031224024362},{"$f":" SUM(AG73,AK73,AL73,AM73,AS73)","v":1.8858436165686396},{"$f":"Vout*K73","v":16.896000000000001},0.8651082818557535,{"$f":"ThetaJA_Q1*BD73","v":10.976689153375842},{"$f":"ThetaJA_Q2*BE73","v":14.521157095153752},null,86.510828185575349,{"$f":"U73","v":0.60896699652108666},{"$f":"AG73+AK73+AM73","v":1.7035428165686397},{"$f":"AG73+AM73*0.66","v":0.73177927689172284},{"$f":"AK73+AM73*0.33","v":0.96807713967691678},{"$f":"AN73","v":0.13671712942701722},1.8399684165686396,36.063380964745342]
["Part Power","Value","Units",null,null,null,65,48,1,{"$f":"Iout*G74/100","v":5.2},5.2,0.3972222222222222,7.2892380047030567E-2,3.6837357041167667,{"$f":"K74+N74/2","v":7.0418678520583837},{"$f":"K74-N74/2","v":3.3581321479416166},0,{"$f":"SQRT(K74^2+(N74^2)/12)","v":5.3076195915069802},0.10704913776696515,0.5,0.61229277082115319,{"$f":"N74/SQRT(12)","v":1.0634029001976255},{"$f":"RCoutEsr*V74^2","v":1.130825728148721E-3},{"$f":"W74","v":1.130825728148721E-3},{"$f":"SQRT(M74*(1-M74))*SQRT(K74^2+(N74^2)/12)","v":1.3797675576352644},{"$f":"RCinEsr*Y74^2","v":1.9037585131027827E-3},{"$f":"Z74","v":1.9037585131027827E-3},{"$f":"SQRT(M74)*SQRT(K74^2+(N74^2)/12)","v":1.4329823918021056},8.2137541408595333E-2,0.3993600000000001,1.1520000000000028E-2,0,0.49730653268027858,5.1105173116753884,0.75740422859508127,4.6592000000000008E-2,0.87346029314669815,4.6592000000000008E-2,0.37439999999999996,0.14085412864074362,1.0560000000000001E-4,{"$f":"CHOOSE(Ext_VCC, (Qg_Q1+Qg_Q2)*Fsw*'Design Regulator'!$G$102, (Qg_Q1+Qg_Q2)*Fsw*Vout, (Qg_Q1+Qg_Q2)*Fsw*Vin)","v":0.13632},0.12758181818181816,0.12211999999999998,0.13642560000000001,2.6843659095301247,1.9281844258269767,17.16,{"$f":"AV74/(AV74+AT74)","v":0.86472906608515132},11.166157990204178,14.955184397200473,null,{"$f":"AW74*100","v":86.472906608515132},0.61229277082115319,1.7451668258269768,0.74441053268027857,0.99701229314669815,0.14085412864074362,{"$f":"BC74+AS74","v":1.8815924258269767},36.879211546208744]
["Power Dis",{"$f":"AS9","v":0.13642560000000001},"W",null,null,null,66,48,1,5.28,5.28,0.40333333333333332,7.2956151059699409E-2,3.6866679784657879,7.1233339892328944,3.4366660107671061,0,5.3861885161915524,0.11024190158142427,0.5,0.61567172733916742,1.0642493748899982,1.1326267319537518E-3,1.1326267319537518E-3,1.4007564950498079,1.9621187584242224E-3,1.9621187584242224E-3,1.4548308659955616,8.4661313946135824E-2,0.40550400000000003,1.1520000000000028E-2,0,0.50618501422860174,5.1859901545703266,0.77994032261571045,4.7308800000000005E-2,0.90103853239878107,4.7308800000000005E-2,0.38016,0.14505513365976877,1.0560000000000001E-4,{"$f":"CHOOSE(Ext_VCC, (Qg_Q1+Qg_Q2)*Fsw*'Design Regulator'!$G$102, (Qg_Q1+Qg_Q2)*Fsw*Vout, (Qg_Q1+Qg_Q2)*Fsw*Vin)","v":0.13632},0.12758181818181816,0.12211999999999998,0.13642560000000001,2.7349395531166971,1.9711179466273827,17.423999999999999,0.86433117942982984,11.356359213429027,15.397369985981715,null,86.433117942982989,0.61567172733916742,1.7873835466273829,0.7570906142286018,1.026491332398781,0.14505513365976877,1.9238091466273828,{"$f":"BG75*$B$63","v":37.706659273896705}]
["Temp rise",{"$f":"B75*B62","v":4.0927680000000004},"°C",null,null,null,67,48,1,5.36,5.36,0.40944444444444439,7.3019923348643587E-2,3.689599809454152,7.2047999047270768,3.5152000952729243,0,5.4647990718927941,0.11348330980540931,0.5,0.61910394700700511,1.0650957215951733,1.1344288961603428E-3,1.1344288961603428E-3,1.421772418597415,2.0214368102843432E-3,2.0214368102843432E-3,1.4767088747885635,8.7226764035172211E-2,0.41164800000000007,1.1520000000000028E-2,0,0.51511258242140645,5.2614978661290968,0.8028174340631502,4.8025600000000009E-2,0.92916802442751478,4.8025600000000009E-2,0.38591999999999993,0.14932014448080172,1.0560000000000001E-4,{"$f":"CHOOSE(Ext_VCC, (Qg_Q1+Qg_Q2)*Fsw*'Design Regulator'!$G$102, (Qg_Q1+Qg_Q2)*Fsw*Vout, (Qg_Q1+Qg_Q2)*Fsw*Vin)","v":0.13632},0.12758181818181816,0.12211999999999998,0.13642560000000001,2.7862317640431726,2.0146518068489212,17.687999999999999,0.86391519856992383,11.547296736321096,15.847824366412723,null,86.391519856992389,0.61910394700700511,1.8302006068489214,0.76981978242140636,1.0565216244275148,0.14932014448080172,1.9666262068489213,38.545873654238861]
["Current (switching)",{"$f":"(Qg_Q1+Qg_Q2)*Fsw+Iq","v":2.8421999999999996E-3},"A",null,null,null,68,48,1,5.44,5.44,0.41555555555555557,7.3083696913901444E-2,3.6925311970685519,7.2862655985342766,3.5937344014657242,0,5.543449487468104,0.11677336243641946,0.5,0.62258951209602764,1.0659419403093098,1.1362322201103761E-3,1.1362322201103761E-3,1.4428148676012023,2.0817147421710747E-3,2.0817147421710747E-3,1.4986159428584731,8.9833989767583611E-2,0.41779200000000005,1.1520000000000028E-2,0,0.52408950010046251,5.337038736595491,0.8260354918017031,4.8742400000000012E-2,0.95785634192152869,4.8742400000000012E-2,0.39168000000000003,0.15364916110055193,1.0560000000000001E-4,{"$f":"CHOOSE(Ext_VCC, (Qg_Q1+Qg_Q2)*Fsw*'Design Regulator'!$G$102, (Qg_Q1+Qg_Q2)*Fsw*Vout, (Qg_Q1+Qg_Q2)*Fsw*Vin)","v":0.13632},0.12758181818181816,0.12211999999999998,0.13642560000000001,2.8382504621808522,2.0587938420219913,17.952000000000002,0.86348166091871481,11.73897450150694,16.306661128822931,null,86.348166091871477,0.62258951209602764,1.8736258420219913,0.78259830010046261,1.0871107419215287,0.15364916110055193,2.0100514420219913,39.397008263631029]
["Qrr Current",{"$f":"Qrr_Q2*Fsw","v":1.1999999999999999E-2},"A",null,null,null,69,48,1,5.52,5.52,0.42166666666666658,7.3147471755511298E-2,3.6954621412956756,7.3677310706478369,3.6722689293521618,0,5.6221380900104005,0.12011205947195402,0.5,0.6261285062220685,1.0667880310285647,1.1380367031458018E-3,1.1380367031458018E-3,1.463883406227972,2.1429546270296095E-3,2.1429546270296095E-3,1.5205516206229972,9.2483089239168925E-2,0.42393599999999998,1.1520000000000028E-2,0,0.53311603208402503,5.4126111510218955,0.84959442469283053,4.9459200000000002E-2,0.98711126890742829,4.9459200000000002E-2,0.39743999999999996,0.15804218351572899,1.0560000000000001E-4,{"$f":"CHOOSE(Ext_VCC, (Qg_Q1+Qg_Q2)*Fsw*'Design Regulator'!$G$102, (Qg_Q1+Qg_Q2)*Fsw*Vout, (Qg_Q1+Qg_Q2)*Fsw*Vin)","v":0.13632},0.12758181818181816,0.12211999999999998,0.13642560000000001,2.8910037820594261,2.1035521009914535,18.215999999999998,0.86303106722723355,11.931396481260375,16.773997033611423,null,86.303106722723356,0.6261285062220685,1.9176673009914533,0.79542643208402497,1.1182664689074282,0.15804218351572899,2.0540929009914533,40.260220859432486]
["Diode Current",{"$f":"Deadtime*Fsw*(Iripple_Vinnom/2)*(Vsd_Q2)/Vin","v":1.6630682764363027E-4},null,null,null,null,70,48,1,5.6,5.6,0.4277777777777777,7.3211247873511451E-2,3.6983926421222129,7.4491963210611063,3.750803678938893,0,5.7008632981863929,0.12349940090951282,0.5,0.62972101435050631,1.0676339937490955,1.1398423446086438E-3,1.1398423446086438E-3,1.4849776218052397,2.2051585372623458E-3,2.2051585372623458E-3,1.5425154824964273,9.5174160549647446E-2,0.43007999999999996,1.1520000000000028E-2,0,0.5421924451864808,5.4882135828398164,0.87349416159515625,5.0176000000000005E-2,1.0169408066073964,5.0176000000000005E-2,0.40319999999999989,0.16249921172304319,1.0560000000000001E-4,{"$f":"CHOOSE(Ext_VCC, (Qg_Q1+Qg_Q2)*Fsw*'Design Regulator'!$G$102, (Qg_Q1+Qg_Q2)*Fsw*Vout, (Qg_Q1+Qg_Q2)*Fsw*Vin)","v":0.13632},0.12758181818181816,0.12211999999999998,0.13642560000000001,2.9445000787492974,2.1489348517938769,18.479999999999997,0.86256388396805994,12.12456667779721,17.249952099110946,null,86.256388396805988,0.62972101435050631,1.962333251793877,0.8083044451864807,1.1499968066073964,0.16249921172304319,2.0987588517938769,41.135673495159992]
["Total",{"$f":"SUM(B77:B79)","v":1.5008506827643629E-2},"A",null,null,null,71,48,1,5.68,5.68,0.43388888888888888,7.3275025267940233E-2,3.7013226995348516,7.530661349767426,3.8293386502325739,0,5.7796236161052041,0.12693538674659577,0.5,0.63336712280142604,1.0684798284670596,1.1416491438409971E-3,1.1416491438409971E-3,1.5060971232722093,2.2683285447288246E-3,2.2683285447288246E-3,1.5645071252846587,9.7907301802658678E-2,0.436224,1.1520000000000028E-2,0,0.55131900823821656,5.5638445879422731,0.89773463136446119,5.0892800000000002E-2,1.0473531795195179,5.0892800000000002E-2,0.40895999999999988,0.16702024571920496,1.0560000000000001E-4,{"$f":"CHOOSE(Ext_VCC, (Qg_Q1+Qg_Q2)*Fsw*'Design Regulator'!$G$102, (Qg_Q1+Qg_Q2)*Fsw*Vout, (Qg_Q1+Qg_Q2)*Fsw*Vin)","v":0.13632},0.12758181818181816,0.12211999999999998,0.13642560000000001,2.9987479339669356,2.194950587757734,18.744,0.86208054551916902,12.318489123573247,17.734649692792768,null,86.208054551916902,0.63336712280142604,2.0076321877577343,0.82123260823821642,1.1823099795195178,0.16702024571920496,2.1440577877577343,42.023532640051592]
[null,null,null,null,null,null,72,48,1,5.76,5.76,0.43999999999999995,7.3338803938835961E-2,3.7042523135202803,7.6121261567601399,3.9078738432398596,0,5.8584176276691844,0.13042001698070313,0.5,0.63706691925486836,1.069325535178614,1.1434571001850292E-3,1.1434571001850292E-3,1.5272415397525285,2.3324667207456741E-3,2.3324667207456741E-3,1.5865261667063877,0.1006826111057626,0.44236800000000004,1.1520000000000028E-2,0,0.56049599210571199,5.6395027992315931,0.92231576285368833,5.1609600000000005E-2,1.0783568417301126,5.1609600000000005E-2,0.41471999999999998,0.17160528550092519,1.0560000000000001E-4,{"$f":"CHOOSE(Ext_VCC, (Qg_Q1+Qg_Q2)*Fsw*'Design Regulator'!$G$102, (Qg_Q1+Qg_Q2)*Fsw*Vout, (Qg_Q1+Qg_Q2)*Fsw*Vin)","v":0.13632},0.12758181818181816,0.12211999999999998,0.13642560000000001,3.0537561624125487,2.2416080338358242,19.007999999999999,0.8615814561664249,12.51316788158568,18.228216625951688,null,86.158145616642486,0.63706691925486836,2.0535728338358243,0.83421119210571204,1.2152144417301125,0.17160528550092519,2.1899984338358243,42.923969303182162]
[null,null,null,null,null,null,73,48,1,5.84,5.84,0.44611111111111107,7.3402583886236952E-2,3.707181484065186,7.6935907420325931,3.9864092579674066,0,5.9372439913635837,0.13395329160933531,0.5,0.6408204927561677,1.0701711138799157,1.1452662129829796E-3,1.1452662129829796E-3,1.5484105192378899,2.3975751360865516E-3,2.3975751360865516E-3,1.6085722440291574,0.10350018657043997,0.44851200000000002,1.1520000000000028E-2,0,0.56972366971186117,5.7151869215907523,0.94723748491293747,5.2326400000000002E-2,1.1099604834677779,5.2326400000000002E-2,0.42047999999999996,0.17625433106491489,1.0560000000000001E-4,{"$f":"CHOOSE(Ext_VCC, (Qg_Q1+Qg_Q2)*Fsw*'Design Regulator'!$G$102, (Qg_Q1+Qg_Q2)*Fsw*Vout, (Qg_Q1+Qg_Q2)*Fsw*Vin)","v":0.13632},0.12758181818181816,0.12211999999999998,0.13642560000000001,3.1095338183497909,2.2889161531796391,19.271999999999998,0.86106699194134761,12.708607045677917,18.730783252016668,null,86.106699194134762,0.6408204927561677,2.1001641531796391,0.84724046971186118,1.2487188834677778,0.17625433106491489,2.236589753179639,43.83715916232093]
[null,null,null,null,null,null,74,48,1,5.92,5.92,0.45222222222222214,7.3466365110181522E-2,3.7101102111562554,7.7750551055781276,4.0649448944218722,0,6.016101435446144,0.13753521062999319,0.5,0.64462793372138105,1.0710165645671217,1.1470764815771596E-3,1.1470764815771596E-3,1.5696037273726398,2.4636558609820842E-3,2.4636558609820842E-3,1.6306450128100585,0.10636012631209264,0.45465599999999995,1.1520000000000028E-2,0,0.57900231605652308,5.7908957272407209,0.97249972638947046,5.3043200000000006E-2,1.1421730379093824,5.3043200000000006E-2,0.42623999999999995,0.18096738240788579,1.0560000000000001E-4,{"$f":"CHOOSE(Ext_VCC, (Qg_Q1+Qg_Q2)*Fsw*'Design Regulator'!$G$102, (Qg_Q1+Qg_Q2)*Fsw*Vout, (Qg_Q1+Qg_Q2)*Fsw*Vin)","v":0.13632},0.12758181818181816,0.12211999999999998,0.13642560000000001,3.1660902024377311,2.3368841539659053,19.535999999999998,0.86053750230902704,12.904810740847847,19.242483568640736,null,86.053750230902708,0.64462793372138105,2.1474153539659055,0.86032071605652305,1.2828322379093824,0.18096738240788579,2.2838409539659055,44.763282697731754]
[null,null,null,null,null,null,75,48,1,6,6,0.45833333333333326,7.353014761070803E-2,3.7130384947801764,7.8565192473900884,4.1434807526099116,0,6.0949887535015153,0.14116577404017783,0.5,0.64848933394280461,1.071861887236389,1.1488879053099534E-3,1.1488879053099534E-3,1.5908208463305398,2.5307109651198146E-3,2.5307109651198146E-3,1.6527441457319059,0.10926252845004349,0.46080000000000004,1.1520000000000028E-2,0,0.58833220823730714,5.8666280514499016,0.99810241612770723,5.3760000000000002E-2,1.1750036882487074,5.3760000000000002E-2,0.43199999999999994,0.18574443952654979,1.0560000000000001E-4,{"$f":"CHOOSE(Ext_VCC, (Qg_Q1+Qg_Q2)*Fsw*'Design Regulator'!$G$102, (Qg_Q1+Qg_Q2)*Fsw*Vout, (Qg_Q1+Qg_Q2)*Fsw*Vin)","v":0.13632},0.12758181818181816,0.12211999999999998,0.13642560000000001,3.223434868825799,2.3855214964860143,19.799999999999997,0.85999331171951254,13.101783123559606,19.763455323730611,null,85.999331171951255,0.64848933394280461,2.1953358964860143,0.87345220823730707,1.3175636882487074,0.18574443952654979,2.3317614964860143,45.702525331125884]
[null,null,null,null,null,null,76,48,1,6.08,6.08,0.46444444444444444,7.3593931387854764E-2,3.7159663349236332,7.9379831674618169,4.2220168325381833,0,6.1739048003288657,0.1448449818373905,0.5,0.65240478659458401,1.0727070818838733,1.1507004835238149E-3,1.1507004835238149E-3,1.6120615737756832,2.5987425176441327E-3,2.5987425176441327E-3,1.6748693315266172,0.11220749110753671,0.46694400000000008,1.1520000000000028E-2,0,0.59771362547059559,5.9423827885651557,1.0240454829692265,5.4476800000000006E-2,1.2084618750390208,5.4476800000000006E-2,0.43775999999999998,0.19058550241761907,1.0560000000000001E-4,{"$f":"CHOOSE(Ext_VCC, (Qg_Q1+Qg_Q2)*Fsw*'Design Regulator'!$G$102, (Qg_Q1+Qg_Q2)*Fsw*Vout, (Qg_Q1+Qg_Q2)*Fsw*Vin)","v":0.13632},0.12758181818181816,0.12211999999999998,0.13642560000000001,3.2815776325229877,2.4348379005096166,20.064,0.85943472103464313,13.299528382058934,20.293840125585312,null,85.943472103464316,0.65240478659458401,2.2439355005096164,0.88663522547059559,1.3529226750390209,0.19058550241761907,2.3803611005096164,46.655077569988485]
[null,null,null,null,null,null,77,48,1,6.16,6.16,0.4705555555555555,7.3657716441660082E-2,3.7188937315733117,8.0194468657866551,4.3005531342133443,0,6.2528484881341297,0.14857283401913285,0.5,0.6563743862384136,1.0735521485057318,1.1525142155612729E-3,1.1525142155612729E-3,1.6333256219003691,2.6677525871562275E-3,2.6677525871562275E-3,1.6970202739783198,0.11519511241173806,0.47308800000000001,1.1520000000000028E-2,0,0.60714684911280625,6.0181588883368491,1.0503288557527668,5.5193600000000009E-2,1.2425573038214157,5.5193600000000009E-2,0.44352000000000003,0.19549057107780637,1.0560000000000001E-4,{"$f":"CHOOSE(Ext_VCC, (Qg_Q1+Qg_Q2)*Fsw*'Design Regulator'!$G$102, (Qg_Q1+Qg_Q2)*Fsw*Vout, (Qg_Q1+Qg_Q2)*Fsw*Vin)","v":0.13632},0.12758181818181816,0.12211999999999998,0.13642560000000001,3.340528577053159,2.484843352934222,20.327999999999999,0.85886200884106367,13.498050736692093,20.833783557321237,null,85.886200884106373,0.6563743862384136,2.2932241529342221,0.89987004911280621,1.3889189038214158,0.19549057107780637,2.429649752934222,47.621135157510757]
[null,null,null,null,null,null,78,48,1,6.24,6.24,0.47666666666666663,7.3721502772162273E-2,3.7218206847158966,8.1009103423579489,4.3790896576420515,0,6.3318187830010526,0.15234933058290673,0.5,0.66039822882932953,1.0743970870981201,1.1543291007649254E-3,1.1543291007649254E-3,1.6546127165333953,2.7377432417140216E-3,2.7377432417140216E-3,1.7191966909994258,0.11822549049373501,0.47923200000000005,1.1520000000000028E-2,0,0.61663216268189947,6.0939553525129764,1.0769524633142251,5.5910400000000006E-2,1.277299953051354,5.5910400000000006E-2,0.4492799999999999,0.20045964550382464,1.0560000000000001E-4,{"$f":"CHOOSE(Ext_VCC, (Qg_Q1+Qg_Q2)*Fsw*'Design Regulator'!$G$102, (Qg_Q1+Qg_Q2)*Fsw*Vout, (Qg_Q1+Qg_Q2)*Fsw*Vin)","v":0.13632},0.12758181818181816,0.12211999999999998,0.13642560000000001,3.4002980624088868,2.5355481157332536,20.591999999999999,0.85827543265909689,13.697354440228491,21.383435295770308,null,85.827543265909696,0.66039822882932953,2.3432121157332535,0.91315696268189939,1.4255623530513539,0.20045964550382464,2.4796377157332534,48.600899228371773]
[null,null,null,null,null,null,79,48,1,6.32,6.32,0.48277777777777769,7.3785290379399723E-2,3.724747194338073,8.1823735971690361,4.4576264028309636,0,6.410814701617686,0.15617447152621436,0.5,0.66447641172159477,1.0752418976571949,1.1561451384774458E-3,1.1561451384774458E-3,1.6759225963128848,2.8087165488321205E-3,2.8087165488321205E-3,1.7413983137735682,0.12129872348853708,0.48537600000000003,1.1520000000000028E-2,0,0.62616985187913132,6.169771231679829,1.1039162344866569,5.6627200000000009E-2,1.312700082336496,5.6627200000000009E-2,0.45504,0.2054927256923873,1.0560000000000001E-4,{"$f":"CHOOSE(Ext_VCC, (Qg_Q1+Qg_Q2)*Fsw*'Design Regulator'!$G$102, (Qg_Q1+Qg_Q2)*Fsw*Vout, (Qg_Q1+Qg_Q2)*Fsw*Vin)","v":0.13632},0.12758181818181816,0.12211999999999998,0.13642560000000001,3.4608967333169192,2.5869627342156276,20.855999999999998,0.85767523005618163,13.89744377818697,21.94294923504744,null,85.767523005618159,0.66447641172159477,2.3939099342156274,0.92649625187913132,1.462863282336496,0.2054927256923873,2.5303355342156273,49.594576470626301]
[null,null,null,null,null,null,80,48,1,6.4,6.4,0.48888888888888887,7.3849079263410722E-2,3.7276732604265228,8.2638366302132624,4.5361633697867392,0,6.4898353082371498,0.16004825684655799,0.5,0.6686090336746775,1.0760865801791115,1.1579623280415755E-3,1.1579623280415755E-3,1.6972550119182863,2.8806745754817423E-3,2.8806745754817423E-3,1.7636248859598487,0.12441490953507557,0.49152000000000007,1.1520000000000028E-2,0,0.63576020461105764,6.2456056223287657,1.131220098100276,5.7344000000000006E-2,1.3487682409995738,5.7344000000000006E-2,0.46079999999999999,0.2105898116402079,1.0560000000000001E-4,{"$f":"CHOOSE(Ext_VCC, (Qg_Q1+Qg_Q2)*Fsw*'Design Regulator'!$G$102, (Qg_Q1+Qg_Q2)*Fsw*Vout, (Qg_Q1+Qg_Q2)*Fsw*Vin)","v":0.13632},0.12758181818181816,0.12211999999999998,0.13642560000000001,3.52233552782904,2.6390980456106314,21.12,0.85706161967272942,14.098323069165865,22.512483614993606,null,85.706161967272948,0.6686090336746775,2.4453284456106315,0.93988820461105771,1.5008322409995738,0.2105898116402079,2.5817540456106314,50.602379293968376]
[null,null,null,null,null,null,81,48,1,6.48,6.48,0.495,7.3912869424233626E-2,3.7305988829679313,8.3452994414839665,4.6147005585160343,0,6.5688797118534712,0.16397068654144054,0.5,0.67279619485932474,1.0769311346600263,1.1597806688001318E-3,1.1597806688001318E-3,1.7186097253567125,2.9536193880906748E-3,2.9536193880906748E-3,1.7858761629533877,0.1275741467762046,0.49766400000000011,1.1520000000000028E-2,0,0.64540351101179283,6.3214576641305626,1.1588639829824561,5.806080000000001E-2,1.3855152769807797,5.806080000000001E-2,0.46655999999999997,0.21575090334400071,1.0560000000000001E-4,{"$f":"CHOOSE(Ext_VCC, (Qg_Q1+Qg_Q2)*Fsw*'Design Regulator'!$G$102, (Qg_Q1+Qg_Q2)*Fsw*Vout, (Qg_Q1+Qg_Q2)*Fsw*Vin)","v":0.13632},0.12758181818181816,0.12211999999999998,0.13642560000000001,3.5846256862527888,2.6919651879925719,21.384,0.85643480216748935,14.299996665176893,23.092201154711695,null,85.643480216748941,0.67279619485932474,2.4974787879925722,0.95333311101179286,1.5394800769807797,0.21575090334400071,2.6339043879925721,51.62452600465442]
[null,null,null,null,null,null,82,48,1,6.56,6.56,0.50111111111111095,7.3976660861906768E-2,3.7335240619489807,8.4267620309744906,4.6932379690255095,0,6.6479470635750397,0.16794176060836477,0.5,0.67703799686372912,1.0777755610960946,1.1616001600960016E-3,1.1616001600960016E-3,1.7399865092991953,3.0275530525431991E-3,3.0275530525431991E-3,1.8081519111975934,0.1307765333587004,0.50380800000000003,1.1520000000000028E-2,0,0.65510006346552441,6.3973265374004855,1.1868478179577262,5.8777599999999999E-2,1.4229523460948827,5.8777599999999999E-2,0.47231999999999991,0.22097600080047997,1.0560000000000001E-4,{"$f":"CHOOSE(Ext_VCC, (Qg_Q1+Qg_Q2)*Fsw*'Design Regulator'!$G$102, (Qg_Q1+Qg_Q2)*Fsw*Vout, (Qg_Q1+Qg_Q2)*Fsw*Vin)","v":0.13632},0.12758181818181816,0.12211999999999998,0.13642560000000001,3.6477787604372551,2.7455756095604071,21.647999999999996,0.85579496108882791,14.502468951982864,23.682269191423241,null,85.579496108882793,0.67703799686372912,2.5503724095604072,0.96683126346552428,1.5788179460948828,0.22097600080047997,2.6867980095604072,52.661240987383984]
[null,null,null,null,null,null,83,48,1,6.64,6.64,0.50722222222222213,7.4040453576468462E-2,3.7364487973563509,8.5082243986781751,4.7717756013218242,0,6.7270365541798673,0.17196147904483414,0.5,0.68133454269979354,1.0786198594834715,1.163420801272144E-3,1.163420801272144E-3,1.7613851464628762,3.1024776341800481E-3,3.1024776341800481E-3,1.8304519075440229,0.13402216743326209,0.50995199999999996,1.1520000000000028E-2,0,0.66485015662929114,6.4732114607388347,1.2151715318477774,5.9494400000000003E-2,1.4610909216591241,5.9494400000000003E-2,0.47807999999999995,0.22626510400636071,1.0560000000000001E-4,{"$f":"CHOOSE(Ext_VCC, (Qg_Q1+Qg_Q2)*Fsw*'Design Regulator'!$G$102, (Qg_Q1+Qg_Q2)*Fsw*Vout, (Qg_Q1+Qg_Q2)*Fsw*Vin)","v":0.13632},0.12758181818181816,0.12211999999999998,0.13642560000000001,3.7118066234300215,2.7999410782884153,21.911999999999999,0.85514226367771595,14.705744349439367,24.282859824886863,null,85.514226367771599,0.68133454269979354,2.6040210782884152,0.9803829566292912,1.6188573216591242,0.22626510400636071,2.7404466782884151,53.712754894452942]
[null,null,null,null,null,null,84,48,1,6.72,6.72,0.51333333333333331,7.4104247567957082E-2,3.7393730891767265,8.5896865445883623,4.8503134554116363,0,6.8061474118381824,0.17602984184835202,0.5,0.68568593680948908,1.0794640298183129,1.1652425916715916E-3,1.1652425916715916E-3,1.782805429035468,3.178395197798339E-3,3.178395197798339E-3,1.8527759386560461,0.1373111471545117,0.516096,1.1520000000000028E-2,0,0.67465408745602373,6.5491116888329826,1.2438350534714553,6.0211200000000006E-2,1.4999428045087306,6.0211200000000006E-2,0.48383999999999994,0.23161821295835794,1.0560000000000001E-4,{"$f":"CHOOSE(Ext_VCC, (Qg_Q1+Qg_Q2)*Fsw*'Design Regulator'!$G$102, (Qg_Q1+Qg_Q2)*Fsw*Vout, (Qg_Q1+Qg_Q2)*Fsw*Vin)","v":0.13632},0.12758181818181816,0.12211999999999998,0.13642560000000001,3.7767214795220712,2.8550736919647539,22.175999999999998,0.85447686160767056,14.909827311840354,24.894150067630957,null,85.447686160767063,0.68568593680948908,2.6584368919647541,0.99398848745602364,1.6596100045087305,0.23161821295835794,2.794862491964754,54.779304842509184]
[null,null,null,null,null,null,85,48,1,6.8,6.8,0.51944444444444438,7.4168042836410944E-2,3.7422969373967869,8.6711484686983926,4.9288515313016061,0,6.8852788999892693,0.18014684901642231,0.5,0.69009228507131348,1.0803080720967735,1.1670655306374475E-3,1.1670655306374475E-3,1.8042471581386832,3.2553078076515145E-3,3.2553078076515145E-3,1.8751238004528819,0.14064357068099437,0.52223999999999993,1.1520000000000028E-2,0,0.68451215521785447,6.6250265104082846,1.2728383116447646,6.0928000000000003E-2,1.5395201334178477,6.0928000000000003E-2,0.48959999999999992,0.23703532765318724,1.0560000000000001E-4,{"$f":"CHOOSE(Ext_VCC, (Qg_Q1+Qg_Q2)*Fsw*'Design Regulator'!$G$102, (Qg_Q1+Qg_Q2)*Fsw*Vout, (Qg_Q1+Qg_Q2)*Fsw*Vin)","v":0.13632},0.12758181818181816,0.12211999999999998,0.13642560000000001,3.8425358746984917,2.9109858886357021,22.439999999999998,0.85379889166640122,15.114722328267817,25.516322001267714,null,85.379889166640126,0.69009228507131348,2.7136322886357021,1.0076481552178544,1.7010881334178476,0.23703532765318724,2.850057888635702,55.861134617259765]
[null,null,null,null,null,null,86,48,1,6.88,6.88,0.52555555555555544,7.4231839381868406E-2,3.7452203420032135,8.7526101710016064,5.0073898289983934,0,6.9644303153605378,0.18431250054654894,0.5,0.69455369480684448,1.0811519863150088,1.1688896175128889E-3,1.1688896175128889E-3,1.8257101433276002,3.3332175274492864E-3,3.3332175274492864E-3,1.8974952975908692,0.14401953617517846,0.52838400000000008,1.1520000000000028E-2,0,0.69442466152970039,6.7009552463162612,1.3021812351808693,6.1644800000000007E-2,1.5798353959445965,6.1644800000000007E-2,0.49535999999999991,0.2425164480875644,1.0560000000000001E-4,{"$f":"CHOOSE(Ext_VCC, (Qg_Q1+Qg_Q2)*Fsw*'Design Regulator'!$G$102, (Qg_Q1+Qg_Q2)*Fsw*Vout, (Qg_Q1+Qg_Q2)*Fsw*Vin)","v":0.13632},0.12758181818181816,0.12211999999999998,0.13642560000000001,3.9092627075136681,2.9676904574742964,22.703999999999997,0.85310847638346965,15.320433922945506,26.149562939168948,null,85.310847638346971,0.69455369480684448,2.7696200574742966,1.0213622615297004,1.7433041959445965,0.2425164480875644,2.9060456574742966,56.958494886496219]
[null,null,null,null,null,null,87,48,1,6.96,6.96,0.53166666666666662,7.4295637204367784E-2,3.7481433029826849,8.8340716514913424,5.0859283485086575,0,7.0436009861179079,0.18852679643623643,0.5,0.69907027478739381,1.0819957724691731,1.1707148516411628E-3,1.1707148516411628E-3,1.8471942021232033,3.4121264203575774E-3,3.4121264203575774E-3,1.9198902429791134,0.14743914180345596,0.534528,1.1520000000000028E-2,0,0.70439191037312054,6.7768972477495009,1.3318637528900881,6.2361600000000003E-2,1.6209014397199801,6.2361600000000003E-2,0.50112000000000001,0.24806157425820582,1.0560000000000001E-4,{"$f":"CHOOSE(Ext_VCC, (Qg_Q1+Qg_Q2)*Fsw*'Design Regulator'!$G$102, (Qg_Q1+Qg_Q2)*Fsw*Vout, (Qg_Q1+Qg_Q2)*Fsw*Vin)","v":0.13632},0.12758181818181816,0.12211999999999998,0.13642560000000001,3.9769152404106989,3.0252005500931007,22.968,0.85240572460787301,15.52696665559681,26.794065595799701,null,85.240572460787305,0.69907027478739381,2.8264133500931008,1.0351311103731207,1.7862710397199801,0.24806157425820582,2.9628389500931007,58.071643421824781]
[null,null,null,null,null,null,88,48,1,7.04,7.04,0.53777777777777769,7.4359436303947465E-2,3.751065820321883,8.9155329101609411,5.164467089839059,0,7.1227902701375108,0.19278973668298927,0.5,0.70364213524075903,1.0828394305554219,1.1725412323655903E-3,1.1725412323655903E-3,1.8686991595755758,3.4920365489984635E-3,3.4920365489984635E-3,1.9423084573268903,0.15090248573614257,0.54067200000000004,1.1520000000000028E-2,0,0.71441420812045497,6.8528518945736767,1.3618857935798989,6.3078400000000007E-2,1.6627314842014573,6.3078400000000007E-2,0.50688,0.25367070616182796,1.0560000000000001E-4,{"$f":"CHOOSE(Ext_VCC, (Qg_Q1+Qg_Q2)*Fsw*'Design Regulator'!$G$102, (Qg_Q1+Qg_Q2)*Fsw*Vout, (Qg_Q1+Qg_Q2)*Fsw*Vin)","v":0.13632},0.12758181818181816,0.12211999999999998,0.13642560000000001,4.0455071115058638,3.0835296923219122,23.231999999999999,0.85169073203909318,15.734325121806826,27.45002826302186,null,85.169073203909321,0.70364213524075903,2.8840256923219121,1.0489550081204551,1.8300018842014574,0.25367070616182796,3.020451292321912,59.200845329509477]
[null,null,null,null,null,null,89,48,1,7.12,7.12,0.54388888888888887,7.442323668064578E-2,3.7539878940074853,8.9969939470037428,5.2430060529962574,0,7.2019975533895844,0.19710132128431232,0.5,0.70826938785807703,1.083682960569909,1.1743687590295628E-3,1.1743687590295628E-3,1.8902248478554373,3.5729499754501115E-3,3.5729499754501115E-3,1.9647497687204198,0.15440966614747773,0.54681600000000008,1.1520000000000028E-2,0,0.72449186355924633,6.9288185937678159,1.392247286054936,6.379520000000001E-2,1.7053391329130974,6.379520000000001E-2,0.51263999999999998,0.2593438437951478,1.0560000000000001E-4,{"$f":"CHOOSE(Ext_VCC, (Qg_Q1+Qg_Q2)*Fsw*'Design Regulator'!$G$102, (Qg_Q1+Qg_Q2)*Fsw*Vout, (Qg_Q1+Qg_Q2)*Fsw*Vin)","v":0.13632},0.12758181818181816,0.12211999999999998,0.13642560000000001,4.1150523468600477,3.1426917964723433,23.495999999999999,0.85096358171484132,15.942513953388694,28.117654993696462,null,85.096358171484127,0.70826938785807703,2.9424709964723439,1.0628342635592463,1.8745103329130974,0.2593438437951478,3.0788965964723438,60.34637329085794]
[null,null,null,null,null,null,90,48,1,7.2,7.2,0.54999999999999993,7.4487038334501043E-2,3.756909524026169,9.0784547620130844,5.3215452379869159,0,7.2812222484261904,0.20146155023771087,0.5,0.71295214580077704,1.0845263625087889,1.176197430976545E-3,1.176197430976545E-3,1.9117711058719151,3.6548687612467253E-3,3.6548687612467253E-3,1.9872140122268223,0.15796078121562501,0.55296000000000001,1.1520000000000028E-2,0,0.73462518791694886,7.0047967779647911,1.4229481591169917,6.4512000000000014E-2,1.748738386195468,6.4512000000000014E-2,0.51839999999999997,0.26508098715488276,1.0560000000000001E-4,{"$f":"CHOOSE(Ext_VCC, (Qg_Q1+Qg_Q2)*Fsw*'Design Regulator'!$G$102, (Qg_Q1+Qg_Q2)*Fsw*Vout, (Qg_Q1+Qg_Q2)*Fsw*Vin)","v":0.13632},0.12758181818181816,0.12211999999999998,0.13642560000000001,4.1855653732602995,3.2027011741124172,23.759999999999998,0.85022434445841433,16.151537818754232,28.797155792932021,null,85.022434445841427,0.71295214580077704,3.0017635741124167,1.0767691879169488,1.9198103861954681,0.26508098715488276,3.1381891741124166,61.508507812603369]
[null,null,null,null,null,null,91,48,1,7.28,7.28,0.55611111111111111,7.4550841265551643E-2,3.7598307103646134,9.1599153551823065,5.400084644817694,0,7.360463792965092,0.20587042354069024,0.5,0.71769052370763675,1.0853696363682157,1.1780272475500728E-3,1.1780272475500728E-3,1.9333377789146118,3.7377949673784846E-3,3.7377949673784846E-3,2.0097010295232502,0.1615559291226725,0.55910400000000005,1.1520000000000028E-2,0,0.74481449488593221,7.0807859040846068,1.4539883415650146,6.5228800000000003E-2,1.7929436544896638,6.5228800000000003E-2,0.52415999999999996,0.27088213623775032,1.0560000000000001E-4,{"$f":"CHOOSE(Ext_VCC, (Qg_Q1+Qg_Q2)*Fsw*'Design Regulator'!$G$102, (Qg_Q1+Qg_Q2)*Fsw*Vout, (Qg_Q1+Qg_Q2)*Fsw*Vin)","v":0.13632},0.12758181818181816,0.12211999999999998,0.13642560000000001,4.2570610315359119,3.2635725493755956,24.024000000000001,0.84947307928832982,16.361401423288982,29.488746817344953,null,84.947307928832984,0.71769052370763675,3.0619181493755958,1.0907600948859322,1.9659164544896637,0.27088213623775032,3.1983437493755957,62.687537487761681]
[null,null,null,null,null,null,92,48,1,7.36,7.36,0.56222222222222218,7.4614645473835922E-2,3.7627514530094963,9.2413757265047494,5.4786242734952522,0,7.4397216485627844,0.21032794119075629,0.5,0.72248463770194016,1.0862127821443441,1.1798582080937566E-3,1.1798582080937566E-3,1.9549247183181988,3.8217306542914892E-3,3.8217306542914892E-3,2.0322106685493542,0.16519520805463253,0.56524800000000008,1.1520000000000028E-2,0,0.75506010064877738,7.1567854520537324,1.4853677621951107,6.5945600000000007E-2,1.83796977218126,6.5945600000000007E-2,0.52991999999999995,0.2767472910404688,1.0560000000000001E-4,{"$f":"CHOOSE(Ext_VCC, (Qg_Q1+Qg_Q2)*Fsw*'Design Regulator'!$G$102, (Qg_Q1+Qg_Q2)*Fsw*Vout, (Qg_Q1+Qg_Q2)*Fsw*Vin)","v":0.13632},0.12758181818181816,0.12211999999999998,0.13642560000000001,4.3295545904348307,3.3253210728300369,24.288,0.84870983379264886,16.572109509731661,30.192650582718905,null,84.870983379264885,0.72248463770194016,3.1229498728300369,1.1048073006487773,2.0128433721812602,0.2767472910404688,3.2593754728300368,63.883759267468726]
[null,null,null,null,null,null,93,48,1,7.44,7.44,0.56833333333333325,7.467845095939224E-2,3.7656717519474938,9.3228358759737482,5.5571641240262535,0,7.5189952993702081,0.21483410318541488,0.5,0.72733460539873929,1.0870557998333277,1.1816903119512758E-3,1.1816903119512758E-3,1.9765317811479008,3.906677881887693E-3,3.906677881887693E-3,2.0547427831814025,0.16887871620144224,0.57139200000000001,1.1520000000000028E-2,0,0.76536232390387526,7.2327949236042377,1.5170863498005418,6.6662400000000011E-2,1.883832012031406,6.6662400000000011E-2,0.53567999999999993,0.28267645155975646,1.0560000000000001E-4,{"$f":"CHOOSE(Ext_VCC, (Qg_Q1+Qg_Q2)*Fsw*'Design Regulator'!$G$102, (Qg_Q1+Qg_Q2)*Fsw*Vout, (Qg_Q1+Qg_Q2)*Fsw*Vin)","v":0.13632},0.12758181818181816,0.12211999999999998,0.13642560000000001,4.4030617610876162,3.3879623359352813,24.552,0.8479346444701823,16.783666858558131,30.909096180471096,null,84.793464447018223,0.72733460539873929,3.1848743359352811,1.1189111239038754,2.0606064120314063,0.28267645155975646,3.3212999359352811,65.097478744331511]
[null,null,null,null,null,null,94,48,1,7.52,7.52,0.57444444444444442,7.4742257722258912E-2,3.7685916071652801,9.4042958035826398,5.6357041964173593,0,7.5982842509652384,0.21938890952217222,0.5,0.73224054591222032,1.0878986894313194,1.1835235584663824E-3,1.1835235584663824E-3,1.9981588299043833,3.9926387095248544E-3,3.9926387095248544E-3,2.0772972329264987,0.17260655175696354,0.57753600000000005,1.1520000000000028E-2,0,0.77572148589133005,7.3088138411470212,1.5491440331717259,6.73792E-2,1.930546100223816,6.73792E-2,0.54143999999999992,0.28866961779233186,1.0560000000000001E-4,{"$f":"CHOOSE(Ext_VCC, (Qg_Q1+Qg_Q2)*Fsw*'Design Regulator'!$G$102, (Qg_Q1+Qg_Q2)*Fsw*Vout, (Qg_Q1+Qg_Q2)*Fsw*Vin)","v":0.13632},0.12758181818181816,0.12211999999999998,0.13642560000000001,4.4775987120876888,3.4515123861151462,24.815999999999999,0.84714753704057344,16.996078288369951,31.638319503357238,null,84.714753704057344,0.73224054591222032,3.2477075861151459,1.13307188589133,2.1092213002238158,0.28866961779233186,3.3841331861151458,66.329010447856859]
[null,null,null,null,null,null,95,48,1,7.6,7.6,0.58055555555555549,7.4806065762474352E-2,3.7715110186495355,9.4857555093247683,5.7142444906752319,0,7.6775880292565128,0.22399236019853502,0.5,0.73720257986317517,1.0887414509344746,1.185357946982905E-3,1.185357946982905E-3,2.0198057322466623,4.0796151960164756E-3,4.0796151960164756E-3,2.0998738826354768,0.17637881291898372,0.58367999999999987,1.1520000000000028E-2,0,0.78613791041916958,7.384841746713894,1.5815407410962412,6.8096000000000004E-2,1.9781282320580527,6.8096000000000004E-2,0.54719999999999991,0.29472678973491451,1.0560000000000001E-4,{"$f":"CHOOSE(Ext_VCC, (Qg_Q1+Qg_Q2)*Fsw*'Design Regulator'!$G$102, (Qg_Q1+Qg_Q2)*Fsw*Vout, (Qg_Q1+Qg_Q2)*Fsw*Vin)","v":0.13632},0.12758181818181816,0.12211999999999998,0.13642560000000001,4.5531820852183111,3.5159877424772219,25.08,0.84634852672506145,17.209348656287546,32.380563480870791,null,84.634852672506142,0.73720257986317517,3.3114661424772223,1.1472899104191696,2.1587042320580525,0.29472678973491451,3.4478917424772222,67.578678152553564]
[null,null,null,null,null,null,96,48,1,7.68,7.68,{"$f":"Vout*K105/(Vin*Efficiency)","v":0.58666666666666656},7.4869875080076878E-2,{"$f":"(Vin-(Rdson1+Rdcr)*K105-Vout)*M105/(Fsw*Lf)","v":3.7744299863869317},9.5672149931934651,5.7927850068065343,{"$f":"IF(MIN(Vin, -P105/(Coss_Q1+Coss_Q2)*0.00000002)<0, 0, MIN(Vin, -P105/(Coss_Q1+Coss_Q2)*0.00000002))","v":0},7.7569061794535541,{"$f":"R105^2*Rdcr","v":0.22864445521200999},0.5,{"$f":"(T105+S105*(1+Ltc*(Ta-25)))/(1-S105*Ltc*ThetaCa)","v":0.74222082938657796},1.0895840843389453,1.187193476844738E-3,1.187193476844738E-3,2.0414723607317686,4.167609399631741E-3,4.167609399631741E-3,2.1224726022331533,{"$f":"Rdson1*AB105^2","v":0.18019559788921494},0.58982400000000001,1.1520000000000028E-2,0,{"$f":"(AF105+AE105+AD105+AC105*(1+RdsonTopTc*Ta-RdsonTopTc*25))/(1-AC105*RdsonTopTc*ThetaJA_Q1)","v":0.79661192388987123},7.4608782009636343,{"$f":"Rdson2*AH105^2","v":1.6142764023588165},6.8812800000000007E-2,{"$f":"(AJ105+AI105*(1+RdsonBotTc*Ta-RdsonBotTc*25))/(1-AI105*RdsonBotTc*ThetaJA_Q2)","v":2.0265950883212027},6.8812800000000007E-2,0.5529599999999999,0.30084796738422365,1.0560000000000001E-4,{"$f":"CHOOSE(Ext_VCC, (Qg_Q1+Qg_Q2)*Fsw*'Design Regulator'!$G$102, (Qg_Q1+Qg_Q2)*Fsw*Vout, (Qg_Q1+Qg_Q2)*Fsw*Vin)","v":0.13632},0.12758181818181816,0.12211999999999998,0.13642560000000001,{"$f":" SUM(U105,X105,AA105,AG105,AK105,AL105,AM105,AS105,AN105)","v":4.6298290118583516},3.5814054122110734,25.343999999999998,0.84553761849956899,17.42348285834807,33.136078324818037,null,84.553761849956899,0.74222082938657796,3.3761670122110736,1.1615655238898712,2.2090718883212026,0.30084796738422365,3.5125926122110736,68.846815199337044]
[null,null,null,null,null,null,97,48,1,7.76,7.76,{"$f":"Vout*K106/(Vin*Efficiency)","v":0.59277777777777763},7.4933685675104847E-2,{"$f":"(Vin-(Rdson1+Rdcr)*K106-Vout)*M106/(Fsw*Lf)","v":3.7773485103641438},9.6486742551820726,5.8713257448179279,{"$f":"IF(MIN(Vin, -P106/(Coss_Q1+Coss_Q2)*0.00000002)<0, 0, MIN(Vin, -P106/(Coss_Q1+Coss_Q2)*0.00000002))","v":0},7.8362382650986211,{"$f":"R106^2*Rdcr","v":0.23334519456010422},0.5,{"$f":"(T106+S106*(1+Ltc*(Ta-25)))/(1-S106*Ltc*ThetaCa)","v":0.74729541813927081},1.0904265896408851,1.1890301473958514E-3,1.1890301473958514E-3,2.0631585925700087,4.2566233780954596E-3,4.2566233780954596E-3,2.1450932664647424,{"$f":"Rdson1*AB106^2","v":0.18405700487329515},0.59596800000000005,1.1520000000000028E-2,0,{"$f":"(AF106+AE106+AD106+AC106*(1+RdsonTopTc*Ta-RdsonTopTc*25))/(1-AC106*RdsonTopTc*ThetaJA_Q1)","v":0.80714385532720312},7.536922782247637,{"$f":"Rdson2*AH106^2","v":1.6473509457413404},6.9529600000000011E-2,{"$f":"(AJ106+AI106*(1+RdsonBotTc*Ta-RdsonBotTc*25))/(1-AI106*RdsonBotTc*ThetaJA_Q2)","v":2.0759638523719697},6.9529600000000011E-2,0.55871999999999988,0.30703315073697923,1.0560000000000001E-4,{"$f":"CHOOSE(Ext_VCC, (Qg_Q1+Qg_Q2)*Fsw*'Design Regulator'!$G$102, (Qg_Q1+Qg_Q2)*Fsw*Vout, (Qg_Q1+Qg_Q2)*Fsw*Vin)","v":0.13632},0.12758181818181816,0.12211999999999998,0.13642560000000001,4.7075571301009136,3.647782907699173,25.607999999999997,0.8447148073215951,17.638485829908046,33.905121785579546,null,84.471480732159506,0.74729541813927081,3.441827707699173,1.1758990553272031,2.2603414523719696,0.30703315073697923,3.5782533076991729,70.1337648309038]
[null,null,null,null,null,null,98,48,1,7.84,7.84,{"$f":"Vout*K107/(Vin*Efficiency)","v":0.5988888888888888},7.4997497547596645E-2,{"$f":"(Vin-(Rdson1+Rdcr)*K107-Vout)*M107/(Fsw*Lf)","v":3.7802665905678476},9.7301332952839239,5.9498667047160758,{"$f":"IF(MIN(Vin, -P107/(Coss_Q1+Coss_Q2)*0.00000002)<0, 0, MIN(Vin, -P107/(Coss_Q1+Coss_Q2)*0.00000002))","v":0},7.9155838671559966,{"$f":"R107^2*Rdcr","v":0.23809457824032507},0.5,{"$f":"(T107+S107*(1+Ltc*(Ta-25)))/(1-S107*Ltc*ThetaCa)","v":0.7524264713077552},1.0912689668364479,1.1908679579802886E-3,1.1908679579802886E-3,2.0848643093947401,4.3466591885880064E-3,4.3466591885880064E-3,2.1677357546573095,{"$f":"Rdson1*AB107^2","v":0.18796313208078783},0.60211200000000009,1.1520000000000028E-2,0,{"$f":"(AF107+AE107+AD107+AC107*(1+RdsonTopTc*Ta-RdsonTopTc*25))/(1-AC107*RdsonTopTc*ThetaJA_Q1)","v":0.81773403640338982},7.6129750857309775,{"$f":"Rdson2*AH107^2","v":1.6807643000228569},7.0246400000000001E-2,{"$f":"(AJ107+AI107*(1+RdsonBotTc*Ta-RdsonBotTc*25))/(1-AI107*RdsonBotTc*ThetaJA_Q2)","v":2.1262522279730853},7.0246400000000001E-2,0.56447999999999987,0.31328233978990144,1.0560000000000001E-4,{"$f":"CHOOSE(Ext_VCC, (Qg_Q1+Qg_Q2)*Fsw*'Design Regulator'!$G$102, (Qg_Q1+Qg_Q2)*Fsw*Vout, (Qg_Q1+Qg_Q2)*Fsw*Vin)","v":0.13632},0.12758181818181816,0.12211999999999998,0.13642560000000001,4.7863846026206991,3.715138264376475,25.872,0.84388007833225642,17.854362546050847,34.687959419596282,null,84.388007833225643,0.7524264713077552,3.5084662643764748,1.1902908364033897,2.3125306279730853,0.31328233978990144,3.6448918643764747,71.439880541778905]
[null,null,null,null,null,null,99,48,1,7.92,7.92,{"$f":"Vout*K108/(Vin*Efficiency)","v":0.60499999999999998},7.5061310697590616E-2,{"$f":"(Vin-(Rdson1+Rdcr)*K108-Vout)*M108/(Fsw*Lf)","v":3.7831842269847149},9.8115921134923578,6.028407886507642,{"$f":"IF(MIN(Vin, -P108/(Coss_Q1+Coss_Q2)*0.00000002)<0, 0, MIN(Vin, -P108/(Coss_Q1+Coss_Q2)*0.00000002))","v":0},7.9949425831548133,{"$f":"R108^2*Rdcr","v":0.24289260625018019},0.5,{"$f":"(T108+S108*(1+Ltc*(Ta-25)))/(1-S108*Ltc*ThetaCa)","v":0.75761411561609371},1.0921112159217858,1.1927069079421615E-3,1.1927069079421615E-3,2.1065893970456773,4.4377188877452707E-3,4.4377188877452707E-3,2.1903999504952414,{"$f":"Rdson1*AB108^2","v":0.19191407772518226},0.60825600000000002,1.1520000000000028E-2,0,{"$f":"(AF108+AE108+AD108+AC108*(1+RdsonTopTc*Ta-RdsonTopTc*25))/(1-AC108*RdsonTopTc*ThetaJA_Q1)","v":0.82838280146660315},7.6890347225651547,{"$f":"Rdson2*AH108^2","v":1.7145163939795658},7.0963200000000004E-2,{"$f":"(AJ108+AI108*(1+RdsonBotTc*Ta-RdsonBotTc*25))/(1-AI108*RdsonBotTc*ThetaJA_Q2)","v":2.1774784579101096},7.0963200000000004E-2,0.57023999999999997,0.31959553453971079,1.0560000000000001E-4,{"$f":"CHOOSE(Ext_VCC, (Qg_Q1+Qg_Q2)*Fsw*'Design Regulator'!$G$102, (Qg_Q1+Qg_Q2)*Fsw*Vout, (Qg_Q1+Qg_Q2)*Fsw*Vin)","v":0.13632},0.12758181818181816,0.12211999999999998,0.13642560000000001,4.8663301353282042,3.7834900593767129,26.135999999999999,0.84303340703469065,18.071118021999048,35.484864868651641,null,84.303340703469061,0.75761411561609371,3.576101259376713,1.2047412014666032,2.3656576579101096,0.31959553453971079,3.7125268593767129,72.765526443783571]
[null,null,null,null,null,null,100,48,1,8,8,{"$f":"Vout*K109/(Vin*Efficiency)","v":0.61111111111111105},7.512512512512512E-2,{"$f":"(Vin-(Rdson1+Rdcr)*K109-Vout)*M109/(Fsw*Lf)","v":3.7861014196014198},9.8930507098007094,6.1069492901992906,{"$f":"IF(MIN(Vin, -P109/(Coss_Q1+Coss_Q2)*0.00000002)<0, 0, MIN(Vin, -P109/(Coss_Q1+Coss_Q2)*0.00000002))","v":0},8.0743140263817867,{"$f":"R109^2*Rdcr","v":0.24773927858717751},0.5,{"$f":"(T109+S109*(1+Ltc*(Ta-25)))/(1-S109*Ltc*ThetaCa)","v":0.76285847933392126},1.092953336893052,1.1945469966256573E-3,1.1945469966256573E-3,2.1283337453648059,4.5298045316585827E-3,4.5298045316585827E-3,2.2130857418087877,{"$f":"Rdson1*AB109^2","v":0.19590994002389409},0.61440000000000006,1.1520000000000028E-2,0,{"$f":"(AF109+AE109+AD109+AC109*(1+RdsonTopTc*Ta-RdsonTopTc*25))/(1-AC109*RdsonTopTc*ThetaJA_Q1)","v":0.83909048756878735},7.7651013191089984,{"$f":"Rdson2*AH109^2","v":1.7486071563848211},7.1680000000000008E-2,{"$f":"(AJ109+AI109*(1+RdsonBotTc*Ta-RdsonBotTc*25))/(1-AI109*RdsonBotTc*ThetaJA_Q2)","v":2.2296613434368981},7.1680000000000008E-2,0.57599999999999996,0.32597273498312829,1.0560000000000001E-4,{"$f":"CHOOSE(Ext_VCC, (Qg_Q1+Qg_Q2)*Fsw*'Design Regulator'!$G$102, (Qg_Q1+Qg_Q2)*Fsw*Vout, (Qg_Q1+Qg_Q2)*Fsw*Vin)","v":0.13632},0.12758181818181816,0.12211999999999998,0.13642560000000001,4.9474129968510194,3.8528574310056856,26.4,0.84217475944991027,18.288757313531811,36.296120151553474,null,84.217475944991023,0.76285847933392126,3.6447518310056854,1.2192504875687873,2.4197413434368982,0.32597273498312829,3.7811774310056854,74.11107764771144]

{"sheet":"Bode Plot Management","index":5,"n_rows":6,"n_cols":14,"rows_kept":6,"cut":false,"hidden":true,"merged":[]}
[null,null,null,null,null,null,null,null,null,"Single or dual output (MODE)",null,null,null,"3.3V or 5V fixed (FB1/2)"]
[{"$f":"CHOOSE(BODE_PLOT_TYPE, \"BODE_PLOT_Ch1\", \"BODE_PLOT_Ch2\")","v":"BODE_PLOT_Ch1"},null,null,null,null,null,null,null,null,"With/without dither (DITH)",null,null,null,"With/without VOUT connected to VCCX"]
[null,null,null,null,null,null,null,null,null,"FPWM or DEM (DEMB)"]
[null,null,null,null,null,null,null,null,null,"Shunt or inductor DCR current sensing"]
[]
[null,null,null,null,null,{"$f":"INDIRECT(A2)","v":0}]

{"sheet":"Stability Calculations","index":6,"n_rows":687,"n_cols":38,"rows_kept":687,"cut":false,"hidden":true,"merged":[[9,1,10,1],[1,0,1,3],[1,9,1,11],[9,0,11,0],[9,18,9,19],[1,19,1,21],[10,6,10,7],[1,4,1,6],[9,2,9,7],[9,8,9,13],[9,20,9,22],[9,14,9,17],[1,12,1,14],[1,15,1,18],[9,27,9,28],[9,30,9,31],[10,2,10,3],[10,4,10,5],[10,8,10,9],[10,10,10,11],[10,12,10,13],[10,18,10,19],[10,14,10,15],[10,16,10,17]]}
[]
["Divider Network & EA Poles/Zeros",null,null,null,"Modulator",null,null,null,null,"Power Stage Poles/Zeros",null,null,"Complex Pole Pair",null,null,"Feedback natural frequencies",null,null,null,"Total System"]
[null,"Afb1",{"$f":"Afb","v":0.24012003827269846},"V/V","Acs",{"$f":"Acs","v":20},"A/V","gm",{"$f":"gm","v":3.0000000000000001E-5},"z_ESR",{"$f":"Fesr","v":489707.51776540431},"Hz","p3",{"$f":"Fsw/2","v":200000},"Hz","zterm1",{"$f":"((1/wffHz)+(1/wfftHz))","v":5.8109410928520001E-6},null,null,"Adc",{"$f":"IF(VOUT_setting=1,Am*Afb*AEA,Am*AEA)","v":12769.129412655066},"V/V"]
[null,"EA zero, z1",{"$f":"Fz1_u","v":7957.747163687819},"Hz","Am",{"$f":"Am","v":6.650588235757847},"V/V",null,null,"p_dom",{"$f":"Fp_dominant","v":1472.6742970867483},"Hz","pterm1",{"$f":"Q*pole3","v":124085.54082155261},null,"pterm3",{"$f":"((1/wfbtHz)+(1/wffHz)+(1/wfftHz)+(Afbr/wffHz))","v":4.051403656893155E-5},null,null,"Crossover",{"$f":"AI7","v":28.023499999999999},"kHz"]
[null,"EA pole, p1",{"$f":"Fp1_u","v":49.427001016694518},"Hz","Q",{"$f":"Q","v":0.62042770410776305},null,null,null,null,null,null,"pterm2",{"$f":"pole3^2","v":40000000000},null,"pterm4",{"$f":"1/(wffHz*wfbtHz)","v":1.5937437150456741E-12},null,null,"Phase Margin",{"$f":"AI9","v":54.318019066839128},"°",null,null,null,null,null,null,null,null,null,null,null,"Gain",null,null,"Phase"]
[null,"Aea",{"$f":"AEA","v":1920},"V/V","mc",{"$f":"mc","v":1.0894854586129754},null,null,null,null,null,null,null,null,null,"Afbr",{"$f":"Rfb1_/Rfb2_u","v":3.1565656565656566},null,null,"radconv",{"$f":"180/Pi","v":57.295779578552292},null,null,null,null,null,null,null,null,null,null,null,null,"XOVER SEARCH",null,null,"XOVER SEARCH"]
[null,"EA pole, p2",{"$f":"Fp2_u","v":221568.6380688971},"Hz","k",{"$f":"k","v":1.0130491182776471},null,null,null,null,null,null,null,null,null,null,null,null,null,"Gain Margin",{"$f":"AL9","v":-17.512578525012021},null,null,null,null,null,null,null,null,null,null,null,null,"xover",{"$f":"SUM(AH12:AH613)/1000","v":28.023499999999999},null,"Phase xover",{"$f":"SUM(AK12:AK613)/1000","v":126.03}]
[]
[null,null,null,null,null,null,null,null,null,null,null,null,null,null,null,null,null,null,null,null,null,null,null,null,null,null,null,null,null,null,null,null,null,"phase margin",{"$f":"SUM(AI13:AI613)","v":54.318019066839128},null,"gain margin",{"$f":"SUM(AL13:AL613)","v":-17.512578525012021}]
["Freq (Hz)",null,"Power Stage",null,null,null,null,null,"Error Amplifier",null,null,null,null,null,"Feedback Gain",null,null,null,"Sampling Double Pole",null,"System Response",null,null,null,null,null,null,"ERROR AMP Response",null,null,"PLANT Response"]
[null,null,"p_dom",null,"z_ESR",null,"z_RHP",null,"p1",null,"z1",null,"p2",null,"z1",null,"p1p2",null,"p3"]
[null,null,"Gain(V/V)","Phase(rad)","Gain(V/V)","Phase(rad)","Gain(V/V)","Phase(rad)","Gain(V/V)","Phase(rad)","Gain(V/V)","Phase(rad)","Gain(V/V)","Phase(rad)","Gain(V/V)","Phase(rad)","Gain(V/V)","Phase(rad)","Gain(V/V)","Phase(rad)","Gain (dB)","Phase (°)","Phase Margin (°)",null,null,"Fsquare",null,"Gain(dB)","Phase(Deg)",null,"Gain(dB)","Phase(Deg)"]
[1,{"$f":"A13/1000","v":1E-3},{"$f":"SQRT(1+(A13/pole1)^2)","v":1.0000002305454418},{"$f":"ATAN(A13/pole1)","v":6.7903666702221139E-4},{"$f":"SQRT(1+(A13/Zero1)^2)","v":1.000000000002085},{"$f":"ATAN(A13/Zero1)","v":2.0420352224971615E-6},{"$f":"IF(VIN_nom>Vout, 1, SQRT(1+(A13/z_RHP)^2))","v":1},{"$f":"IF(VIN_nom>Vout, 0, -ATAN(A13/z_RHP))","v":0},{"$f":"SQRT(1+(A13/Pole2)^2)","v":1.0002046430726832},{"$f":"ATAN(A13/Pole2)","v":2.0229096855131044E-2},{"$f":"SQRT(1+(A13/Zero2)^2)","v":1.0000000078956834},{"$f":"ATAN(A13/Zero2)","v":1.2566370533853279E-4},{"$f":"SQRT(1+(A13/pole4)^2)","v":1.0000000000101847},{"$f":"ATAN(A13/pole4)","v":4.513274119969355E-6},{"$f":"IF(VOUT_setting=1,1,SQRT(1+(A13*zterm1)^2))","v":1.0000000000168834},{"$f":"IF(VOUT_setting=1,0,ATAN(((A13*zterm1))))","v":5.8109410927865939E-6},{"$f":"IF(VOUT_setting=1,1,SQRT((1+Afbr-pterm4*(A13)^2)^2+(A13*$Q$4)^2))","v":4.1565656567615079},{"$f":"IF(VOUT_setting=1,0,ATAN(A13*$Q$4/(1+Afbr-$Q$5*(A13)^2)))","v":9.7469978619653573E-6},{"$f":"SQRT((1-(Z13/pterm2))^2+(A13/pterm1)^2)","v":1.0000000000074734},{"$f":"IF((ATAN((A13/pterm1)/(1-A13^2/pterm2))>0),ATAN((A13/pterm1)/(1-A13^2/pterm2)),PI()+ATAN((A13/pterm1)/(1-A13^2/pterm2)))","v":8.0589566953771884E-6},{"$f":"20*LOG10(((E13*K13*G13*O13)/(C13*I13*S13*M13*Q13))*Adc)","v":69.746753610977436},{"$f":"((F13+L13+H13+P13)-(D13+J13+T13+N13+R13))*radconv","v":-1.1915766649287949},{"$f":"IF(V13>0,V13,V13+180)","v":178.80842333507121},null,{"$f":"IF(U13<0,A13,1000000000)","v":1000000000},{"$f":"A13^2","v":1},null,{"$f":"20*LOG10((K13/(I13*M13))*AEA)","v":65.664247317271503},{"$f":"(L13-(J13+N13))*radconv","v":-1.1521004660818284},null,{"$f":"20*LOG10((E13*G13/(C13*S13))*Acs*Am)","v":42.477799106262957},{"$f":"(F13+H13-(D13+T13))*radconv","v":-3.9250679405911024E-2},null,{"$f":"SUM((U14<0)*(U13>0))*A13","v":0},{"$f":"IF(AH13>0,W11,0)","v":0},null,{"$f":"SUM((V14<-182)*(V13>-182))*A13","v":0},{"$f":"IF(AK13>0,U13,0)","v":0}]
[1.0965,{"$f":"A14/1000","v":1.0965E-3},1.0000002771876024,7.4456368223781958E-4,1.0000000000025069,2.2390916214675083E-6,1,0,1.0002460397810671,2.2180592658660406E-2,1.000000009493077,1.3779025275696436E-4,1.0000000000122453,4.9488050725395995E-6,1.0000000000202993,6.3716969082259915E-6,{"$f":"IF(VOUT_setting=1,1,SQRT((1+Afbr-pterm4*(A14)^2)^2+(A14*$Q$4)^2))","v":4.1565656568011313},1.068758315557737E-5,1.0000000000089853,8.8366460164870815E-6,69.746393733409846,-1.3065287442960216,178.69347125570397,null,1000000000,1.2023122500000001,null,65.663887844895072,-1.2632430935868393,null,42.477798701124925,-4.3038368642067913E-2,null,0,0,null,{"$f":"SUM((V15<-183)*(V14>-183))*A14","v":0},{"$f":"IF(AK14>0,U14,0)","v":0}]
[1.2022999999999999,1.2022999999999999E-3,1.0000003332592495,8.1640572885672029E-4,1.0000000000030138,2.4551389480068163E-6,1,0,1.0002958032556268,2.4319965366854903E-2,1.0000000114134102,1.5108547257419971E-4,1.0000000000147224,5.4263094744227409E-6,1.0000000000244056,6.9864944758222864E-6,{"$f":"IF(VOUT_setting=1,1,SQRT((1+Afbr-$Q$5*(A15)^2)^2+(A15*$Q$4)^2))","v":4.1565656568487643},1.1718815529277612E-5,1.0000000000108029,9.6892836348664599E-6,69.745961139984175,-1.4325479503854162,178.56745204961459,null,1000000000,1.4455252899999997,null,65.663455738576644,-1.3850857197147828,null,42.477798214081552,-4.7191088646659642E-2,null,0,0,null,0,0]
[1.3183,1.3183000000000001E-3,1.0000004006683223,8.9517393660902013E-4,1.0000000000036233,2.6920150338152468E-6,1,0,1.0003556253993231,2.6665334804150068E-2,1.000000013722026,1.6566246210431696E-4,1.0000000000177005,5.9498492723257902E-6,1.0000000000293421,7.6605636425569403E-6,4.1565656569060287,1.2849467281132298E-5,1.0000000000129881,1.0624122611542022E-5,69.745441135063288,-1.5707017537890569,178.42929824621095,null,1000000000,1.7379148900000001,null,65.662936319253788,-1.5186602866661447,null,42.477797628560324,-5.1744164843782157E-2,null,0,0,null,0,0]
[1.4454,1.4454000000000001E-3,1.0000004816511332,9.8147943421055222E-4,1.0000000000043558,2.9515577105929285E-6,1,0,1.000427488824813,2.9234794045221318E-2,1.000000016495513,1.8163431865496585E-4,1.0000000000212781,6.5234864129554622E-6,1.0000000000352727,8.3991342554107729E-6,4.1565656569748253,1.4088310709204675E-5,1.0000000000156133,1.1648416007540706E-5,69.744816502136615,-1.7220560923929167,178.2779439076071,null,1000000000,2.0891811599999999,null,65.662312389843237,-1.6649972039934187,null,42.477796925136424,-5.6732922599417833E-2,null,0,0,null,0,0]
[1.5849,1.5849E-3,1.0000005791088411,1.0762049634797744E-3,1.0000000000052371,3.2364216241289499E-6,1,0,1.0005139650912369,3.2054486559963902E-2,1.0000000198332304,1.9916440500601765E-4,1.0000000000255833,7.1530881526659995E-6,1.0000000000424099,9.2097605378007458E-6,4.1565656570576177,1.5448016910698209E-5,1.0000000000187725,1.2772640466568021E-5,69.744064914553704,-1.8881511715801278,178.11184882841988,null,1000000000,2.51190801,null,65.661561648897589,-1.8255853583563417,null,42.477796078610197,-6.2208387461690294E-2,null,0,0,null,0,0]
[1.7378,1.7378000000000001E-3,1.0000006962352777,1.1800295535994206E-3,1.0000000000062963,3.548648809645604E-6,1,0,1.0006178839555697,3.5144444020142121E-2,1.0000000238445599,2.1837838481537569E-4,1.0000000000307576,7.8431677655751756E-6,1.0000000000509872,1.0098253430814951E-5,4.1565656571571177,1.693833288345301E-5,1.0000000000225693,1.4004854945321279E-5,69.743161814589442,-2.0701672559650306,177.92983274403497,null,1000000000,3.0199488400000001,null,65.660659566437175,-2.001565538599225,null,42.477795061239767,-6.8209809681187436E-2,null,0,0,null,0,0]
[1.9055,1.9055000000000001E-3,1.0000008370941651,1.2939038458004391E-3,1.0000000000075704,3.8910981164541124E-6,1,0,1.0007428448433053,3.8532720794014756E-2,1.0000000286686757,2.3945218720648195E-4,1.0000000000369804,8.6000438354479776E-6,1.000000000061303,1.1072748251976958E-5,4.1565656572767793,1.85729044244463E-5,1.0000000000271352,1.5356341983176623E-5,69.74207597424595,-2.2697572905790322,177.73024270942096,null,1000000000,3.63093025,null,65.659574949766537,-2.1945354236539449,null,42.477793837727361,-7.4792139630225143E-2,null,0,0,null,0,0]
[2.0893000000000002,2.0893000000000001E-3,1.0000010063706912,1.4187105746286592E-3,1.0000000000091012,4.2664241903433637E-6,1,0,1.0008929954041428,4.2245268993017594E-2,1.0000000344660356,2.6254917491311388E-4,1.0000000000444587,9.4295836186365173E-6,1.0000000000736995,1.214079922469917E-5,4.1565656574205816,2.03644026308603E-5,1.0000000000326228,1.6837578223841442E-5,69.740771428642631,-2.4884505163591015,177.51154948364089,null,1000000000,4.3651744900000002,null,65.658271874706287,-2.4059729361507642,null,42.477792367377127,-8.2006402440236256E-2,null,0,0,null,0,0]
[2.2909000000000002,2.2909000000000002E-3,1.0000012099532543,1.5556040847675267E-3,1.0000000000109424,4.6780984911911235E-6,1,0,1.0010735460859681,4.6316013371460733E-2,1.0000000414383055,2.8788297612247825E-4,1.0000000000534524,1.0339459681139557E-5,1.0000000000886085,1.3312284948828261E-5,4.1565656575935286,2.2329397399008777E-5,1.000000000039222,1.8462263893702436E-5,69.739203017750299,-2.7282459866893087,177.2717540133107,null,1000000000,5.2482228100000006,null,65.656705232380915,-2.6378100209470157,null,42.477790599042081,-8.9919323254912378E-2,null,0,0,null,0,0]
[2.5118999999999998,2.5118999999999996E-3,1.0000014546582228,1.7056708119377578E-3,1.0000000000131553,5.1293882753527633E-6,1,0,1.0012905238407774,5.0776716927560181E-2,1.0000000498189319,3.1565465261768153E-4,1.0000000000642626,1.1336893261542306E-5,1.000000000106529,1.4596502930098304E-5,4.1565656578014085,2.4483483925403831E-5,1.0000000000471543,2.0243293323478153E-5,69.737318544890059,-2.9910156416724938,177.0089843583275,null,1000000000,6.309641609999999,null,65.65482288532661,-2.8918554575421247,null,42.477788473514892,-9.8593701846564644E-2,null,0,0,null,0,0]
[2.7542,2.7542000000000001E-3,1.0000017488282431,1.8702008953170876E-3,1.0000000000158158,5.6241734097501992E-6,1,0,1.0015512996749421,5.5665013857593558E-2,1.0000000598936343,3.4610296524562376E-4,1.0000000000772582,1.2430459580663762E-5,1.0000000001280718,1.6004493956566494E-5,4.15656565805131,2.6845181505894124E-5,1.0000000000566902,2.2195978530897699E-5,69.735054220535361,-3.278977576289182,176.72102242371082,null,1000000000,7.5856176399999997,null,65.652561116490944,-3.1702523378857368,null,42.47778591833093,-0.10810411275913899,null,0,0,null,0,0]
[3.02,3.0200000000000001E-3,1.0000021026646799,2.0506881749858155E-3,1.0000000000190155,6.1669463718718213E-6,1,0,1.0018648787693329,6.1024343172827344E-2,1.0000000720117892,3.7950437390080741E-4,1.0000000000928897,1.3630087841555937E-5,1.0000000001539844,1.7549042098611521E-5,4.1565656583518988,2.9435933535657382E-5,1.0000000000681601,2.4338049220701404E-5,69.732332182786877,-3.5946922367822438,176.40530776321776,null,1000000000,9.1204000000000001,null,65.649842152595681,-3.4754742629087367,null,42.477782844880771,-0.11853690516185671,null,0,0,null,0,0]
[3.3113000000000001,3.3113000000000001E-3,1.0000025278604758,2.2484906718505449E-3,1.0000000000228608,6.761791232161196E-6,1,0,1.00224156875185,6.6893789748786459E-2,1.0000000865738579,4.161102056616229E-4,1.0000000001116736,1.4944804592443374E-5,1.0000000001851228,1.9241769238386101E-5,4.1565656587131095,3.2275234010264357E-5,1.0000000000819436,2.6685623306293592E-5,69.72906343184026,-3.9404640881606623,176.05953591183933,null,1000000000,10.964707690000001,null,65.646577095414955,-3.8097467482262881,null,42.477779151599236,-0.12997057740965937,null,0,0,null,0,0]
[3.6307999999999998,3.6308E-3,1.0000030392091204,2.4654417142277282E-3,1.0000000000274853,7.4142214857171438E-6,1,0,1.0026943961549817,7.3326123904049079E-2,1.0000001040864896,4.5625975208448278E-4,1.0000000001342635,1.6386795673429232E-5,1.0000000002225704,2.1098364916796457E-5,4.1565656591475078,3.5389399823735829E-5,1.0000000000985194,2.9260459970770065E-5,69.725135615842063,-4.3194044868759143,175.68059551312408,null,1000000000,13.182708639999998,null,65.642653721608582,-4.1760745686029166,null,42.477774709989902,-0.1425111022870201,null,0,0,null,0,0]
[3.9811000000000001,3.9811000000000004E-3,1.0000036539446979,2.7033067054184306E-3,1.0000000000330447,8.1295464241156561E-6,1,0,1.0032385081351636,8.037154066653146E-2,1.0000001251399213,5.002797382199555E-4,1.0000000001614209,1.7967795597198415E-5,1.0000000002675895,2.3133937580626164E-5,4.1565656596697353,3.8803773170244016E-5,1.000000000118447,3.2083512501562623E-5,69.720418339688749,-4.7344739813988781,175.26552601860112,null,1000000000,15.849157210000001,null,65.637941785787831,-4.5773156396656214,null,42.477769370357585,-0.15626052628728232,null,0,0,null,0,0]
[4.3651999999999997,4.3651999999999996E-3,1.0000043930275753,2.9641226334828868E-3,1.0000000000397287,8.9138921530209074E-6,1,0,1.0038922918551108,8.8087555304064327E-2,1.0000001504520093,5.4854715441118591E-4,1.0000000001940714,1.970134418607502E-5,1.0000000003217151,2.536592005307715E-5,4.1565656602975984,4.2547595043018512E-5,1.0000000001424052,3.5178957768788962E-5,69.714753620147263,-5.1890655512664914,174.81093444873352,null,1000000000,19.054971039999998,null,65.632283486804781,-5.0167445193415059,null,42.477762950641072,-0.17133659446197069,null,0,0,null,0,0]
[4.7862999999999998,4.7862999999999994E-3,1.0000052814755771,3.2500622554805115E-3,1.0000000000477636,9.7737931851405283E-6,1,0,1.0046776396842614,9.6534745826488105E-2,1.0000001808795731,6.0146412349941785E-4,1.0000000002333207,2.1601883917195885E-5,1.0000000003867788,2.7812907345545897E-5,4.1565656610523503,4.6652055834749327E-5,1.0000000001712055,3.8572584433915741E-5,69.70795382600555,-5.6867541629823917,174.3132458370176,null,1000000000,22.908667689999998,null,65.625491410779446,-5.4978098594810048,null,42.47775523353674,-0.18786489980210247,null,0,0,null,0,0]
[5.2481,5.2481000000000003E-3,1.0000063497907643,3.5636377943554214E-3,1.000000000057425,1.0716805050791976E-5,1,0,1.0056211707443936,0.10578246672436598,1.0000002174672626,6.5949559984613225E-4,1.0000000002805161,2.3686113904742443E-5,1.0000000004650151,3.0496399939942391E-5,4.1565656619599034,5.1153219436904177E-5,1.0000000002058362,4.2294210636770936E-5,69.699791440758034,-6.2316339027643597,173.76836609723563,null,1000000000,27.542553609999999,null,65.61733830617959,-6.0244596965543655,null,42.477745954106005,-0.20599065763330329,null,0,0,null,0,0]
[5.7544000000000004,5.7544000000000007E-3,1.0000076340504753,3.9074293109389192E-3,1.0000000000690394,1.1750687483813161E-5,1,0,1.0067542538878047,0.11590043226435645,1.0000002614506762,7.2311910376641542E-4,1.0000000003372511,2.5971184590288793E-5,1.0000000005590659,3.3438479412244672E-5,4.1565656630509062,5.6088124440544812E-5,1.0000000002474674,4.6374460412869024E-5,69.689999353488105,-6.8278227202160613,173.17217727978394,null,1000000000,33.113119360000006,null,65.607557375493442,-6.6006619865667355,null,42.477734798985161,-0.22586300458025182,null,0,0,null,0,0]
[6.3095999999999997,6.3095999999999994E-3,1.0000091782155498,4.2844241971790754E-3,1.0000000000830043,1.2884425439173024E-5,1,0,1.0081149633450182,0.12696821255524604,1.0000003143354184,7.9288755322250788E-4,1.0000000004054683,2.8476954379854323E-5,1.0000000006721506,3.6664713903029506E-5,4.1565656643627058,6.1499657635184538E-5,1.0000000002975236,5.0848793171765245E-5,69.678254644859493,-7.4800227787993139,172.51997722120069,null,1000000000,39.811052159999996,null,65.595826081271994,-7.2309452188693548,null,42.477721386337002,-0.24765462246803388,null,0,0,null,0,0]
[6.9183000000000003,6.9183000000000005E-3,1.0000110345080326,4.6977455372996411E-3,1.0000000000997917,1.4127412278881882E-5,1,0,1.0097482933924837,0.139066570992921,1.0000003779100402,8.6937899818843466E-4,1.0000000004874747,3.1224184334248662E-5,1.0000000008080936,4.0201833741020095E-5,4.1565656659396666,6.7432655209572959E-5,1.0000000003576979,5.5754280114383723E-5,69.6641777334723,-8.1930111126981036,171.80698888730188,null,1000000000,47.862874890000008,null,65.58176529576491,-7.9199048648882036,null,42.477705262571455,-0.27154603666529636,null,0,0,null,0,0]
[7.5857999999999999,7.5858000000000002E-3,1.0000132665038108,5.1509915833162188E-3,1.0000000001199774,1.5490470789601496E-5,1,0,1.0117087129462115,0.15228655840967026,1.0000004543519636,9.5325945223126841E-4,1.000000000586079,3.4236794806119014E-5,1.0000000009715513,4.4080636913605635E-5,4.1565656678357987,7.3938776250501644E-5,1.0000000004300515,6.1133633711376139E-5,69.64731175947415,-8.9721769481500413,171.02782305184996,null,1000000000,57.544361639999998,null,65.564918711395848,-8.6727209638092706,null,42.477685875484887,-0.2977452389706981,null,0,0,null,0,0]
[8.3176000000000005,8.3176000000000014E-3,1.0000159495777048,5.6478961953566227E-3,1.0000000001442424,1.6984832165032713E-5,1,0,1.014060315589228,0.16671847277187291,1.0000005462427359,1.0452200603963634E-3,1.000000000704611,3.753960880287812E-5,1.0000000011680434,4.8333083596269033E-5,4.1565656701151381,8.1071629243752519E-5,1.0000000005170278,6.7031178224784908E-5,69.627123306613456,-9.8228728709693751,170.17712712903062,null,1000000000,69.182469760000004,null,65.544753566679546,-9.4945290305699857,null,42.477662570396888,-0.32646805990424871,null,0,0,null,0,0]
[9.1201000000000008,9.1201000000000008E-3,1.0000191757176742,6.1928040911451493E-3,1.0000000001734186,1.8623565430569138E-5,1,0,1.0168807006874345,0.18246428015028288,1.000000656732924,1.1460650633181709E-3,1.000000000847135,4.1161511278565764E-5,1.0000000014043073,5.2996363811304073E-5,4.1565656728558338,8.889359497237843E-5,1.0000000006216083,7.3498490977749417E-5,69.602971885905376,-10.751149265738636,169.24885073426137,null,1000000000,83.176224010000013,null,65.520630171705022,-10.391126866076602,null,42.47763454833833,-0.35796563981795004,null,0,0,null,0,0]
[10,0.01,1.0000230542810948,6.7902633508676946E-3,1.0000000002084954,2.0420352222161632E-5,1,0,1.0202611442250247,0.19962395358672247,1.0000007895680385,1.2566363985333933E-3,1.0000000010184822,4.5132741169355403E-5,1.0000000016883517,5.8109410863113912E-5,4.1565656761507928,9.7469978317772332E-5,1.0000000007473391,8.0589566980507991E-5,69.574112499602577,-11.762952065487879,168.23704793451213,null,1000000000,100,null,65.491804478670389,-11.368195996793062,null,42.477600859488412,-0.39250087429784614,null,0,0,null,0,0]
[10.965,1.0964999999999999E-2,1.0000277183799355,7.4455006135875695E-3,1.0000000002506766,2.2390916210970581E-5,1,0,1.0243114808352063,0.21830688118148722,1.0000009493072493,1.3779016642553354E-3,1.0000000012245336,4.9488050685400143E-5,1.000000002029926,6.3716968996895023E-5,4.1565656801131068,1.0687583115779298E-4,1.000000000898535,8.8366460200117923E-5,69.539659503538161,-12.864799153950742,167.13520084604926,null,1000000000,120.23122499999999,null,65.457391999685314,-12.431950451063445,null,42.477560347722154,-0.43037588223406648,null,0,0,null,0,0]
[12.023,1.2022999999999999E-2,1.0000333253752234,8.1638777264080552E-3,1.0000000003013854,2.4551389475184545E-5,1,0,1.0291595605551023,0.23861344786950295,1.0000011413403671,1.5108535876392514E-3,1.0000000014722417,5.4263094691501065E-5,1.0000000024405551,6.9864944645686754E-5,4.156565684876468,1.1718815476812008E-4,1.0000000010802976,9.6892836395130733E-5,69.498599013820197,-14.062699044321043,165.93730095567895,null,1000000000,144.55252899999999,null,65.416380217748738,-13.588087025789269,null,42.47751164632799,-0.4719005983156474,null,0,0,null,0,0]
[13.183,1.3183E-2,1.0000400660376003,8.9515026567004007E-3,1.0000000003623473,2.6920150331714538E-5,1,0,1.0349578381784819,0.26064897808255105,1.0000013722016512,1.6566231207174151E-3,1.0000000017700352,5.9498492653750381E-5,1.0000000029342118,7.6605636277216478E-5,4.1565656906029576,1.2849467211968491E-4,1.0000000012988117,1.0624122617667507E-4,69.449743558268636,-15.362979003696593,164.63702099630342,null,1000000000,173.79148899999998,null,65.367583317745414,-14.842577894943739,null,42.477453098458426,-0.51742808599267787,null,0,0,null,0,0]
[14.454000000000001,1.4454E-2,1.0000481639650367,9.8144823578925119E-3,1.0000000004355847,2.9515577097443978E-5,1,0,1.0418810103040395,0.28449861006188742,1.0000016495499615,1.8163412090937291E-3,1.0000000021277937,6.5234864037942437E-5,1.0000000035272727,8.3991342358575899E-5,4.1565656974825558,1.4088310618045523E-4,1.0000000015613268,1.1648416015614208E-4,69.391766328519552,-16.770809657925842,163.22919034207416,null,1000000000,208.91811600000003,null,65.309676433466478,-16.200238649345479,null,42.477382762213182,-0.56731135062058968,null,0,0,null,0,0]
[15.849,1.5848999999999999E-2,1.0000579092241473,1.0761638325114359E-2,1.0000000005237213,3.2364216230102614E-5,1,0,1.0501521005353855,0.31029671434112172,1.0000019833210967,1.9916414430178465E-3,1.0000000025583335,7.15308814058801E-5,1.0000000042409845,9.2097605120221667E-5,4.156565705761718,1.5448016790515579E-4,1.000000001877247,1.2772640477211984E-4,69.32300291109631,-18.294312483214899,161.7056875167851,null,1000000000,251.19080099999999,null,65.240997670879338,-17.668677917333348,null,42.47729811847865,-0.62206030831468473,null,0,0,null,0,0]
[17.378,1.7378000000000001E-2,1.0000696211284501,1.1799753339691068E-2,1.0000000006296454,3.5486488081709061E-5,1,0,1.0600070609067687,0.33808989019987529,1.0000023844531807,2.1837804114535103E-3,1.0000000030757639,7.8431677496535119E-5,1.0000000050987361,1.0098253396832654E-4,4.1565657157117686,1.6938332725023708E-4,1.000000002256926,1.4004854959352554E-4,69.241773597267255,-19.936482337667986,160.063517662332,null,1000000000,301.99488400000001,null,65.159870094592065,-19.250496229632219,null,42.477196394278927,-0.68206703126088586,null,0,0,null,0,0]
[19.055,1.9054999999999999E-2,1.0000837059481962,1.2938323671047039E-2,1.0000000007570322,3.8910981145099585E-5,1,0,1.0717388443586395,0.3679599199505485,1.0000028668634982,2.3945173413275301E-3,1.0000000036980377,8.600043814457809E-5,1.0000000061302876,1.1072748207176732E-4,4.156565727677922,1.8572904215582593E-4,1.0000000027135363,1.5356342001674622E-4,69.146051163718866,-21.702459906482868,158.29754009351714,null,1000000000,363.09302500000001,null,65.064270009760421,-20.95028219159024,null,42.477074061607681,-0.74788044203800996,null,0,{"$f":"IF(AH45>0,W43,0)","v":0},null,0,0]
[20.893000000000001,2.0893000000000002E-2,1.0001006320563604,1.4186163545930436E-2,1.0000000009101186,4.2664241877806145E-5,1,0,1.0856697586778985,0.39992446239772633,1.0000034465976813,2.6254857767965666E-3,1.0000000044458524,9.4295835909676429E-5,1.0000000073699502,1.2140799165644294E-4,4.1565657420581958,2.0364402355539809E-4,1.0000000032622658,1.6837578248225175E-4,69.033733784108207,-23.593679162557621,156.40632083744237,null,1000000000,436.51744900000006,null,64.952099657627087,-22.768957344686651,null,42.476927053412929,-0.82001004031387659,null,0,0,null,0,0]
[22.909000000000002,2.2909000000000002E-2,1.0001209880795676,1.5554798770634756E-2,1.0000000010942303,4.6780984878126389E-5,1,0,1.1021907581328647,0.43401673037931215,1.0000041438220404,2.8788218878713729E-3,1.0000000053452214,1.0339459644663533E-4,1.0000000088608465,1.3312284870975905E-4,4.1565657593528185,2.2329397036052333E-4,1.0000000039222026,1.8462263925847643E-4,68.902382525997695,-25.612595138398859,154.38740486160114,null,1000000000,524.82228100000009,null,64.820925217420879,-24.708306646891259,null,42.476750258699091,-0.89912206679714457,null,0,0,null,0,0]
[25.119,2.5118999999999999E-2,1.0001454553494427,1.7055070834323015E-2,1.0000000013155312,5.1293882708991687E-5,1,0,1.1217269334975621,0.47018925437179315,1.0000049818809074,3.1565361473576306E-3,1.0000000064262573,1.1336893213458804E-4,1.0000000106528948,1.45965028274716E-4,4.1565657801408493,2.4483483446946573E-4,1.0000000047154423,2.0243293365852677E-4,68.749569619601303,-27.75700727229761,152.24299272770239,null,1000000000,630.96416099999999,null,64.668324835564462,-26.765499240706021,null,42.476537762033914,-0.98584320896888378,null,0,0,null,0,0]
[27.542000000000002,2.7542000000000001E-2,1.0001748676878743,1.8699850770497382E-2,1.0000000015815662,5.6241734038794977E-5,1,0,1.1447709762465879,0.50837391538839583,1.0000059893456696,3.4610159711740795E-3,1.0000000077258162,1.243045951728037E-4,1.0000000128071913,1.6004493821284569E-4,4.1565658051310148,2.6845180875194552E-4,1.0000000056690292,2.219597858675555E-4,68.572693641123351,-30.02362904908972,149.97637095091028,null,1000000000,758.56176400000004,null,64.4917043279833,-28.9365003200625,null,42.476282324646562,-1.0809174728680071,null,0,0,null,0,0]
[30.2,3.0199999999999998E-2,1.0002102445876506,2.0504036607576513E-2,1.0000000019015614,6.1669463641321145E-5,1,0,1.1718888732081301,0.54847000782452948,1.0000072011532537,3.7950257021632516E-3,1.0000000092889647,1.363008775799373E-4,1.0000000153984439,1.7549041920261082E-4,4.1565658351899355,2.9435932704167559E-4,1.0000000068160322,2.4338049294342224E-4,68.369040471346224,-32.407403906435633,147.59259609356437,null,1000000000,912.04,null,64.288358426385642,-31.21538718267319,null,42.475975096773269,-1.1852060370201563,null,0,0,null,0,0]
[33.113,3.3112999999999997E-2,1.0002527544246798,2.2481156501697942E-2,1.0000000022860909,6.7617912219588699E-5,1,0,1.203667816890073,0.59026358865886586,1.0000086573486873,4.1610782808478696E-3,1.0000000111673593,1.4944804482293331E-4,1.0000000185122839,1.92417690032881E-4,4.1565658713109528,3.2275232914211015E-4,1.0000000081943556,2.6685623403365459E-4,68.136279536748972,-34.896721514606035,145.10327848539396,null,1000000000,1096.470769,null,64.055966699150162,-33.589762987289696,null,42.475605937846368,-1.2994909025624823,null,0,0,null,0,0]
[36.308,3.6308E-2,1.0003038752038134,2.4649473570257568E-2,1.0000000027485341,7.4142214722675061E-5,1,0,1.2408082881977933,0.6335579113224481,1.0000104085953438,4.5625661775222709E-3,1.0000000134263536,1.6386795528219395E-4,1.0000000222570498,2.1098364606868806E-4,4.1565659147508036,3.5389398378818236E-4,1.0000000098519548,2.9260460098739068E-4,67.871890012723469,-37.481183529952858,142.51881647004714,null,1000000000,1318.2708640000001,null,63.792021149654659,-36.04816759360493,null,42.475162021565104,-1.4248277771384557,null,0,0,null,0,0]
[39.811,3.9810999999999999E-2,1.0003653284049276,2.7026550608116741E-2,1.0000000033044762,8.1295464063854876E-5,1,0,1.2840367675915121,0.67805555981786658,1.0000125139146128,5.0027560635419379E-3,1.0000000161420837,1.7967795405773559E-4,1.0000000267589531,2.3133937172059804E-4,4.1565659669735604,3.8803771265461694E-4,1.0000000118446963,3.2083512670259508E-4,67.573919117799747,-40.144589928809808,139.85541007119019,null,1000000000,1584.9157210000001,null,63.494583934416966,-38.573379877085216,null,42.474628411904845,-1.5622318981221153,null,0,0,null,0,0]
[43.652000000000001,4.3652000000000003E-2,1.0004392072709556,2.9632636691955535E-2,1.0000000039728736,8.9138921296478207E-5,1,0,1.3341564243411144,0.7234335119184595,1.0000150450888714,5.4854170752813292E-3,1.0000000194071479,1.970134393372607E-4,1.0000000321714946,2.5365919514477858E-4,4.1565660297598583,4.2547592532008041E-4,1.000000014240527,3.5178957991176382E-4,67.240713686973692,-42.86940199754639,137.13059800245361,null,1000000000,1905.497104,null,63.162020048429952,-41.14668382957057,null,42.473986951256308,-1.7128737944757881,null,0,0,null,0,0]
[47.863,4.7863000000000003E-2,1.000528009555367,3.2489300749323317E-2,1.0000000047763515,9.7737931543296998E-5,1,0,1.3920186665967667,0.7693238875765448,1.000018087795371,6.0145694334542898E-3,1.0000000233320692,2.1601883584544907E-4,1.00000003867789,2.7812906635554503E-4,4.1565661052350276,4.6652052524689654E-4,1.0000000171205459,3.8572584727070895E-4,66.871202862163187,-45.635573752223422,134.36442624777658,null,1000000000,2290.8667689999997,null,62.793280296863763,-43.746779410184978,null,42.473215979217038,-1.8780003065353272,null,0,0,null,0,0]
[52.481000000000002,5.2481E-2,1.0006347796198458,3.5621454602423046E-2,1.0000000057424954,1.071680501017478E-4,1,0,1.4585588452073179,0.81535739316376288,1.0000217464921615,6.5948613445882811E-3,1.0000000280515993,2.3686113466216425E-4,1.0000000465015195,3.0496399003977325E-4,4.1565661959903073,5.1153215073329963E-4,1.0000000205836308,4.229421102323051E-4,66.464729677420848,-48.423137913782391,131.5768620862176,null,1000000000,2754.255361,null,62.387734109633435,-46.352250897865638,null,42.472289103399262,-2.0590515321137031,null,0,0,null,0,0]
[57.544000000000004,5.7544000000000005E-2,1.0007631167878486,3.9054623651902071E-2,1.0000000069039328,1.1750687430270029E-4,1,0,1.5347354078534219,0.8611333976032598,1.0000261447292524,7.2310662619940874E-3,1.0000000337251209,2.5971184012207123E-4,1.0000000559065938,3.3438478178419946E-4,4.1565663050905854,5.6088118688315484E-4,1.0000000247467338,4.6374460922314712E-4,66.021462563267988,-51.210360507813022,128.78963949218698,null,1000000000,3311.3119360000005,null,61.945581111736033,-48.939880150486658,null,42.471175133436951,-2.2575030692244749,null,0,0,null,0,0]
[63.095999999999997,6.3095999999999999E-2,1.0009174049510436,4.2818317103700244E-2,1.0000000083004208,1.2884425368588561E-4,1,0,1.6215973396662771,0.90628323838508196,1.0000314330527587,7.9287110448883601E-3,1.0000000405468457,2.8476953617784901E-4,1.00000006721506,3.6664712276511757E-4,4.156566436270495,6.1499650052176513E-4,1.0000000297523626,5.0848793843353689E-4,65.541979017102676,-53.977529285238063,126.02247071476194,null,1000000000,3981.1052159999995,null,61.467436777666379,-51.488239074453794,null,42.4698360972411,-2.4750608395778553,null,0,0,null,0,0]
[69.183000000000007,6.9183000000000008E-2,1.0011028487535945,4.6943287991575003E-2,1.0000000099791888,1.4127412185835006E-4,1,0,1.7202213813644209,0.95044565746895071,1.0000377902971134,8.6935731506656618E-3,1.0000000487474832,3.1224183329662435E-4,1.0000000808093685,4.0201831596888249E-4,4.1565665939665131,6.7432645213390285E-4,1.0000000357698069,5.5754280999694794E-4,65.027598430209835,-56.705414807404402,123.2945851925956,null,1000000000,4786.2874890000012,null,60.954665558907521,-53.976309979998419,null,42.468226940562516,-2.7135027204588242,null,0,0,null,0,0]
[75.858000000000004,7.5858000000000009E-2,1.0013257803343394,5.1464885989637041E-2,1.0000000119977341,1.5490470666940133E-4,1,0,1.8317892851329713,0.99331631980009993,1.0000454341745562,9.5323086818008759E-3,1.0000000586079043,3.4236793481798192E-4,1.0000000971551228,4.4080634087050432E-4,4.1565667835797111,7.393876307278535E-4,1.0000000430051639,6.1133634878459482E-4,64.479906966831265,-59.378267909893012,120.62173209010699,null,1000000000,5754.4361640000006,null,60.408908405712872,-56.386288091666195,null,42.466292884631898,-2.9748723704568767,null,0,0,null,0,0]
[83.176000000000002,8.3176E-2,1.0015937005492046,5.6419621689490579E-2,1.000000014424226,1.6984832003337296E-4,1,0,1.9575066705614268,1.0346184890146712,1.000054622796692,1.0451823805717762E-2,1.0000000704611089,3.7539607057123772E-4,1.0000001168043418,4.8333079870230088E-4,4.1565670115135855,8.1071611872543222E-4,1.0000000517027818,6.7031179763264595E-4,63.901107850900999,-61.981974562486556,118.01802543751344,null,1000000000,6918.2469760000004,null,59.832433383274967,-58.701936112027255,null,42.463969096777191,-3.2612806533260037,null,0,0,null,0,0]
[91.201000000000008,9.1201000000000004E-2,1.0019157550940267,6.1849844854143396E-2,1.0000000173418593,1.8623565217410753E-4,1,0,2.0987224549846495,1.0741492921178215,1.0000656711576239,1.1460153917621384E-2,1.0000000847134971,4.1161508977188431E-4,1.0000001404307193,5.299635889937502E-4,4.1565672855830806,8.889357207241829E-4,1.0000000621608682,7.3498493005882514E-4,63.293375651948566,-64.506930113829839,115.49306988617016,null,1000000000,8317.6224010000005,null,59.227494047621875,-60.911186430295139,null,42.461176600978938,-3.5751760954002294,null,0,0,null,0,0]
[100,0.1,1.0023028032331205,6.779959902391737E-2,1.000000020849539,2.0420351941163382E-4,1,0,2.256829688198843,1.1117432079582463,1.0000789537181833,1.2565709195432184E-2,1.0000001018482112,4.5132738135540912E-4,1.0000001688351676,5.8109404387912688E-4,4.156567615078897,9.7469948129665107E-4,1.0000000747339435,8.0589569654115271E-4,62.659260023058152,-66.945748074905268,113.05425192509473,null,1000000000,10000,null,58.596733720587238,-63.004090840978542,null,42.457821740945612,-3.9191053035435508,null,0,0,null,0,0]
[109.65,0.10965000000000001,1.0027680453713881,7.4319248575605179E-2,1.0000000250676562,2.2390915840520646E-4,1,0,2.433392894105125,1.147301718067582,1.0000949262644778,1.3778153426568008E-2,1.0000001224533508,4.9488046685815257E-4,1.000000202992587,6.3716960460408483E-4,4.1565680113100045,1.0687579135974772E-3,1.0000000898535426,8.8366463724828684E-4,62.001098134566739,-69.295179546857057,110.70482045314294,null,1000000000,12023.122500000001,null,57.942603280189111,-64.974470868913244,null,42.453790824160365,-4.2959804893230462,null,0,0,null,0,0]
[120.23,0.12023,1.0033270583925993,8.1459929716019619E-2,1.0000000301385357,2.4551388986822223E-4,1,0,2.6300076251214839,1.1807545716588885,1.0001141275892984,1.5107397929481568E-2,1.0000001472241618,5.4263089418868122E-4,1.0000002440554956,6.9864933392079062E-4,4.1565684876457789,1.1718810230255984E-3,1.0000001080298238,9.689284104173907E-4,61.321527714543713,-71.553626947423766,108.44637305257623,null,1000000000,14455.252900000001,null,57.267874385745976,-66.817753992468496,null,42.448949937301094,-4.7087587764067314,null,0,0,null,0,0]
[131.83000000000001,0.13183,1.0039986892664632,8.9279448683304549E-2,1.0000000362347241,2.6920149687921372E-4,1,0,2.848468479851527,1.2120871666868063,1.0001372108458548,1.6564731128396536E-2,1.0000001770035161,5.9498485702999255E-4,1.0000002934211336,7.660562144192922E-4,4.1565690602943874,1.2849460295594692E-3,1.0000001298812697,1.0624123230215643E-3,60.622826394138642,-73.722993511970699,106.2770064880293,null,1000000000,17379.148900000004,null,56.574986391754322,-68.532480070189592,null,42.443137378754415,-5.160783245307262,null,0,0,null,0,0]
[144.54,0.14454,1.0048049686302924,9.7834630062842876E-2,1.0000000435584637,2.9515576248912893E-4,1,0,3.0905669323307996,1.2413013329309759,1.0001649415293403,1.8161435026306336E-2,1.0000002127793524,6.5234854876726619E-4,1.000000352727219,8.3991322805399232E-4,4.1565697482535713,1.4088301502141061E-3,1.0000001561328116,1.1648416822963642E-3,59.907558554555102,-75.806068073301745,104.19393192669826,null,1000000000,20891.811599999997,null,55.86669220098527,-70.118130802737454,null,42.436164652426818,-5.6553407319936966,null,0,0,null,0,0]
[158.49,0.15849000000000002,1.0057744181362456,0.10720790812846365,1.0000000523721233,3.2364215111414059E-4,1,0,3.3588604356073253,1.2684928447232999,1.0001983126423997,1.9913808008083563E-2,1.0000002558333179,7.1530869327893687E-4,1.0000004240983558,9.2097579341657071E-4,4.1565705761690017,1.5448004772269141E-3,1.0000001877248994,1.277264154160718E-3,59.17639434809206,-77.812235154130121,102.18776484586988,null,1000000000,25119.080100000003,null,55.143905526939577,-71.579293443256915,null,42.427788230163841,-6.1971991892939515,null,0,0,null,0,0]
[173.78,0.17377999999999999,1.0069382852986426,0.11745982195597812,1.00000006296454,3.548648660701147E-4,1,0,3.6553381399291394,1.2936910534145658,1.0002384171809777,2.1834368397214435E-2,1.0000003075763557,7.8431661574877073E-4,1.0000005098734819,1.0098249998605005E-3,4.1565715711726314,1.6938316882120772E-3,1.0000002256928597,1.4004856362478269E-3,58.431983241124684,-79.746010733940736,100.25398926605926,null,1000000000,30199.488400000002,null,54.409541362897933,-72.916958312198119,null,42.417742621441064,-6.7898617252965776,null,0,0,null,0,0]
[190.55,0.19055000000000002,1.0083361990466311,0.12867554427771363,1.0000000757032199,3.8910979200946556E-4,1,0,3.9827647496078953,1.3169985651387601,1.0002866456778761,2.3940644233873671E-2,1.0000003698037014,8.6000417154418526E-4,1.0000006130285815,1.1072743727157327E-3,4.1565727677862192,1.8572883329254749E-3,1.0000002713540082,1.5356343851471066E-3,57.675207575730305,-81.617265504917853,98.382734495082147,null,1000000000,36309.302500000005,null,53.66481768498312,-74.136036227916904,null,42.405692238503036,-7.4382566424559311,null,0,0,null,0,0]
[208.93,0.20893,1.0100135761231808,0.14093065109714967,1.0000000910118727,4.2664239315057625E-4,1,0,4.3437175887449939,1.3384950999852994,1.0003446009871564,2.6248887902041093E-2,1.0000004445851374,9.4295808240817168E-4,1.0000007369947574,1.214079326016184E-3,4.1565742058109159,2.0364374823558747E-3,1.000000326227122,1.6837580686593708E-3,56.907732296744094,-83.434073834187117,96.565926165812883,null,1000000000,43651.744900000005,null,52.911781735044642,-75.240197238754021,null,42.391254837704437,-8.1467589437728414,null,0,0,null,0,0]
[229.09,0.22909000000000002,1.0120272129370234,0.15432363670524221,1.0000001094230215,4.6780981499641613E-4,1,0,4.7415658522633546,1.3582999378085345,1.0004142972414987,2.8780349437693819E-2,1.0000005345219898,1.0339455997063671E-3,1.0000008860842604,1.3312277085748749E-3,4.1565759352692329,2.2329360740515271E-3,1.0000003922210217,1.846226714036037E-3,56.129830239926655,-85.207836626831607,94.792163373168393,null,1000000000,52482.2281,null,52.151181995226487,-76.235101999840253,null,42.37395483973647,-8.9210705432388657,null,0,0,null,0,0]
[251.19,0.25119000000000002,1.0144423027527989,0.16894141906634183,1.0000001315531117,5.1293878255397984E-4,1,0,5.1794914164794621,1.3765071353507992,1.0004980652971682,3.1554988854091644E-2,1.0000006426255377,1.13368884051121E-3,1.0000010652889217,1.459649256481409E-3,4.1565780140668362,2.4483435601390679E-3,1.0000004715453532,2.0243297603292809E-3,55.342543450677503,-86.947911959018228,93.052088040981772,null,1000000000,63096.416100000002,null,51.384601701764119,-77.125037315292715,null,42.353251131407994,-9.7662266328325789,null,0,0,null,0,0]
[275.42,0.27542,1.0173379946928707,0.18488450877806747,1.0000001581566202,5.6241728168093938E-4,1,0,5.6612771355637213,1.3932260412466215,1.0005987571055532,3.459648825324154E-2,1.0000007725813285,1.243045317894681E-3,1.0000012807183143,1.6004480293112884E-3,4.1565805130751938,2.6845117805508033E-3,1.0000005669045422,2.2195984172521067E-3,54.546108273931452,-88.665124472998571,91.334875527001429,null,1000000000,75856.176400000011,null,50.612928738268941,-77.914960647755976,null,42.328492269072591,-10.688051547502491,null,0,0,null,0,0]
[302,0.30199999999999999,1.0208101379829493,0.20226491392863122,1.0000001901561197,6.1669455901617091E-4,1,0,6.1913127133833328,1.4085690523826409,1.0007198588198316,3.7932235745596968E-2,1.0000009288960416,1.3630079401782394E-3,1.0000015398432076,1.7549024085250272E-3,4.1565835189556459,2.9435849555613986E-3,1.0000006816055662,2.433805665839337E-3,53.740192654687618,-90.370944746368778,89.629055253631222,null,1000000000,91204,null,49.836612068785769,-78.609799530788933,null,42.298897349886616,-11.693038722375984,null,0,0,null,0,0]
[331.13,0.33112999999999998,1.0249669621094404,0.2211711383681581,1.0000002286090772,6.7617902017265115E-4,1,0,6.7735973707987265,1.4226226787089682,1.0008653641886232,4.1587031707416067E-2,1.0000011167352982,1.4944793467304154E-3,1.0000018512267039,1.9241745493540233E-3,4.1565871310404363,3.227512330955589E-3,1.0000008194389547,2.6685633110502928E-3,52.925417548457489,-92.074145138455663,87.925854861544337,null,1000000000,109647.0769,null,49.057140517907492,-79.213141379959254,null,42.263598637960143,-12.786328004245371,null,0,0,null,0,0]
[363.08,0.36307999999999996,{"$f":"SQRT(1+(A77/pole1)^2)","v":1.029943821175018},{"$f":"ATAN(A77/pole1)","v":0.24172395407635419},{"$f":"SQRT(1+(A77/Zero1)^2)","v":1.0000002748533634},{"$f":"ATAN(A77/Zero1)","v":7.4142201273041193E-4},{"$f":"IF(VIN_nom>Vout, 1, SQRT(1+(A77/z_RHP)^2))","v":1},{"$f":"IF(VIN_nom>Vout, 0, -ATAN(A77/z_RHP))","v":0},{"$f":"SQRT(1+(A77/Pole2)^2)","v":7.4135363225679152},{"$f":"ATAN(A77/Pole2)","v":1.4354955017349007},{"$f":"SQRT(1+(A77/Zero2)^2)","v":1.0010403238144947},{"$f":"ATAN(A77/Zero2)","v":4.5594357539543134E-2},{"$f":"SQRT(1+(A77/pole4)^2)","v":1.0000013426344612},{"$f":"ATAN(A77/pole4)","v":1.6386781007258731E-3},{"$f":"IF(VOUT_setting=1,1,SQRT(1+(A77*zterm1)^2))","v":1.0000022257025347},{"$f":"IF(VOUT_setting=1,0,ATAN(((A77*zterm1))))","v":2.10983336141863E-3},4.1565914750009778,{"$f":"IF(VOUT_setting=1,0,ATAN(A77*$Q$4/(1+Afbr-$Q$5*(A77)^2)))","v":3.5389253888135643E-3},{"$f":"SQRT((1-(Z77/pterm2))^2+(A77/pterm1)^2)","v":1.0000009852003735},{"$f":"IF((ATAN((A77/pterm1)/(1-A77^2/pterm2))>0),ATAN((A77/pterm1)/(1-A77^2/pterm2)),PI()+ATAN((A77/pterm1)/(1-A77^2/pterm2)))","v":2.9260472895560881E-3},{"$f":"20*LOG10(((E77*K77*G77*O77)/(C77*I77*S77*M77*Q77))*Adc)","v":52.10073273447081},{"$f":"((F77+L77+H77+P77)-(D77+J77+T77+N77+R77))*radconv","v":-93.78617207479094},{"$f":"IF(V77>0,V77,V77+180)","v":86.21382792520906},null,{"$f":"IF(U77<0,A77,1000000000)","v":1000000000},{"$f":"A77^2","v":131827.0864},null,{"$f":"20*LOG10((K77/(I77*M77))*AEA)","v":48.274535958481252},{"$f":"(L77-(J77+N77))*radconv","v":-79.729358933054215},null,{"$f":"20*LOG10((E77*G77/(C77*S77))*Acs*Am)","v":42.221524208183823},{"$f":"(F77+H77-(D77+T77))*radconv","v":-13.974932199937625},null,{"$f":"SUM((U78<0)*(U77>0))*A77","v":0},{"$f":"IF(AH77>0,W75,0)","v":0},null,0,0]
[398.11,{"$f":"A78/1000","v":0.39811000000000002},1.035895278235156,0.26402062505107143,1.0000003304475709,8.1295446333692521E-4,1,0,8.1163441309918518,1.4472742745886653,1.0012506172693898,4.9986303908089377E-2,1.0000016142070907,1.7967776263325143E-3,1.0000026758917606,2.3133896315555083E-3,4.156596697241322,3.8803580788935956E-3,1.0000011844767174,3.208352953982363E-3,51.265799621593416,-95.515945790512788,84.484054209487212,null,1000000000,158491.57210000002,null,47.489657435327217,-80.161651350706933,null,42.171476620909559,-15.264513761040609,null,0,0,null,{"$f":"SUM((V79<-183)*(V78>-183))*A78","v":0},{"$f":"IF(AK78>0,U78,0)","v":0}]
[436.52,0.43651999999999996,1.0430056301352437,0.28816284946373388,1.0000003972872877,8.9138897923402981E-4,1,0,8.8880445802812407,1.4580469052342315,1.0015033901139565,5.479980004060829E-2,1.000001940712931,1.9701318698889677E-3,1.0000032171443269,2.536586565475619E-3,{"$f":"IF(VOUT_setting=1,1,SQRT((1+Afbr-$Q$5*(A79)^2)^2+(A79*$Q$4)^2))","v":4.1566029758200074},4.2547341433665717E-3,1.0000014240629203,3.5178980229722467E-3,50.419647988608325,-97.272462668512247,82.727537331487753,null,1000000000,190549.71039999998,null,46.702931706777314,-80.513017074773259,null,42.112059135336828,-16.661002988832742,null,0,0,null,0,0]
[478.63,0.47863,1.0514893201942073,0.31423856488287938,1.0000004776350522,9.7737900732486446E-4,1,0,9.7350704576486766,1.467893423149744,1.0018071629765051,6.00740482260749E-2,1.0000023332042227,2.1601850319539688E-3,1.0000038677815972,2.7812835636744212E-3,4.1566105232630886,4.6651721523008937E-3,1.0000017120693605,3.8572614042274669E-3,49.561245071662071,-99.063365598441166,80.936634401558834,null,1000000000,229086.67689999999,null,45.914904978479704,-80.785878077481541,null,42.04169306692512,-18.169548655635147,null,0,0,null,0,0]
[524.80999999999995,0.52481,1.0616007811252539,0.34233416180576282,1.0000005742493876,1.0716800948458072E-3,1,0,10.664867110904403,1.476892562619561,1.0021723133889122,6.5854205791642584E-2,1.0000028051560261,2.3686069613762196E-3,1.0000046501412374,3.0496305407992988E-3,4.1566195986842942,5.1152778722701065E-3,1.0000020583844504,4.2294249668695149E-3,48.688937739254698,-100.89583485743745,79.10416514256255,null,1000000000,275425.53609999997,null,45.125739252449463,-80.982253852062271,null,41.958563629582777,-19.795228131184214,null,0,0,null,0,0]
[575.44000000000005,0.57544000000000006,1.0736301003105753,0.3725024863378546,1.0000006903930434,1.1750682075961352E-3,1,0,11.685087813615304,1.4851123603116345,1.0026110981857113,7.218627692454245E-2,1.0000033725064597,2.5971126204273973E-3,1.0000055906439036,3.3438354796774517E-3,4.1566305085577531,5.6087543476151594E-3,1.0000024747042535,4.6374511866103304E-3,47.801318085452408,-102.7744756006539,77.225524399346099,null,1000000000,331131.19360000006,null,44.336005824137558,-81.103505026774698,null,41.860692032843936,-21.541200281658536,null,0,0,null,0,0]
[630.96,0.63096000000000008,1.0879178063590824,0.40478500592457395,1.0000008300417502,1.2884418310149448E-3,1,0,12.804600470193309,1.4926197898362539,1.0031384298068728,7.9123240723790636E-2,1.0000040546764357,2.8476877411213204E-3,1.0000067214836448,3.6664549626048686E-3,4.1566436263255646,6.1498891768439262E-3,1.0000029752808941,5.0848861000962102E-3,46.896349493618317,-104.70283021163364,75.297169788366361,null,1000000000,398110.52160000004,null,43.545886080277612,-81.150547202115845,null,41.745860774039336,-23.409992710180912,null,0,0,null,0,0]
[691.83,0.69183000000000006,1.1048490296217908,0.4391790464945286,1.0000009979183908,1.412740288115863E-3,1,0,14.032681856663451,1.4994736577446761,1.0037719871730517,8.6719878216573773E-2,1.0000048747365584,3.1224082871626974E-3,1.0000080809045389,4.0201617185782468E-3,4.1566593956050122,6.7431645622169686E-3,1.0000035770452196,5.5754369528840941E-3,45.972171507802535,-106.68135733233144,73.318642667668556,null,1000000000,478628.74890000006,null,42.755870077640957,-81.123729967584325,null,41.611719935225565,-25.401610794026212,null,0,0,null,0,0]
[758.58,0.75858000000000003,1.1248696974393795,0.47565744205969468,1.000001199772707,1.5490458400821523E-3,1,0,15.380025959431807,1.505731031495902,1.0045332455113833,9.5038794557263648E-2,1.0000058607734232,3.423666105064668E-3,1.0000097154655712,4.4080351434824683E-3,4.1566783564586469,7.3937445344022983E-3,1.0000043006096686,6.1133751583685508E-3,45.026404483169181,-108.70862238815992,71.291377611840076,null,1000000000,575443.61640000006,null,41.966118588387218,-81.022873079317421,null,41.455729823476943,-27.514680761694738,null,0,0,null,0,0]
[831.76,0.83175999999999994,1.1484746832146422,0.51413160718379713,1.0000014424215784,1.6984815833823541E-3,1,0,16.857735213522847,1.5114415324515995,1.0054475907293117,0.10414389030447758,1.0000070460863284,3.7539432483165418E-3,1.0000116803666523,4.8332707271557512E-3,4.1567011491724228,8.1069874819552946E-3,1.0000051704130233,6.7031333606310537E-3,44.057033283282117,-110.77918742903573,69.22081257096427,null,1000000000,691824.69759999996,null,41.177167567722947,-80.84730061078379,null,41.275340205565342,-29.744316664666325,null,0,0,null,0,0]
[912.01,0.91200999999999999,1.1762304325953237,0.55448149665256941,1.0000017341844434,1.862354390161675E-3,1,0,18.478733568772487,1.5166536153574277,1.0065459069485427,0.11410870133002346,1.0000084713141817,4.1161278841794187E-3,1.0000140429743098,5.2995867714745876E-3,4.1567285551482192,8.8891282184083136E-3,1.0000062162817378,7.349869581138673E-3,43.061581369025589,-112.88526764804199,67.114732351958011,null,1000000000,831762.24009999994,null,40.389178661781777,-80.595740999102802,null,41.067913943812101,-32.083861073407576,null,0,0,null,0,0]
[1000,1,1.2087559459614465,0.59651770015575745,1.0000020849517515,2.0420323841408667E-3,1,0,20.256555090971634,1.5214095174039495,1.0078647563069434,0.12500843621459273,1.0000101847697764,4.513243475779906E-3,1.0000168833756682,5.810875688090673E-3,4.1567615033222625,9.7466929489601895E-3,1.0000074736760809,8.0589837002473987E-3,42.038095917364188,-115.01467665186212,64.985323348137882,null,1000000000,1000000,null,39.602669496361067,-80.266478354450115,null,40.830981834689759,-34.522692579171746,null,0,0,null,0,0]
[1096.5,1.0965,1.2467458769915474,0.64001286548870329,1.0000025067625027,2.2390878795638712E-3,1,0,22.206757928795721,1.5257497566380367,1.0094484404837842,0.13692801917201827,1.00001224526085,4.9487646733202828E-3,1.0000202990547198,6.3716106832546185E-3,4.156801124398088,1.0687181182571994E-2,1.000008985761524,8.8366816176296912E-3,40.98447535607729,-117.15248179479173,62.847518205208274,null,1000000000,1202312.25,null,38.817897873380346,-79.857167473663679,null,40.56218601977443,-37.048050345043443,null,0,0,null,0,0]
[1202.3,1.2022999999999999,1.2909371054682048,0.68466479817300718,1.0000030138490854,2.4551340150766416E-3,1,0,24.345307778290966,1.529709090408345,1.0113490101692615,0.14995136618638596,1.0000147223088833,5.4262562164887366E-3,1.0000244052547229,6.9863808064263141E-3,4.1568487550342592,1.1718285617526287E-2,1.0000108035710518,9.6893305671496514E-3,39.899571758066543,-119.27920648637658,60.72079351362342,null,1000000000,1445525.2899999998,null,38.035612386470241,-79.365196018942996,null,40.259631770021883,-39.642892292390101,null,0,{"$f":"IF(AH90>0,W90,0)","v":0},null,0,0]
[1318.3,1.3183,1.3421388917983152,0.7301424937355655,1.0000036234659064,2.6920085308884474E-3,1,0,26.690396551395914,1.533320896093991,1.0136291490740494,0.16417145616730733,1.0000177001965336,5.9497790642649099E-3,1.0000293416871948,7.6604137965430794E-3,4.1569060156439779,1.2848768726162838E-2,1.0000129889778839,1.0624184480103984E-2,38.782373494983773,-121.37321617713958,58.626783822860418,null,1000000000,1737914.89,null,37.256352128977319,-78.787381749944799,null,39.921770535620155,-42.288563586772,null,0,0,null,0,0]
[1445.4,1.4454,1.4011789673029917,0.77605175884402433,1.0000043558369729,2.9515491396248316E-3,1,0,29.260218664966622,1.5366135757562063,1.0163616612401605,0.17967551642641647,1.0000212777111201,6.5233938778533271E-3,1.0000352721060612,8.398936757048418E-3,4.1569748054226201,1.4087390019350839E-2,1.0000156145107968,1.1648497550103646E-2,37.633243631599079,-123.40930020650536,56.590699793494636,null,1000000000,2089181.1600000001,null,36.481253901842365,-78.1205868868377,null,39.547831125695147,-44.962788955407873,null,0,0,null,0,0]
[1584.9,1.5849000000000002,1.4690874779026468,0.82208585633843378,1.0000052371987505,3.2364103243261518E-3,1,0,32.081058938084055,1.5396202358889906,1.0196403587885059,0.19659197670148859,1.0000255830078155,7.1529661566326393E-3,1.000042408945325,9.2095001616366492E-3,4.1570575880829939,1.5446803118270513E-2,1.0000187742675317,1.2772747968756951E-2,36.450546816305661,-125.36549893285938,54.634501067140619,null,1000000000,2511908.0100000002,null,35.70976880553745,-77.359685878417181,null,39.136730389787651,-47.648441919074259,null,0,0,null,0,0]
[1737.8,1.7378,1.5467614683644875,0.86779267586144559,1.0000062964343646,3.5486339138366108E-3,1,0,35.173138781207207,1.5423617087325852,1.0235668617490215,0.21500303063774104,1.0000307571672991,7.8430069467830127E-3,1.0000509860613906,1.0097910196628722E-2,4.1571570756115106,1.6936732862265318E-2,1.000022571855302,1.4004996655445861E-2,35.236966349879488,-127.21322044595991,52.786779554040095,null,1000000000,3019948.84,null,34.943859253167517,-76.501421439056671,null,38.689192849276623,-50.319963330876092,null,0,0,null,0,0]
[1905.5,1.9055,1.6352947840620995,0.91282804990283006,1.0000075702936213,3.8910784787409801E-3,1,0,38.56477025825415,1.5448630179351228,1.0282691049281227,0.23502694339444388,1.0000369796932387,8.5998318231595133E-3,1.0000613009980246,1.1072295758167122E-2,4.157276718413728,1.857079512511382E-2,1.0000271391149256,1.5356528800042362E-2,33.993488124616817,-128.9285621011002,51.071437898899802,null,1000000000,3630930.25,null,34.184024155083584,-75.540813079471292,null,38.205710108660384,-52.958116654730411,null,0,0,null,0,0]
[2089.3000000000002,2.0893000000000002,1.7357253225420335,0.95681276599545628,1.0000091011462706,4.2663983043004262E-3,1,0,42.282245080852348,1.5471435324217306,1.0338917121320348,0.25675434041019762,1.0000444575353769,9.4293041502482439E-3,1.0000736967873063,1.214020276413354E-2,4.1574204940737474,2.0361622304709816E-2,1.0000326280802809,1.6837824474203955E-2,32.723516630089719,-130.48678969126982,49.51321030873018,null,1000000000,4365174.4900000012,null,33.431978724664624,-74.474114048210737,null,37.687976771814412,-55.541623001239429,null,0,0,null,0,0]
[2290.9,2.2909000000000002,1.8492993193390574,0.99947340441287136,1.0000109422428805,4.678064365560031E-3,1,0,46.359946862944,1.549224309772949,1.0406135750220429,0.28030353138870584,1.0000534507847596,1.0339091260470005E-2,1.0000886045399076,1.3311498645794839E-2,4.1575934011434317,2.2325732263360251E-2,1.0000392298617442,1.8462588513583841E-2,31.42923205701404,-131.86807198831815,48.13192801168185,null,1000000000,5248222.8100000005,null,32.688491469845673,-73.296191514851017,null,37.13741121550742,-58.055402931045535,null,0,0,null,0,0]
[2511.9,2.5119000000000002,1.9771996766740965,1.040526870065632,1.00001315522551,5.1293432903056751E-3,1,0,50.830238375778279,1.5511217285667789,1.0486361935092925,0.30575628071423661,1.0000642605097108,1.1336407607514134E-2,1.0001065232753052,1.4595466430222533E-2,4.1578012248919274,2.4478652751821657E-2,1.0000471657508454,2.0243721223612194E-2,30.115066289708786,-133.05376563078821,46.946234369211794,null,1000000000,6309641.6100000003,null,31.955520369228729,-72.003712506397079,null,36.556495090645868,-60.483788259375039,null,0,0,null,0,0]
[2754.2,2.7542,2.1207686211775107,1.0797745861972159,1.0000158155382062,5.6241141109130291E-3,1,0,55.73155193035322,1.5528522065861599,1.0582000151756785,0.33319887615448668,1.00007725517852,1.2429819404341104E-2,1.0001280637132675,1.6003127683794718E-2,4.1580510447830488,2.6838813540267265E-2,1.0000567066643851,2.2196542553047843E-2,28.784982301785924,-134.03006053624767,45.969939463752326,null,1000000000,7585617.6399999987,null,31.23468610213942,-70.59316457545269,null,35.947580166555952,-62.816056892380089,null,0,0,null,0,0]
[3020,3.02,2.2815200592755658,1.1170851194040778,1.000019015432984,6.1668681948869649E-3,1,0,61.108389861705639,1.5544312312701005,1.0695903812387109,0.36271386644447046,1.0000928853334532,1.3629243873771613E-2,1.0001539725855424,1.7547240913621379E-2,4.1583515157826145,2.9427538984993836E-2,1.0000681839896686,2.4338792752790758E-2,27.442752406904102,-134.78740190326582,45.212598096734183,null,1000000000,9120400,null,30.52755077968142,-69.061273607796437,null,35.31288822533746,-65.045437355844541,null,0,0,null,0,0]
[3311.3,3.3113000000000001,2.4608387475788622,1.1523235220697865,1.0000228606490298,6.7616881812892016E-3,1,0,67.001209945561001,1.555870669019648,1.0831194408939908,0.39431690222805177,1.0001116673573704,1.4943692115957946E-2,1.0001851057096953,1.9239395040826026E-2,4.1587125551823663,3.2264169633386519E-2,1.0000819777634242,2.6686603331849298E-2,26.094383006066913,-135.31949176468916,44.680508235310839,null,1000000000,10964707.690000001,null,29.836928808744592,-67.408339080294112,null,34.655624522245176,-67.164888070279375,null,0,0,null,0,0]
[3630.8,3.6308000000000002,2.6605314276775185,1.1854665450294199,1.0000274849624091,7.4140856354008014E-3,1,0,73.464631494368646,1.55718391408297,1.0991692273089033,0.42804735489158985,1.0001342545241068,1.6385329145080497E-2,1.0002225457378444,2.1095235173355899E-2,4.1591467068077055,3.5374815579108598E-2,1.0000985689923292,2.9261751797314429E-2,24.743647605664989,-135.62573823440749,44.374261765592507,null,1000000000,13182708.640000001,null,29.164583667640581,-65.633569616532824,null,33.977815851292803,-69.174008926472382,null,0,0,null,0,0]
[3981.1,3.9811000000000001,2.8823432736211601,1.2164899171025774,1.0000330442165724,8.129367338775376E-3,1,0,80.551252040353717,1.5583815515691197,1.1181591381522686,0.46387140791656895,1.0001614078131051,1.7965862389159429E-2,1.0002675537415853,2.312981197638236E-2,4.1596685776164959,3.8784550185657726E-2,1.0001185184322874,3.2085215259345511E-2,23.395942994046663,-135.70943759030752,44.290562409692484,null,1000000000,15849157.209999999,null,28.513249160681756,-63.74018002859404,null,33.282144705404491,-71.072307131914926,null,0,0,null,0,0]
[4365.2,4.3651999999999997,3.1282702008269188,1.2454199030127266,1.0000397279475051,8.913656072729266E-3,1,0,88.32176201880641,1.5594738469905256,1.1405718043923219,0.50172714049044964,1.0001940526532032,1.9698795802712086E-2,1.000321663216595,2.5360481760722194E-2,4.160295925017758,4.2522258615193848E-2,1.0001425085706492,3.5181202123998959E-2,22.055969747158933,-135.5787011660554,44.421298833944604,null,1000000000,19054971.039999999,null,27.885437352085862,-61.733080007843114,null,32.570823294863629,-72.86232377438219,null,0,0,null,0,0]
[4786.3,4.7862999999999998,3.4004380671095311,1.2723037690351486,1.0000477623759936,9.7734819827997033E-3,1,0,96.840898805919821,1.5604699276704412,1.1669443770391834,0.54149541957113911,1.0002332934815343,2.1598524749984027E-2,1.0003867041376604,2.7805739048864662E-2,4.161049931771621,4.6618664158748165E-2,1.0001713547635689,3.8575542455946181E-2,20.728555421742918,-135.24621715171872,44.753782848281276,null,1000000000,22908667.690000001,null,27.283825330866609,-59.620443125518349,null,31.846030329403106,-74.547872815876715,null,0,0,null,0,0]
[5248.1,5.2481,3.7013000214215177,1.2972211850996382,1.0000574233065347,1.0716394804771594E-2,1,0,106.1835159020695,1.561378529934994,1.1978875457773248,0.5830216406872536,1.00028047666248,2.3681685843757603E-2,1.0004649071356144,3.0486951028391877E-2,4.1619564079622586,5.1109211479660563E-2,1.0002060521176221,4.2298109291352096E-2,19.41767893972537,-134.72894785490965,45.271052145090351,null,1000000000,27542553.610000003,null,26.710767691187904,-57.4125813276491,null,31.109424510725994,-76.134798038033153,null,0,0,null,0,0]
[5370.3,5.3703000000000003,3.781258906066383,1.3031501153148004,1.0000601285180286,1.0965902180641432E-2,1,0,108.65574164050143,1.5615928175972105,1.2064099437633427,0.59364784800533588,1.0002936883731648,2.423289144076398E-2,1.000486804236792,3.1196372764211971E-2,4.1622102016499918,5.2297151806358889E-2,1.0002157701678571,4.3283192275248655E-2,19.093186868074032,-134.57323570805869,45.426764291941311,null,1000000000,28840122.090000004,null,26.572318558198358,-56.847604028445545,null,30.923721111086259,-76.516646094678549,null,0,0,null,0,0]
[5432.85,5.4328500000000002,3.8222369283075408,1.3060888962455774,1.0000615373129058,1.1093615945282178E-2,1,0,109.92119129543683,1.5616987744249571,1.2108244149713001,0.59902885052942345,1.0003005685900088,2.4515029053569053E-2,1.0004982074391298,3.1559489375389216E-2,4.1623423641102661,5.290516156705094E-2,1.0002208314332852,4.3787427545998049E-2,18.930445129690124,-134.49114732862338,45.508852671376616,null,1000000000,29515859.122500002,null,26.503409119726093,-56.561531467435294,null,30.830065611231873,-76.706598932338593,null,0,0,null,0,0]
[5495.4,5.4954000000000001,3.8632472605848132,1.3089653082757207,1.0000629624195461,1.1221329348017475E-2,1,0,111.18664215635022,1.5618023193965151,1.215273690530609,0.60437060568114742,1.0003075284313119,2.4797162762773516E-2,1.0005097425578142,3.1922597661524332E-2,4.1624760527368263,5.3513132653502417E-2,1.0002259515721847,4.4291666245334163E-2,18.769910519785864,-134.40759424865863,45.592405751341374,null,1000000000,30199421.159999996,null,26.435783451753526,-56.27756920238064,null,30.737335501172048,-76.892978512394563,null,0,0,null,0,0]
[5559.4,5.5593999999999992,3.9052406525239314,1.3118458459563984,1.0000644374455006,1.1352002954299445E-2,1,0,112.48142921502509,1.5619058532249899,1.2198617334559805,0.60979569963666569,1.0003147320246981,2.5085832654666518E-2,1.0005216816113822,3.2294114609667503E-2,4.1626144199513577,5.4135156905627459E-2,1.0002312513493183,4.4807597520823313E-2,18.607889766871303,-134.32070018088982,45.679299819110184,null,1000000000,30906928.359999996,null,26.367886915163655,-55.989205832824418,null,30.643396364756462,-77.080094802910224,null,0,0,null,0,0]
[5623.4,5.6233999999999993,3.9472657585713793,1.3146650705377585,1.0000659295480963,1.1482676172881585E-2,1,0,113.77621745197452,1.5620070305975073,1.2244854092569182,0.61517998059109147,1.0003220189734128,2.5374498364922751E-2,1.0005337587584913,3.2665622640144568E-2,4.16275438459658,5.4757139737401331E-2,1.000236612780542,4.5323532468519077E-2,18.448081200462969,-134.23249465978932,45.767505340210676,null,1000000000,31622627.559999995,null,26.301270466792744,-55.703045621411455,null,30.550391452598117,-77.263698344217616,null,0,0,null,0,0]
[5688.9,5.6888999999999994,3.9903076201776502,1.3174888607290591,1.0000674743034488,1.1616411638932846E-2,1,0,115.10135346675517,1.5621082223502682,1.2292539282374271,0.62064835331834489,1.0003295630167708,2.5669925297861624E-2,1.0005462619448378,3.3045828549785099E-2,4.1628992835241485,5.5393656912179602E-2,1.0002421637192958,4.5851563487552351E-2,18.286767930761084,-134.14097284336799,45.85902715663201,null,1000000000,32363583.209999997,null,26.23438598401097,-55.412455519769971,null,30.456156459879455,-77.448081075686915,null,0,0,null,0,0]
[5754.4,5.7543999999999995,4.0333806204336344,1.3202523613144648,1.0000690369451275,1.1750146689443604E-2,1,0,116.42649063331801,1.5622071106256337,1.23405892100653,0.62607430339831749,1.0003371943646433,2.5965347749092281E-2,1.0005589097630567,3.3426024902206232E-2,4.1630458552960219,5.6030129703828313E-2,1.000247779257359,4.6379598441652778E-2,18.127672152786488,-134.04829334320181,45.951706656798194,null,1000000000,33113119.359999996,null,26.168778012323408,-55.12416382046014,null,30.362864673339661,-77.629009716457446,null,0,0,null,0,0]
[5821.4,5.8213999999999997,4.0774712129702388,1.3230187203105361,1.0000706538778383,1.1886943939790081E-2,1,0,117.78197560367154,1.5623059613602888,1.2390112456431268,0.63158080432830299,1.0003450908005425,2.6267530909484034E-2,1.000571996858318,3.3814918039090411E-2,4.1631975142362414,5.6681131762740318E-2,1.0002535902422749,4.6919729917306446E-2,17.967176927281393,-133.95239940848825,46.047600591511753,null,1000000000,33888697.959999993,null,26.10295594143334,-54.83164210658073,null,30.26839432938452,-77.81061976060117,null,0,0,null,0,0]
[5888.4,5.8883999999999999,4.1215923416009774,1.325725872604238,1.0000722895252985,1.2023740745224694E-2,1,0,119.13746169873906,1.5624025627480258,1.2440008392430615,0.63704329746745825,1.000353078581169,2.6569709271627051E-2,1.000585235273987,3.4203800944151562E-2,4.1633509231407908,5.7332086314432443E-2,1.0002594688424766,4.7459865605225061E-2,17.808901312534577,-133.8555036183983,46.144496381601698,null,1000000000,34673254.559999995,null,26.038404921955312,-54.541512700379855,null,30.174874872056769,-77.988837777412954,null,0,0,null,0,0]
[5957,5.9569999999999999,4.1667977347119756,1.3284382523170362,1.000073983623365,1.2163803873722307E-2,1,0,120.5253187366949,1.5624992197286121,1.2491477354845726,0.64259085389619042,1.0003613517553036,2.6879098804456793E-2,1.0005989466086407,3.4601959881489203E-2,4.1635098084881577,5.7998536263304756E-2,1.000265557896312,4.801290447028269E-2,17.649094887726665,-133.7553584191802,46.244641580819803,null,1000000000,35485849,null,25.97359680597377,-54.246925881570952,null,30.08008901056478,-78.167907454344004,null,0,0,null,0,0]
[6025.6,6.0256000000000007,4.2120331248304153,1.3310923916692492,1.0000756973404963,1.2303866524946786E-2,1,0,121.91317687503006,1.5625936760262567,1.2543327585525212,0.64809271472641339,1.0003697206843214,2.7188483190296799E-2,1.000612816564423,3.5000107843814632E-2,4.1636705279654498,5.8664935264065868E-2,1.0002717178590141,4.8565947852932029E-2,17.491513554965227,-133.65436606918871,46.345633930811289,null,1000000000,36307855.360000007,null,25.910056136729164,-53.954830842956426,null,29.986263232646394,-78.343640490597082,null,0,0,null,0,0]
[6095.8,6.0958000000000006,4.258353625050475,1.3337500393986694,1.0000774713383833,1.2447195443715432E-2,1,0,123.33340598290073,1.5626881346206472,1.2596776949659567,0.65367583556869302,1.0003783839354645,2.7505078148372376E-2,1.0006271742245345,3.540753056280966E-2,4.1638368945770106,5.9346823750436893E-2,1.0002780949170107,4.9131894937145093E-2,17.332508996727448,-133.55024040765102,46.449759592348983,null,1000000000,37158777.640000001,null,25.846312879245197,-53.658493215553818,null,29.891224352826949,-78.520126726352572,null,0,0,null,0,0]
[6166,6.1660000000000004,4.3047035550027974,1.3363504739155092,1.0000792658809676,1.2590523851049567E-2,1,0,124.75363616614932,1.5627804425298866,1.2650615645841239,0.65921160627660369,1.0003871474551589,2.7821667591355143E-2,1.0006416979772421,3.5814941522406281E-2,4.1640051814207508,6.0028657658418451E-2,1.0002845462582652,4.9697846861114184E-2,17.175731674353155,-133.44542394543743,46.554576054562574,null,1000000000,38019556,null,25.783831471334743,-53.36474500983914,null,29.797153410983981,-78.693335193091713,null,0,0,null,0,0]
[6237.8,6.2378,4.3521393570798281,1.3389528627398526,1.0000811225771087,1.2737118467523064E-2,1,0,126.20623734268635,1.5628727052283615,1.2706079019812049,0.66482484322747948,1.0003962144330267,2.814546697706688E-2,1.00065672456223,3.6231625896964166E-2,4.1641792899993177,6.0725974836058239E-2,1.0002912214958666,5.0276703038120714E-2,17.017633179712814,-133.3375994946222,46.662400505377803,null,1000000000,38910148.840000004,null,25.721198437721576,-53.066968824246132,null,29.701920688864867,-78.86720785264157,null,0,0,null,0,0]
[6309.6,6.3096000000000005,4.3996039980111581,1.3414991173321065,1.0000830007648944,1.2883712536528123E-2,1,0,127.65883956909317,1.5629628682531498,1.2761939255222194,0.67038911487122643,1.0004053862965705,2.8469260459445898E-2,1.0006719248818745,3.6648297684899744E-2,4.1643554068440913,6.1423233608262531E-2,1.0002979744722351,5.0855564394545118E-2,16.861760875320471,-133.22924135688757,46.77075864311243,null,1000000000,39811052.160000004,null,25.659819762667397,-52.771877503420576,null,29.607662465965614,-79.03786458572921,null,0,0,null,0,0]
[6383.05,6.3830499999999999,4.448188278188888,1.3440476418371614,1.000084944352404,1.3033674837689357E-2,1,0,129.14482437238621,1.5630530045355417,1.2819488423744834,0.67603090075608441,1.0004148774599888,2.8800488699393282E-2,1.0006876542735266,3.7074531625370263E-2,4.1645376486995449,6.2136454611983388E-2,1.0003049630909078,5.1447733695898772E-2,16.704557779405235,-133.11793268581468,46.882067314185321,null,1000000000,40743327.302500002,null,25.598295511701576,-52.472769391726551,null,29.512227196436488,-79.209220878832497,null,0,0,null,0,0]
[6456.5,6.4565000000000001,4.4968008248547831,1.346541080732758,1.0000869104304277,1.3183636552599099E-2,1,0,130.6308102010515,1.5631410901349101,1.2877441978752686,0.68162208276654268,1.0004244783789813,2.9131710618186774E-2,1.000703565459746,3.7500752089033612E-2,4.1647219916412412,6.284961309335603E-2,1.0003120330960764,5.2039908542092304E-2,16.54957978606723,-133.00624691376299,46.993753086237007,null,1000000000,41686392.25,null,25.538018010625869,-52.176442810807991,null,29.417773069168838,-79.377421350283981,null,0,0,null,0,0]
[6531.7,6.5316999999999998,4.5465999389292602,1.3490386709885636,1.0000889466522382,1.333717060069774E-2,1,0,132.15220175570349,1.5632292221209649,1.2937189597894592,0.68729439969820427,1.0004344217528318,2.9470817517023219E-2,1.0007200440758146,3.7937113443838315E-2,4.1649129031695677,6.3579697583285785E-2,1.0003193558856436,5.2646198197694082E-2,16.393161803106086,-132.89159754039477,47.10840245960523,null,1000000000,42663104.890000001,null,25.477562847879341,-51.875921975167941,null,29.322065372780198,-79.546463716548587,null,0,0,null,0,0]
[6606.9,6.6068999999999996,4.5964267998426793,1.3514821267229511,1.0000910064487527,1.349070401997533E-2,1,0,133.6735943134492,1.5633153479770208,1.2997349638676976,0.6929143858499236,1.0004444801678323,2.9809917636128277E-2,1.0007367132339233,3.8373460344882732E-2,4.1651060165014639,6.4309715034017209E-2,1.0003267640231095,5.3252493799088418E-2,16.238970593792068,-132.7767268527943,47.223273147205703,null,1000000000,43651127.609999992,null,25.418348248389332,-51.5782841411284,null,29.227346808708813,-79.712404779904077,null,0,0,null,0,0]
[6683.85,6.6838500000000005,4.6474409873122768,1.3539281924252076,1.0000931385832179,1.3647809699431083E-2,1,0,135.23039262127881,1.5634014720240594,1.3059330663912125,0.69861137138228935,1.0004548917394025,3.0156901948531541E-2,1.0007539675395563,3.8819946460561812E-2,4.1653059027655832,6.5056650733226112E-2,1.0003344329275052,5.3872904898523838E-2,16.083443008196674,-132.65903808621013,47.340961913789869,null,1000000000,44673850.822500005,null,25.359006522269464,-51.276686194899987,null,29.131428023594921,-79.879099466435932,null,0,0,null,0,0]
[6760.8,6.7608000000000006,4.6984823776005538,1.3563211271140456,1.0000952954020708,1.380491470513211E-2,1,0,136.78719190932793,1.5634856356856064,1.3121731526020499,0.70425435418119242,1.0004654237613382,3.0503878997216832E-2,1.000771421338442,3.9266417091498355E-2,4.1655080938507485,6.5803514628718252E-2,1.0003421912389219,5.4493322366740066E-2,15.930140521294323,-132.54128370417811,47.458716295821887,null,1000000000,45708416.640000001,null,25.300897168755352,-50.978069639389275,null,29.036505021705597,-80.042750373641738,null,0,0,null,0,0]
[6839.55,6.83955,4.7507449684085072,1.3587167858447082,1.0000975282299198,1.3965693976059557E-2,1,0,138.38040853535389,1.5635698074168933,1.3186020520696193,0.70997385200119845,1.0004763268520387,3.0858964860585772E-2,1.000789489950028,3.9723315262704437E-2,4.1657174005242883,6.6567773834046301E-2,1.0003502236216701,5.5128259193688689E-2,15.775502104921131,-132.42078707555947,47.579212924440526,null,1000000000,46779444.202500001,null,25.242671013779237,-50.675534159315809,null,28.940372374645122,-80.207178735034503,null,0,0,null,0,0]
[6918.3,6.9183000000000003,4.8030342311523508,1.3610602960766618,1.0000997869101482,1.4126472524917659E-2,1,0,139.97362611946994,1.5636520630180337,1.3250736671346663,0.71563766593023515,1.000487356086009,3.1214042939889559E-2,1.0008077674747944,4.0180196840829498E-2,4.1659291203926525,6.7331956115700642E-2,1.0003583496876614,5.5763202844010117E-2,15.623086724571211,-132.30037975346565,47.699620246534352,null,1000000000,47862874.890000001,null,25.185668683482362,-50.376078899020797,null,28.845242138170025,-80.368619639861876,null,0,0,null,0,0]
[6998.9,6.9988999999999999,4.8565785966513753,1.3634065911560751,1.0001021254217548,1.4291027337271122E-2,1,0,141.60427263059478,1.5637343342898156,1.3317408964707564,0.72137734394202091,1.0004987750382164,3.1577454382295915E-2,1.0008266906969172,4.0647794129522206E-2,4.1661483125107566,6.8114010052671814E-2,1.0003667636859286,5.6413069777356557E-2,15.469338664517018,-132.17731234661883,47.822687653381166,null,1000000000,48984601.209999993,null,25.128560932761559,-50.072755311359764,null,28.748894597756887,-80.530858781869398,null,0,0,null,0,0]
[7079.5,7.0795000000000003,4.9101491149170693,1.3657017017266204,1.0001044910142858,1.4455581375622481E-2,1,0,143.23492007835398,1.5638147323396059,1.3384515606258145,0.72705965295071251,1.0005103261211461,3.1940857481386128E-2,1.0008458327387155,4.1115373634041871E-2,4.1663700317530452,6.8895981566050854E-2,1.0003752758695992,5.7062944022458359E-2,15.317811091806302,-132.05448823915282,47.945511760847182,null,1000000000,50119320.25,null,25.072668035483549,-49.772610919703517,null,28.653556039722673,-80.690165730818762,null,0,0,null,0,0]
[7161.95,7.16195,4.9649754069093657,1.3679982339935384,1.0001069389241504,1.4623911588585203E-2,1,0,144.90299647441205,1.5638951034786861,1.3453605176843926,0.73281354332393389,1.0005222790443127,3.231259298606852E-2,1.0008656405430258,4.159366680922455E-2,4.1665994544609575,6.9695815302868253E-2,1.0003840850500942,5.7727742387816965E-2,15.165048583144928,-131.92916846074939,48.070831539250605,null,1000000000,51293527.802499995,null,25.016715537596497,-49.468841087767288,null,28.557052406208069,-80.850192867206573,null,0,0,null,0,0]
[7244.4,7.2443999999999997,5.0198273124074948,1.3702445892459414,1.0001094151719665,1.4792240972754089E-2,1,0,146.57107378516923,1.563973645263125,1.3523135599597904,0.73850845233837692,1.0005343702236227,3.2684319557477616E-2,1.0008856773006323,4.2071940943887498E-2,4.1668315207749886,7.0495560817836353E-2,1.0003929970284915,5.8392548579875331E-2,15.014500783161925,-131.80424434010013,48.195755659899874,null,1000000000,52481331.359999992,null,24.961966999106878,-49.168345312623707,null,28.461563022819213,-81.007345568354069,null,0,0,null,0,0]
[7328.75,7.3287500000000003,5.0759688797794373,1.3724924583470555,1.0001119778079013,1.4964448516972033E-2,1,0,148.27759163298111,1.5640521682903008,1.3594717454157474,0.74427412215513045,1.0005468831019677,3.3064602944864789E-2,1.0009064127045164,4.2561216625781419E-2,4.1670716701150816,7.1313643550652894E-2,1.0004022207841694,5.9072682936578372E-2,14.862720796815314,-131.67691819589731,48.323081804102685,null,1000000000,53710576.5625,null,24.907168953765783,-48.864284436878307,null,28.364901721950304,-81.165241043583137,null,0,0,null,0,0]
[7413.1,7.4131,5.1321355343705921,1.374691136503851,1.0001145701024428,1.5136655173573745E-2,1,0,149.98411037424782,1.564128904448423,1.3666746494397213,0.74997920534777107,1.000559540671224,3.3444876765701292E-2,1.0009273877061191,4.3050471918695099E-2,4.1673145853646174,7.2131631841126032E-2,1.0004115521887562,5.9752825672491849E-2,14.713149282015284,-131.55013833587861,48.449861664121386,null,1000000000,54954051.610000007,null,24.853563570553536,-48.563591990815084,null,28.269259891145243,-81.320318616259314,null,0,0,null,0,0]
[7499.45,7.4994499999999995,5.1896590774072422,1.3768926382776998,1.0001172545837214,1.5312944045469297E-2,1,0,151.73109281311034,1.5642056720981476,1.3740939269450083,0.75575741191057766,1.0005726482326169,3.3834157132161709E-2,1.0009491082112008,4.355130644825983E-2,4.1675661248664131,7.2968916290940974E-2,1.0004212163870505,6.0449103867128068E-2,14.562263831237402,-131.42098118517012,48.57901881482988,null,1000000000,56241750.302499995,null,24.799888726786872,-48.259227725641537,null,28.172385064366093,-81.476248570254484,null,0,0,null,0,0]
[7585.8,7.5857999999999999,5.2472072211545173,1.3790458608607721,1.0001199701462429,1.5489231965511404E-2,1,0,153.47807612580897,1.5642806921136418,1.381558588610466,0.76147336746394667,1.0005859074160062,3.4223427240575796E-2,1.0009710797786449,4.4052119116553184E-2,4.167820561964561,7.3806099509495515E-2,1.000430993463961,6.114539104403844E-2,14.41358260044187,-131.2925198625137,48.7074801374863,null,1000000000,57544361.640000001,null,24.747396145893767,-47.958329460774856,null,28.076536027257575,-81.629412899560307,null,0,0,null,0,0]
[7674.15,7.67415,5.3061128963584361,1.3812006038741593,1.000122780774557,1.5669601990750955E-2,1,0,155.2655231567054,1.5643557024160302,1.3892423534505092,0.76725794327628549,1.0005996306267382,3.4621702708974959E-2,1.0009938200766386,4.4564508496257385E-2,4.1680838907100926,7.4662567225494705E-2,1.0004411138582274,6.1857814715181932E-2,14.263683635589892,-131.16186170469251,48.838138295307488,null,1000000000,58892578.222499996,null,24.694877491289219,-47.654014957276374,null,27.979507160501534,-81.783355008723433,null,0,0,null,0,0]
[7762.5,7.7625000000000002,5.3650426663604343,1.3833080209857451,1.000125623940028,1.5849970996343665E-2,1,0,157.05297104132495,1.5644290053075538,1.39697209189574,0.772978694222762,1.0006135125515663,3.5019967189666351E-2,1.0010168231664485,4.5076874461341961E-2,4.1683502517018285,7.5518926551767673E-2,1.0004513524910612,6.2570248004588519E-2,14.115981388229585,-131.0320461516859,48.967953848314096,null,1000000000,60256406.25,null,24.643528775727429,-47.353258892238124,null,27.883509080256687,-81.934586152955944,null,0,0,null,0,0]
[7852.9,7.8529,5.4253639147135946,1.3854169404287038,1.0001285667540227,1.6034524066851762E-2,1,0,158.88189423528311,1.5645023018696402,1.4049279793110765,0.77876683289407933,1.0006278808549802,3.5427461164100879E-2,1.0010406319909084,4.5601104425844301E-2,4.1686259311054865,7.6395042664634344E-2,1.0004619511161241,6.3299222073126285E-2,13.967070055572762,-130.90014430305513,49.099855696944871,null,1000000000,61668038.409999996,null,24.592165634684928,-47.049170243360187,null,27.786328734244982,-82.086611362009663,null,0,0,null,0,0]
[7943.3,7.9432999999999998,{"$f":"SQRT(1+(A141/pole1)^2)","v":5.4857087618745064},{"$f":"ATAN(A141/pole1)","v":1.3874794710728968},{"$f":"SQRT(1+(A141/Zero1)^2)","v":1.0001315436320311},{"$f":"ATAN(A141/Zero1)","v":1.6219076045006203E-2},{"$f":"IF(VIN_nom>Vout, 1, SQRT(1+(A141/z_RHP)^2))","v":1},{"$f":"IF(VIN_nom>Vout, 0, -ATAN(A141/z_RHP))","v":0},{"$f":"SQRT(1+(A141/Pole2)^2)","v":160.7108182633884},{"$f":"ATAN(A141/Pole2)","v":1.5645739301705022},{"$f":"SQRT(1+(A141/Zero2)^2)","v":1.4129304044156694},{"$f":"ATAN(A141/Zero2)","v":0.78448959683804176},{"$f":"SQRT(1+(A141/pole4)^2)","v":1.0006424153092062},{"$f":"ATAN(A141/pole4)","v":3.5834943368396495E-2},{"$f":"IF(VOUT_setting=1,1,SQRT(1+(A141*zterm1)^2))","v":1.0010647159052775},{"$f":"IF(VOUT_setting=1,0,ATAN(((A141*zterm1))))","v":4.6125309310238762E-2},4.1689047838651696,{"$f":"IF(VOUT_setting=1,0,ATAN(A141*$Q$4/(1+Afbr-$Q$5*(A141)^2)))","v":7.7271042716650779E-2},{"$f":"SQRT((1-(Z141/pterm2))^2+(A141/pterm1)^2)","v":1.0004726736077134},{"$f":"IF((ATAN((A141/pterm1)/(1-A141^2/pterm2))>0),ATAN((A141/pterm1)/(1-A141^2/pterm2)),PI()+ATAN((A141/pterm1)/(1-A141^2/pterm2)))","v":6.4028206441558197E-2},{"$f":"20*LOG10(((E141*K141*G141*O141)/(C141*I141*S141*M141*Q141))*Adc)","v":13.820347279159362},{"$f":"((F141+L141+H141+P141)-(D141+J141+T141+N141+R141))*radconv","v":-130.76922944921239},{"$f":"IF(V141>0,V141,V141+180)","v":49.230770550787611},null,{"$f":"IF(U141<0,A141,1000000000)","v":1000000000},{"$f":"A141^2","v":63096014.890000001},null,{"$f":"20*LOG10((K141/(I141*M141))*AEA)","v":24.541959584327792},{"$f":"(L141-(J141+N141))*radconv","v":-46.748731031744107},null,{"$f":"20*LOG10((E141*G141/(C141*S141))*Acs*Am)","v":27.690184045529939},{"$f":"(F141+H141-(D141+T141))*radconv","v":-82.235979341402128},null,{"$f":"SUM((U142<0)*(U141>0))*A141","v":0},0,null,0,0]
[8035.8,{"$f":"A142/1000","v":8.0358000000000001},5.5474790493214803,1.3895434578765895,1.0001346249230314,1.6407914038130158E-2,1,0,162.58222919259177,1.564645554288407,1.4211660783421238,0.7902783951471466,1.0006574593777264,3.6251879096295334E-2,1.0010896440200747,4.6661665261073647E-2,4.1691933985232001,7.8167270830165156E-2,1.0004837734412995,6.4774135964224169E-2,13.672425607054656,-130.63634403705379,49.363655962946211,null,1000000000,64574081.640000001,null,24.49175100830449,-46.445049737037046,null,27.592855965778092,-82.386156067841256,null,0,0,null,{"$f":"SUM((V143<-183)*(V142>-183))*A142","v":0},{"$f":"IF(AK142>0,U142,0)","v":0}]
[8128.3,8.1282999999999994,5.6092724487113692,1.391561978147563,1.0001377418783997,1.6596750860950898E-2,1,0,164.45364093686209,1.5647155483033153,1.4294488261236642,0.79600029853872989,1.00067267739069,3.6668802215332162E-2,1.0011148601116537,4.7197994346713401E-2,{"$f":"IF(VOUT_setting=1,1,SQRT((1+Afbr-$Q$5*(A143)^2)^2+(A143*$Q$4)^2))","v":4.1694853343279741},7.9063374665486408E-2,1.0004950030478279,6.5520076517057338E-2,13.526683621164025,-130.50458737813281,49.495412621867189,null,1000000000,66069260.890000001,null,24.442686123176184,-46.145107118322656,null,27.496568265187229,-82.533728452878989,null,0,0,null,0,0]
[8222.9500000000007,8.2229500000000009,5.6725252631912548,1.3935818844913064,1.0001409681990068,1.6789975638518622E-2,1,0,166.36855117452498,1.564785539211786,1.4379719710502958,0.80178677075522786,1.0006884291673308,3.7095402777369738E-2,1.0011409603791253,4.7746761330911727E-2,4.1697874927751997,7.9980176759945565E-2,1.0005066280448089,6.6283366695056731E-2,13.379754265112014,-130.37098084563732,49.62901915436268,null,1000000000,67616906.702500015,null,24.393630737618722,-45.84201927710361,null,27.399097281023078,-82.682122903047912,null,0,0,null,0,0]
[8270.2750000000015,8.2702750000000016,5.7041602050704787,1.3945750367480472,1.0001425953621468,1.6886587558011798E-2,1,0,167.32600659373284,1.5648199339241133,1.442251438795632,0.80465431204216409,1.0006963733465322,3.7308698002699529E-2,1.0011541235667296,4.8021134051857775E-2,4.1699398754876489,8.0438527996521667E-2,1.0005124915285515,6.6665016205333286E-2,13.307106777068574,-130.30465049644249,49.695349503557509,null,1000000000,68397448.575625017,null,24.369528748865257,-45.691912851666736,null,27.350754994304623,-82.755357786811203,null,0,0,null,0,0]
[8317.6,8.3176000000000005,5.7358007111908327,1.395557232875476,1.0001442318604501,1.6983199162241839E-2,1,0,168.28346220863423,1.564853937256246,1.4465426956497862,0.80750486318184189,1.0007043630515442,3.7521989831800016E-2,1.0011673621196218,4.8295499537332663E-2,4.1700931270658286,8.0896845777191861E-2,1.0005183890103899,6.7046668685309493E-2,13.234994975087698,-130.23864193788111,49.761358062118887,null,1000000000,69182469.760000005,null,24.345705071760037,-45.542757270939219,null,27.302671227812731,-82.827965118818895,null,0,0,null,0,0]
[8366.0499999999993,8.3660499999999995,5.7681990374172196,1.3965516139606733,1.0001459169318725,1.7082107068842018E-2,1,0,169.26367845738065,1.5648883503967608,1.4509480669557822,0.8104056855066164,1.0007125898470328,3.7740348451174077E-2,1.0011809934474363,4.857637964338804E-2,4.1702509217014176,8.1366023739216656E-2,1.0005244619121814,6.7437396821995177E-2,13.161716899159694,-130.17140239590748,49.828597604092522,null,1000000000,69990792.602499992,null,24.321599170668485,-45.39103514946067,null,27.253709455956145,-82.901659025872988,null,0,0,null,0,0]
[8414.5,8.4145000000000003,5.8006030034868479,1.3975348861672623,1.0001476117874633,1.718101464119004E-2,1,0,170.24389490427168,1.5649223672549541,{"$f":"SQRT(1+(A148/Zero2)^2)","v":1.4553655736812203},{"$f":"ATAN(A148/Zero2)","v":0.81328892209680848},1.0007208643561987,3.7958703469941533E-2,1.0011947037599029,4.8857252078884451E-2,4.1704096267989748,8.1835166240318155E-2,1.0005305704604119,6.7828128106513466E-2,13.088986205771329,-130.10450964608003,49.895490353919968,null,1000000000,70803810.25,null,24.297776499424302,-45.24029770475039,null,27.205013036990916,-82.974716640575721,null,0,0,null,0,0]
[8462.9500000000007,8.4629500000000011,5.8330125154071411,1.398507232748105,1.0001493164271729,1.7279921877352427E-2,1,0,171.22411154590438,1.5649559946366083,1.4597951056566085,0.81615468488150522,1.0007291865778585,3.8177054867370087E-2,1.0012084930537772,4.9138116799822239E-2,4.170569242254567,8.2304273080561569E-2,1.0005367146615816,6.821886255669353E-2,13.016795949966296,-130.03796815590286,49.96203184409714,null,1000000000,71621522.702500015,null,24.274232884553427,-45.090538912498779,null,27.156579199059042,-83.047148463675029,null,0,0,null,0,0]
[8511.4,8.5114000000000001,5.8654274812470426,1.3994688329887972,1.0001510308509511,1.7378828775395753E-2,1,0,172.20432837895314,1.56498923919255,1.464236553747476,0.81900308558530333,1.0007375565108219,3.839540262272953E-2,1.0012223613257958,4.9418973762209037E-2,4.1707297679636826,8.2773344060104795E-2,1.0005428945222272,6.8609600190357611E-2,12.945139301413658,-129.97178216841496,50.028217831585039,null,1000000000,72443929.959999993,null,24.250964225714831,-44.941752751234539,null,27.108405211792828,-83.11896476861078,null,0,0,null,0,0]
[8560.9500000000007,8.5609500000000001,5.8985839379430205,1.4004413329366212,1.0001527943184367,1.7479980885951801E-2,1,0,173.20680007153967,1.5650228493383789,1.4687910520118952,0.82189831422668858,1.0007461658204189,3.86187039172253E-2,1.0012366261452808,4.9706199179445409E-2,4.170894879597288,8.3253027442599339E-2,1.0005492515792351,6.900921237157287E-2,12.872400690038051,-129.90446540183245,50.095534598167546,null,1000000000,73289864.902500018,null,24.227447472118119,-44.790588310424262,null,27.059403455341254,-83.19178541368295,null,0,0,null,0,0]
[8610.5,8.6105,5.9317459108927411,1.401402960084037,1.0001545680191992,1.7581132638771108E-2,1,0,174.20927195753603,1.5650560726710072,1.4733577860172444,0.82477561909812036,1.0007548250298302,3.8842001358546825E-2,1.0012509735628683,4.9993416388787675E-2,4.1710609430631198,8.3732672895074037E-2,1.0005556459472631,6.9408827920149824E-2,12.800206097765098,-129.83752875299237,50.16247124700763,null,1000000000,74140710.25,null,24.204209854401238,-44.64042844245197,null,27.010667835834425,-83.263983306611948,null,0,0,null,0,0]
[8660.0499999999993,8.66005,5.9649133080932613,1.4023538940094311,1.0001563519531838,1.7682284031785674E-2,1,0,175.21174403362241,1.5650889158298034,1.4779366423404499,0.82763511892784947,1.0007635341377608,3.9065294924526414E-2,1.0012654035750075,5.0280625343202469E-2,4.1712279582475018,8.4212280204068374E-2,1.0005620776334252,6.9808446855129644E-2,12.728548575601726,-129.77097607916218,50.229023920837818,null,1000000000,74996466.002499983,null,24.181247214156425,-44.491266723827628,null,26.962195562276218,-83.335568737690892,null,0,0,null,0,0]
[8709.6,8.7096,5.9980860395617412,1.4032943103968556,1.0001581461203359,1.7783435062927559E-2,1,0,176.21421629655467,1.565121385303055,1.4825275086604606,0.83047693214401541,1.0007722931429079,3.9288584592998707E-2,1.0012799161781274,5.0567825995664582E-2,4.1713959250361281,8.4691849156225518E-2,1.0005685466448762,7.020806919554573E-2,12.657421290149104,-129.7048110230246,50.295188976975396,null,1000000000,75857132.160000011,null,24.158555466533759,-44.343096739600171,null,26.913983885704681,-83.406551774083525,null,0,{"$f":"IF(AH154>0,W154,0)","v":0},null,0,0]
[8760.3250000000007,8.7603249999999999,6.0320508435967524,1.4042463121092137,1.000159993433311,1.788698435402869E-2,1,0,177.24046079631961,1.5651542442758,1.4872395645775436,0.83336793708104728,1.0007813115387583,3.9517165162959826E-2,1.0012948584729369,5.0861828509372847E-2,4.1715688604923713,8.5182750374118765E-2,1.0005752077296794,7.0617171496064945E-2,12.585149564435216,-129.6374820667051,50.362517933294896,null,1000000000,76743294.105625018,null,24.135602035320204,-44.192433740379492,null,26.864896058361435,-83.478604352230363,null,0,0,null,0,0]
[8811.0499999999993,8.8110499999999998,6.0660210533000374,1.4051876520932247,1.0001618514704176,1.7990533261505532E-2,1,0,178.2667054852499,1.5651867249239095,1.4919639721315421,0.83624065676570236,1.0007903822235644,3.9745741601373993E-2,1.0013098873145609,5.1155822223018482E-2,4.1717427929750963,8.5673610942303913E-2,1.0005819079462863,7.102627740578589E-2,12.513419389707748,-129.57056639693462,50.429433603065377,null,1000000000,77634602.102499992,null,24.112924062978159,-44.042796495823417,null,26.816075635273453,-83.550046287112011,null,0,0,null,0,0]
[8861.7749999999996,8.8617749999999997,6.0999965783608845,1.4061185068163617,1.0001637202315958,1.8094081783139659E-2,1,0,179.29295036009725,1.5652188337437281,1.4967006143568511,0.83909521716202984,1.0007995051959047,3.9974313884468947E-2,1.0013250026991032,5.1449807086177801E-2,4.1719177223596091,8.6164430632224537E-2,1.0005886473025059,7.1435386945102805E-2,12.442223796188152,-129.50406726928679,50.495932730713207,null,1000000000,78531056.15062499,null,24.090517396778182,-43.894178159574601,null,26.767519798941152,-83.620887690865473,null,0,0,null,0,0]
[8912.5,8.9124999999999996,6.1339773304554921,1.4070390489093541,1.0001655997167858,1.8197629916712674E-2,1,0,180.31919541768738,1.5652505770837137,{"$f":"SQRT(1+(A158/Zero2)^2)","v":1.5014493754628362},{"$f":"ATAN(A158/Zero2)","v":0.84193174383042424},1.000808680454349,4.0202881988474992E-2,1.0013402046226441,5.1743783048436222E-2,4.172093648520522,8.6655209215440496E-2,1.0005954258061918,7.184450013440119E-2,12.371555931062254,-129.43798773416597,50.562012265834028,null,1000000000,79432656.25,null,24.068377958231892,-43.746571899930309,null,26.719225774585826,-83.691138455798097,null,0,0,null,0,0]
[8964.4,8.9643999999999995,6.16875053673881,1.4079704169669114,1.0001675338380409,1.8303576247741482E-2,1,0,181.36921272510989,1.5652826839240792,1.5063205611116361,0.84481544149328403,1.0008181223649575,4.0436740321322294E-2,1.001355848250375,5.204455944010259E-2,4.1722746814026719,8.7157313468601449E-2,1.0006024018543846,7.2263093869851483E-2,12.299790286201977,-129.37081478292058,50.629185217079424,null,1000000000,80360467.359999999,null,24.045998085912693,-43.59658687620788,null,26.670081190664575,-83.762415291499934,null,0,0,null,0,0]
[9016.2999999999993,9.0162999999999993,6.2035290340906695,1.4088913428627292,1.000169479185758,1.8409522167824439E-2,1,0,182.41923021734431,1.5653144211461645,1.5112041920752364,0.84768052484893464,1.0008276190089944,4.0670594228893152E-2,1.0013715824643674,5.2345326406981536E-2,4.1724567575071765,8.7659374205143817E-2,1.0006094189014607,7.2681691469486803E-2,12.228562952280313,-129.30408692163252,50.695913078367482,null,1000000000,81293665.689999983,null,24.023889558006147,-43.447646942611136,null,26.621204944989962,-83.833094080351387,null,0,0,null,0,0]
[9068.2000000000007,9.0682000000000009,6.2383127340181952,1.409801999692313,1.0001714357598717,1.8515467674585555E-2,1,0,183.46924789121763,1.5653457950960219,1.5161001480878571,0.85052712696649979,1.0008371703849013,4.0904443685736064E-2,1.001387407260351,5.2646083895103397E-2,4.1726398766974793,8.8161391180764354E-2,1.0006164769559776,7.3100292955113666E-2,12.15786695400082,-129.23780679626836,50.762193203731641,null,1000000000,82232251.24000001,null,24.002048237280135,-43.299744836984658,null,26.572594199004538,-83.903184741379945,null,0,0,null,0,0]
[9120.1,9.1201000000000008,6.2731015499781497,1.4107025567804112,1.000173403560316,1.8621412765648895E-2,1,0,184.51926574362889,1.5653768119752554,1.5210083101306304,0.85335538040201864,1.0008467764911118,4.1138288666402408E-2,1.001403322634032,5.294683185050874E-2,4.1728240388362678,8.86633641512901E-2,1.0006235760265423,7.3518898348528788E-2,12.087695434090829,-129.17197685787431,50.828023142125687,null,1000000000,83176224.010000005,null,23.980470061229909,-43.152873318294475,null,26.524246157444566,-83.972696977564027,null,0,0,null,0,0]
[9173.2000000000007,9.1732000000000014,6.3086999381906494,1.4116136560209473,1.0001754284776516,1.8729807021489468E-2,1,0,185.59356164707742,1.5654081827783459,1.5260424654812859,0.8562301747144575,1.0008566613452738,4.1377535808276932E-2,1.0014196997320586,5.3254523593721757E-2,4.1730135383140725,8.9176897635710642E-2,1.0006308816960281,7.3947186546448995E-2,12.016437229484971,-129.10509311982602,50.894906880173977,null,1000000000,84147598.24000001,null,23.95866114906849,-43.003665003160016,null,26.475049257147447,-84.043227691617886,null,0,0,null,0,0]
[9226.2999999999993,9.2262999999999984,6.3443035044950609,1.412514530015436,1.0001774651463151,1.8838200837155556E-2,1,0,186.66785773107131,1.5654391924959394,1.531089149726629,0.8590860410504364,1.0008666034865317,4.1616778210706584E-2,1.0014361716355971,5.3562205244062994E-2,4.1732041292335262,8.9690384539915069E-2,1.0006382303185697,7.4375478881082119E-2,11.945713882880566,-129.03868522294141,50.96131477705859,null,1000000000,85124611.689999983,null,23.937119320178976,-42.855520220967449,null,26.426121565372235,-84.113172804464412,null,0,0,null,0,0]
[9279.4,9.279399999999999,6.379912162201224,1.4134053485019278,1.0001795135662352,1.894659421010278E-2,1,0,187.74215399251128,1.5654698473265751,1.5361482393837087,0.86192311960510792,1.0008766029131786,4.1856015846446035E-2,1.001452738339969,5.3869876743776711E-2,4.1733958114451051,9.0203824602826929E-2,1.0006456219035447,7.48037753757399E-2,11.875518418264331,-128.97275520332499,51.027244796675006,null,1000000000,86107264.359999999,null,23.915840456407746,-42.708431292715296,null,26.377460223719552,-84.182542042858941,null,0,0,null,0,0]
[9332.5,9.3324999999999996,6.4155258265313728,1.414286277514144,1.0001815737373394,1.9054987137786816E-2,1,0,188.81645042836843,1.5655001533277253,1.5412196122893618,0.86474154994494379,1.0008866596234973,4.2095248688253192E-2,1.0014693998404696,5.4177538035118662E-2,4.17358858479846,9.0717217563515501E-2,1.0006530564603844,7.5232076053723076E-2,11.805843978622541,-128.90730491278433,51.092695087215674,null,1000000000,87095556.25,null,23.894820514760564,-42.562390567340486,null,26.329062417627252,-84.251344921313859,null,0,0,null,0,0]
[9386.85,9.3868500000000008,6.4519829522256282,1.415177872115384,1.0001836945751874,1.9165931224297664E-2,1,0,189.91603650588161,1.5655308176817944,1.5464229620485948,0.86760716064271493,1.0008970123941714,4.234010819532763E-2,1.0014865517256277,5.4492431191981036E-2,4.1737870259462717,9.124264699520615E-2,1.0006607105413712,7.5670463495888518E-2,11.735061901252784,-128.84081243837556,51.159187561624435,null,1000000000,88112952.922499999,null,23.873569747485238,-42.413989522859765,null,26.27979532521573,-84.321190651389969,null,0,0,null,0,0]
[9441.2000000000007,9.4412000000000003,6.4884451492260684,1.4160594466748602,1.0001858277238347,1.9276874838941548E-2,1,0,191.01562275991733,1.5655611289956353,1.5516389253771432,0.87045352860593861,1.0009074251735615,4.2584962622369368E-2,1.0015038029124819,5.4807313531817774E-2,4.1739866098911564,9.1768026528268695E-2,1.0006684096613594,7.6108855370013162E-2,11.664811502905863,-128.77482590831778,51.22517409168222,null,1000000000,89136257.440000013,null,23.852581899604431,-42.266670487076631,null,26.230798492230054,-84.390462556330363,null,0,0,null,0,0]
[9495.5499999999993,9.4955499999999997,6.524912332515016,1.4169311678141825,1.0001879731832022,1.9387817978990401E-2,1,0,192.11520918744461,1.5655910933311517,1.556867375497518,0.87328080135027397,1.000917897959795,4.2829811940177542E-2,1.0015211533959008,5.5122184992747729E-2,4.1741873364691982,9.2293355883387579E-2,1.0006761538306372,7.6547251701046148E-2,11.595085802273966,-128.70934675207747,51.290653247922535,null,1000000000,90165469.80249998,null,23.831852870142122,-42.120425353614806,null,26.182069037747024,-84.459170184435862,null,0,0,null,0,0]
[9549.9,9.5498999999999992,6.5613844189533586,1.4177931985108962,1.0001901309532109,1.9498760641716229E-2,1,0,193.21479578550139,1.5656207166122569,1.5621081870280724,0.87608912563992414,1.000928430750988,4.3074656119555008E-2,1.0015386031707236,5.543704551290269E-2,4.174389205515574,9.2818634781410767E-2,1.0006839430595513,7.698565251392446E-2,11.525877938151307,-128.64437622548866,51.355623774511344,null,1000000000,91200590.00999999,null,23.811378633789705,-41.975246051247211,null,26.133604125274822,-84.527322875217052,null,0,0,null,0,0]
[9605.5249999999996,9.6055250000000001,6.5987170985060857,1.4186655838922255,1.0001923520896185,1.9612305418107722E-2,1,0,194.34017782689423,1.5656506877194916,1.5674846134793221,0.87894386249835277,1.000939272762563,4.3325238762504124E-2,1.001556565108124,5.5759280972081576E-2,4.1745969930319573,9.3356183691845979E-2,1.0006919616849472,7.743434246529253E-2,11.455575686766224,-128.57840935415581,51.421590645844191,null,1000000000,92266110.52562499,null,23.790683797160334,-41.827756223282385,null,26.084273280759884,-84.596509279805531,null,0,0,null,0,0]
[9661.15,9.6611499999999992,6.6360547435466941,1.4195281530019359,1.000194586120865,1.972584968873661E-2,1,0,195.46556004084636,1.5656803137127489,1.5728737267908894,0.88177906004776418,1.0009501776234138,4.3575815961237337E-2,1.0015746310391063,5.608150484005521E-2,4.1748059768956347,9.3893679158927837E-2,1.0007000275310105,7.7883037164066318E-2,11.385801685023258,-128.5129773893585,51.487022610641503,null,1000000000,93337819.32249999,null,23.77024755242255,-41.681365829755158,null,26.035213662473172,-84.6651335544434,null,0,0,null,0,0]
[9716.7749999999996,9.7167750000000002,6.6733972707294997,1.4203810693331942,1.0001968330468638,1.9839393450678602E-2,1,0,196.59094242439434,1.5657096005187783,1.5782753970027081,0.88459487309419449,1.0009611453314857,4.3826387684466145E-2,1.0015928009580428,5.6403717050540793E-2,4.175016156926965,9.4431120883931338E-2,1.0007081406090259,7.8331736636938654E-2,11.316548952085492,-128.44808115499663,51.551918845003371,null,1000000000,94415716.40062499,null,23.750065820028485,-41.536066338718037,null,25.986422368477747,-84.733205068296087,null,0,0,null,0,0]
[9772.4,9.7723999999999993,6.7107445985531768,1.4212244927965048,1.000199092867528,1.9952936701009481E-2,1,0,197.71632497464216,1.5657385539293933,1.5836894956270322,0.88739145556370391,1.0009721758847137,4.4076953900906157E-2,1.0016110748592748,5.6725917537269945E-2,4.1752275329453159,9.4968508568314611E-2,1.000716300930343,7.8780440910588556E-2,11.247810628209667,-128.38372131239558,51.616278687604421,null,1000000000,95499801.75999999,null,23.730134596529577,-41.391849260911393,null,25.937896541827563,-84.800732985256715,null,0,0,null,0,0]
[9829.2999999999993,9.8292999999999999,6.7489528613557637,1.422077589977272,1.0002014178276351,2.0069081983345668E-2,1,0,198.86750297983608,1.5657678319462072,1.5892404192562306,0.8902324021995025,1.000983524293336,4.433325770268795E-2,1.0016298752017607,5.7055491094587144E-2,4.1754449912193055,9.5518157679097604E-2,1.0007246971891592,7.9239435086083859E-2,11.178021932560295,-128.31844175612787,51.681558243872132,null,1000000000,96615138.48999998,null,23.71000161448654,-41.245437641602159,null,25.888530169911178,-84.869255647896239,null,0,0,null,0,0]
[9886.2000000000007,9.8862000000000005,6.7871659805731932,1.4229210815463171,1.0002037562801231,2.0185226724158824E-2,1,0,200.01868115353747,1.5657967729523852,1.5948040802592334,0.89305354952184701,1.0009949384567132,4.4589555676134721E-2,1.0016487843359203,5.7385052244314977E-2,4.1756637005504214,9.6067749612161496E-2,1.0007331429060884,7.9698434341386987E-2,11.108757355038197,-128.25372436966057,51.746275630339426,null,1000000000,97736950.440000013,null,23.690122519529098,-41.100140796166265,null,25.839435667492026,-84.937228271602336,null,0,0,null,0,0]
[9943.1,9.9431000000000012,6.8253838746369722,1.4237551276495053,1.0002061082248974,2.0301370920319257E-2,1,0,201.16985949285348,1.565825382733427,1.6003803457930681,0.89585505935207266,1.0010064183725955,4.4845847787774666E-2,1.0016678022555925,5.7714600915570499E-2,4.1758836607421062,9.6617284048562402E-2,1.0007416380934882,8.0157438705008507E-2,11.040009930231419,-128.18956937416337,51.810430625836631,null,1000000000,98865237.610000014,null,23.670493263127192,-40.955949782491118,null,25.790610116979671,-85.004660033870081,null,0,0,null,0,0]
[10000,10,6.8636064637852856,1.4245798849186055,1.0002084736618628,2.0417514568697375E-2,1,0,202.32103799495712,1.56585366694316,1.6059690845609214,0.89863709249959889,1.0010179640387209,4.510213400414062E-2,1.0016869289545809,5.8044137037487016E-2,4.1761048715967233,9.7166760669561272E-2,1.000750182763787,8.0616448205443433E-2,10.971772814483433,-128.12597683990728,51.874023160092719,null,1000000000,100000000,null,23.651109873066694,-40.812855708898574,null,25.742050646219372,-85.071559910850709,null,0,0,null,0,0]
[10058.25,10.058249999999999,6.9027406978364336,1.4254147481589461,1.0002109091968534,2.0536413251390957E-2,1,0,203.49952933376713,1.5658822907383501,1.6117032059973826,0.90146512321208849,1.0010298517417564,4.5364494683261404E-2,1.0017066221252171,5.8381478605533478E-2,4.1763326261805203,9.7729213860275346E-2,1.0007589814344333,8.1086353440262632E-2,10.902438310108236,-128.06145807801494,51.938541921985063,null,1000000000,101168393.0625,null,23.631517212673039,-40.667493666855286,null,25.692611733616502,-85.139505245088714,null,0,0,null,0,0]
[10116.5,10.1165,6.941879688827358,1.4262401978893806,1.0002133588716535,2.0655311353363431E-2,1,0,204.67802083738869,1.5659105849143953,1.6174501259913583,0.90427307984445993,1.0010418083471664,4.5626849113083658E-2,1.0017264292849097,5.8718806871441265E-2,4.1765616910546646,9.8291605784255179E-2,1.000767831990466,8.1556264118922084E-2,10.833624482298347,-127.99752847497243,52.002471525027573,null,1000000000,102343572.25,null,23.612174037053411,-40.52326254103739,null,25.64344572691806,-85.206911570120027,null,0,0,null,0,0]
[10174.75,10.17475,6.9810233567489508,1.4270563913244518,1.0002158226861593,2.0774208871257409E-2,1,0,205.85651250299122,1.5659385551322818,1.6232097086042523,0.90706113156611312,1.0010538338524819,4.5889197257716334E-2,1.0017463504268971,5.9056121759232312E-2,4.1767920660035927,9.8853936100206014E-2,1.0007767344454503,8.2026180271942556E-2,10.765324368539694,-127.93418765485055,52.065812345149453,null,1000000000,103525537.5625,null,23.593076322305532,-40.380152961046448,null,25.594549686735579,-85.273787895615499,null,0,0,null,0,0]
[10233,10.233000000000001,7.0201716233671307,1.4278634822218115,1.0002183006402658,2.0893105801715592E-2,1,0,207.03500432780874,1.5659662069241032,1.6289818195226009,0.9098294463944252,1.0010659282552201,4.6151539081273542E-2,1.0017663855443792,5.939342319294675E-2,4.1770237508105561,9.941620446706291E-2,1.0007856888130289,8.2496101929827384E-2,10.697531129039156,-127.87143510228746,52.128564897712536,null,1000000000,104714289,null,23.574220121239911,-40.238155615105363,null,25.545920719684592,-85.340143033179729,null,0,0,null,0,0]
[10292.5,10.2925,7.0601646497821431,1.4286786513951599,1.000220846367238,2.1014553558478966E-2,1,0,208.23878583832973,1.5659941289742465,1.6348905919638477,0.9126369638670363,1.0010783533229157,4.6419503994388982E-2,1.0017869682633709,5.9737948885642718E-2,4.177261759490321,9.9990474366875415E-2,1.0007948889442375,8.2976113458487058E-2,10.628799419153964,-127.80794259180611,52.19205740819389,null,1000000000,105935556.25,null,23.555204598123339,-40.094249787058743,null,25.496520982532683,-85.407392977294563,null,0,0,null,0,0]
[10352,10.352,7.1001623148288946,1.4294846368404266,1.0002234068469498,2.1136000695243507E-2,1,0,209.44256750933593,1.5660217300576413,1.640812157994546,0.91542423894436187,1.00109085027145,4.6687462236555358E-2,1.0018076698875304,6.0082460380486244E-2,4.1775011343874597,0.10056467891168827,1.0008041432689765,8.3456130795086444E-2,10.560582525439477,-127.74506236123102,52.254937638768979,null,1000000000,107163904,null,23.536432977642949,-39.951484990573256,null,25.447393944099616,-85.474117100843259,null,0,0,null,0,0]
[10411.5,10.4115,7.1401645405535383,1.4302815918549594,1.000225982079288,2.1257447208431431E-2,1,0,210.64634933807594,1.5660490156769364,1.6467463796005817,0.91819144692060561,1.0011034190981309,4.6955413769543534E-2,1.001828490409487,6.0426957596581121E-2,4.1777418752671469,0.1011388177387548,1.0008134518020357,8.3936153972078195E-2,10.492873538085384,-127.68279344923909,52.317206550760915,null,1000000000,108399332.25,null,23.517901290105559,-39.809851495119005,null,25.398536663422632,-85.540324189181263,null,0,0,null,0,0]
[10471,10.471,7.1801712507306208,1.4310696663659883,1.0002285720641391,2.1378893094465088E-2,1,0,211.850131321861,1.5660759912097133,1.6526931204572159,0.92093876180435641,1.0011160598002513,4.7223358555130171E-2,1.0018494298218277,6.0771440453051433E-2,4.1779839818932674,0.10171289048558367,1.0008228145582916,8.4416183021895533E-2,10.425665669804527,-127.62113476792058,52.37886523207942,null,1000000000,109641841,null,23.49960564218987,-39.669339636660936,null,25.349946245685729,-85.606022834569373,null,0,0,null,0,0]
[10532,10.532,7.2211911108642752,1.4318685426577054,1.0002312426576745,2.1503399986676525E-2,1,0,213.08426090882193,1.5661033303884662,1.6588026348426794,0.92373486585477504,1.0011290937889428,4.7498051206570011E-2,1.0018710205347281,6.1124592759438774E-2,4.1782336096255541,0.10230136667532656,1.0008324696569648,8.4908319775103228E-2,10.357276734688989,-127.55855390049076,52.441446099509236,null,1000000000,110923024,null,23.48108980286397,-39.526439824477869,null,25.300404915799042,-85.672858713972275,null,0,0,null,0,0]
[10593,10.593,7.2622155275221845,1.4326583937089763,1.0002339287566777,2.1627906212098796E-2,1,0,214.31839065321435,1.5661303547077108,1.6649250228369674,0.92651042738257461,1.0011422033169135,4.7772736684771062E-2,1.0018927361921328,6.1477729800973269E-2,4.1784846723267046,0.10288977264028441,1.0008421817791751,8.5400462769952584E-2,10.289400439896799,-127.49661172045607,52.503388279543927,null,1000000000,112211649,null,23.462814005931897,-39.384698561025502,null,25.251138056563526,-85.739177881011841,null,0,0,null,0,0]
[10654,10.654,7.3032444239184411,1.4334393706345758,1.0002366303610242,2.1752411766877158E-2,1,0,215.55252055233413,1.5661570695755214,1.6710601429420768,0.92926562964655191,1.0011553883811963,4.8047414948564723E-2,1.0019145767859177,6.1830851490573893E-2,4.1787371697380937,0.10347810799069788,1.0008519509412279,8.5892612041327934E-2,10.2220298557564,-127.43530667847828,52.564693321521716,null,1000000000,113507716,null,23.444774295132046,-39.244105653849218,null,25.202142693638404,-85.804988996146506,null,0,0,null,0,0]
[10715,10.715,7.3442777249747078,1.4342116212159537,1.000239347470588,2.187691664715697E-2,1,0,216.78665060353882,1.5661834802768249,1.6772078554382484,0.93200065446336589,1.001168648978807,4.832208595678892E-2,1.0019365423079123,6.2183957741182516E-2,4.1789911015996797,0.10406637233709554,1.0008617771595227,8.6384767624091738E-2,10.155158176639267,-127.37463710982036,52.625362890179645,null,1000000000,114811225,null,23.426966791290646,-39.104650986067405,null,25.153415899633114,-85.870300528847963,null,0,0,null,0,0]
[10777.5,10.7775,7.3863245333276923,1.4349939618322491,1.0002421474760081,2.200448241924137E-2,1,0,218.05112827005931,1.5662102303443881,1.683519657608527,0.93478219479372471,1.0011823139957776,4.8603503601710986E-2,1.0019591775310901,6.2545730828237542E-2,4.1792527652078961,0.10466902814876256,1.0008719042014085,8.6889031975842787E-2,10.087152581163121,-127.31313291527943,52.686867084720575,null,1000000000,116154506.25,null,23.408958263054451,-38.962937173738091,null,25.103766449368202,-85.936708583142718,null,0,0,null,0,0]
[10840,10.84,7.4283758113508185,1.4357674454165914,1.000244963758304,2.213204747505515E-2,1,0,219.3156060908106,1.5662366719536003,1.6898443877527978,0.93754293491658625,1.0011960583001054,4.8884913542380934E-2,1.0019819438845161,6.2907487522712482E-2,4.1795159341231818,0.10527160859463489,1.0008820911752365,8.7393303027219871E-2,10.019656651824079,-127.2522919454924,52.747708054507598,null,1000000000,117505600,null,23.39118549815668,-38.822397010729922,null,25.054392863892655,-86.002609591786538,null,0,0,null,0,0]
[10902.5,10.9025,7.4704314835643748,1.4365322206206701,1.0002477963173375,2.2259611810452679E-2,1,0,220.58008406314028,1.5662628104091483,1.6961819012534167,0.94028306566266495,1.0012098818885253,4.9166315734546391E-2,1.0020048413592524,6.3269227731043279E-2,4.1797806080612236,0.1058741132567473,1.0008923380989503,8.7897580815648663E-2,9.952663456254875,-127.19211206897494,52.807887931025064,null,1000000000,118864506.25,null,23.37364456476303,-38.683019864649012,null,25.005292141650823,-86.068012074275714,null,0,0,null,0,0]
[10965,10.965,7.5124914761710198,1.4372884328084361,1.0002506451529707,2.2387175421288482E-2,1,0,221.84456218445646,1.566288650894776,1.7025320553559087,0.94300277626215845,1.001223784757753,4.9447710133962319E-2,1.0020278699463101,6.3630951359691629E-2,4.1800467867361535,0.10647654171745845,1.0009026449905967,8.8401865378530078E-2,9.8861661872588726,-127.13259105065842,52.867408949341581,null,1000000000,120231225,null,23.356331608580593,-38.54479518787528,null,24.956461328710816,-86.132924361731611,null,0,0,null,0,0]
[11028.75,11.02875,7.5553970446708041,1.4380510950401884,1.0002535677333253,2.2517289553598503E-2,1,0,223.1343300190581,1.5663147064749341,1.7090220887592571,0.94575603881410231,1.0012380473560285,4.9734724347398611E-2,1.0020514941676477,6.3999892283545551E-2,4.1803198388664429,0.10709093981191703,1.000913219817863,8.8916242650471683E-2,9.8188429445103473,-127.07255594746165,52.927444052538348,null,1000000000,121633326.5625,null,23.338903337213083,-38.404982441463716,null,24.906928945258958,-86.198638345003459,null,0,0,null,0,0]
[11092.5,11.092499999999999,7.5983069581631062,1.4388051437426572,1.0002565072475611,2.2647402923362765E-2,1,0,224.42409800340295,1.5663404625716459,1.7155249792482288,0.94848844884533479,1.0012523924310961,5.0021730360296113E-2,1.0020752547791927,6.436881576139955E-2,4.1805944559192803,0.10770525774975521,1.00092385707402,8.9430627049076908E-2,9.7520217437837982,-127.01320131679071,52.986798683209287,null,1000000000,123043556.25,null,23.321704392026575,-38.26634682748869,null,24.857671314591499,-86.263859261418517,null,0,0,null,0,0]
[11156.25,11.15625,7.6412211434489246,1.4395507231754674,1.0002594636955287,2.2777515526182509E-2,1,0,225.71386613492402,1.5663659243187777,1.7220405811673429,0.95120020201913735,1.0012668199794101,5.0308728125725524E-2,1.0020991517712432,6.473772169407388E-2,4.1808706375863141,0.1083194950888207,1.0009345567785495,8.9945018613955582E-2,9.6856957462756004,-126.95452448776373,53.045475512236266,null,1000000000,124461914.0625,null,23.304730920950277,-38.128877426729993,null,24.808685448867106,-86.328595378965915,null,0,0,null,0,0]
[11220,11.22,7.6841395289572523,1.4402879744134462,1.0002624370770778,2.2907627357659124E-2,1,0,227.00363441111276,1.5663910967335213,1.7285687507746483,0.95389149226686709,1.0012813299974064,5.0595717596765684E-2,1.0021231851340424,6.5106609982417338E-2,4.1811483835575185,0.10893365138731899,1.0009453189510444,9.0459417384690238E-2,9.6198582371628678,-126.89652269958799,53.10347730041201,null,1000000000,125888400,null,23.28797914845833,-37.992563412514848,null,24.759968407674393,-86.392854783157802,null,0,0,null,0,0]
[11285.5,11.285500000000001,7.728240367428123,1.4410369346657661,1.000265509717934,2.3041310078452309E-2,1,0,228.32880823906379,1.5664166639541572,1.7352890658674638,0.95663554985056898,1.0012963242224182,5.0890576521790645E-2,1.0021480202632969,6.5485606134234986E-2,4.1814353829063871,0.1095645820062765,1.0009564416401497,9.0987944452852201E-2,9.5527152810237173,-126.83762880485649,53.162371195143507,null,1000000000,127362510.25,null,23.270994545023903,-37.853699559861205,null,24.710190989541058,-86.458389959382501,null,0,0,null,0,0]
[11351,11.351000000000001,7.7723454917927972,1.4417773951965549,1.0002686002344949,2.3174991975559084E-2,1,0,229.65398221454691,1.5664419361133866,1.7420223465582505,0.95935841509239206,1.0013114054993089,5.1185426590399541E-2,1.0021729993320254,6.5864583447598338E-2,4.1817240329526113,0.11019542612991257,1.0009676303162029,9.1516479212544355E-2,9.4860740191647235,-126.77944134192722,53.220558658072775,null,1000000000,128845201,null,23.254236138998454,-37.716032525748012,null,24.660691213838902,-86.523438625321845,null,0,0,null,0,0]
[11416.5,11.416499999999999,7.8164548295005263,1.4425094990822187,1.0002717086265949,2.3308673044209079E-2,1,0,230.97915633502291,1.5664669182896573,1.7487684430827442,0.96206029263998716,1.001326573824145,5.1480267751727204E-2,1.0021981223294651,6.6243541815059745E-2,4.1820143333544104,0.11082618328023393,1.0009788850008228,9.2045021706607985E-2,9.4199275595639804,-126.72195705258414,53.278042947415855,null,1000000000,130336472.25,null,23.237700076355896,-37.579550872787891,null,24.611466041344194,-86.58800898137801,null,0,0,null,0,0]
[11482,11.481999999999999,7.8605683096221757,1.4432333862236804,1.0002748348940673,2.3442353279632115E-2,1,0,232.30433059801044,1.5664916154455399,1.7555272076958441,0.96474138522412511,1.0013418291929708,5.1775099954917719E-2,1.0022233892447927,6.6622481129204131E-2,4.1823062837681473,0.11145685297965424,1.0009902057157505,9.2573571977853195E-2,9.3542691365320767,-126.66517259987961,53.334827400120389,null,1000000000,131836324,null,23.221382580786077,-37.444243266783765,null,24.562512481443292,-86.652109046009571,null,0,0,null,0,0]
[11548.75,11.54875,7.9055278400037237,1.4439627761869613,1.0002780392132864,2.3578583802416883E-2,1,0,233.654794590276,1.5665164957108149,1.7624278385010657,0.96745246786852412,1.0013574652422279,5.2075549458023687E-2,1.0022492864057733,6.7008632396264409E-2,4.1826055029425158,0.1120994678961251,1.0010018104300085,9.3112217131853831E-2,9.2878529097284019,-126.60802094026519,53.391979059734808,null,1000000000,133373626.5625,null,23.204974715350033,-37.30754969587052,null,24.512901083698949,-86.716956672581873,null,0,0,null,0,0]
[11615.5,11.615500000000001,7.9504915286343474,1.4446839164584324,1.0002812620963015,2.3714813449866725E-2,1,0,235.00525872551799,1.5665410900258576,1.7693413219986744,0.9701423837116101,1.0013731916810995,5.2375989551207022E-2,1.0022753330072161,6.7394763650709386E-2,4.1829064349808567,0.11274199099187984,1.0010134837648466,9.3650870452375662E-2,9.2219297261710622,-126.55158885737841,53.448411142621595,null,1000000000,134919840.25,null,23.188786159021767,-37.172051970449388,null,24.463565643160159,-86.781332144690822,null,0,0,null,0,0]
[11682.25,11.68225,{"$f":"SQRT(1+(A205/pole1)^2)","v":7.995459305360396},{"$f":"ATAN(A205/pole1)","v":1.4453969454745126},{"$f":"SQRT(1+(A205/Zero1)^2)","v":1.0002845035429335},{"$f":"ATAN(A205/Zero1)","v":2.3851042216933682E-2},{"$f":"IF(VIN_nom>Vout, 1, SQRT(1+(A205/z_RHP)^2))","v":1},{"$f":"IF(VIN_nom>Vout, 0, -ATAN(A205/z_RHP))","v":0},{"$f":"SQRT(1+(A205/Pole2)^2)","v":236.35572300128564},{"$f":"ATAN(A205/Pole2)","v":1.5665654032921343},1.7762675081152062,0.97281134120516244,{"$f":"SQRT(1+(A205/pole4)^2)","v":1.0013890085053272},{"$f":"ATAN(A205/pole4)","v":5.2676420180674345E-2},{"$f":"IF(VOUT_setting=1,1,SQRT(1+(A205*zterm1)^2))","v":1.0023015290374708},{"$f":"IF(VOUT_setting=1,0,ATAN(((A205*zterm1))))","v":6.7780874778961456E-2},4.183209079513535,{"$f":"IF(VOUT_setting=1,0,ATAN(A205*$Q$4/(1+Afbr-$Q$5*(A205)^2)))","v":0.1133844217627818},{"$f":"SQRT((1-(Z205/pterm2))^2+(A205/pterm1)^2)","v":1.001025225743672},{"$f":"IF((ATAN((A205/pterm1)/(1-A205^2/pterm2))>0),ATAN((A205/pterm1)/(1-A205^2/pterm2)),PI()+ATAN((A205/pterm1)/(1-A205^2/pterm2)))","v":9.4189531984625693E-2},{"$f":"20*LOG10(((E205*K205*G205*O205)/(C205*I205*S205*M205*Q205))*Adc)","v":9.1564928124931413},{"$f":"((F205+L205+H205+P205)-(D205+J205+T205+N205+R205))*radconv","v":-126.49587259788782},{"$f":"IF(V205>0,V205,V205+180)","v":53.504127402112175},null,{"$f":"IF(U205<0,A205,1000000000)","v":1000000000},{"$f":"A205^2","v":136474965.0625},null,{"$f":"20*LOG10((K205/(I205*M205))*AEA)","v":23.172813152826418},{"$f":"(L205-(J205+N205))*radconv","v":-37.037738424864322},null,{"$f":"20*LOG10((E205*G205/(C205*S205))*Acs*Am)","v":24.414503144107712},{"$f":"(F205+H205-(D205+T205))*radconv","v":-86.845243397038388},null,{"$f":"SUM((U206<0)*(U205>0))*A205","v":0},0,null,0,0]
[11749,{"$f":"A206/1000","v":11.749000000000001},8.0404311015913095,1.4461019986078212,1.0002877635530021,2.3987270098570001E-2,1,0,237.70618741518385,1.5665894402997274,1.7832062488351985,0.97545954675975877,1.001404915710628,5.2976841292642511E-2,1.0023278744848216,6.8166965667478888E-2,4.1835134361689175,0.11402675970514205,1.0010370363900263,9.4728201773776513E-2,9.091535519823811,-126.44086834351178,53.559131656488219,null,1000000000,138039001,null,23.157052014080818,-36.90459750403032,null,24.365710619019893,-86.908698188781713,null,0,0,null,{"$f":"SUM((V207<-183)*(V206>-183))*A206","v":0},{"$f":"IF(AK206>0,U206,0)","v":0}]
[11817.5,11.817500000000001,8.0865860423047078,1.4468173828255031,1.0002911283311477,2.41270685718535E-2,1,0,239.09205740430974,1.5666138251826904,1.7903398036537099,0.9781558200942565,1.0014213339206934,5.3285128662090432E-2,1.0023550659688276,6.8563157627354057E-2,{"$f":"IF(VOUT_setting=1,1,SQRT((1+Afbr-$Q$5*(A207)^2)^2+(A207*$Q$4)^2))","v":4.1838275518621968},0.11468584092931236,1.0010492280951602,9.5281002623642863E-2,9.0253670297487858,-126.38515821182595,53.614841788174047,null,1000000000,139653306.25,null,23.14109415050536,-36.769173137419443,null,24.315916510467424,-86.973349978366102,null,0,0,null,0,0]
[11886,11.885999999999999,8.1327450745523269,1.4475246467873801,1.0002945126584646,2.4266866101900153E-2,1,0,240.47792753396652,1.5666379290063515,1.7974862706825812,0.98083067299570492,1.0014378473038201,5.3593405893720428E-2,1.0023824147820224,6.8959328030158765E-2,4.1841434698297677,0.11534482332038117,1.0010614921662304,9.5833812265310986E-2,8.9596898418478617,-126.330189569984,53.669810430016,null,1000000000,141276996,null,23.125351789863618,-36.634959386853048,null,24.266400536643985,-87.037537069340402,null,0,0,null,0,0]
[11954.5,11.954499999999999,8.1789081290603978,1.4482239272758493,1.0002979165347541,2.440666268325533E-2,1,0,241.86379780173846,1.5666617566020595,1.8046454965232388,0.98348432189097457,1.0014544558553002,5.3901672929441286E-2,1.0024099209115285,6.9355476753303835E-2,4.1844611896634571,0.11600370633548157,1.0010738286291168,9.6386630747486032E-2,8.8944971612803663,-126.27595810720435,53.724041892795654,null,1000000000,142910070.25,null,23.10982119116694,-36.501944125472377,null,24.217159642233064,-87.10126730186181,null,0,0,null,0,0]
[12023,12.023,8.2250751381043745,1.4489153580339267,1.0003013399598164,2.4546458310464633E-2,1,0,243.2496682052649,1.5666853126910616,1.8118173299299536,0.98611698098383882,1.0014711595703987,5.4209929711173409E-2,1.0024375843443962,6.9751603674240811E-2,4.1847807109528832,0.11666248943225357,1.0010862375098477,9.693945811883406E-2,8.8297823192780172,-126.22245945965238,53.777540540347616,null,1000000000,144552529,null,23.094498690367114,-36.370115347485068,null,24.168190821042437,-87.164548341941554,null,0,0,null,0,0]
[12093,12.093,8.2722571200282147,1.4496139562454566,1.0003048585457557,2.4689314164397052E-2,1,0,244.66588627372141,1.5667091089180585,1.8191590803181814,0.98878582585756236,1.0014883273675717,5.4524925987726527E-2,1.0024660160402894,7.0156382256264249E-2,4.1851090896890648,0.11733559464811881,1.0010989929590297,9.7504400432930224E-2,8.7641372017271468,-126.16854177823852,53.83145822176148,null,1000000000,146240649,null,23.079051909162839,-36.236613180477129,null,24.118427687056577,-87.228758843867965,null,0,0,null,0,0]
[12163,12.163,8.3194430933466883,1.4503046302131928,1.0003083975455673,2.4832169010422862E-2,1,0,246.08210447912791,1.5667326312474605,1.8265136838716354,0.99143319682653031,1.0015055945316622,5.4839911433701163E-2,1.0024946119765972,7.0561137812163582E-2,4.1854393487671686,0.1180085943782388,1.0011118240877941,9.8069352132397425E-2,8.6989773891273945,-126.1153799923925,53.884620007607495,null,1000000000,147938569,null,23.063814941102443,-36.104325063860095,null,24.068942477571341,-87.292515915559605,null,0,0,null,0,0]
[12233,12.233000000000001,8.3666329905280232,1.450987513356687,1.0003119569590349,2.4975022842722166E-2,1,0,247.49832281913336,1.5667558843810769,1.8338809859511682,0.99405931536099601,1.0015229610575307,5.5154885987156052E-2,1.0025233721392648,7.0965870211295065E-2,4.1857714877421452,0.1186814880454945,1.0011247309243958,9.8634313269041499E-2,8.6342961547361643,-126.06296930074613,53.937030699253867,null,1000000000,149646289,null,23.048784113491401,-35.973238574167986,null,24.019732136943027,-87.355827204695402,null,0,0,null,0,0]
[12303,12.303000000000001,8.4138267455499403,1.4516627361314915,1.0003155367859407,2.5117875655475321E-2,1,0,248.91454129144037,1.5667788729137129,1.8412608341277397,0.99666440056228978,1.0015404269400083,5.5469849586162835E-2,1.0025522965141589,7.1370579323060263E-2,4.1861055061665553,0.1193542750733305,1.0011377134972499,9.9199283894624665E-2,8.5700868972438755,-126.01130486173294,53.988695138267062,null,1000000000,151363809,null,23.033955829849369,-35.843341417534013,null,23.970793658738465,-87.418700189127108,null,0,0,null,0,0]
[12374.5,12.374499999999999,8.4620357109382365,1.4523446522400625,1.000319214397466,2.526378854132828E-2,1,0,250.36110743668979,1.5668020855597573,{"$f":"SQRT(1+(A215/Zero2)^2)","v":1.8488116179404126},{"$f":"ATAN(A215/Zero2)","v":0.99930382013386265},1.0015583696590176,5.5791551031701726E-2,1.0025820102104872,7.1783936595957665E-2,4.1864486219527217,0.12004136827557052,1.001151052485828,9.9776370883506313E-2,8.5049822474773205,-125.95929866639486,54.040701333605142,null,1000000000,153128250.25,null,23.019015236419985,-35.711875937310758,null,23.921084086562701,-87.482475560541957,null,0,0,null,0,0]
[12446,12.446,8.5102485666718781,1.4530188421814665,1.0003229133062013,2.540970035119932E-2,1,0,251.80767371529058,1.5668250315051966,1.8563751767361201,1.0019217498774615,1.0015764160274054,5.6113240917721401E-2,1.0026118952020528,7.2197269297480438E-2,4.1867936976479037,0.1207283490050237,1.0011644705517173,0.10035346788137907,8.4403564848234129,-125.90806072634409,54.09193927365591,null,1000000000,154902916,null,23.004278610873122,-35.581625790403521,null,23.871651964938639,-87.54580889030801,null,0,0,null,0,0]
[12517.5,12.5175,8.5584652470038023,1.4536854359206217,1.0003266335119096,2.5555611078887416E-2,1,0,253.25424012495768,1.566847715320119,1.863951354999541,1.0045184157306177,1.0015945660395691,5.6434919178268719E-2,1.002641951473539,7.2610577288601277E-2,4.1871407327675643,0.12141521664911002,1.0011779677257204,0.10093057494326219,8.3762029615148244,-125.85758577719791,54.142414222802088,null,1000000000,156687806.25,null,22.989742355183239,-35.452578289613257,null,23.822494242388569,-87.608707628374191,null,0,0,null,0,0]
[12589,12.589,8.6066856876551068,1.4543445605371943,1.000330375014354,2.5701520718191807E-2,1,0,254.70080666345788,1.5668701414707915,1.871539999476137,1.007094041122538,1.0016128196898744,5.6756585747404949E-2,1.0026721790095425,7.3023860430343326E-2,4.1874897268245821,0.12210197059587538,1.0011915440388153,0.10150769212412644,8.3125151542803071,-125.8078685270598,54.192131472940204,null,1000000000,158482921,null,22.975402946615748,-35.324720885509628,null,23.773607916630972,-87.671179059373969,null,0,{"$f":"IF(AH218>0,W218,0)","v":0},null,0,0]
[12662.25,12.66225,8.6560901826806891,1.4550122019058822,1.0003342301767708,2.5851000437293943E-2,1,0,256.18277880799656,1.5668928538753886,1.8793271497463064,1.0097111180396787,1.0016316275760013,5.708611308146197E-2,1.0027033239676486,7.3447232979368879E-2,4.1878492936253222,0.12280541466097454,1.0012055347401163,0.10209894510160838,8.2477448161397966,-125.75771460708478,54.242285392915221,null,1000000000,160332575.0625,null,22.960913100850551,-35.194955273749734,null,23.723803426211603,-87.734743835307654,null,0,0,null,0,0]
[12735.5,12.7355,8.7054984923205279,1.4556722651300396,1.0003381076906697,2.6000479000908464E-2,1,0,257.6647510831678,1.5669153050168345,1.8871270654201513,1.0123065786898411,1.0016505442234764,5.7415628004738102E-2,1.0027346486434421,7.3870579152593263E-2,4.1882109153856053,0.12350873809679259,1.0012196085682448,0.10269020881611195,8.1834497981402876,-125.70834461298199,54.291655387018011,null,1000000000,162192960.25,null,22.946622605420504,-35.066412502496682,null,23.674277554957506,-87.797875096933296,null,0,0,null,0,0]
[12808.75,12.80875,8.7549105519913297,1.4563248779410252,1.0003420075557907,2.6149956402368998E-2,1,0,259.14672348673054,1.5669374993773326,1.8949395888635148,1.0148806552486642,1.0016695696261377,5.7745130446381E-2,1.0027661530200802,7.4293898800749533E-2,4.1885745915732207,0.12421194024739655,1.0012337655570813,0.10328148332658359,8.1196234742938884,-125.65975278801612,54.340247211983879,null,1000000000,164064076.5625,null,22.932527906670451,-34.93907952181798,null,23.625027228630721,-87.860580166478016,null,0,0,null,0,0]
[12882,12.882,8.8043262985547912,1.4569701652282574,1.0003459297718722,2.6299432635009477E-2,1,0,260.62869601649447,1.5669594413371422,1.9027645647784275,1.0174335772153265,1.001688703777788,5.8074620335554529E-2,1.0027978370806268,7.4717191774627503E-2,4.1889403216531189,0.12491502045755633,1.0012480057407001,0.1038727686919151,8.0562593435741761,-125.61193336016467,54.38806663983533,null,1000000000,165945924,null,22.918625526140531,-34.812943429291067,null,23.57604942274968,-87.922866203334578,null,0,0,null,0,0]
[12957.25,12.95725,8.855095054925318,1.457625571316274,1.0003499823535913,2.6452988905844722E-2,1,0,262.15113208920843,1.5669817240608415,1.9108159982685351,1.0200344130105727,1.0017084736004733,5.8413093390034893E-2,1.0028305733270324,7.5152014302433262E-2,4.1893181757483386,0.12563716972918657,1.0012627214038903,0.10448020973286215,7.9916397268480228,-125.5636065235455,54.436393476454498,null,1000000000,167890327.5625,null,22.904540247274841,-34.684596298394901,null,23.526014995546912,-87.986423887830398,null,0,0,null,0,0]
[13032.5,13.032500000000001,8.905867571696696,1.4582735047153661,1.0003540585228994,2.6606543928901043E-2,1,0,263.67356829058241,1.5670037494661908,1.9188802486624268,1.0226134056809755,1.0017283581783594,5.8751553045726566E-2,1.0028634991668477,7.5586808360406252E-2,4.1896981962710127,0.1263591889110193,1.0012775249404717,0.10508766235533978,7.9274943707678869,-125.5160824539759,54.483917546024102,null,1000000000,169846056.25,null,22.89065072575184,-34.557485175415572,null,23.476261859496415,-88.049554153854061,null,0,0,null,0,0]
[13107.75,13.107749999999999,8.9566437849191889,1.4589140919673487,1.0003581582795087,2.6760097696952357E-2,1,0,265.19600461840065,1.5670255219848053,1.9269571550451861,1.0251707953717555,1.0017483575046127,5.9089999225885315E-2,1.0028966145813989,7.6021573786966626E-2,4.1900803826317263,0.12708107729501547,1.0012924163880221,0.10569512662301431,7.8638166202656947,-125.4693548647279,54.530645135272096,null,1000000000,171813110.0625,null,22.87695342628632,-34.43159655056116,null,23.426786892707078,-88.112264255779266,null,0,0,null,0,0]
[13183,13.183,9.00742363208043,1.4595474567849205,1.000362281623129,2.6913650202772914E-2,1,0,266.71844107049793,1.567047045947118,1.9350465589380934,1.0277068193522108,1.0017684715723605,5.9428431853785352E-2,1.0029299195519077,7.6456310420599097E-2,4.1904647342379233,0.12780283417393459,1.001307395784335,0.10630260259948979,7.8005999469731622,-125.42341746599763,54.57658253400237,null,1000000000,173791489,null,22.863444889427971,-34.306917073021758,null,23.37758702414186,-88.174561285879847,null,0,0,null,0,0]
[13259.75,13.25975,9.0592193820595917,1.4601861324090297,1.0003665114562992,2.7070262248170624E-2,1,0,268.27122521889464,1.5670687473088898,1.9433099252427852,1.0302716295751573,1.0017891047729131,5.9773596607316418E-2,1.0029640836506934,7.689968307376821E-2,4.1908589771374309,0.12853884203738261,1.0013227644086105,0.10692219985875522,7.7365914552317161,-125.37737182392821,54.622628176071785,null,1000000000,175820970.0625,null,22.849858013401835,-34.180984151904227,null,23.327686673078261,-88.237681802422898,null,0,0,null,0,0]
[13336.5,13.336499999999999,9.111018785337416,1.4608175460891606,1.000370765825584,2.7226872965332487E-2,1,0,269.8240094921793,1.5670901988965069,1.9515859668240845,1.03281470335657,1.0018098573203995,6.0118747101752329E-2,1.0029984448980123,7.7343025435498022E-2,4.1912554712097663,0.12927471161722554,1.0013382246029523,0.10754180943171972,7.6730492778393806,-125.33213497561934,54.66786502438066,null,1000000000,177862232.25,null,22.836460464150772,-34.056281509158758,null,23.278066200804446,-88.300387021849758,null,0,0,null,0,0]
[13413.25,13.41325,9.1628217799552516,1.4614418204860615,1.0003750447306703,2.7383482346593144E-2,1,0,271.37679388820811,1.5671114049974799,1.9598745231087851,1.0353362833720816,1.0018307292074036,6.0463883255746982E-2,1.003033003273603,7.7786337334630612E-2,4.1916542158161505,0.1300104421656722,1.0013537764081482,0.10816143138566467,7.60996687671327,-125.28770025697557,54.712299743024431,null,1000000000,179915275.5625,null,22.823248803091655,-33.932795481491254,null,23.228722505537792,-88.362683976397747,null,0,0,null,0,0]
[13490,13.49,9.214628305343485,1.4620590755245324,1.0003793481712431,2.7540090384287622E-2,1,0,272.92957840488612,1.5671323698017481,1.9681754359877817,1.0378366093059248,1.0018517204264663,6.080900498797473E-2,1.0030677587570904,7.8229618600079417E-2,4.19205521031442,0.13074603293581225,1.0013694198652194,0.10878106578780251,7.5473378384960688,-125.24406101299097,54.755938987009031,null,1000000000,181980100,null,22.810219665870971,-33.810512571412985,null,23.179652535980054,-88.424579541541917,null,0,0,null,0,0]
[13568.5,13.5685,9.2676196777406545,1.4626832657353106,1.0003837751165641,2.7700267891434104E-2,1,0,274.51776855438936,1.5671535672865209,1.9766782406601515,1.0403722061165184,1.0018733137093239,6.1161980941852621E-2,1.0031035105901396,7.8682975388314425E-2,4.1924676747642806,0.13149825076100788,1.0013855148668673,0.10941484160881615,7.4837432061405913,-125.20024270132646,54.799757298673541,null,1000000000,184104192.25,null,22.797078830428052,-33.686672134318215,null,23.129743737347358,-88.487478190873858,null,0,0,null,0,0]
[13647,13.647,9.3206146198684809,1.4633003581707653,1.000388227728338,2.7860443976827218E-2,1,0,276.10595882582351,1.5671745209110168,1.985193644981665,1.0428860663031572,1.001895031812216,6.1514941636768405E-2,1.0031394685787178,7.9136299768157906E-2,4.1928824915069907,0.13225032078327467,1.0014017058351514,0.11004863059417018,7.4206096625858518,-125.15724251156924,54.842757488430763,null,1000000000,186240609,null,22.784122047816133,-33.564062267599539,null,23.08011498956958,-88.549971003356987,null,0,0,null,0,0]
[13725.5,13.7255,9.3736130711811505,1.4639104727494463,1.0003927060062217,2.8020618632266927E-2,1,0,277.69414921709665,1.5671952348592793,1.9937214875088565,1.0453784368137953,1.0019168747270253,6.1867886985772662E-2,1.0031756327006565,7.9589591556785869E-2,4.193299659844504,0.13300224220632414,1.0014179928147162,0.11068243281555383,7.3579307318531235,-125.11505336964517,54.884946630354833,null,1000000000,188389350.25,null,22.77134594739745,-33.442669056927606,null,23.030763184813345,-88.612064854395413,null,0,0,null,0,0]
[13804,13.804,9.4266149724904942,1.4645137267139452,1.0003972099498708,2.8180791849553639E-2,1,0,279.2823397261642,1.5672157132201801,2.0022616093148584,1.0478495614603844,1.0019388424455888,6.222081690193882E-2,1.0032120029336631,8.0042850571454133E-2,4.1937191790750985,0.13375401423485039,1.00143437585046,0.11131624834457922,7.295700062070293,-125.07366822243432,54.926331777565679,null,1000000000,190550416,null,22.758747231950846,-33.322478762201143,null,22.981685265922714,-88.67376646606769,null,0,0,null,0,0]
[13884.25,13.88425,9.4808019508134844,1.4651234566492324,1.0004018408299391,2.8344534312213288E-2,1,0,280.90593587581662,1.5672364087424187,2.0110046460326854,1.0503540639298692,1.0019614288899545,6.2581598639240316E-2,1.0032493969992318,8.0506180018181162E-2,4.1941504800005465,0.13452239025792395,1.0014512234522548,0.11196420734959871,7.2325389585618716,-125.03218423561916,54.967815764380845,null,1000000000,192772398.0625,null,22.746047655454205,-33.200838377732438,null,22.9317932341283,-88.736444982321686,null,0,0,null,0,0]
[13964.5,13.964499999999999,9.5349924137578199,1.4657262562194566,1.0004064985321266,2.8508275254555598E-2,1,0,282.52953214439952,1.567256866405123,2.0197601875903284,1.052836868118926,1.0019841457471987,6.2942364064303105E-2,1.0032870064204571,8.0969474827435259E-2,4.1945842363094989,0.13529060847363758,1.0014681715364291,0.1126121804133086,7.169833284881304,-124.99152566055443,55.00847433944557,null,1000000000,195007260.25,null,22.733526719331408,-33.080426650186496,null,22.882181132036159,-88.798727310518032,null,0,0,null,0,0]
[14044.75,14.044750000000001,9.5891863022465653,1.466322242484966,1.0004111830560589,2.8672014667821717E-2,1,0,284.15312852987432,1.5672770902855271,2.0285280720674645,1.0552982245772817,1.0020069930084519,6.3303113084331397E-2,1.0033248311731209,8.1432734804237669E-2,4.195020447240366,0.13605866803551628,1.0014852201517737,0.1132601676119649,7.1075766382649954,-124.95168504469657,55.048314955303425,null,1000000000,197255002.5625,null,22.721181127019136,-32.961229452412866,null,22.832845850729267,-88.860620162591616,null,0,0,null,0,0]
[14125,14.125,9.6433835585270984,1.466911529894134,1.0004158944013593,2.8835752543253285E-2,1,0,285.77672503024871,1.5672970843682084,2.0373081401048601,1.0577383805841689,1.0020299706647937,6.3663845606554914E-2,1.0033628712328708,8.1895959753698774E-2,4.1954591120275611,0.13682656809817853,1.0015023693473564,0.1139081690217373,7.0457627391213826,-124.91265496797766,55.087345032022341,null,1000000000,199515625,null,22.70900765435276,-32.843232839339308,null,22.783784332050345,-88.922130100817256,null,0,0,null,0,0]
[14207.25,14.20725,9.6989349609089111,1.467508669307976,1.0004207509953336,2.9003569508434902E-2,1,0,287.44078511200024,1.5673173423604667,2.0463195047500164,1.0602176062020459,1.0020536562737878,6.4033551130692354E-2,1.0034020827286843,8.2370692698712916E-2,4.1959112548166093,0.13761343946239135,1.001520050360337,0.11457233482574671,6.9828612991121854,-124.87348554309047,55.126514456909533,null,1000000000,201845952.5625,null,22.696706101234852,-32.723526938491013,null,22.733781030658527,-88.984782362713943,null,0,0,null,0,0]
[14289.5,14.2895,9.7544897823014871,1.4680990071448443,1.0004256357634171,2.9171384839546205E-2,1,0,289.10484531035559,1.5673373671465509,2.0553433368838139,1.0626750771030906,1.0020774788391689,6.4403239127207731E-2,1.0034415203448956,8.2845388434456116E-2,4.196365973655384,0.13840014148352983,1.001537837134638,0.11523651571978251,6.9204119768701675,-124.83515189153114,55.16484810846886,null,1000000000,204189810.25,null,22.684578721056262,-32.605053125114821,null,22.684058961243263,-89.047045881175734,null,0,0,null,0,0]
[14371.75,14.37175,9.8100479646187093,1.468682658549803,1.0004305487051972,2.9339198527159174E-2,1,0,290.76890562331278,1.5673571627303373,2.0643794730122984,1.0651110490814653,1.0021014383511699,6.4772909496304806E-2,1.0034811840548445,8.3320046751396024E-2,4.1968232677066135,0.13918667325502823,1.0015557297239934,0.11590071178556723,6.8584083953876371,-124.79764614367292,55.202353856327079,null,1000000000,206547198.0625,null,22.672622267426014,-32.487796966972091,null,22.634614990204046,-89.108927258751365,null,0,0,null,0,0]
[14454,14.454000000000001,9.8656094510794308,1.4692597360924611,1.0004354898202588,2.9507010561846344E-2,1,0,292.43296604891538,1.567376733024568,2.0734277522705935,1.0675257744959894,1.0021255347999682,6.5142562138216037E-2,1.0035210738317224,8.3794667440100737E-2,4.1972831361286467,0.1399730338715505,1.0015737281824433,0.11656492310472596,6.796844301080033,-124.76096047399568,55.239039526004319,null,1000000000,208918116,null,22.660833566008684,-32.371744223434895,null,22.585446035293124,-89.170432950421272,null,0,0,null,0,0]
[14622.5,14.6225,9.9794445878428064,1.4704218882847293,1.0004457003244926,2.9850790501393474E-2,1,0,295.84201419466416,1.5674161378551874,2.0920016045470811,1.072407356318767,1.0021753271408229,6.5899788672118265E-2,1.003603499153529,8.4766872288575087E-2,4.1982332729743872,0.14158345928095939,1.0016109312377761,0.11792569578942155,6.6720688114054729,-124.68833320553586,55.311666794464145,null,1000000000,213817506.25,null,22.637193696736123,-32.13769380238935,null,22.485563016863651,-89.295288758425215,null,0,0,null,0,0]
[14706.75,14.70675,10.036367124561981,1.4709930779169904,1.0004508499149249,3.0022677829571319E-2,1,0,297.54653843684025,1.5674355016689172,2.101306977223532,1.0748157566433156,1.0022004387849095,6.6278373614557531E-2,1.0036450674911068,8.5252914600667792E-2,4.1987123894114529,0.14238839876860582,1.0016296996186669,0.11860610648505068,6.6103470626420151,-124.65327727593902,55.346722724060982,null,1000000000,216288495.5625,null,22.625624810603654,-32.02250341247413,null,22.436041606338506,-89.357151756464845,null,0,0,null,0,0]
[14791,14.791,10.093292898788214,1.4715578247577397,1.0004560290636266,3.0194563383179024E-2,1,0,299.25106278931264,1.5674546448913436,2.1106244307903217,1.077202906713348,1.002225694063726,6.6656939531182915E-2,1.0036868729072423,8.5738916538440249E-2,4.1991942032948231,0.14319315482099593,1.0016485793141423,0.11928653353263,6.5490609849085448,-124.61904886421425,55.38095113578575,null,1000000000,218773681,null,22.614219110478444,-31.908516843408112,null,22.386796110538508,-89.418646648315246,null,0,0,null,0,0]
[14877.25,14.87725,10.151573323541786,1.4721294168188779,1.0004613617781171,3.0370527457176742E-2,1,0,300.99605074019559,1.5674740179567379,2.120175418375386,1.0796249764100863,1.0022516976528377,6.7044472355363899E-2,1.0037299162932123,8.62364135564197E-2,4.1996902481850489,0.14401682384709744,1.0016680225643544,0.11998313018092198,6.4867649905569849,-124.58485662434845,55.415143375651553,null,1000000000,221332567.5625,null,22.60270851346953,-31.793056462098221,null,22.336664215728227,-89.481226510277239,null,0,0,null,0,0]
[14963.5,14.9635,10.209857027126159,1.4726944831140505,1.0004667254699171,3.0546489649869266E-2,1,0,302.74103880274475,1.5674931676908856,2.1297387322039643,1.0820253081073019,1.0022778517539794,6.7431985012664036E-2,1.0037732080842898,8.673386778435821E-2,4.2001891181361799,0.14484029857775724,1.00168758260393,0.12067974415152652,6.4249128010614793,-124.55151444951456,55.448485550485444,null,1000000000,223906332.25,null,22.591362552888036,-31.678827625002434,null,22.286815076793008,-89.543433573677149,null,0,0,null,0,0]
[15049.75,15.04975,10.268143953707753,1.4732531344094622,1.0004721201385289,3.0722449950390415E-2,1,0,304.48602697504032,1.5675120979334605,2.1393142069711235,1.0844041658537482,1.002304156355369,6.7819477388284102E-2,1.0038167482483362,8.7231278981607263E-2,4.2006908121417794,0.14566357797938401,1.0017072594977039,0.12137637553774265,6.3634981317768524,-124.51901373122506,55.480986268774942,null,1000000000,226494975.0625,null,22.580178105402574,-31.565815416661142,null,22.237245528840042,-89.605274190919232,null,0,0,null,0,0]
[15136,15.135999999999999,10.326434048710539,1.4738054789865551,1.0004775457834512,3.089840834787471E-2,1,0,306.23101525520616,1.5675308124366176,2.148901680109971,1.086761809967046,1.0023306114451571,6.8206949367461245E-2,1.0038605367530333,8.7728646907645189E-2,4.2011953291901989,0.14648666101992922,1.0017270533108795,0.12207302443274622,6.3025148208531991,-124.48734592746577,55.512654072534232,null,1000000000,229098496,null,22.569152118317987,-31.45400513038058,null,22.187952459118026,-89.666754572034264,null,0,0,null,0,0]
[15224,15.224,10.385910051442661,1.4743626404300216,1.0004831134388437,3.1077934943122252E-2,1,0,308.01140920395284,1.5675496881091293,2.1586958818187245,1.0891456929779002,1.0023577583919761,6.8602261956496879E-2,1.0039054696363878,8.8236061510317057E-2,4.2017129913038911,0.14732624084912349,1.0017473693075807,0.12278382637468445,6.2407324741836225,-124.45588523128892,55.544114768711083,null,1000000000,231770176,null,22.55806263550302,-31.34114993418725,null,22.137941013222754,-89.72911740644831,null,0,0,null,0,0]
[15312,15.311999999999999,10.445389241544701,1.4749134567529611,1.0004887133392457,3.1257459534475833E-2,1,0,309.79180326117989,1.5675683468221615,2.1685022403204872,1.0915080286142873,1.002385061970791,6.8997553071769399E-2,1.0039506609716853,8.8743430562594594E-2,4.2022335900367018,0.14816561410255191,1.0017678071546727,0.12349464673868352,6.1793865866881958,-124.42527384313127,55.574726156868735,null,1000000000,234457344,null,22.547131905246658,-31.229515650393392,null,22.088210993354682,-89.79111786255622,null,0,0,null,0,0]
[15400,15.4,10.504871564875435,1.4754580354032638,1.000494345484116,3.1436982110397374E-2,1,0,311.57219742502764,1.5675867922949687,2.1783205914329979,1.0938490816919291,1.0024125221688032,6.9392822591506059E-2,1.0039961107240261,8.9250753809429068E-2,4.2027571242974213,0.14900477968907319,1.0017883669225938,0.12420548562330569,6.1184709901027734,-124.39550291100444,55.604497088995558,null,1000000000,237160000,null,22.536356900861492,-31.119087312296273,null,22.038759254061002,-89.852762102976953,null,0,0,null,0,0]
[15488,15.488,10.564356968510191,1.4759964814237554,1.0005000098729098,3.161650265934958E-2,1,0,313.35259169367862,1.5676050281622771,2.1881507737217798,1.0961691132097013,1.0024401389731414,6.97880703939745E-2,1.0040418188583171,8.9758030995912161E-2,4.2032835929892345,0.14984373651924837,1.0018090486821809,0.12491634312697672,6.0579796367705701,-124.36656365904997,55.633436340950027,null,1000000000,239878144,null,22.5257346644843,-31.009850167041552,null,21.989582701653291,-89.914056152521496,null,0,0,null,0,0]
[15578.25,15.578250000000001,10.625366451014466,1.4765424322662168,1.0005058525803432,3.180061110488186E-2,1,0,315.17850751369508,1.5676235162956076,2.1982444184279375,1.0985268984993397,1.0024686245391197,7.0193401279370363E-2,1.0040889640054727,9.0278230228929585E-2,4.2038265693057939,0.15070392597991439,1.0018303860215803,0.12564539540672548,5.9963760710706655,-124.33773921995997,55.662260780040029,null,1000000000,242681873.0625,null,22.514996485964719,-30.899042061871029,null,21.939431437740616,-89.976559813459858,null,0,0,null,0,0]
[15668.5,15.6685,10.686379064377983,1.4770821491849007,1.0005117292004457,3.1984717393890506E-2,1,0,317.00442344020195,1.5676417914490954,2.2083501717577265,1.1008631174942825,1.002497274794427,7.0598709063542042E-2,1.0041363808408164,9.0798380473506662E-2,4.2043726296731245,0.15156389355723063,1.0018518518228081,0.12637446747905476,5.9352062125109235,-124.30977108600818,55.690228913991817,null,1000000000,245501892.25,null,22.504412900020668,-30.789456087918939,null,21.889563183901267,-90.038707554466569,null,0,0,null,0,0]
[15758.75,15.758749999999999,10.747394755279384,1.4776157380373736,1.0005176397326203,3.2168821513933001E-2,1,0,318.83033947136971,1.5676598572818841,2.21846786823646,1.1031780395874102,1.0025260897249442,7.1003993615312455E-2,1.0041840693258612,9.131848145514318E-2,4.2049217728898078,0.15242363808166806,1.0018734461635812,0.12710355944968219,5.874463913855914,-124.28265004493757,55.717349955062431,null,1000000000,248338201.5625,null,22.493980929883275,-30.681077012247755,null,21.839974765406225,-90.100505447503522,null,0,0,null,0,0]
[15849,15.849,10.808413471598687,1.4781433023048731,1.0005235841762654,3.2352923452567732E-2,1,0,320.65625560541042,1.5676777173697727,2.2285973452006331,1.1054719301955034,1.0025550693164718,7.1409254803550051E-2,1.0042320294219074,9.1838532899497519E-2,4.2054739977482676,0.15328315838561482,1.0018951691220561,0.12783267142417085,5.8141431487348374,-124.25636697147043,55.743633028529572,null,1000000000,251190801,null,22.483697667175399,-30.573889824961068,null,21.790663059978812,-90.161959428370096,null,0,0,null,0,0]
[15941.25,15.94125,10.870787476925994,1.4786764367379988,1.0005296953991532,3.2541102945149378E-2,1,0,322.52263535938573,1.5676957642525637,2.2389633066147123,1.1077951914198825,1.0025848612750869,7.1823472566772142E-2,1.0042813330113678,9.2370057548028919E-2,4.2060416438483728,0.15416149328845416,1.0019175064822285,0.12857796178820502,5.7529151338361615,-124.23035806687668,55.769641933123324,null,1000000000,254123451.5625,null,22.473337249372985,-30.465543701823215,null,21.740541356655704,-90.224425883027749,null,0,0,null,0,0]
[16033.5,16.0335,10.93316453682686,1.4792034879283074,1.0005358420518859,3.2729280132285529E-2,1,0,324.38901521719464,1.567713603469028,2.2493412415058813,1.1100970270043662,1.0026148252433185,7.2237665642579746E-2,1.0043309203009323,9.2901529860279913E-2,4.2066125071151408,0.15503959146219831,1.0019399783903096,0.12932327327505574,5.6921151837737654,-124.20520568140579,55.794794318594214,null,1000000000,257073122.25,null,22.463126269057121,-30.358411864537398,null,21.690702332715421,-90.286545135886385,null,0,0,null,0,0]
[16125.75,16.12575,10.995544599316046,1.4797245591150565,1.000542024133811,3.2917455000691855E-2,1,0,326.25539517705533,1.5677312385830884,2.259730984907653,1.1123777079184536,1.0026449612057446,7.2651833891078058E-2,1.0043807912485807,9.3432949543782173E-2,4.2071865862390752,0.15591745166614326,1.0019625849311939,0.13006860599695472,5.6317372351653141,-124.18090035386693,55.819099646133068,null,1000000000,260039813.0625,null,22.453061830085566,-30.252478983877268,null,21.641142816277743,-90.348323109311281,null,0,0,null,0,0]
[16218,16.218,11.057927613578887,1.480239751220976,1.0005482416442717,3.3105627537085E-2,1,0,328.12177523722619,1.5677486730775811,2.270132374687555,1.1146375010542566,1.0026752691468577,7.3065977172423135E-2,1.0044309458120615,9.3964316306244244E-2,4.2077638799040145,0.15679507266171522,1.0019853261902565,0.13081396006596099,5.5717753440779099,-124.15743271941786,55.842567280582145,null,1000000000,263023524,null,22.443141103309785,-30.147729959590581,null,21.591859687896047,-90.409765592930498,null,0,0,null,0,0]
[16312.5,16.3125,11.121835173497614,1.4807615161978154,1.000554647535878,3.3298387215627903E-2,1,0,330.03367686451043,1.5677663283424641,2.2807993662723218,1.1169310276833166,1.0027064946114883,7.3490195475271927E-2,1.0044826176895494,9.4508588055378553E-2,4.208358585621764,0.15769384972392664,1.0020087618908855,0.13157751575390705,5.5107762799880398,-124.13425160548145,55.865748394518548,null,1000000000,266097656.25,null,22.433124531509193,-30.041638053932772,null,21.541657907159198,-90.472364726374366,null,0,0,null,0,0]
[16407,16.407,11.185745726612302,1.4812773190311941,1.0005610906039097,3.3491144418798358E-2,1,0,331.94557859348379,1.5677837802298493,2.2914782437287724,1.1192031893250165,1.0027379005130939,7.3914387281292904E-2,1.0045345870960043,9.5052803650121392E-2,4.2089566617823424,0.15859237314249633,1.0020323391443628,0.13234109408047492,5.4502015611035413,-124.11192996229055,55.888070037709454,null,1000000000,269189649,null,22.423252965467562,-29.936757101052745,null,21.491739698235783,-90.534623693086587,null,0,0,null,0,0]
[16501.5,16.5015,11.249659221908926,1.4817872610637439,1.0005675708476487,3.3683899132320408E-2,1,0,333.85748042239936,1.5678010322337725,2.3021688416549244,1.121454259992072,1.0027694868347212,7.4338552440325806E-2,1.0045868539852505,9.5596962776851493E-2,4.2095581069492738,0.15949064159300924,1.0020560580440301,0.13310469516555543,5.3900451688215387,-124.0904580379411,55.909541962058896,null,1000000000,272299502.25,null,22.413523571030005,-29.833071592768306,null,21.442101871594375,-90.596548307259425,null,0,0,null,0,0]
[16596,16.596,11.313575609523902,1.4822914413602946,1.0005740882663727,3.3876651341919181E-2,1,0,335.76938234954991,1.5678180877686878,2.3128709975270252,1.123684509488889,1.0028012535593214,7.476269080226762E-2,1.0046394183108585,9.6141065122146471E-2,4.2101629196788135,0.16038865375343705,1.002079918683757,0.13386831912884492,5.3303012035619961,-124.0698261866967,55.930173813303298,null,1000000000,275427216,null,22.403933580176663,-29.730566257459238,null,21.392741290567329,-90.658144252565549,null,0,0,null,0,0]
[16692.5,16.692499999999999,11.378847659052258,1.4828004468406688,1.0005807819825985,3.4073480364553689E-2,1,0,337.72174790919178,1.5678353049848786,2.3238114155491285,1.1259407492803228,1.0028338787481903,7.5195777827749749E-2,1.0046934020058464,9.6696623938740192E-2,4.2107840063933262,0.16130540560714343,1.0021044306801619,0.13464812817967028,5.2697124181922703,-124.04961469914595,55.950385300854052,null,1000000000,278639556.25,null,22.394281677422924,-29.627093772267056,null,21.342618944550914,-90.720710413567247,null,0,0,null,0,0]
[16789,16.789000000000001,11.444122623057577,1.4833036459212721,1.0005875144624692,3.4270306746074786E-2,1,0,339.67411356779462,1.5678523242801834,2.3347635523080332,1.1281758327812939,1.0028666920207068,7.5628836593692891E-2,1.0047476957616535,9.7252122885081019E-2,4.211408601655207,0.16222188742902763,1.0021290906792177,0.13542796133899271,5.2095416346197734,-124.03025922763395,55.969740772366052,null,1000000000,281870521,null,22.384769510649825,-29.524820494046168,null,21.292779256294111,-90.782945425007327,null,0,0,null,0,0]
[16885.5,16.8855,11.509400451951945,1.4838011371414979,1.0005942857052026,3.4467130471285606E-2,1,0,341.62647932366161,1.5678691490478942,2.3457272436603551,1.1303900341501321,1.0028996933584093,7.6061866940447309E-2,1.0048022995280175,9.7807561628071346E-2,4.2120367039037339,0.16313809781910646,1.0021538987825842,0.13620781873363597,5.1497829361750895,-124.01174984221988,55.988250157780115,null,1000000000,285120110.25,null,22.375394334443691,-29.423730899955377,null,21.243219049025598,-90.844854940914331,null,0,0,null,0,0]
[16982,16.981999999999999,{"$f":"SQRT(1+(A269/pole1)^2)","v":11.574681097263946},{"$f":"ATAN(A269/pole1)","v":1.4842930168291584},{"$f":"SQRT(1+(A269/Zero1)^2)","v":1.0006010957100118},{"$f":"ATAN(A269/Zero1)","v":3.4663951524990487E-2},{"$f":"IF(VIN_nom>Vout, 1, SQRT(1+(A269/z_RHP)^2))","v":1},{"$f":"IF(VIN_nom>Vout, 0, -ATAN(A269/z_RHP))","v":0},{"$f":"SQRT(1+(A269/Pole2)^2)","v":343.5788451751348},{"$f":"ATAN(A269/Pole2)","v":1.567885782604175},2.3567023283456021,1.1325836232653013,{"$f":"SQRT(1+(A269/pole4)^2)","v":1.0029328827427333},{"$f":"ATAN(A269/pole4)","v":7.6494868708426811E-2},{"$f":"IF(VOUT_setting=1,1,SQRT(1+(A269*zterm1)^2))","v":1.0048572132544009},{"$f":"IF(VOUT_setting=1,0,ATAN(((A269*zterm1))))","v":9.8362939834834268E-2},4.2126683115703578,{"$f":"IF(VOUT_setting=1,0,ATAN(A269*$Q$4/(1+Afbr-$Q$5*(A269)^2)))","v":0.16405403538003677},{"$f":"SQRT((1-(Z269/pterm2))^2+(A269/pterm1)^2)","v":1.002178855092495},{"$f":"IF((ATAN((A269/pterm1)/(1-A269^2/pterm2))>0),ATAN((A269/pterm1)/(1-A269^2/pterm2)),PI()+ATAN((A269/pterm1)/(1-A269^2/pterm2)))","v":0.13698770049020773},{"$f":"20*LOG10(((E269*K269*G269*O269)/(C269*I269*S269*M269*Q269))*Adc)","v":5.0904305232479192},{"$f":"((F269+L269+H269+P269)-(D269+J269+T269+N269+R269))*radconv","v":-123.9940767271779},{"$f":"IF(V269>0,V269,V269+180)","v":56.005923272822102},null,{"$f":"IF(U269<0,A269,1000000000)","v":1000000000},{"$f":"A269^2","v":288388324},null,{"$f":"20*LOG10((K269/(I269*M269))*AEA)","v":22.366153467802153},{"$f":"(L269-(J269+N269))*radconv","v":-29.323809707956276},null,{"$f":"20*LOG10((E269*G269/(C269*S269))*Acs*Am)","v":21.193935198596133},{"$f":"(F269+H269-(D269+T269))*radconv","v":-90.906444488590083},null,{"$f":"SUM((U270<0)*(U269>0))*A269","v":0},0,null,0,0]
[17081,{"$f":"A270/1000","v":17.081},11.641655828151276,1.4847919067335142,1.000608122420368,3.4865868777580238E-2,1,0,345.58179055046691,1.5679026517723567,2.3679734155025112,1.1348128993887907,1.0029671273533358,7.6939058272643732E-2,1.0049138716720338,9.8932642820378322E-2,4.2133199232929082,0.16499341690859401,1.0022046120622956,0.13778781188665232,5.0299567346413765,-123.9768046394118,56.023195360588204,null,1000000000,291760561,null,22.356810030337833,-29.222498314069369,null,21.143658532970584,-90.969302774395487,null,0,0,null,{"$f":"SUM((V271<-183)*(V270>-183))*A270","v":0},{"$f":"IF(AK270>0,U270,0)","v":0}]
[17180,17.18,11.708633423395014,1.4852850891000042,1.0006151899255207,3.5067783186054351E-2,1,0,347.58473602300751,1.5679193265245024,2.3792561591807893,1.1370210433620114,1.0030015698401988,7.7383217418070888E-2,1.0049708562091741,9.9502281383419738E-2,{"$f":"IF(VOUT_setting=1,1,SQRT((1+Afbr-$Q$5*(A271)^2)^2+(A271*$Q$4)^2))","v":4.213975221044401},0.16593250831777911,1.0022305252370429,0.13858794919290643,4.9698985548339012,-123.9603921507519,56.0396078492481,null,1000000000,295152400,null,22.347602435632304,-29.12238482111967,null,21.093666232302553,-91.031835689847981,null,0,0,null,0,0]
[17279,17.279,11.775613834119314,1.4857726610811173,1.0006222982246056,3.5269694734009392E-2,1,0,349.58768159108564,1.5679358102022949,2.3905503943336686,1.1392083330166032,1.0030362101829384,7.7827345972605849E-2,1.0050281668103496,0.10007185516526641,4.2146342031056276,0.16687130810754652,1.0022565947290034,0.13938811254495781,4.9102500869346963,-123.94482903398558,56.055170966014416,null,1000000000,298563841,null,22.338527988834585,-29.023453492130347,null,21.043955088485212,-91.094048810106486,null,0,0,null,0,0]
[17378,17.378,11.842597012552044,1.4862547176421261,1.000629447316753,3.547160340504333E-2,1,0,351.59062725306859,1.5679521060712687,2.4018559588522455,1.1413750417593556,1.0030710483610561,7.8271443764218143E-2,1.0050858034197827,0.10064136380747594,4.2152968677487941,0.16780981478082513,1.0022828206510768,0.1401883020785494,4.8510055512769901,-123.93010518589045,56.069894814109546,null,1000000000,301994884,null,22.329584058938664,-28.925688839290999,null,20.994521946762745,-91.15594758499762,null,0,0,null,0,0]
[17479.25,17.47925,11.911105350062925,1.4867421219070809,1.0006368010816267,3.5678097916676414E-2,1,0,353.63909450283677,1.5679685813667568,2.413430020606413,1.1435699864172115,1.0031068829253258,7.8725602688642676E-2,1.0051450871000802,0.10122374807748741,4.2159784002179537,0.16876934640933108,1.0023098045385188,0.14100670495997014,4.7908264521828512,-123.91590440144206,56.084095598557937,null,1000000000,305524180.5625,null,22.320569181030944,-28.826893128513596,null,20.944249642632382,-91.218933559405741,null,0,0,null,0,0]
[17580.5,17.580500000000001,11.979616484846424,1.4872239513791816,1.0006441975130091,3.5884589384435735E-2,1,0,355.68756184748946,1.5679848668939893,2.4250155987181072,1.1457439686497954,1.0031429243759442,7.9179729072204816E-2,1.0052047116566027,0.10180606345576594,4.2166637808783776,0.16972856828866997,1.0023369522882277,0.14182513551292822,4.7310579892385816,-123.90256048576374,56.097439514236257,null,1000000000,309073980.25,null,22.311685450489172,-28.72928573885979,null,20.894261611914395,-91.281601881574716,null,0,0,null,0,0]
[17681.75,17.681750000000001,12.048130369182863,1.4877003009389949,1.0006516366099534,3.609107779077992E-2,1,0,357.73602928539674,1.5680009659129102,2.4366125289137885,1.1478972670687497,1.0031791726906125,7.9633822731112344E-2,1.0052646770286955,0.10238830955968918,4.2173530078540349,0.17068747882709534,1.0023642640230339,0.14264359388183009,4.6716943413829224,-123.89006302809189,56.109936971908112,null,1000000000,312644283.0625,null,22.30293024877048,-28.632850883308855,null,20.844554645479882,-91.34395799703951,null,0,0,null,0,0]
[17783,17.783000000000001,12.116646956429989,1.488171263331062,1.0006591183715086,3.6297563118169167E-2,1,0,359.78449681496562,1.568016881609219,2.4482206498730448,1.1500301557766353,1.0032156278469073,8.0087883481653507E-2,1.0053249831553719,0.10297048600691368,4.2180460792596017,0.1716460764361693,1.0023917398664601,0.14346208021080839,4.6127298034328916,-123.87840174953773,56.12159825046227,null,1000000000,316235089,null,22.294301019770828,-28.537573028942081,null,20.79512558760922,-91.406007228934087,null,0,0,null,0,0]
[17886.5,17.886500000000002,12.186688880710674,1.4886472178791332,1.0006668104907337,3.6508633807780848E-2,1,0,361.87848593831046,1.5680329647505817,2.4600981306818923,1.1521896277062011,1.0032531068817274,8.0552000266455523E-2,1.0053869815515546,0.10356552731491669,4.2187585238059917,0.17262565112627659,1.0024199960329536,0.14429878417364547,4.5528616323653202,-123.86733502387551,56.132664976124488,null,1000000000,319926882.25,null,22.285607635088116,-28.441357830382778,null,20.744882115872194,-91.469123561929507,null,0,0,null,0,0]
[17990,17.989999999999998,12.256733534122697,1.4891177325725695,1.0006745471898155,3.6719701243016378E-2,1,0,363.97247515418451,1.5680488628344129,{"$f":"SQRT(1+(A279/Zero2)^2)","v":2.471986973437907},{"$f":"ATAN(A279/Zero2)","v":1.1543283378810369},1.003290802005498,8.1016082276104393E-2,1.0054493358853116,0.10416049502893822,4.2194749815308246,0.17360489547864039,1.0024484239460534,0.14513551765672025,4.4933988090175268,-123.85712075045184,56.142879249548159,null,1000000000,323640100,null,22.2770406750776,-28.346319597261104,null,20.69492253884896,-91.531930092059881,null,0,0,null,0,0]
[18093.5,18.093499999999999,12.3267808701427,1.4895828999377019,1.0006823284677198,3.6930765405145595E-2,1,0,366.06646446099967,1.5680645790364276,2.4838870149930883,1.1564465649964264,1.003328713193864,8.1480129314630306E-2,1.0055120460904252,0.1047553887414877,4.2201954503903067,0.17458380780736463,1.0024770237399434,0.14597228081309171,4.4343355962125477,-123.84774836989389,56.152251630106107,null,1000000000,327374742.25,null,22.268597600646672,-28.252442532240348,null,20.645243651264821,-91.594432130536276,null,0,0,null,0,0]
[18197,18.196999999999999,12.396830843297078,1.4900428104189083,1.0006901543234064,3.7141826275440069E-2,1,0,368.16045385720446,1.5680801164600897,2.495798095158793,1.1585445831701813,1.0033668404223337,8.194414118615323E-2,1.0055751121003162,0.10535020804538542,4.2209199283305994,0.17556238643022545,1.002505795549562,0.14680907379551283,4.3756663710575303,-123.8392074618518,56.1607925381482,null,1000000000,331130809,null,22.260275933596905,-28.159711096119061,null,20.595842301202548,-91.656634869264963,null,0,0,null,0,0]
[18303,18.303000000000001,12.468575531799004,1.4905084733400558,1.0006982154142547,3.735798180275765E-2,1,0,370.30502279849372,1.5680958470447826,2.5080081600232362,1.1606726127601998,1.0034061125032854,8.2419324417893611E-2,1.0056400701738848,0.10595931741387424,4.221666059088431,0.17656425457005617,1.0025354407705773,0.14766611024350187,4.3159826342760637,-123.83131134938913,56.168688650610875,null,1000000000,334999809,null,22.251876574537221,-28.065911271611149,null,20.545532117519528,-91.720035161319842,null,0,{"$f":"IF(AH282>0,W282,0)","v":0},null,0,0]
[18409,18.408999999999999,12.5403228930744,1.490968807934941,1.0007063232601836,3.7574133837536987E-2,1,0,372.44959183036019,1.5681113964757043,2.5202294723471845,1.1627800129704355,1.0034456111346737,8.2894470347637708E-2,1.0057054013059437,0.10656834787219167,4.222416390548843,0.17756576912857125,1.0025652667065375,0.14852317829913683,4.2567005652372041,-123.82426567971784,56.17573432028216,null,1000000000,338891281,null,22.243599485744699,-27.973280906906616,null,20.495506515499706,-91.783132173860068,null,0,0,null,0,0]
[18515,18.515000000000001,12.612072881508766,1.4914239049452078,1.0007144778600561,3.7790282359665223E-2,1,0,374.59416095124811,1.5681267678641886,2.5324618692945697,1.1648670638803036,1.0034853362897465,8.3369578765261645E-2,1.0057711054237959,0.10717729898395824,4.2231709204729748,0.17856692831075155,1.0025952735048573,0.14938027812550034,4.1978144779014368,-123.81805970346181,56.181940296538187,null,1000000000,342805225,null,22.235442192730908,-27.881804120864111,null,20.445762275728271,-91.845931116495223,null,0,0,null,0,0]
[18621,18.620999999999999,12.683825452518093,1.4918738530679843,1.0007226792127295,3.8006427349031494E-2,1,0,376.73873015963744,1.5681419642507253,2.5447051910140548,1.1669340408954847,1.0035252879416026,8.3844649460742493E-2,1.0058371824543482,0.10778617031314355,4.2239296466110421,0.17956773032568271,1.0026254613137806,0.15023740988533082,4.1393187997531751,-123.81268281803021,56.187317181969789,null,1000000000,346741641,null,22.227402280793903,-27.791465296074254,null,20.396296232492862,-91.908437081672886,null,0,0,null,0,0]
[18729.5,18.729500000000002,12.757272930318273,1.4923291711966913,1.0007311224121269,3.8227666417867019E-2,1,0,378.93387891955916,1.5681573409022656,2.5572484208347408,1.1690292603822845,1.0035664163937978,8.4330885367499081E-2,1.0059052040378038,0.1084093187331603,4.2247106107057117,0.18059176439447611,1.0026565487195587,0.15111479025842825,4.0798421355685228,-123.80802685717025,56.191973142829752,null,1000000000,350794170.25,null,22.219291855188089,-27.700158344763896,null,20.3459484038396,-91.972119016354782,null,0,0,null,0,0]
[18838,18.838000000000001,12.830723022607915,1.4927792764366818,1.0007396145932079,3.8448901742703795E-2,1,0,381.12902776804452,1.5681725404272382,2.5698027672158306,1.1711040172066476,1.0036077820950617,8.4817081306826775E-2,1.0059736161753738,0.10903238263956026,4.2254959664782445,0.181615420466049,1.0026878260918217,0.15199220443297035,4.0207630507265062,-123.80421754123779,56.19578245876221,null,1000000000,354870244,null,22.21129947792533,-27.610011379080326,null,20.29588550442147,-92.035504425709249,null,0,0,null,0,0]
[18946.5,18.9465,12.904175684742283,1.4932242576218284,1.0007481557547258,3.8670133301980651E-2,1,0,383.32417670357199,1.5681875658686415,2.582368068025735,1.1731585920771774,1.0036493850160599,8.5303237053821368E-2,1.0060424187873835,0.10965536156587653,4.2262857114805428,0.1826386966332274,1.0027192935922473,0.15286965258235083,3.9620759201719635,-123.80124396670915,56.198756033290849,null,1000000000,358969862.25,null,22.203422743195596,-27.521008477070179,null,20.246104306409507,-92.098598410712384,null,0,0,null,0,0]
[19055,19.055,12.977630873085845,1.4936642015829784,1.0007567458954261,3.8891361074138625E-2,1,0,385.51932572465466,1.5682024202001672,2.5949441641330671,1.1751932609494742,1.0036912251272934,8.5789352383691786E-2,1.0061116117937254,0.11027825504603328,4.2270798432526631,0.1836615909934142,1.002750951383421,0.15374713487957695,3.9037752313212697,-123.79909538387568,56.200904616124319,null,1000000000,363093025,null,22.195659303703572,-27.433133985142621,null,20.196601635893838,-92.161405957553086,null,0,0,null,0,0]
[19165.75,19.165749999999999,13.052611886746881,1.4941081619484424,1.0007655646846352,3.9117172590870275E-2,1,0,387.75999635594201,1.568217409119355,2.6077920260900931,1.1772498756417393,1.0037341774790738,8.6285506529864553E-2,1.0061826422163169,0.11091397706608633,4.2278949647961968,0.18470530171210034,1.002783462093199,0.15464284921094773,3.8446584773359134,-123.79774207199094,56.202257928009061,null,1000000000,367325973.0625,null,22.187849336778996,-27.344584983462582,null,20.146356422653227,-92.225225616800941,null,0,0,null,0,0]
[19276.5,19.276499999999999,13.127595443699143,1.4945470506821545,1.0007744345028211,3.934298011640152E-2,1,0,390.00066707334554,1.5682322258068802,2.6206508099530965,1.1792863164372276,1.0037773768978477,8.6781618092330343E-2,1.0062540792225587,0.11154960907935507,4.2287146517190184,0.18574861063317985,1.0028161714129995,0.15553859948413215,3.7859330984945649,-123.79722617183505,56.20277382816495,null,1000000000,371583452.25,null,22.180152649923471,-27.25717955291146,null,20.096394892736868,-92.288756980946999,null,0,0,null,0,0]
[19387.25,19.387250000000002,13.202581500609051,1.4949809540288745,1.0007833553486274,3.9568783627811369E-2,1,0,392.24133787538932,1.568246873214346,2.6335203557357412,1.1813028620793153,1.0038208233517176,8.7277686832390206E-2,1.0063259227258636,0.11218515059143633,4.2295389013669995,0.18679151574808858,1.0028490795186591,0.15643438588186589,3.7275935765406865,-123.79753673451597,56.202463265484027,null,1000000000,375865462.5625,null,22.172566924843871,-27.17090187810814,null,20.046713836891833,-92.352005003235291,null,0,0,null,0,0]
[19498,19.498000000000001,13.277570015120526,1.4954099562926102,1.0007923272206893,3.9794583102181272E-2,1,0,394.48200876063117,1.5682613542262949,2.6464005064311649,1.1832997865388,1.0038645168086093,8.7773712511470675E-2,1.006398172639176,0.11282060110836012,4.2303677110733107,0.18783401505330768,1.0028821865869979,0.15733020858645577,3.6696345033880235,-123.79866296979768,56.201337030202325,null,1000000000,380172004,null,22.165089899842393,-27.085736413285083,null,19.9973100994,-92.41497452568818,null,0,0,null,0,0]
[19611.75,19.611750000000001,13.354592336095926,1.4958455639210253,1.000801595239982,4.0026494814242947E-2,1,0,396.78337510486813,1.5682760572438779,2.6596404329778527,1.1853306609602299,1.0039096509314438,8.828312947516373E-2,1.0064728026411973,0.11347316948757023,4.231223715808123,0.18890432907076646,1.0029163977675082,0.15825033535525956,3.6104959124617664,-123.80065765837874,56.199342341621261,null,1000000000,384620738.0625,null,22.157521176037239,-26.999405743003031,null,19.946853540393285,-92.479364822542323,null,0,0,null,0,0]
[19725.5,19.7255,13.431617162095479,1.496276175567518,1.0008109170844306,4.0258402218590603E-2,1,0,399.08474153389193,1.5682905906883007,2.6728912203812945,1.1873414075942565,1.0039550455510342,8.8792500503651534E-2,1.0065478611814587,0.11412564082020456,4.2320845252495873,0.189974210727714,1.0029508192170031,0.15917050081296613,3.5517474411351602,-123.80349023928287,56.196509760717134,null,1000000000,389095350.25,null,22.150062461094478,-26.914215962271626,null,19.896682947501755,-92.543471334242142,null,0,0,null,0,0]
[19839.25,19.83925,13.508644450269056,1.4967018765333868,1.0008202927525309,4.0490305290400534E-2,1,0,401.3861080462442,1.5683049574763241,2.6861527079117238,1.1893323081717981,1.0040007006320464,8.9301825338861177E-2,1.0066233481640983,0.11477801457249559,4.2329501364666688,0.19104365787011404,1.0029854511303029,0.16009070515567336,3.4933835745781172,-123.80714953007661,56.192850469923386,null,1000000000,393595840.5625,null,22.142711480451883,-26.830151081429882,null,19.846795070218178,-92.607298960849917,null,0,0,null,0,0]
[19953,19.952999999999999,13.585674158736975,1.4971227501925355,1.0008297222427704,4.0722204004851797E-2,1,0,403.68747464049977,1.5683191604581983,2.6994247378693221,1.1913036395191556,1.0040466161389501,8.9811103722862384E-2,1.0066992634927368,0.11543029021116769,4.2338205465143846,0.19211266834962948,1.0030202937033201,0.1610109485789909,3.4353989085469627,-123.81162451537676,56.188375484623236,null,1000000000,398122209,null,22.135466015611588,-26.747195388028075,null,19.797186712513664,-92.670852491968162,null,0,0,null,0,0]
[20069,20.068999999999999,13.66422998191436,1.4975470618249636,1.000839393678411,4.0958685213618444E-2,1,0,406.03436285469036,1.5683334785672074,2.7129699883883154,1.1932940925161959,1.0040937080313945,9.0330407639474586E-2,1.0067771214817707,0.11609536640914529,4.2347131125490378,0.19320237216600891,1.0030560426255923,0.16194943506953194,3.3766523287086954,-123.81701682523378,56.182983174766221,null,1000000000,402764761,null,22.128183657918225,-26.663725121806451,null,19.746881700601499,-92.735385697619918,null,0,0,null,0,0]
[20185,20.184999999999999,13.742788237079653,1.4979665225251177,1.000849121083272,4.1195161838815768E-2,1,0,408.38125115116463,1.5683476321093968,2.7265258806105956,1.1952647607676163,1.0041410706789335,9.0849662707754228E-2,1.0068554247258663,0.11676033945513904,4.2356106629058203,0.19429161737973785,1.00309201103877,0.16288796261133198,3.3182890868274511,-123.82323480064102,56.176765199358982,null,1000000000,407434225,null,22.121006542856335,-26.58137621022134,null,19.696860830245591,-92.799643580008393,null,0,0,null,0,0]
[20301,20.300999999999998,13.8213488827638,1.4983812148623201,1.0008589044557212,4.1431633854129672E-2,1,0,410.72813952851197,1.5683616239057505,2.7400922565950099,1.19721592271924,1.004188704043256,9.1368868654623875E-2,1.0069341731211492,0.11742520878519465,4.23651319441701,0.19538040173090335,1.0031281991541292,0.16382653141025375,3.2603037890223203,-123.83026728081748,56.16973271918252,null,1000000000,412130601,null,22.113932487579589,-26.500132845486565,null,19.647120879367005,-92.86363088331008,null,0,0,null,0,0]
[20417,20.417000000000002,13.899911878434022,1.4987912195457944,1.0008687437941177,4.1668101233249183E-2,1,0,413.07502798535415,1.5683754567131429,2.7536689613919352,1.1991478519259586,1.0042366080858403,9.1888025207163646E-2,1.0070133665631869,0.11808997383590053,4.2374207039000167,0.19646872296584644,1.0031646071841254,0.16476514167162001,3.2026911492599708,-123.83810327526788,56.161896724732117,null,1000000000,416853889,null,22.106959363172734,-26.419979496381437,null,19.597658679757085,-92.927352245094454,null,0,0,null,0,0]
[20536,20.536000000000001,13.980509076129609,1.4992070394117911,1.0008788957521886,4.1910679302865461E-2,1,0,415.48261191451473,1.5683894848794815,2.7676073615016747,1.2011100411988935,1.0042860322547122,9.2420556609385071E-2,1.0070950704617758,0.11877182213672263,4.2383568528521387,0.19758470684740284,1.0032021855443705,0.16572806963568845,3.1439703373046939,-123.84696553646064,56.153034463539356,null,1000000000,421727296,null,22.099908603341948,-26.338869888874715,null,19.547202639330564,-92.992449977252946,null,0,0,null,0,0]
[20655,20.655000000000001,14.061108663429364,1.4996180923116165,1.0008891066049004,4.2153252437298214E-2,1,0,417.89019592449586,1.5684033514053284,2.7815563106001506,1.203052557914263,1.004335741200675,9.2953035448007024E-2,1.0071772424999981,0.11945355949525804,4.2392982337537664,0.19870019856418597,1.0032399957979961,0.16669104167053533,3.0856307747614604,-123.8566505175372,56.143349482462796,null,1000000000,426629025,null,22.092959691104479,-26.258875162899628,null,19.49703231664558,-93.057277390203211,null,0,0,null,0,0]
[20774,20.774000000000001,14.141710599475193,1.5000244596144037,1.0008993763504508,4.2395820608152078E-2,1,0,420.29778001390849,1.5684170590684448,2.7955156507766352,1.2049756820050308,1.004385734881446,9.3485461428905042E-2,1.007259882563281,0.12013518530504019,4.2402448431205002,0.19981519570378764,1.003278038178234,0.16765405799603872,3.0276670907636127,-123.86714689468229,56.132853105317707,null,1000000000,431559076,null,22.086110494904364,-26.179979421780676,null,19.447144460268056,-93.121839160278228,null,0,0,null,0,0]
[20893,20.893000000000001,14.222314844334047,1.500426220850936,1.0009097049870266,4.2638383787035196E-2,1,0,422.70536418139557,1.5684306105833079,2.8094852271423396,1.2068796884165369,1.0044360132545094,9.4017834258132912E-2,1.0073429905364379,0.12081669896021549,4.2411966774517049,0.20092969586082474,1.0033163129196194,0.16861711883146557,2.9700740221310165,-123.87844352123699,56.121556478763011,null,1000000000,436517449,null,22.079358936275241,-26.102167050996467,null,19.397535873310851,-93.186139858445969,null,0,0,null,0,0]
[21014.75,21.014749999999999,14.304784141088904,1.5008325805944718,1.0009203332568222,4.2886547221580182E-2,1,0,425.16858587754956,1.5684443164272239,2.8237880651640439,1.2088081911174893,1.0044877481150087,9.4562454506134916E-2,1.0074285032056061,0.12151384517706472,4.2421759117637432,0.20206943442980038,1.0033557128850201,0.16960248156715763,2.9115282035955508,-123.89081796507183,56.109182034928168,null,1000000000,441619717.5625,null,22.072550288790399,-26.023661714021557,null,19.347066615875967,-93.251660965405179,null,0,0,null,0,0]
[21136.5,21.136500000000002,14.387255772887483,1.501234281676334,1.0009310231670754,4.313470537065317E-2,1,0,427.6318076526515,1.5684578643758103,2.8381012993258214,1.210717249043904,1.0045397808870991,9.5107018495579052E-2,1.0075145054147179,0.12221087271476121,4.2431606078554935,0.20320864770977684,1.0033953565758822,0.17058789135609109,2.8533595152057596,-123.90400702241554,56.095992977584459,null,1000000000,446751632.25,null,22.065839605684271,-25.946258210448562,null,19.296883084045078,-93.316918149499386,null,0,0,null,0,0]
[21258.25,21.25825,14.469729699803361,1.5016314036254648,1.0009417747158116,4.3382858203859627E-2,1,0,430.09502950534483,1.5684712571419361,2.8524247731267347,1.2126071411012467,1.0045921115244889,9.5651525912251442E-2,1.0076009970384212,0.12290778092648304,4.2441507619256251,0.20434733314771925,1.0034352442476067,0.17157334843107949,2.7955626526793931,-123.91799931313027,56.082000686869733,null,1000000000,451913193.0625,null,22.059224823664497,-25.869940697604239,null,19.246982023630867,-93.38191598248207,null,0,0,null,0,0]
[21380,21.38,14.552205882814135,1.5020240241737031,1.0009525879010444,4.3631005690808924E-2,1,0,432.55825143430405,1.5684844973766763,2.866758333082764,1.2144781411705987,1.0046447399806324,9.6195976442137648E-2,1.0076879779506942,0.12360456916609341,4.2451463701552932,0.20548548819839721,1.0034753761570188,0.17255885302425153,2.7381324180741791,-123.93278363882712,56.067216361172882,null,1000000000,457104400,null,22.05270393109544,-25.794693617162213,null,19.197360235075845,-93.44665893310075,null,0,0,null,0,0]
[21504.5,21.5045,14.636547270927299,1.5024209370477264,1.000963709065039,4.3884752591378577E-2,1,0,435.0771108970838,1.5684978816332706,2.8814259226387446,1.21637214534587,1.0046988651061999,9.6752665466954449E-2,1.0077774293831463,0.12431697120912182,4.2461701028013472,0.20664879992707277,1.0035166673807305,0.1735666668561669,2.6797788271481826,-123.94870949334175,56.051290506658248,null,1000000000,462443520.25,null,22.046130800399499,-25.718837964490366,null,19.146903153194266,-93.512605218328545,null,0,0,null,0,0]
[21629,21.629000000000001,14.720890938457417,1.5028133017409382,1.0009748946771395,4.413849383718562E-2,1,0,437.59597043690542,1.5685111118068107,2.8961037438742538,1.2182469580829425,1.0047533015570269,9.7309294342633912E-2,1.0078673921885049,0.12502924643478103,4.2471995306461405,0.20781155167984486,1.0035582145477953,0.17457453086586289,2.6217979485610825,-123.9654404509167,56.034559549083298,null,1000000000,467813641,null,22.03965175275696,-25.644069625630927,null,19.096731504268153,-93.578294110960172,null,0,0,null,0,0]
[21753.5,21.753499999999999,14.805236846447791,1.5032011958648794,1.0009861447351853,4.4392229395746094E-2,1,0,440.11483005244588,1.5685241905428298,2.9107916420079363,1.2201028566224323,1.0048080492825149,9.7865862734053094E-2,1.0079578662298458,0.12574139415439881,4.2482346495498096,0.20897374076057834,1.0036000179374498,0.17558244529930928,2.5641845516453508,-123.98296510696035,56.01703489303965,null,1000000000,473214762.25,null,22.033264795017292,-25.570372848243423,null,19.046842036440331,-93.643730073763578,null,0,0,null,0,0]
[21878,21.878,14.889584956823418,1.5035846952778948,1.0009974592370035,4.4645959234580423E-2,1,0,442.63368974241268,1.5685371204266436,2.9254894652616521,1.2219401131603949,1.004863108231786,9.8422370306311777E-2,1.0080488513695165,0.12645341368006682,4.2492754553536454,0.21013536448178652,1.0036420778304842,0.17659041040171042,2.5069335105141666,-124.00127224243249,55.998727757567508,null,1000000000,478646884,null,22.02696798415618,-25.497732165581969,null,18.997231552451247,-93.708917469011908,null,0,0,null,0,0]
[22005.25,22.00525,14.975798415225263,1.5039722013545203,1.0010090902499402,4.4905287603329964E-2,1,0,445.20818697100623,1.5685501847199652,2.9405220406867567,1.2237989656485302,1.0049197049006708,9.8991107017022295E-2,1.008142374234043,0.12718102735674416,4.2503451232039859,0.2113220595404964,1.0036853321157813,0.17762069240807643,2.4487871089795519,-124.02078086020022,55.979219139799781,null,1000000000,484231027.5625,null,22.020623271034076,-25.424562505238317,null,18.946810277472423,-93.77529232144974,null,0,0,null,0,0]
[22132.5,22.1325,15.062014096663589,1.5043552712818806,1.0010207885803752,4.5164609928288246E-2,1,0,447.78268427471227,1.5685630987886863,2.9555646732167284,1.2256389028210724,1.0049766265856634,9.9559779485380862E-2,1.0082364307317997,0.12790850566305659,4.2514207231128811,0.21250815833882419,1.0037288549591785,0.17865102786201201,2.3910087431859965,-124.04108378659022,55.958916213409779,null,1000000000,489847556.25,null,22.01436878063134,-25.352464324596333,null,18.89667386245533,-93.841416409861012,null,0,0,null,0,0]
[22259.75,22.25975,15.148231963181365,1.5047339806931079,1.0010325542259484,4.5423926174789908E-2,1,0,450.35718165224267,1.5685758652091097,2.9706172100698538,1.2274601996645227,1.0050338732315409,0.10012838735453013,1.0083310207134557,0.12863584786699517,4.2525022505794086,0.21369365803542598,1.0037726466655079,0.17968141702282472,2.3335932621670001,-124.06216962264799,55.937830377352014,null,1000000000,495496470.0625,null,22.008202591217227,-25.281421995254892,null,18.846819062610361,-93.907294084548369,null,0,0,null,0,0]
[22387,22.387,15.234451977679873,1.5051084035142066,1.0010443871842865,4.5683236308174509E-2,1,0,452.93167910233848,1.5685884864989632,2.985679501445877,1.2292631261164761,1.0050914447827768,0.10069693026786093,1.0084261440288891,0.12936305323740085,4.2535897010824337,0.21487855579851839,1.003816707541292,0.18071186014896795,2.276535617991672,-124.08402715799703,55.915972842002972,null,1000000000,501177769,null,22.00212282957828,-25.211420174752007,null,18.797242687605891,-93.972929597954064,null,0,0,null,0,0]
[22517.5,22.517499999999998,15.322876268053882,1.5054880126748931,1.0010565922706336,4.5949162908080952E-2,1,0,455.57192999950354,1.5686012819793864,3.001136465446991,1.2310932971922119,1.005150824127371,0.1012799260848096,1.0085242506018433,0.13010868874769979,4.2547110724956845,0.21609308803010949,1.003862173636056,0.18176867739616015,2.2183871865368086,-124.10723290848219,55.892767091517811,null,1000000000,507037806.25,null,21.995975643676605,-25.140695423054648,null,18.746686014891171,-94.039994296948379,null,0,0,null,0,0]
[22648,22.648,15.411302741163702,1.5058632656708744,1.0010688681469271,4.6215083004799151E-2,1,0,458.21218097039718,1.5686139300028865,3.0166033787976017,1.2329047067534251,1.0052105450663416,0.10186285282670195,1.0086229177770987,0.13085417879082886,4.2558386636646777,0.21730698118681099,1.0039079234836203,0.18282555194827721,2.1606046712503324,-124.13122699264322,55.868773007356779,null,1000000000,512931904,null,21.989915516556501,-25.071033220589374,null,18.696415544825143,-94.106813062025523,null,0,0,null,0,0]
[22778.5,22.778500000000001,15.499731359651587,1.5062342369535473,1.0010812148105626,4.6480996560960726E-2,1,0,460.85243201375232,1.5686264331038282,3.0320800892401336,1.2346976301154886,1.0052706075388083,0.10244571010972311,1.0087221453901514,0.1315995225809761,4.2569724696472866,0.21852023224580616,1.0039539574201282,0.18388248408125543,2.1031829479816055,-124.15599791481948,55.84400208518052,null,1000000000,518860062.25,null,21.983940577491907,-25.002417916164681,null,18.646428006947129,-94.173390176887352,null,0,0,null,0,0]
[22909,22.908999999999999,15.588162087006607,1.5066009992896507,1.0010936322589215,4.674690353920289E-2,1,0,463.49268312833061,1.5686387937588284,3.0475664475144266,1.236472337478393,1.0053310114835576,0.10302849755033834,1.008821933275627,0.1323447193332879,4.2581124854794243,0.21973283819498593,1.0040002757835866,0.18493947407006536,2.0461169952549834,-124.18153437312672,55.818465626873277,null,1000000000,524822281,null,21.978049003318802,-24.934834148386255,null,18.596720185844667,-94.23972982865628,null,0,0,null,0,0]
[23042.25,23.042249999999999,15.678458436038708,1.506971221311793,1.0011063844127983,4.7018407095081365E-2,1,0,466.18857179073626,1.5686512704220281,3.063388949569374,1.2382659225855315,1.0053930405861788,0.10362349348854183,1.0089244019047885,0.13310546693268829,4.2592829269694423,0.2209703283800418,1.0040478640382842,0.18601879777642713,1.9882104852176745,-124.20838731520311,55.791612684796888,null,1000000000,530945285.0625,null,21.97211744948121,-24.866874907702282,null,18.546250217574162,-94.307226673313266,null,0,0,null,0,0]
[23175.5,23.1755,15.768756909417212,1.5073372032924579,1.0011192103605295,4.7289903714177843E-2,1,0,468.88446052487774,1.5686636036140822,3.0792212050905765,1.2400410694065185,1.0054554255742219,0.10421841580250951,1.0090274543169511,0.13386605958123152,4.2604598322547291,0.22220713966757233,1.0040957495517442,0.18709818237898421,1.9306646328429959,-124.23601518473824,55.763984815261765,null,1000000000,537103800.25,null,21.966269114892768,-24.799959664348325,null,18.496065273982204,-94.374484468031696,null,0,0,null,0,0]
[23308.75,23.30875,15.859057470855236,1.5076990175604139,1.001132110099278,4.7561393356735454E-2,1,0,471.58034932952455,1.5686757957955364,3.0950630644015686,1.2417980497923671,1.0055181663814463,0.10481326408485954,1.0091310903332666,0.13462649644651623,4.2616431959805068,0.22344326888577382,1.0041439326898023,0.18817762816730751,1.8734744069904496,-124.26440655241822,55.735593447581778,null,1000000000,543297826.5625,null,21.960502203169632,-24.734072960046298,null,18.446162101901624,-94.441507375813813,null,0,0,null,0,0]
[23442,23.442,15.949360084886857,1.5080567348107985,1.0011450836261921,4.7832875983003488E-2,1,0,474.27623820347463,1.5686878493709917,3.1109143807848287,1.2435371305070355,1.0055812629412511,0.10540803792852102,1.0092353097739493,0.13538677669720262,4.2628330127685734,0.22467871287462177,1.0041924138203138,0.18925713542989486,1.8166348770522165,-124.29355018416074,55.706449815839264,null,1000000000,549527364,null,21.954814963716007,-24.669199624797272,null,18.396537502841742,-94.508299465999869,null,0,0,null,0,0]
[23578.5,23.578499999999998,16.041867293764771,1.5084190009739418,1.0011584500872732,4.8110972820126018E-2,1,0,477.03788053522527,1.5687000556743087,3.1271619701882019,1.245300341583675,1.0056462672452742,0.10601724084191207,1.0093426759059849,0.13616543710976478,4.2640585349012303,0.22594357585035946,1.0042423867873218,0.1903630361799542,1.7587675966510796,-124.32417310412407,55.675826895875929,null,1000000000,555945662.25,null,21.949069838700193,-24.603779197108263,null,18.345988108078615,-94.576485458761994,null,0,0,null,0,0]
[23715,23.715,16.134376583783943,1.5087771129499241,1.0011718939737262,4.8389062210102765E-2,1,0,479.79952293723335,1.5687121214629198,3.1434191811472805,1.2470453200037019,1.0057116447246481,0.10662636477742456,1.0094506538842385,0.13694393141220856,4.2652908172185144,0.22720771308834392,1.0042926732482138,0.19146900204898359,1.701258165900329,-124.35556217840173,55.644437821598274,null,1000000000,562401225,null,21.943404742357909,-24.539390847694921,null,18.295724416949607,-94.644437591864374,null,0,0,null,0,0]
[23851.5,23.851500000000001,16.226887919350698,1.5091311416965814,1.0011854152824322,4.8667144110223236E-2,1,0,482.56116540829271,1.5687240491492707,3.1596858651476261,1.2487723366534835,1.005777395306602,0.10723540929849504,1.0095592435123883,0.137722258714367,4.2665298538633172,0.2284711212303169,1.0043432736050071,0.19257503334356757,1.6441015960233534,-124.38770594374427,55.612294056255735,null,1000000000,568894052.25,null,21.937817933498209,-24.476019169121365,null,18.245743161786319,-94.712159950904706,null,0,0,null,0,0]
[23988,23.988,16.319401265677659,1.50948115656688,1.0011990140102542,4.8945218477783867E-2,1,0,485.32280794722465,1.5687358410908963,3.1759618766317939,1.2504816572999335,1.0058435189179682,0.10784437396890949,1.0096684445930866,0.13850041812726438,4.2677756389532462,0.22973379693114046,1.0043941882619354,0.19368113036908263,1.5872929979603199,-124.42059313576088,55.579406864239118,null,1000000000,575424144,null,21.932307715560189,-24.413649044148666,null,18.196041129934528,-94.779656529458762,null,0,0,null,0,0]
[24127.75,24.127749999999999,16.414119358367081,1.5098354175392532,1.0012130167200446,4.9229905815320253E-2,1,0,488.15020394905349,1.5687477755675541,3.1926349264881702,1.2522136153000183,1.0059116032818396,0.1084677546179104,1.0097808789558167,0.13929693028530801,4.2690580707978478,0.23102577405251692,1.0044466412112634,0.1948136314527624,1.5294873090219998,-124.45502198678847,55.544978013211534,null,1000000000,582148320.0625,null,21.926743923860322,-24.350816035739172,null,18.14544169286798,-94.848530337567837,null,0,0,null,0,0]
[24267.5,24.267499999999998,16.508839487404078,1.5101856133820668,1.0012271005727531,4.9514585166767454E-2,1,0,490.97760001960967,1.5687595725899084,3.2093174536986613,1.2539275724272541,1.0059800784934134,0.10909105064435307,1.0098939538125786,0.14009326458222832,4.2703475637086292,0.23231697638553189,1.0044994244701997,0.19594620207857624,1.4720362971909531,-124.49020681365342,55.509793186346585,null,1000000000,588911556.25,null,21.921256952313456,-24.289001677305716,null,18.095128290083125,-94.917175672949696,null,0,0,null,0,0]
[24407.25,24.407250000000001,16.603561617937721,1.510531813582503,1.001241265564955,4.9799256486321317E-2,1,0,493.80499615771259,1.5687712345190366,3.2260093112337347,1.2556237979504461,1.006048944472882,0.10971426158126782,1.010007668948254,0.14088942006794461,4.2716441112914314,0.23360740038335395,1.0045525384797565,0.19707884257025796,1.4149350241199512,-124.5261361506264,55.4738638493736,null,1000000000,595713852.5625,null,21.915845117035641,-24.228190649406596,null,18.045097645255083,-94.985596538099585,null,0,0,null,0,0]
[24547,24.547000000000001,{"$f":"SQRT(1+(A333/pole1)^2)","v":16.698285715907158},{"$f":"ATAN(A333/pole1)","v":1.5108740860549092},{"$f":"SQRT(1+(A333/Zero1)^2)","v":1.0012555116932069},{"$f":"ATAN(A333/Zero1)","v":5.0083919728185433E-2},{"$f":"IF(VIN_nom>Vout, 1, SQRT(1+(A333/z_RHP)^2))","v":1},{"$f":"IF(VIN_nom>Vout, 0, -ATAN(A333/z_RHP))","v":0},{"$f":"SQRT(1+(A333/Pole2)^2)","v":496.63239236220858},{"$f":"ATAN(A333/Pole2)","v":1.5687827636622478},3.2427103550098049,1.2573025560039033,{"$f":"SQRT(1+(A333/pole4)^2)","v":1.0061182011400045},{"$f":"ATAN(A333/pole4)","v":0.11033738696207693},{"$f":"IF(VOUT_setting=1,1,SQRT(1+(A333*zterm1)^2))","v":1.0101220241466031},{"$f":"IF(VOUT_setting=1,0,ATAN(((A333*zterm1))))","v":0.14168539579370953},4.2729477071248949,{"$f":"IF(VOUT_setting=1,0,ATAN(A333*$Q$4/(1+Afbr-$Q$5*(A333)^2)))","v":0.23489704251372495},{"$f":"SQRT((1-(Z333/pterm2))^2+(A333/pterm1)^2)","v":1.0046059836833734},{"$f":"IF((ATAN((A333/pterm1)/(1-A333^2/pterm2))>0),ATAN((A333/pterm1)/(1-A333^2/pterm2)),PI()+ATAN((A333/pterm1)/(1-A333^2/pterm2)))","v":0.198211553250185},{"$f":"20*LOG10(((E333*K333*G333*O333)/(C333*I333*S333*M333*Q333))*Adc)","v":1.3581786501300621},{"$f":"((F333+L333+H333+P333)-(D333+J333+T333+N333+R333))*radconv","v":-124.56279873366847},{"$f":"IF(V333>0,V333,V333+180)","v":55.437201266331527},null,{"$f":"IF(U333<0,A333,1000000000)","v":1000000000},{"$f":"A333^2","v":602555209},null,{"$f":"20*LOG10((K333/(I333*M333))*AEA)","v":21.910506777514524},{"$f":"(L333-(J333+N333))*radconv","v":-24.168367923726791},null,{"$f":"20*LOG10((E333*G333/(C333*S333))*Acs*Am)","v":17.995346537278834},{"$f":"(F333+H333-(D333+T333))*radconv","v":-95.053796845317777},null,{"$f":"SUM((U334<0)*(U333>0))*A333","v":0},0,null,0,0]
[24690,{"$f":"A334/1000","v":24.69},16.795214701749117,1.511220321791426,1.0012701731114719,5.0375194636022212E-2,1,0,499.52554203436017,1.568794425823302,3.2598091570390468,1.2590025436932006,1.0061894727650742,0.11097491458074438,1.0102397011049447,0.14249969551529956,4.2742889084393587,0.23621586329877475,1.0046610151007362,0.19937067902946592,1.3004544363739194,-124.60106141458355,55.398938585416445,null,1000000000,609596100,null,21.905118702777408,-24.108161638318137,null,17.944724486973659,-95.123358883996772,null,0,0,null,{"$f":"SUM((V335<-183)*(V334>-183))*A334","v":0},{"$f":"IF(AK334>0,U334,0)","v":0}]
[24833,24.832999999999998,16.892145677881413,1.51156258400968,1.00128491947608,5.0666460989101672E-2,1,0,502.41869177366783,1.5688059536725627,3.2769172814508503,1.2606847856159777,1.0062611532892385,0.1116123516305219,1.0103580477808047,0.14331380501321347,{"$f":"IF(VOUT_setting=1,1,SQRT((1+Afbr-$Q$5*(A335)^2)^2+(A335*$Q$4)^2))","v":4.2756374759520837},0.23753385799154866,1.0047163942428379,0.200529878978082,1.2430814029141453,-124.64006860963926,55.359931390360742,null,1000000000,616677889,null,21.899804240072559,-24.04895922572241,null,17.894388474443556,-95.192697996590624,null,0,0,null,0,0]
[24976,24.975999999999999,16.989078610237311,1.5119009406427384,1.0012997507832775,5.0957718738383083E-2,1,0,505.31184157897798,1.5688173495170226,3.2940345829931164,1.2623495488212786,1.0063332426251204,0.11224969761280411,1.0104770639388725,0.14412772327533677,4.2769934026957372,0.23885102285521187,1.0047721215926615,0.20168915343696944,1.1860546689865084,-124.67980888017249,55.320191119827513,null,1000000000,623800576,null,21.894561764368508,-23.990745488769406,null,17.844335220205721,-95.26181809772136,null,0,0,null,0,0]
[25119,25.119,17.086013465522473,1.5122354580856618,1.0013146670292905,5.1248967834834451E-2,1,0,508.20499144916346,1.5688286156111413,3.3111609193401996,1.263997095225097,1.0064057406848699,0.11288695202942405,1.0105967493426165,0.14494144929104386,4.2783566816738201,0.24016735416907264,1.0048281976358426,0.20284850274554458,1.1293694512396955,-124.72027099126821,55.279729008731792,null,1000000000,630964161,null,21.889389692664814,-23.93350552140625,null,17.794561500078203,-95.330723013802228,null,0,0,null,0,0]
[25265.25,25.265250000000002,17.185153340768569,1.5125736747640608,1.0013300101333318,5.1546827227793614E-2,1,0,511.16389479144516,1.5688400058417638,3.3286856904095909,1.2656645453896151,1.0064803090989385,0.11353859427137963,1.0107198468550997,0.14577346917822231,4.279758541720609,0.24151273606146653,1.0048859093141365,0.20403427867488713,1.0717442943863564,-124.76238783128896,55.237612168711038,null,1000000000,638332857.5625,null,21.884171289126147,-23.875956626724047,null,17.743942391382006,-95.400975272210331,null,0,0,null,0,0]
[25411.5,25.4115,17.284295159281964,1.5129080114937696,1.0013454420728631,5.1844677466433314E-2,1,0,514.12279819928062,1.5688512649652189,3.3462196195678802,1.2673145254847897,1.0065553048389715,0.11419013968573517,1.0108436438748736,0.14660528584781171,4.2811680770966962,0.24285723826481456,1.0049439867515431,0.20522013360804356,1.0144665345422168,-124.80523656029638,55.194763439703621,null,1000000000,645744332.25,null,21.87902330608653,-23.819395633583994,null,17.693609017615252,-95.471010277022486,null,0,0,null,0,0]
[25557.75,25.557749999999999,17.383438887813938,1.5132385345854404,1.0013609628437767,5.2142518498330584E-2,1,0,517.08170167154435,1.5688623952322129,3.3637625636028665,1.2689472997893714,1.0066307278094591,0.11484158774101728,1.0109681401449662,0.14743689822357928,4.2825852802240574,0.24420085685158935,1.0050024304761613,0.20640606790311422,0.95753135481154883,-124.84880579421294,55.151194205787064,null,1000000000,653198585.0625,null,21.873944178392804,-23.763807498433827,null,17.643558101284505,-95.540831851080469,null,0,0,null,0,0]
[25704,25.704000000000001,17.482584493869339,1.5135653088488825,1.0013765724419426,5.2440350271072224E-2,1,0,520.04060520713665,1.5688733988422279,3.3813143822015328,1.2705631274660127,1.0067065779143762,0.11549293790624199,1.0110933354070806,0.14826830523095119,4.2840101434935045,0.24554358791209796,1.0050612410189794,0.20759208191650011,0.90093403427415286,-124.8930843540217,55.106915645978304,null,1000000000,660695616,null,21.868932381517475,-23.709177467945203,null,17.593786420161159,-95.610443731136129,null,0,0,null,0,0]
[25853.75,25.853750000000002,17.584104727572544,1.51389608503421,1.0013926476401622,5.2745299992874355E-2,1,0,523.07032017389042,1.5688845367915474,3.3992952964225163,1.2722003301333036,1.0067846857244207,0.11615977395250791,1.0112222508081661,0.14911939523816617,4.2854770353900111,0.24691752900235789,1.005121839642293,0.2088065621445058,0.84332749963487963,-124.93914609869655,55.060853901303446,null,1000000000,668416389.0625,null,21.863868860392696,-23.65421771340575,null,17.543109652188946,-95.681508069943902,null,0,0,null,0,0]
[26003.5,26.003499999999999,17.68562686311553,1.5142230636960858,1.001408815959228,5.3050239895857471E-2,1,0,526.10003520478574,1.5688955464579937,{"$f":"SQRT(1+(A343/Zero2)^2)","v":3.4172852263253759},{"$f":"ATAN(A343/Zero2)","v":1.2738202993506964},1.006863241152151,0.11682650624217086,1.0113518985052903,0.14997026765492369,4.2869519422092761,0.2482905313394094,1.0051828239870166,0.21002112670283035,0.78606546884840189,-124.98592844513506,55.014071554864941,null,1000000000,676182012.25,null,21.858872821543478,-23.600232067930342,null,17.492718979258179,-95.752360221033285,null,0,0,null,0,0]
[26153.25,26.15325,17.787150867933416,1.5145463097895426,1.00142507739463,5.3355169923786812E-2,1,0,529.12975029872075,1.5689064300451474,3.4352840302698744,1.2754232974266371,1.0069422440928057,0.11749313420681629,1.0114822782168649,0.15082092133309549,4.2884348556822829,0.24966259078449107,1.005244194632585,0.21123577596847978,0.72914317073643331,-125.03342003297988,54.966579967020124,null,1000000000,683992485.5625,null,21.853942752789312,-23.5472055960402,null,17.442611114364293,-95.823003930876382,null,0,0,null,0,0]
[26303,26.303000000000001,17.888676710199992,1.5148658867981832,1.0014414319418317,5.3660090020438624E-2,1,0,532.15946545461884,1.5689171897064076,3.4532915694995858,1.2770095815511677,1.0070216944410604,0.11815965727857837,1.0116133896598571,0.15167135512640972,4.2899257675065883,0.25103370321862656,1.0053059521615981,0.21245051031655127,0.67255592912536333,-125.08160970890339,54.918390291096614,null,1000000000,691847809,null,21.84907718137994,-23.495123652675744,null,17.39278282598772,-95.893442861528598,null,0,0,null,0,0]
[26456,26.456,17.992407816721872,1.5151886746856791,1.0014582375892913,5.3971617433172726E-2,1,0,535.25493409082401,1.5689280570825632,3.4716988037487013,1.2786132928622131,1.0071033310551918,0.11884053687018425,1.0117481020220478,0.15254001746132212,4.2914572882926914,0.2524335903566029,1.0053694501828876,0.21369169610791489,0.6150818590482634,-125.13155482532802,54.868445174671976,null,1000000000,699919936,null,21.844171133385881,-23.442871944679457,null,17.342158561207405,-95.965202746726504,null,0,{"$f":"IF(AH346>0,W346,0)","v":0},null,0,0]
[26609,26.609000000000002,18.096140776416966,1.5155077619559671,1.0014751404243332,5.4283134360257959E-2,1,0,538.35040278951567,1.5689387994857564,3.490114872628677,1.2802000838139802,1.0071854344836118,0.11952130576988902,1.0118835776196962,0.1534084478504176,4.292997140743938,0.25383248030255101,1.0054333533024014,0.21493297150030471,0.55794797087739811,-125.18220576374415,54.81779423625585,null,1000000000,708038881,null,21.839329425304474,-23.391576199256679,null,17.291819491858185,-96.036756336720643,null,0,0,null,0,0]
[26762,26.762,18.199875557597938,1.5158232118213122,1.0014921404420369,5.4594640741765829E-2,1,0,541.44587154962232,1.5689494190594113,3.508539637022515,1.2817702129191568,1.0072680046121683,0.12020196337383833,1.012019816146287,0.15427664507721903,4.2945453158987954,0.25523036872772198,1.0054976621517175,0.21617433688753168,0.5011495689478157,-125.23355127014997,54.766448729850026,null,1000000000,716204644,null,21.834550606230149,-23.341221692932304,null,17.241762342932589,-96.108107279304335,null,0,0,null,0,0]
[26915,26.914999999999999,18.30361212929526,1.5161350860638783,1.001509237637453,5.4906136517780084E-2,1,0,544.54134037009658,1.5689599178982152,3.5269729606551774,1.2833239336185331,1.0073510413260991,0.12088250907878782,1.0121568172937447,0.15514460792730847,4.2961018047602479,0.25662725132511111,1.0055623773658493,0.21741579266128092,0.44468205082805828,-125.28558029745116,54.714419702548838,null,1000000000,724417225,null,21.829833263176877,-23.291793990072058,null,17.19198389464416,-96.179259140209723,null,0,0,null,0,0]
[27071.75,27.071750000000002,18.409893089260265,1.5164509592631543,1.0015268546561846,5.5225255932968106E-2,1,0,547.71267858594069,1.5689705509918639,3.5458668183576489,1.2848989788957486,1.0074365970123691,0.12157961814891102,1.0122979668761842,0.15603360004521907,4.2977050552694287,0.25805732365198775,1.0056291008314864,0.21868777041660073,0.38716895647685906,-125.33958206444895,54.660417935551052,null,1000000000,732879648.0625,null,21.825062614931991,-23.242101182056413,null,17.141271107421861,-96.251952102836,null,0,0,null,0,0]
[27228.5,27.2285,18.516175865001593,1.5167632062714753,1.0015445736640136,5.5544364089134005E-2,1,0,550.88401686299778,1.5689810616599729,3.5647693792736148,1.2864573243215138,1.0075226421903065,0.12227660848766952,1.0124399162613382,0.15692234358263318,4.2993170127826295,0.25948633115948511,1.0056962521863173,0.21995984386888098,0.32999367420563819,-125.39427844082726,54.605721559172736,null,1000000000,741391212.25,null,21.820353607647618,-23.193351387775607,null,17.090844180513947,-96.324443428151,null,0,0,null,0,0]
[27385.25,27.385249999999999,18.622460425430052,1.5170718891150516,1.0015623946555274,5.5863460921887494E-2,1,0,554.0553552002167,1.5689914520047816,3.5836805056845873,1.2879992266426186,1.0076091767345097,0.12297347944837825,1.0125826651128442,0.1578108372404145,4.3009376675106461,0.26091426928737482,1.0057638321243942,0.22123201343230184,0.27315154376877543,-125.44965819388905,54.55034180611095,null,1000000000,749951917.5625,null,21.815704838198965,-23.145529980119299,null,17.040699823876583,-96.396736697414866,null,0,0,null,0,0]
[27542,27.542000000000002,18.728746740161661,1.5173770684148424,1.001580317625282,5.6182546366852097E-2,1,0,557.22669359657004,1.5690017240806722,3.6026000627020243,1.289524937528906,1.0076962005189081,0.12367023038503737,1.012726213092636,0.15869907972173522,4.3025670096262401,0.26234113349957366,1.0058318413435365,0.22250427951865068,0.21663799743032208,-125.50571029972039,54.494289700279609,null,1000000000,758561764,null,21.811114940311835,-23.09862262016199,null,16.990834803027706,-96.46883541123492,null,0,0,null,0,0]
[27702.5,27.702500000000001,18.837577576439969,1.5176859802630518,1.0015987750354294,5.6509253567979138E-2,1,0,560.47390139277422,1.5690121214499555,3.6219808382699816,1.2910706292206977,1.0077858130163133,0.12438352496493138,1.0128740229135704,0.15960831040931989,4.3042443225366798,0.26380101574636372,1.0059019231190056,0.22380708303455946,0.15910824578178359,-125.56378873847812,54.436211261521876,null,1000000000,767428506.25,null,21.806474847812911,-23.051525504095526,null,16.940062957693804,-96.542460955698303,null,0,0,null,0,0]
[27863,27.863,18.946410189671461,1.5179913432162513,1.0016173393498744,5.6835948693372287E-2,1,0,563.72110924887068,1.5690223990351173,3.6413701752133121,1.2925998637315712,1.0078759381728817,0.12509669234076065,1.0130226698331515,0.16051727501436927,4.3059307224976289,0.26525976253185279,1.0059724564537982,0.22510998861299891,0.10191358263142979,-125.62254934406603,54.37745065593397,null,1000000000,776346769,null,21.801893691780947,-23.005357163658758,null,16.889577283219765,-96.615889703096286,null,0,0,null,0,0]
[28023.5,28.023499999999999,19.055244549409313,1.5182932180257254,1.0016360105626734,5.7162631673968768E-2,1,0,566.96831716383008,1.5690325588942808,3.6607679374954851,1.2941128954628014,1.0079665758510985,0.12580973182129906,1.0131721534829365,0.16142597215232643,4.3076261988373847,0.26671736906553034,1.0060434421092752,0.22641299668814072,4.5049390646474431E-2,-125.68198093316087,54.318019066839128,null,1000000000,785316552.25,null,21.797370118302872,-22.960103101049764,null,16.839374480430074,-96.689125163054314,null,28023.5,54.318019066839128,null,0,0]
[28184,28.184000000000001,19.164080625897885,1.5185916640652675,1.001654788667848,5.748930244072134E-2,1,0,570.21552513664699,1.5690426030386875,3.6801739918896068,1.2956099737499418,1.0080577259127161,0.12652264271608865,1.0133224734926261,0.16233440044121586,4.3093307408436514,0.26817383058361688,1.006114880850921,0.2277161076914693,-1.1488855928351747E-2,-125.74207253234601,54.257927467653985,null,28184,794337856,null,21.792902809173501,-22.915749106068912,null,16.789451305917687,-96.762170766118501,null,0,0,null,0,0]
[28348,28.347999999999999,19.27529181782835,1.5188931369082452,1.0016740866724292,5.782308418096356E-2,1,0,573.53354455702038,1.5690527487319081,3.700011660839615,1.2971234737760831,1.0081513927912107,0.12725096641439579,1.0134769350378727,0.16326235955049812,4.3110818067225871,0.26966086527466188,1.0061883462619805,0.22904774221123395,-6.8927954620104662E-2,-125.80414509370652,54.195854906293476,null,28348,803609104,null,21.788394864893483,-22.871343121661472,null,16.73872498793617,-96.836616640586044,null,0,0,null,0,0]
[28512,28.512,19.386504741511398,1.5191911509104794,1.0016934962694637,5.8156853023157463E-2,1,0,576.85156403575149,1.5690627777101556,3.7198577149309804,1.298620827657508,1.0082455943495368,0.12797915440265409,1.0136322690299122,0.16419003504837398,4.3128423152250175,0.27114669449670886,1.0062622863644746,0.23037948509941028,-0.12603600844273147,-125.86688425065749,54.133115749342508,null,28512,812934144,null,21.783942992273147,-22.827847780314322,null,16.688283952936288,-96.910871286133087,null,0,0,null,0,0]
[28676,28.675999999999998,19.497719367313831,1.5194857652060654,1.0017130174524649,5.8490608893690191E-2,1,0,580.16958357183898,1.5690726919759244,3.7397120206678891,1.3001022857877957,1.0083403304378413,0.12870720594675261,1.0137884750677122,0.16511742546889671,4.3146122547930936,0.27263131325426015,1.0063367019883713,0.23171133680754316,-0.18281756451365183,-125.9302789453716,54.069721054628403,null,28676,822312976,null,21.779545893447036,-22.785248808205171,null,16.638124913094018,-96.984938120983074,null,0,0,null,0,0]
[28840,28.84,19.608935666274277,1.5197770375899231,1.0017326502149091,5.8824351718966154E-2,1,0,583.48760316430423,1.5690824934861605,3.75957444731957,1.3015680935514542,1.0084356009054771,0.12943512031343424,1.0139455527482368,0.16604452934898167,4.3163916138260614,0.27411471658114722,1.0064115939681113,0.23304329778418517,-0.23927708003259901,-125.99431832907449,54.005681670925512,null,28840,831745600,null,21.775202304850239,-22.743532215949543,null,16.588244636098583,-97.05882048645789,null,0,0,null,0,0]
[29008,29.007999999999999,19.722866263173941,1.5200720080526209,1.0017528775131659,5.9166221009836692E-2,1,0,586.88655012136041,1.5690924191424263,3.7799296100183524,1.303053676491144,1.0085337489734898,0.13018064568657309,1.0141073649596566,0.1669939468836131,4.3182241265698549,0.27563303505751585,1.006488807383636,0.23440785937826841,-0.29678430563859021,-126.06057699043382,53.939423009566184,null,29008,841464064,null,21.770806973031014,-22.701698738954569,null,16.537433489677944,-97.134317001852367,null,0,0,null,0,0]
[29176,29.175999999999998,19.836798556400474,1.5203635902254262,1.0017732218861659,5.9508076455049637E-2,1,0,590.28549713557015,1.5691022304920401,3.8002930254828335,1.3045233420085638,1.0086324574834373,0.13092602555418131,1.0142700909888738,0.16794306063092831,4.3200664990875639,0.27715006763555661,1.0065665224622511,0.23577253657922018,-0.35396277911879853,-126.12748977832591,53.872510221674091,null,29176,851238976,null,21.766465215049237,-22.660762376935903,null,16.486908176816339,-97.209626799619414,null,0,0,null,0,0]
[29344,29.344000000000001,19.950732516892334,1.5206518421075184,1.001793683326776,5.9849917975548977E-2,1,0,593.68444420595154,1.5691119294982765,3.8206645617560016,1.3059773383157272,1.0087317262707947,0.13167125913084307,1.0144337303961299,0.16889186902757736,4.3219187187709167,0.27866580907280897,1.0066447401155163,0.23713732985934838,-0.41081701323531561,-126.1950456826379,53.804954317362103,null,29344,861070336,null,21.762175777711761,-22.620708975879044,null,16.43666539604094,-97.284753234458066,null,0,0,null,0,0]
[29512,29.512,20.064668116247631,1.520936820382945,1.0018142618278234,6.0191745492298186E-2,1,0,597.0833913315455,1.5691215180797062,3.8410440896281868,1.3074159086250392,1.0088315551701685,0.1324163456321007,1.0145982827394833,0.16984037051341508,4.3237807729659146,0.28018025415929487,1.0067234612598899,0.23850223968759529,-0.46735143155700959,-126.26323390333883,53.736766096661171,null,29512,870958144,null,21.757937441093848,-22.581524665719535,null,16.386701901696586,-97.359699585521867,null,0,0,null,0,0]
[29684,29.684000000000001,20.181318136842826,1.5212252502545578,1.0018354515599961,6.054169716908183E-2,1,0,600.56326582587462,1.5691312225186296,3.8619169915218921,1.3088729981534215,1.0089343410492595,0.13317901910023017,1.0147676983317264,0.17081113578330454,4.3256973370551846,0.28172940903947369,1.006804579294996,0.23989976859860673,-0.52490510692647518,-126.33368966948157,53.666310330518428,null,29684,881139856,null,21.753649891908896,-22.542293579588964,null,16.335834808586959,-97.4362471541735,null,0,0,null,0,0]
[29856,29.856000000000002,20.297969817060832,1.5215103649580992,1.0018567639779268,6.0891633999731937E-2,1,0,604.04314037611084,1.5691408151435864,3.8827980045253923,1.3103144187661253,1.0090377136762529,0.13394153674499329,1.0149380699062578,0.17178157605436498,4.3276241825528254,0.28327719415542524,1.0068862270422203,0.2412974206576122,-0.58213266309258882,-126.40478596456767,53.595214035432335,null,29856,891380736,null,21.7494134203165,-22.50394492170771,null,16.285253748379059,-97.512612684167152,null,0,0,null,0,0]
[30028,30.027999999999999,20.414623128451773,1.5217922212774486,1.0018781990737862,6.1241555899495113E-2,1,0,607.5230149812935,1.5691502978759766,3.9036869984785185,1.3117404159624344,1.0091416728708364,0.13470389772770669,1.0151093969817337,0.17275168966286511,4.3295612957328649,0.28482360402219031,1.0069684055009722,0.24269519635677164,-0.63903857137522979,-126.47651185215048,53.52348814784952,null,30028,901680784,null,21.745226818871014,-22.46646468803802,null,16.234955411777594,-97.58879946203416,null,0,0,null,0,0]
[30200,30.2,20.531278043211973,1.5220708747080411,1.0018997568397003,6.1591462783639833E-2,1,0,611.00288964048355,1.5691596725934278,3.9245838459430411,1.3131512302668009,1.0092462184517483,0.13546610121076003,1.0152816790744363,0.17372147494865303,4.3315086628208093,0.28636863319067413,1.0070511156760156,0.24409309618446795,-0.69562721481877587,-126.54885660618342,53.451143393816579,null,30200,912040000,null,21.741088912303326,-22.429839157132498,null,16.184936545476585,-97.664810700265818,null,0,0,null,0,0]
[30375.75,30.37575,20.650477934319088,1.5223523514662205,1.0019219113177555,6.1948982853209746E-2,1,0,614.5586337148078,1.5691691420375304,3.9459442756763843,1.314577365746995,1.0093536488824435,0.13624475894406654,1.015458703288258,0.17471206294740055,4.3335090643415946,0.28794591577610035,1.0071361794078633,0.24552160220097788,-0.7531263767462355,-126.62340695185682,53.376593048143178,null,30375.75,922686188.0625,null,21.73690989848707,-22.393283974046838,null,16.134112500298251,-97.742301105306538,null,0,0,null,0,0]
[30551.5,30.551500000000001,20.769679442766442,1.5226305973389633,1.0019441938563975,6.2306487066481404E-2,1,0,618.11437784360578,1.569178502534418,3.9673126444876314,1.3159881414353758,1.0094616911617209,0.13702325047044581,1.0156367235878165,0.17570230465801101,4.3355201425324852,0.2895217454141466,1.007221800432095,0.24695023883640302,-0.81030326883542969,-126.69858145301285,53.301418546987151,null,30551.5,933394152.25,null,21.732779343577011,-22.35759307703621,null,16.083573550424603,-97.819614786659017,null,0,0,null,0,0]
[30727.25,30.727250000000002,20.888882540866199,1.5229056675942758,1.0019666044470832,6.2663975333131047E-2,1,0,621.67012202594276,1.5691877559535132,3.988688824782114,1.3173837986192294,1.0095703450931439,0.13780157489980333,1.0158157394494238,0.17669219832103691,4.3375418825440981,0.29109611640777028,1.007307979837909,0.24837900659942197,-0.86716229599723904,-126.77436931635603,53.225630683643971,null,30727.25,944163892.5625,null,21.728696091421213,-22.322752697468811,null,16.033316398180915,-97.896754945267006,null,0,0,null,0,0]
[30903,30.902999999999999,21.008087201558556,1.5231776162476987,1.0019891430812196,6.3021447562859267E-2,1,0,625.22586626090515,1.5691969041217124,4.0100726916396496,1.3187645736775682,1.0096796104792489,0.13857973134323648,1.0159957503468335,0.17768174218099572,4.3395742694760715,0.2926690230991858,1.0073947187203072,0.24980790599450869,-0.92370777644444835,-126.8507599574647,53.149240042535297,null,30903,954995409,null,21.724659016733501,-22.288749345567929,null,15.983337801614212,-97.973724710071053,null,0,0,null,0,0]
[31083,31.082999999999998,21.130176070608115,1.5234529606020821,1.0020123594627335,6.3387547495856025E-2,1,0,628.86759582970433,1.5692061662776962,4.0319815046416467,1.3201635544118975,1.0097921517347304,0.13937653016956961,1.0161811451488094,0.17869485084263906,4.3416668243525187,0.29427844222524857,1.007484136213429,0.25127149611247901,-0.9813000557333349,-126.92961185614018,53.070388143859816,null,31083,966152889,null,21.720571038754052,-22.254777546148851,null,15.93243602966313,-98.05238233523589,null,0,0,null,0,0]
[31263,31.263000000000002,21.252266523225749,1.5237251413692183,1.0020357101368895,6.3753630415290766E-2,1,0,632.50932545183116,1.5692153217782798,4.0538981235216713,1.3215474111908732,1.0099053339523811,0.14017315090372867,1.0163675825669685,0.17970758886419291,4.3437705155054633,0.29588631348646777,1.007574142912508,0.25273522536328491,-1.0385723400361744,-127.00907421511569,52.990925784884311,null,31263,977375169,null,21.716529204380389,-22.22165597070784,null,15.881819738644758,-98.130867646732682,null,0,0,null,0,0]
[31443,31.443000000000001,21.374358532275419,1.523994212720404,1.0020591950942994,6.411969622423383E-2,1,0,636.1510551263699,1.5692243724551502,4.0758224223578132,1.32291638273124,1.0100191569167234,0.14096959259467676,1.01655506202766,0.18071995437275304,4.3458853267641322,0.29749263093287698,1.0076647400127927,0.25419909427503062,-1.0955290000031002,-127.0891363133868,52.910863686613197,null,31443,988662249,null,21.71253239914865,-22.189370992240402,null,15.831485619357084,-98.209183784159961,null,0,0,null,0,0]
[31623,31.623000000000001,21.496452071237222,1.5242602275980526,1.002082814325522,6.4485744825783023E-2,1,0,639.79278485242548,1.5692333200982898,4.0977542778793925,1.3242707028650023,1.0101336204111571,0.14176585429271304,1.0167435829544502,0.18173194549984681,4.3480112419038202,0.29909738865784541,1.0077559287158779,0.2556631033710966,-1.1521743203263763,-127.16978763905807,52.830212360941928,null,31623,1000014129,null,21.708579538468804,-22.157909261304155,null,15.781430418570439,-98.287333816434113,null,0,0,null,0,0]
[31807,31.806999999999999,21.621260354254055,1.5245290486820635,1.0021070972014239,6.4859909954608289E-2,1,0,643.51544195806309,1.5692423619056857,4.1201811927591114,1.3256402140847532,1.0102512893513456,0.14257962367057406,1.0169373690708499,0.18276603642450207,4.3501958594046037,0.30073618946352393,1.0078497565613345,0.25715979143436607,-1.209761004733654,-127.25282949863755,52.747170501362447,null,31807,1011685249,null,21.704583157634541,-22.126585656632209,null,15.730547834542266,-98.36705195663346,null,0,0,null,0,0]
[31991,31.991,21.746070181791382,1.5247947840309466,1.0021315203650516,6.523405689809357E-2,1,0,647.23809911570572,1.5692512997032932,4.1426157516110056,1.3269948944987808,1.0103696271446636,0.14339320296444016,1.0171322422281179,0.18379973220961285,4.3523920453211593,0.30237334811395827,1.0079442051545329,0.25865662707234338,-1.2670311469712769,-127.3364654994749,52.663534500525103,null,31991,1023424081,null,21.700630495800976,-22.096094944203372,null,15.679950002324688,-98.446602794584237,null,0,0,null,0,0]
[32175,32.174999999999997,21.870881527407022,1.5250574864352733,1.0021560838061485,6.5608185552821663E-2,1,0,650.96075632446093,1.5692601352755176,4.1650578309151989,1.3283349788275163,1.0104886335561241,0.14420659116424869,1.0173282018015735,0.18483303087382444,4.3545997821517357,0.30400885844051789,1.0080392757994665,0.26015361082861599,-1.323989059360545,-127.42068505928098,52.579314940719016,null,32175,1035230625,null,21.696720485235595,-22.066423719894107,null,15.629633620234916,-98.525989392034049,null,0,0,null,0,0]
[32359,32.359000000000002,21.995694365258633,1.5253172074890879,1.0021807875143998,6.5982295815405947E-2,1,0,654.68341358345697,1.5692688703661772,4.1875073097587672,1.3296606969702247,1.0106083083495234,0.14501978726142287,1.0175252471635361,0.18586593044069633,4.356819052338099,0.30564271432200274,1.008134969807013,0.26165074324150595,-1.3806389696372998,-127.50547780333534,52.494522196664661,null,32359,1047104881,null,21.692852086887939,-22.037558853573067,null,15.579595442382697,-98.60521474187108,null,0,0,null,0,0]
[32547.5,32.547499999999999,22.123561212013598,1.525580241519596,1.0022062408333579,6.6365536333352085E-2,1,0,658.49711414184321,1.5692777166705894,4.2105133742364798,1.3310041754661048,1.0107316028251667,0.14585267104646366,1.0177282368554696,0.18692367521972997,4.3591045396428303,0.30731480665313776,1.0082336519517654,0.26318464501752276,-1.4383592796110654,-127.59292803281228,52.407071967187719,null,32547.5,1059339756.25,null,21.688931175117958,-22.008810787474516,null,15.528618662030054,-98.686213515516712,null,0,0,null,0,0]
[32736,32.735999999999997,22.251429571837406,1.5258402525055199,1.0022318413421591,6.6748757328972591E-2,1,0,662.3108147511681,1.5692864610978903,4.2335269558095394,1.332333049958728,1.0108555982693528,0.14668535107954181,1.0179323647513265,0.18798099695821749,4.361402093848338,0.30898514977273112,1.0083329911298542,0.26471870393702635,-1.4957650576869632,-127.68095842929296,52.319041570707043,null,32736,1071645696,null,21.685051816573832,-21.980881957871503,null,15.477927137746796,-98.767049203671661,null,0,0,null,0,0]
[32924.5,32.924500000000002,22.379299418794428,1.5260972922302123,1.0022575890295247,6.7131958691209401E-2,1,0,666.12451541055668,1.569295105397881,4.2565479325514799,1.3336475526677556,1.0109802944241626,0.14751782628115309,1.0181376301665064,0.18903789354729919,4.3637116958959812,0.31065373725438472,1.0084329887731134,0.26625292056143679,-1.5528605872267596,-127.76955848409709,52.230441515902911,null,32924.5,1084022700.25,null,21.68121298190502,-21.953759097962664,null,15.427517553672633,-98.847724811833615,null,0,0,null,0,0]
[33113,33.113,22.507170727538153,1.5263514113018171,1.0022834838841117,6.7515140309038851E-2,1,0,669.93821611915394,1.5693036512805192,4.2795761851205718,1.3349479110156681,1.011105691030348,0.14835009557345979,1.0183440324131472,0.19009436288361006,4.3660333266676163,0.31232056272401859,1.0085336463209105,0.26778729544625346,-1.609650067615924,-127.85871789622222,52.141282103777783,null,33113,1096470769,null,21.677413669529532,-21.927429213617476,null,15.377386650045278,-98.928243277824592,null,0,0,null,0,0]
[33305.75,33.305750000000003,22.637926562187321,1.5266082912071122,1.002310114744827,6.7906940767407067E-2,1,0,673.83790217225703,1.5693122898123562,4.303131044367233,1.3362631935144225,1.0112346389278966,0.14920091551143039,1.01855626313892,0.19117420782384317,4.3684197205081592,0.31402314050281127,1.0086372572334359,0.26935642921572511,-1.6674077594073693,-127.95045543090295,52.049544569097051,null,33305.75,1109272983.0625,null,21.673568549906093,-21.901312420528338,null,15.326410311482054,-99.010417642140013,null,0,0,null,0,0]
[33498.5,33.4985,22.768683873494421,1.5268622206795235,1.0023368994595718,6.8298720346320466E-2,1,0,677.73758827506629,1.569320828932377,4.3266932668311719,1.337564152763457,1.011364318665732,0.15005151787636842,1.0187696810719449,0.19225360159759813,4.3708186509786042,0.31572386260746088,1.0087415612109152,0.27092572961814371,-1.7248540670345287,-128.04275668940386,51.957243310596141,null,33498.5,1122149502.25,null,21.669762721825517,-21.875998127303969,null,15.275718641980955,-99.092433702772496,null,0,0,null,0,0]
[33691.25,33.691249999999997,22.899442636164004,1.5271132502280742,1.0023638380160129,6.8690478927188187E-2,1,0,681.63727442672837,1.5693292703468023,4.3502627328687442,1.3388510171304404,1.0114947299623744,0.15090190152133121,1.018984285466269,0.19333254197396407,4.3732300974497536,0.31742272239271624,1.0088465598166343,0.27249519722803162,-1.7819932217410874,-128.135611300009,51.864388699990997,null,33691.25,1135100326.5625,null,21.665995198866312,-21.851473281485031,null,15.225308330139359,-99.174294393388379,null,0,0,null,0,0]
[33884,33.884,23.030202825474841,1.5273614292161541,1.0023909304017469,6.908221639145791E-2,1,0,685.53696062640938,1.5693376157230297,4.3738393253788317,1.3401240102481102,1.0116258725349032,0.15175206530123092,1.0192000755724231,0.19441102672812638,4.3756540392303789,0.31911971327055083,1.0089522546220564,0.27406483261330417,-1.8388293720086746,-128.2290090970844,51.770990902915599,null,33884,1148125456,null,21.662265021280781,-21.827725099785635,null,15.175176120536641,-99.25600258163324,null,0,0,null,0,0]
[34081.5,34.081499999999998,23.164186834565697,1.5276128178139532,1.0024188499830768,6.9483585540033255E-2,1,0,689.5327480913819,1.5693460688436833,4.3980041956197997,1.3414142149480985,1.0117610051280035,0.1526229506848282,1.0194224125775015,0.19551561400472525,4.3781506542742168,0.32085657824973118,1.0090612778965469,0.27567332364130476,-1.8967561103207431,-128.32526153679277,51.674738463207234,null,34081.5,1161548642.25,null,21.6584806803953,-21.804184200798385,null,15.12409360665082,-99.339569076449294,null,0,0,null,0,0]
[34279,34.279000000000003,23.298172290708536,1.5278613150059943,1.0024469310422601,6.9884932266543243E-2,1,0,693.5285356050573,1.5693544245584712,4.4221763068840767,1.3426903169460609,1.0118969048771957,0.15349360280536881,1.019645992849852,0.19661971821685403,4.3806603438887439,0.32259146725463383,1.009171035473537,0.27728199200144632,-1.9543732870150841,-128.42206329816884,51.577936701831163,null,34279,1175049841,null,21.654733590324206,-21.781432381184185,null,15.073296325500326,-99.42298135099135,null,0,0,null,0,0]
[34476.5,34.476500000000001,23.432159169080553,1.5281069703611589,1.0024751735657262,7.0286256443580344E-2,1,0,697.52432316659872,1.5693626845413686,4.4463555410766418,1.3439525421226763,1.0120335714734296,0.15436402043712044,1.0198708155718124,0.19772333699119182,4.3831830856173779,0.3243243733850048,1.0092815290701702,0.27889083828286743,-2.0116851081378146,-128.51940408665422,51.48059591334578,null,34476.5,1188629052.25,null,21.651022800288878,-21.759456724615863,null,15.022780949753855,-99.506242286402156,null,0,0,null,0,0]
[34674,34.673999999999999,23.566147445423219,1.5283498323223987,1.0025035775398292,7.0687557943780427E-2,1,0,701.52011077518819,1.5693708504282122,4.470541782622945,1.3452011116494798,1.0121710046060788,0.15523420235643218,1.0200968799218986,0.19882646796123427,4.3857188569385475,0.32605528980363296,1.0093927604125348,0.28049986306727426,-2.0686956974883826,-128.61727381372057,51.382726186279427,null,34674,1202286276,null,21.647347385333635,-21.738244582514422,null,14.972544208401917,-99.58935469888516,null,0,0,null,0,0]
[34875.75,34.875749999999996,23.703020432553519,1.5285950854526984,1.0025327594238198,7.1097471499419806E-2,1,0,705.60188373449375,1.5693790965439449,4.4952556051359078,1.3464626747349742,1.0123121862924249,0.15612286506368714,1.0203290900830932,0.19995283107602285,4.3883226251878718,0.32782139234922869,1.0095071488749261,0.2821436973388865,-2.1266262767856765,-128.71778545154325,51.28221454845675,null,34875.75,1216317938.0625,null,21.643628468551658,-21.71735143226746,null,14.921510772028444,-99.674105117539568,null,0,0,null,0,0]
[35077.5,35.077500000000001,23.839894829028033,1.5288375224042965,1.0025621097526876,7.150736112322631E-2,1,0,709.6836567412272,1.569387247803971,4.5199765037918551,1.3477104401708879,1.01245416720005,0.15701127923020639,1.0205625941395162,0.2010786801963329,4.3909399421186164,0.32958540440680806,1.0096223108453342,0.28378771908176215,-2.1842509658809424,-128.81882839221288,51.181171607787121,null,35077.5,1230431006.25,null,21.639944593444447,-21.69722915394269,null,14.870761365189026,-99.758706293545032,null,0,0,null,0,0]
[35279.25,35.279249999999998,23.976770610710499,1.5290771913784613,1.0025916285116394,7.1917226679577118E-2,1,0,713.76542979457486,1.5693953058356283,4.5447043631188446,1.3489446292599965,1.0125969469927665,0.15789944355841881,1.0207973912032442,0.20220401282176223,4.3935707835193085,0.33134731889183472,1.0097382481924941,0.28543192889170937,-2.2415739081074686,-128.92039251589443,51.079607484105566,null,35279.25,1244625480.5625,null,21.636294852274951,-21.677865086719347,null,14.820292675057674,-99.843161030538695,null,0,0,null,0,0]
[35481,35.481000000000002,{"$f":"SQRT(1+(A397/pole1)^2)","v":24.11364775401244},{"$f":"ATAN(A397/pole1)","v":1.5293141394833241},{"$f":"SQRT(1+(A397/Zero1)^2)","v":1.0026213156857988},{"$f":"ATAN(A397/Zero1)","v":7.2327068032897637E-2},{"$f":"IF(VIN_nom>Vout, 1, SQRT(1+(A397/z_RHP)^2))","v":1},{"$f":"IF(VIN_nom>Vout, 0, -ATAN(A397/z_RHP))","v":0},{"$f":"SQRT(1+(A397/Pole2)^2)","v":717.84720289374161},{"$f":"ATAN(A397/Pole2)","v":1.5694032722292419},4.5694390701123115,1.3501654586808329,{"$f":"SQRT(1+(A397/pole4)^2)","v":1.0127405253326855},{"$f":"ATAN(A397/pole4)","v":0.15878735675305949},{"$f":"IF(VOUT_setting=1,1,SQRT(1+(A397*zterm1)^2))","v":1.0210334803822569},{"$f":"IF(VOUT_setting=1,0,ATAN(((A397*zterm1))))","v":0.20332882645943501},4.3962151251114703,{"$f":"IF(VOUT_setting=1,0,ATAN(A397*$Q$4/(1+Afbr-$Q$5*(A397)^2)))","v":0.33310712878830939},{"$f":"SQRT((1-(Z397/pterm2))^2+(A397/pterm1)^2)","v":1.0098549627948037},{"$f":"IF((ATAN((A397/pterm1)/(1-A397^2/pterm2))>0),ATAN((A397/pterm1)/(1-A397^2/pterm2)),PI()+ATAN((A397/pterm1)/(1-A397^2/pterm2)))","v":0.28707632735627908},{"$f":"20*LOG10(((E397*K397*G397*O397)/(C397*I397*S397*M397*Q397))*Adc)","v":-2.298599166041746},{"$f":"((F397+L397+H397+P397)-(D397+J397+T397+N397+R397))*radconv","v":-129.02246790610124},{"$f":"IF(V397>0,V397,V397+180)","v":50.977532093898759},null,{"$f":"IF(U397<0,A397,1000000000)","v":35481},{"$f":"A397^2","v":1258901361},null,{"$f":"20*LOG10((K397/(I397*M397))*AEA)","v":21.632678361994309},{"$f":"(L397-(J397+N397))*radconv","v":-21.659246832737633},null,{"$f":"20*LOG10((E397*G397/(C397*S397))*Acs*Am)","v":14.770101444782803},{"$f":"(F397+H397-(D397+T397))*radconv","v":-99.927472069049742},null,{"$f":"SUM((U398<0)*(U397>0))*A397","v":0},0,null,0,0]
[35687.75,{"$f":"A398/1000","v":35.687750000000001},24.253918532281588,1.5295541852151495,1.0026519133136405,7.2747041292941531E-2,1,0,722.03013522424578,1.5694113426080714,4.5947937696459284,1.3514029055988652,1.0128884901187458,0.15969701333234151,1.0212767602029313,0.20448097547926056,4.3989389825484295,0.33490836157357273,1.009975378315455,0.28876167552209586,-2.3567330141495617,-129.12759331112815,50.872406688871848,null,35687.75,1273615500.0625,null,21.629005842330496,-21.640928228387139,null,14.718950828149691,-100.01372631807457,null,0,0,null,{"$f":"SUM((V399<-183)*(V398>-183))*A398","v":0},{"$f":"IF(AK398>0,U398,0)","v":0}]
[35894.5,35.894500000000001,24.394190692036457,1.529791470325113,1.0026826877759478,7.3166988847307463E-2,1,0,726.2130676012348,1.5694193200173572,4.6201554278417749,1.3526267688110991,1.0130372927995599,0.16060640342927868,1.021521395067972,0.20563257419179137,{"$f":"IF(VOUT_setting=1,1,SQRT((1+Afbr-$Q$5*(A399)^2)^2+(A399*$Q$4)^2))","v":4.4016769657860815},0.33670736946278007,1.0100966141195404,0.29044722303191245,-2.4145626273783343,-129.23323518563865,50.766764814361352,null,35894.5,1288415130.25,null,21.625366440521944,-21.62336731797377,null,14.668084843961694,-100.09983528951444,null,0,0,null,0,0]
[36101.25,36.10125,24.534464209581724,1.530026042137058,1.0027136390564393,7.3586910550248574E-2,1,0,730.39600002390989,1.5694272060543906,4.6455239307300094,1.3538372671565666,1.0131869330059533,0.16151552565750177,1.0217673840040913,0.20678361993894454,4.404429048482994,0.33850414512900467,1.0102186722600575,0.29213297049079595,-2.472092127206396,-129.33938349013459,50.660616509865406,null,36101.25,1303300251.5625,null,21.621759281843659,-21.60655157502951,null,14.617500161968804,-100.18580173784432,null,0,0,null,0,0]
[36308,36.308,24.674739061760661,1.5302579468999029,1.0027447671387413,7.4006806256072435E-2,1,0,734.57893249149072,1.5694350022800814,4.6708991667863229,1.3550346148774204,1.013337410366892,0.16242437863322914,1.0220147260335541,0.20793411007105028,4.4071952042280511,0.34029868132070257,1.0103415548005703,0.29381891849452413,-2.5293255547857285,-129.44602838827672,50.553971611723284,null,36308,1318270864,null,21.61818351546988,-21.590468734531896,null,14.567193508262903,-100.27162835541515,null,0,0,null,0,0]
[36519.5,36.519500000000001,24.818238030926612,1.5304924670451259,1.0027767933007334,7.4436321848986714E-2,1,0,738.85796623434726,1.569442886281293,4.6968642421176039,1.3562460825840124,1.0134922107226885,0.16335383210632107,1.0222691497054908,0.20911045459874783,4.4100394454511678,0.34213212155220402,1.0104681157097593,0.29554380861141127,-2.5875716756928191,-129.55562720126349,50.444372798736509,null,36519.5,1333673880.25,null,21.614557216838431,-21.574762229166883,null,14.516015406211205,-100.35928486315979,null,0,0,null,0,0]
[36731,36.731000000000002,24.961738349394071,1.5307242907789498,1.002809004446807,7.486580992825978E-2,1,0,743.13700002260055,1.5694506794892664,4.722836135018265,1.3574442277894061,1.0136478863500862,0.16428300089173412,1.0225249872745212,0.21028621210578316,4.412898357665223,0.34396320311475764,1.0105955437369347,0.29726890982517562,-2.6455162702488821,-129.66572549428332,50.334274505716678,null,36731,1349166361,null,21.610962041642701,-21.559797533422103,null,14.465121498613488,-100.44680054928693,null,0,0,null,0,0]
[36942.5,36.942500000000003,25.105239994025414,1.5309534643143334,1.0028414005591371,7.5295270338103765E-2,1,0,747.41603385547069,1.5694583834634024,4.7488147336297537,1.3586292656690542,1.0138044368458758,0.1652118835165815,1.0227822376796341,0.21146137978314322,4.4157719123771999,0.34579191848987778,1.0107238411253552,0.29899422274313248,-2.7031634167541183,-129.776313365345,50.223686634654996,null,36942.5,1364748306.25,null,21.607397151792803,-21.545562323609118,null,14.414508455537021,-100.53417810532665,null,0,0,null,0,0]
[37154,37.154000000000003,25.248742942208825,1.531180032814746,1.0028739816197982,7.5724702922791653E-2,1,0,751.69506773219598,1.5694659997275944,4.7747999284993368,1.3598014068634117,1.0139618618048321,0.16614047851085878,1.0230408998550282,0.21263595483114903,4.4186600810224599,0.34761826024131243,1.0108530101297482,0.30071974796222167,-2.7605171141646228,-129.88738111387187,50.112618886128132,null,37154,1380419716,null,21.603861732162738,-21.532044534006481,null,14.364173003356392,-100.62142016207979,null,0,0,null,0,0]
[37370.25,37.370249999999999,25.39547009461884,1.5314090422604807,1.0029074856131346,7.6163751042812242E-2,1,0,756.07020288712704,1.5694736979070774,4.8013754237903825,1.3609867531336466,1.0141237260308567,0.16708962955442244,1.0233068297989554,0.2138362935743664,4.4216281940785391,0.34948315727932439,1.0109859836522976,0.30248424622932418,-2.8188595728164403,-130.00142955719122,49.998570442808784,null,37370.25,1396535585.0625,null,21.600276556477219,-21.518952617556437,null,14.312990745883255,-100.71048413627358,null,0,0,null,0,0]
[37586.5,37.586500000000001,25.542198563600632,1.5316354206049736,1.0029411829172408,7.6602769744751567E-2,1,0,760.44533808634867,1.569481307505372,{"$f":"SQRT(1+(A407/Zero2)^2)","v":4.8279575909598158},{"$f":"ATAN(A407/Zero2)","v":1.362159048281379},1.0142865035763997,0.16803847680397158,1.0235742333694178,0.21503600688059377,4.4246115242379052,0.35134555741979107,1.0111198731848463,0.30424896766933895,-2.8769034632519452,-130.11595978791522,49.884040212084784,null,37586.5,1412744982.25,null,21.596720536486117,-21.506585993901407,null,14.262091941166084,-100.79941183186844,null,0,0,null,0,0]
[37802.75,37.802750000000003,25.688928326594457,1.5318592129097139,1.002975073512633,7.7041758862352663E-2,1,0,764.82047332910099,1.5694888300426564,4.854546320407497,1.3633185035037965,1.0144501940018105,0.16898701869764321,1.0238431094117857,0.21623509178771394,4.4276100407432457,0.35320545298011852,1.0112546811744851,0.30601391288635971,-2.9346528155617504,-130.23096205845562,49.769037941544383,null,37802.75,1429047907.5625,null,21.593192870658719,-21.494932559945529,null,14.211473264459906,-100.88820587483541,null,0,0,null,0,0]
[38019,38.018999999999998,25.835659361552871,1.5320804632135525,1.003009157379718,7.7480718229426579E-2,1,0,769.19560861464095,1.569496267004522,4.8811415048945941,1.3644653255350063,1.014614796865257,0.16993525367677717,1.0241134567662882,0.21743354534394027,4.4306237127641594,0.35506283636713243,1.0113904100807192,0.30777908247291741,-2.9921115816031438,-130.34642682041388,49.653573179586118,null,38019,1445444361,null,21.589692779480263,-21.483980466510417,null,14.161131447179923,-100.97686883188619,null,0,0,null,0,0]
[38240.5,38.240499999999997,25.985953948992442,1.5323044945722857,1.0030442690626837,7.7930303397197018E-2,1,0,773.67696110100201,1.5695037973171988,4.9083889351710717,1.3656271040086783,1.0147843413379805,0.17090618958229289,1.0243918915748116,0.21866043670206092,4.4337262286684931,0.3569627000596417,1.0115303914472977,0.30958733910096703,-3.0506680963202926,-130.46516446821994,49.534835531780061,null,38240.5,1462335840.25,null,21.586135509657961,-21.473477447926427,null,14.109851123506038,-101.06755102374268,null,0,{"$f":"IF(AH410>0,W410,0)","v":0},null,0,0]
[38462,38.462000000000003,26.136249825668461,1.5325259493681356,1.0030795834735835,7.8379856999646141E-2,1,0,778.15831363072959,1.569511240896919,4.9356429172911911,1.3667760536378031,1.0149548421445427,0.17187680019030654,1.0246718675225774,0.21988665944645619,4.4368445791899633,0.35885991228072323,1.0116713442514667,0.3113958323460102,-3.1089278938085805,-130.58436767722702,49.415632322772979,null,38462,1479325444,null,21.582605581887208,-21.463685860385507,null,14.058854498801887,-101.15810095513494,null,0,0,null,0,0]
[38683.5,38.683500000000002,26.286546969466933,1.5327448717748084,1.0031151005910064,7.8829378858409169E-2,1,0,782.63966620307883,1.5695185992335663,4.9629033433158192,1.3679123827640096,1.0151262988030654,0.17284708383639666,1.0249533833466546,0.22111221043900653,4.4399787309678338,0.3607544651615287,1.0118132711765526,0.31320456280669423,-3.1668949782922855,-130.70402680477446,49.295973195225542,null,38683.5,1496413172.25,null,21.579102225777021,-21.454593756791351,null,14.008138235660901,-101.24852120154941,null,0,0,null,0,0]
[38905,38.905000000000001,26.436845358776548,1.5329613049624506,1.0031508203934216,7.9278868795197827E-2,1,0,787.12101881732156,1.5695258737830953,4.9901701076391909,1.3690362953073223,1.0152987108292955,0.17381703885972549,1.0252364377785566,0.2223370865531013,4.4431286505666945,0.36264635093101338,1.0119561749194081,0.31501353106869251,-3.2245732762952195,-130.82413240649896,49.175867593501039,null,38905,1513599025,null,21.575624692188079,-21.446189441648244,null,13.957699053087076,-101.33881428022508,null,0,0,null,0,0]
[39131.5,39.131500000000003,26.590537754247755,1.5331800935939026,1.0031875560889152,7.9738472035024141E-2,1,0,791.7035306753703,1.5695332273805864,5.0180588214212376,1.3701729461160237,1.0154760022277387,0.17480854746998903,1.0255274714707561,0.22358891109355411,4.4463659452699247,0.36457817683186355,1.0121033174460985,0.31686358033911982,-3.2832589407847825,-130.94740126373634,49.052598736263661,null,39131.5,1531274292.25,null,21.572094603441975,-21.438294736339959,null,13.906404460944938,-101.43101663471222,null,0,0,null,0,0]
[39358,39.357999999999997,26.744231407937672,1.5333963675681541,1.0032245036773253,8.0198041518619145E-2,1,0,796.28604257573795,1.5695404963402813,5.0459539467406165,1.3712970310604005,1.015654291580701,0.17579970895279487,1.0258201113174887,0.22484002336756476,4.4496196567483999,0.36650719772813095,1.0122514871351824,0.31871387946484914,-3.3416506978633138,-131.07111761907535,48.928882380924648,null,39358,1549052164,null,21.568589996902809,-21.431095263697419,null,13.855392835900666,-101.52309115969859,null,0,0,null,0,0]
[39584.5,39.584499999999998,26.897926298278087,1.5336101699710905,1.0032616631352416,8.0657577055597188E-2,1,0,800.86855451769816,1.5695476821150534,5.0738553778489628,1.3724087545773538,1.0158335783627281,0.17679052154399513,1.0261143559445667,0.22609042006952715,4.452889749018194,0.36843340562665278,1.0124006869139446,0.32056442902962484,-3.3997525065440461,-131.19527198572638,48.804728014273621,null,39584.5,1566932640.25,null,21.565110136109283,-21.42457929251427,null,13.804660844530691,-101.61504036817797,null,0,0,null,0,0]
[39811,39.811,27.051622404190745,1.5338215429103281,1.0032990344391228,8.1117078455658034E-2,1,0,805.45106650054095,1.5695547861247121,5.1017630112876091,1.3735083167542914,1.0160138620457984,0.17778098348342372,1.0264102039718452,0.22734009790656579,4.456176186020115,0.37035679264039095,1.0125509197243014,0.32241522960273311,-3.457568249169972,-131.31985507290801,48.680144927091987,null,39811,1584915721,null,21.561654304972148,-21.418735339125515,null,13.754205209694772,-101.70686671626015,null,0,0,null,0,0]
[40042.75,40.042749999999998,27.208882239300756,1.5340353435603664,1.0033374912089665,8.1587195019055953E-2,1,0,810.13979569014032,1.5695619716141505,5.1303238244692313,1.3746209822912685,1.0161993557656097,0.17879403838070443,1.0267145675362546,0.2286179943133177,4.4595556784257999,0.37232183363730437,1.0127057070616998,0.32430918990829022,-3.5164319739053496,-131.4477600989712,48.552239901028798,null,40042.75,1603421827.5625,null,21.558142517141757,-21.413439768088825,null,13.702862752122387,-101.80069682838355,null,0,0,null,0,0]
[40274.5,40.274500000000003,27.366143303853978,1.5342466869853195,1.0033761697089842,8.2057275441899877E-2,1,0,814.82852492108702,1.5695690744093451,5.1588909187870016,1.3757213265210746,1.0163858920094331,0.17980672246714602,1.0270206067499292,0.22989513121053698,4.4629522054379667,0.37428390509845016,1.0128615821524489,0.32620341415232157,-3.5750042030514395,-131.5760948794659,48.423905120534101,null,40274.5,1622035350.25,null,21.554654431620364,-21.408824172024648,null,13.651802844624207,-101.89440334514197,null,0,0,null,0,0]
[40506.25,40.506250000000001,27.523405576776319,1.5344556152861646,1.0034150699135351,8.2527319520628556E-2,1,0,819.51725419267109,1.5695760959296592,5.1874641904712533,1.376809550359362,1.0165734702033742,0.18081903387037468,1.0273283201153505,0.23117150511264073,4.4663657281972213,0.37624299891902341,1.0130185481951084,0.32809790289717911,-3.6332888584187422,-131.70485006824754,48.295149931752462,null,40506.25,1640756289.0625,null,21.551189343375391,-21.404877013358476,null,13.601022151640468,-101.98798872262725,null,0,0,null,0,0]
[40738,40.738,27.680669037472445,1.5346621696079723,1.0034541917968354,8.2997327051776482E-2,1,0,824.20598350419891,1.5695830375621571,5.2160435380039116,1.3778858504346772,1.0167620897707581,0.18183097072244972,1.0276377061286068,0.23244711254815356,4.469796207768729,0.37819910710948879,1.0131766084040914,0.32999265668906913,-3.6912897859697322,-131.83401651330428,48.165983486695723,null,40738,1659584644,null,21.547746566945612,-21.401586998552258,null,13.550517393901151,-102.08145536123139,null,0,0,null,0,0]
[40975.25,40.975250000000003,27.841665957961208,1.5348712087989593,1.0034944717446534,8.3478450951462474E-2,1,0,829.00598798568842,1.5695900625977681,5.2453073342146865,1.3789755430888664,1.0169562638796814,0.18286653340008191,1.0279561657223442,0.23375219572200626,4.4733256255947502,0.3801985376031729,1.0133395565703454,0.33193265277936518,-3.7503772485801283,-131.96666505285532,48.033334947144681,null,40975.25,1678971112.5625,null,21.544244501510946,-21.398888084238749,null,13.499096503361866,-102.17701964410793,null,0,0,null,0,0]
[41212.5,41.212499999999999,28.002664081068499,1.5350778443049189,1.0035349839629009,8.3959536117027972E-2,1,0,833.80599250761918,1.569597006750769,5.2745772897451211,1.3800531430537997,1.0171515281453301,0.18390169959009264,1.0282763750880617,0.23505646829998642,4.4768727318250701,0.38219482249603237,1.0135036583219685,0.33387292775272032,-3.8091752781039148,-132.0997257923523,47.900274207647698,null,41212.5,1698470156.25,null,21.540764425807261,-21.396854678683798,null,13.44795802092756,-102.27246440410089,null,0,0,null,0,0]
[41449.75,41.449750000000002,28.163663386169944,1.5352821173304898,1.0035757284234488,8.4440582330489816E-2,1,0,838.60599706929679,1.569603871410024,5.3038533026223655,1.3811188480522016,1.0173478819399873,0.18493646730291841,1.028598332591613,0.2363599266037392,4.4804374844523576,0.38418795358961105,1.0136689171590285,0.33581348214208417,-3.8676877661520663,-132.23318951359443,47.766810486405575,null,41449.75,1718081775.0625,null,21.537305664085153,-21.395475418792223,null,13.397098603399968,-102.36779204508741,null,0,0,null,0,0]
[41687,41.686999999999998,28.324663853109932,1.5354840681442627,1.0036167050980116,8.4921589373972303E-2,1,0,843.40600167004266,1.5696106579327807,5.3331352730917985,1.3821728515737819,1.0175453246329202,0.18597083455394042,1.0289220365919816,0.23766256697056873,4.4840198413942165,0.38617792281074736,1.0138353365987955,0.33775431646234255,-3.925918529128392,-132.36704719099561,47.632952809004394,null,41687,1737805969,null,21.533867559433233,-21.394739182474545,null,13.346514963996386,-102.46300491627198,null,0,0,null,0,0]
[41929.75,41.929749999999999,28.489397862723198,1.5356883381023207,1.0036588720276483,8.541370649595062E-2,1,0,848.3172814435336,1.569617522291592,5.3631021314773779,1.3832393752903733,1.0177484708956157,0.1870287642542641,1.0292550507736928,0.2389945551304021,4.4877034228365824,0.38821074312886727,1.0140068189828386,0.3397404340388272,-3.9852115213889805,-132.5044065410091,47.495593458990896,null,41929.75,1758103935.0625,null,21.530370466490222,-21.394640080402176,null,13.295040751211918,-102.56030864349505,null,0,0,null,0,0]
[42172.5,42.172499999999999,28.654133047422778,1.5358902593360495,1.003701282002192,8.5905782149668625E-2,1,0,853.22856125653652,1.569624307626357,5.393075022447845,1.3842940454377441,1.0179527557825401,0.18808627052268265,1.029589889868785,0.24032567928293358,4.4914053449054556,0.39024023657693885,1.0141795239089406,0.34172684570783213,-4.0442174255174512,-132.64215980449038,47.357840195509624,null,42172.5,1778519756.25,null,21.526893665875093,-21.395191349213647,null,13.243848464861177,-102.65749702494315,null,0,0,null,0,0]
[42415.25,42.41525,28.818869387057493,1.5360898721066436,1.0037439349908357,8.6397816102096972E-2,1,0,858.13984110837316,1.5696310152938788,5.4230538459780036,1.3853370562307328,1.0181581786083274,0.1891433512495253,1.0299265520973668,0.24165593555594878,4.4951255622921202,0.39226639491216014,1.0143534552002635,0.34371355196162812,-4.1029400972202881,-132.78029790854978,47.219702091450216,null,42415.25,1799053432.5625,null,21.523436511253795,-21.396381818082251,null,13.192934759424759,-102.75457240896951,null,0,0,null,0,0]
[42658,42.658000000000001,28.98360686193417,1.5362872157606944,1.003786830962601,8.6889808120326512E-2,1,0,863.05112099838038,1.569637646620077,5.453038504222687,1.3863685977152003,1.0183647386843484,0.19020000433062295,1.0302650356721896,0.24298532009456719,4.4988640296141762,0.39428921002742462,1.0145286166985796,0.34570055327232557,-4.1613833177829367,-132.91881197092468,47.081188029075321,null,42658,1819704964,null,21.519998374381153,-21.398200553591799,null,13.142296345801054,-102.85153709036237,null,0,0,null,0,0]
[42906.5,42.906500000000001,29.152247616118494,1.5364869236467085,1.0038309946598964,8.739341023554853E-2,1,0,868.07873402454061,1.5696443572995304,5.4837393504287553,1.3874128873496643,1.0185773687863791,0.19128124111839825,1.0306134215773746,0.24434528670112102,4.5027099057436795,0.39635646813850151,1.0147092055254969,0.34773492662027117,-4.220925291174682,-133.06098734878105,46.939012651218945,null,42906.5,1840967742.25,null,21.516497859920417,-21.400701963154763,null,13.090740238471277,-102.95068624051484,null,0,0,null,0,0]
[43155,43.155000000000001,29.320889519614362,1.5366843342624645,1.0038754129214429,8.7896967912919954E-2,1,0,873.10634708934288,1.5696509906946996,5.514446110284581,1.3884455480103151,1.0187911891818335,0.19236202531672195,1.030963712321231,0.24570433166757699,4.5065748101482264,0.39842020601373374,1.014891091735965,0.34976961010473462,-4.2801822059870833,-133.2035384613844,46.796461538615603,null,43155,1862354025,null,21.513015998071332,-21.403839304309287,null,13.039465819535303,-103.04972408239183,null,0,0,null,0,0]
[43403.5,43.403500000000001,29.489532552704055,1.5368794870049312,1.0039200857134503,8.8400480902981665E-2,1,0,878.13396019212371,1.5696575481330197,5.5451586855482349,1.3894667707019281,1.0190061991214254,0.1934423546863796,1.0313159059627992,0.24706245091529866,4.5104586939176521,0.40048041539513907,1.015074279511464,0.35180460416593412,-4.3391578883208464,-133.34645637006278,46.653543629937218,null,43403.5,1883863812.25,null,21.509552170019312,-21.40760158104673,null,12.988469736081383,-103.148652912789,null,0,0,null,0,0]
[43652,43.652000000000001,29.658176696118204,1.5370724203756883,1.003965013001942,8.8903948956409476E-2,1,0,883.16157333223418,1.5696640309116991,5.5758769801239056,1.3904767423168196,1.0192223978523347,0.19452222699428776,1.0316700005532342,0.2484196403848635,4.5143615080703494,0.40253708817175649,1.0152587730536311,0.35383990922155073,-4.397856090479273,-133.48973232511233,46.510267674887672,null,43652,1905497104,null,21.506105774349681,-21.411978031604477,null,12.937748691727043,-103.24747497590093,null,0,0,null,0,0]
[43906,43.905999999999999,29.830554533940376,1.5372673694769206,1.0040111976293078,8.9418513467027422E-2,1,0,888.30046165018518,1.5696705813355736,5.6072809692037975,1.3914976304460875,1.0194446094277982,0.19562552523040438,1.0320338947346341,0.2498059031733996,4.5183702148434239,0.40463561769482398,1.0154487037859843,0.35592058307684116,-4.4575705188596046,-133.63654048243609,46.363459517563911,null,43906,1927736836,null,21.502600507204175,-21.417075094563987,null,12.886185912420673,-103.34837619244244,null,0,0,null,0,0]
[44160,44.16,30.002933492450065,1.5374600784629173,1.0040576480708832,8.9933030503555389E-2,1,0,893.43935000581314,1.5696770564059352,5.6386907371642527,1.3925071461054304,1.0196680613977969,0.19672834125076705,1.0323997708005386,0.2511911860566568,4.5223985955391983,0.4067304356628838,1.0156400076658259,0.35800158265519411,-4.5170027475730503,-133.78370480939657,46.216295190603432,null,44160,1950105600,null,21.4991122352749,-21.422791805687773,null,12.834903692899982,-103.44917044245696,null,0,0,null,0,0]
[44414,44.414000000000001,30.175313552441224,1.5376505857100138,1.0041043642897785,9.0447499800187015E-2,1,0,898.57823839847129,1.5696834574156031,5.6701061879682904,1.3935054762488008,1.019892752947043,0.19783067269071555,1.0327676266445951,0.25257548476217734,4.5264465976352009,0.40882153388711906,1.0158326892448126,0.36008290832899797,-4.5761565564497717,-133.93121654388614,46.068783456113863,null,44414,1972603396,null,21.495640369077623,-21.429117391891403,null,12.78389868793645,-103.54985996131244,null,0,0,null,0,0]
[44668,44.667999999999999,30.347694695144035,1.537838928723251,1.0041513462488991,9.0961921091266315E-2,1,0,903.71712682752809,1.569689785627991,5.7015272276783975,1.3944928037992557,1.0201186832564471,0.19893251719237776,1.033137460152062,0.2539587950386597,4.5305141685413126,0.41090890433678401,1.0160267530962812,0.36216456044560902,-4.6350356525724452,-134.07906710993532,45.920932890064677,null,44668,1995230224,null,21.492184335761436,-21.436041309747889,null,12.733167608599992,-103.65044693301242,null,0,0,null,0,0]
[44928.25,44.928249999999998,30.524318603642573,1.5380296997203018,1.004199759850158,9.1488950316968964E-2,1,0,908.98246431999814,1.5696961953391562,5.7337271236914935,1.3954932009614462,1.0203514568712497,0.20006096649270505,1.0335184429298623,0.255375113827705,4.5347020692595041,0.41304376252283415,1.0162270306559562,0.36429777324430052,-4.6950824118898407,-134.23089839428158,45.769101605718419,null,44928.25,2018547648.0625,null,21.4886591022,-21.443745406227219,null,12.68146896273608,-103.75340484597007,null,0,0,null,0,0]
[45188.5,45.188499999999998,30.700943610248117,1.5382182756822618,1.0042484523508073,9.2015928581419618E-2,1,0,914.24780184938288,1.5697025312206823,5.7659326938927631,1.3964824236840123,1.0205855292057209,0.20118889960679101,1.033901497372864,0.25679038597836473,4.5389104016828625,0.4151746906607181,1.0164287691401641,0.36643132940580819,-4.7548484257471841,-134.38306774108466,45.616932258915341,null,45188.5,2042000532.25,null,21.485149323927114,-21.452055945516349,null,12.630051074177924,-103.85625958578589,null,0,0,null,0,0]
[45448.75,45.448749999999997,30.877569696116595,1.5384046942637672,1.0042974237102809,9.2542855599361956E-2,1,0,919.51313941504827,1.5697087945408634,5.7981438437310153,1.397460656250878,1.0208208993664785,0.20231631402072081,1.0342866211793047,0.25820460698712044,4.543139109038747,0.41730168062428974,1.0166319735384894,0.36856522922128832,-4.8143374558055925,-134.53556650320101,45.464433496798989,null,45448.75,2065588876.5625,null,21.481654435610224,-21.460962297555394,null,12.578910580862917,-103.95901334293764,null,0,0,null,0,0]
[45709,45.709000000000003,31.054196842832528,1.5385889922633873,1.0043466738877873,9.3069731085708957E-2,1,0,924.77847701637484,1.56971498653911,5.8303604807283422,1.3984280789579975,1.0210575664560133,0.20344320722816556,1.0346738120384245,0.25961777237395928,4.5473881344913369,0.41942472445871415,1.0168366488640381,0.37069947295383437,-4.8735531913093304,-134.68838621856275,45.311613781437245,null,45709,2089312681,null,21.478173887968737,-21.470454059557991,null,12.528044177340135,-104.06166825723642,null,0,0,null,0,0]
[45975.25,45.975250000000003,31.234897164198813,1.5387753822297427,1.0043973480075543,9.360869993285871E-2,1,0,930.16520572259196,1.5697212487480294,5.8633254484543293,1.3994068027399917,1.0213010310311019,0.20459553870741698,1.0350720661540325,0.26106242088745041,4.5517560869927802,0.42159262278881393,1.017047570367257,0.37288327729948534,-4.9338550859017802,-134.84505265772557,45.154947342274426,null,45975.25,2113723612.5625,null,21.474627381065545,-21.480759846055101,null,12.476285313688271,-104.16658974782949,null,0,0,null,0,0]
[46241.5,46.241500000000002,31.415598558220218,1.5389596279856601,1.0044483138626255,9.414761424182605E-2,1,0,935.55193446486567,1.5697274388437512,5.8962959698569035,1.4003745819133913,1.0215458511115099,0.20574731938806484,1.0354724788103911,0.26250595513321323,4.5561451847127907,0.42375637464025312,1.0172600420930364,0.37506744206949072,-4.9938785265312884,-135.00203767505695,44.997962324943046,null,46241.5,2138276322.25,null,21.471094769857004,-21.491657022216565,null,12.424806500604607,-104.27141215981595,null,0,0,null,0,0]
[46507.75,46.507750000000001,31.596301006492975,1.5391417663073927,1.0044995714085947,9.468647370790402E-2,1,0,940.93866324257669,1.569733558064786,5.9292719522901471,1.4013315972572551,1.0217920257229052,0.20689854661122237,1.035875047504379,0.26394837039084623,4.5605553666064447,0.42591597204681753,1.0174740694850621,0.37725196745360923,-5.0536272398845803,-135.15933278078174,44.840667219218261,null,46507.75,2162970810.0625,null,21.467575515000199,-21.503135148783713,null,12.373604374418301,-104.37613762865074,null,0,0,null,0,0]
[46774,46.774000000000001,31.777004491031839,1.5393218331352312,1.0045511206008115,9.5225278026575072E-2,1,0,946.32539205512012,1.5697396076214445,5.9622533051425881,1.4022780256304503,1.0220395538865061,0.20804921772642551,1.0362797697232966,0.2653896619658882,4.5649865715720406,0.42807140722650189,1.017689658012358,0.37943685361034263,-5.1131048809928448,-135.31692966797132,44.683070332028677,null,46774,2187807076,null,21.464069092545888,-21.515184009975172,null,12.322675628037526,-104.48076824008986,null,0,0,null,0,0]
[47046.25,47.046250000000001,31.961781220018079,1.5395038523573454,1.0046041329969571,9.5776167071797466E-2,1,0,951.83351197489765,1.5697457227014489,5.9959833607398139,1.4032350146974419,1.0222940587749818,0.20922524165866957,1.0366958366821273,0.26686226653594181,4.5695393100133659,0.43027110369915833,1.0179117248992939,0.38167134982981421,-5.1736462939429817,-135.47838162577378,44.521618374226222,null,47046.25,2213349639.0625,null,21.460496391288991,-21.528084151610727,null,12.270878494349141,-104.58766075887183,null,0,0,null,0,0]
[47318.5,47.3185,32.146558995756685,1.5396837790996949,1.0046574502368708,9.6326997812731588E-2,1,0,957.34163192985886,1.5697517674145269,6.0297188461878193,1.4041812961665825,1.0225499768242088,0.21040067855861161,1.0371141499758056,0.26833368636364074,4.574113900340298,0.43246643236668014,1.0181354357213748,0.38390622349990788,-5.2339117873670702,-135.64013211813568,44.359867881864318,null,47318.5,2239040442.25,null,21.456936046427217,-21.541560127211302,null,12.219360382660376,-104.69445835431171,null,0,0,null,0,0]
[47590.75,47.59075,32.33133780030068,1.5398616492271053,1.0047110722720209,9.6877769924426205E-2,1,0,962.84975191939964,1.5697577429683103,6.0634596708558446,1.405117047079889,1.0228073069734205,0.21157552562003293,1.0375347068872993,0.26980391651437341,4.5787102770625054,0.43465738550053512,1.0183607964072128,0.38614147468786852,-5.2939050480879137,-135.80217282699891,44.197827173001087,null,47590.75,2264879485.5625,null,21.453387544508637,-21.555601701424191,null,12.168117932524204,-104.80116310378386,null,0,0,null,0,0]
[47863,47.863,32.516117616110947,1.5400374977896925,1.0047649990536087,9.7428483082141581E-2,1,0,968.35787194293016,1.5697636505429544,6.0972057461050788,1.4060424406345973,1.0230660481570666,0.21274978004604356,1.0379575046894187,0.27127295208207691,4.5833283746410993,0.43684395556950234,1.0185878129126276,0.38837710342621229,-5.3536296921602826,-135.96449561454315,44.035504385456846,null,47863,2290866769,null,21.449850386812347,-21.570198858146721,null,12.117147839927021,-104.9077770359812,null,0,0,null,0,0]
[48141.75,48.141750000000002,32.705310101103571,1.540215485990976,1.0048205290391321,9.7992283158712834E-2,1,0,973.99749899888172,1.5697696299330337,6.1317628623557336,1.4069793737780347,1.0233324276678775,0.2139514529920036,1.0383927157604695,0.27277581824429858,4.5880791662658549,0.43907818130746773,1.0188219713023623,0.390666499233704,-5.4145056598002883,-136.13097782416347,43.869022175836534,null,48141.75,2317628093.0625,null,21.446240026924997,-21.585709925333724,null,12.065239626950621,-105.01684436137003,null,0,0,null,0,0]
[48420.5,48.420499999999997,32.894503610275628,1.5403914267911498,1.0048763783921257,9.8556020744327413E-2,1,0,979.63712608925596,1.5697755404781719,6.1663253010017129,1.4079058046502952,1.0236002841186431,0.21515249876227754,1.0388302701840653,0.27427742178378645,4.5928525891108363,0.44130779684017724,1.0190578782444109,0.39295629079175487,-5.4751074835009579,-136.29773903606568,43.702260963934322,null,48420.5,2344544820.25,null,21.442640546555978,-21.601782849290707,null,12.013610097677461,-105.12582063462105,null,0,0,null,0,0]
[48699.25,48.699249999999999,33.083698126056419,1.540565355304417,1.0049325470593433,9.911969549112247E-2,1,0,985.27675321346146,1.5697813833605534,6.200892973045371,1.408821907286439,1.0238696163502088,0.21635291438541707,1.0392701650004048,0.27577775752793304,4.5976485726936458,0.4435327947199077,1.0192955402192609,0.39524647802120394,-5.5354388253535625,-136.46477107319458,43.535228926805416,null,48699.25,2371616950.5625,null,21.439051455319035,-21.618407556025971,null,11.962255881401019,-105.23470788302541,null,0,0,null,0,0]
[48978,48.978000000000002,33.272893631274755,1.5407373058468119,1.0049890349872452,9.9683307051472464E-2,1,0,990.91638037092082,1.56978715973545,6.2354657914492435,1.4097278519319676,1.0241404231982552,0.21755269690035545,1.0397123972388784,0.27727682033569218,4.6024670464932553,0.44575316771097995,1.0195349637367306,0.3975370608041216,-5.5955032771850997,-136.63206593704805,43.367934062951946,null,48978,2398844484,null,21.435472276997004,-21.635574187726345,null,11.911173663998554,-105.34350808590762,null,0,0,null,0,0]
[49263.25,49.263249999999999,33.466501877054505,1.5409112532929781,1.0050471705807194,0.10025999534738483,1,0,996.68751456319819,1.5697930031320988,6.2708500311271846,1.4106445794368487,1.0244190702006017,0.21877979790341315,1.0401673583237452,0.27880951573094936,4.6074210886967588,0.44802052097454242,1.0197818006824384,0.39988146561237092,-5.6566957127768438,-136.80352577602309,43.196474223976907,null,49263.25,2426867800.5625,null,21.431819417898925,-21.653692081231274,null,11.859178478853325,-105.45475723608963,null,0,0,null,0,0]
[49548.5,49.548499999999997,33.660111123805187,1.5410831996912464,1.0051056403833876,0.10083661673990721,1,0,1002.4586487891161,1.5697987792481145,6.3062394816186194,1.4115510186857163,1.0246992589092057,0.22000622968747863,1.0406247607831884,0.28034086734067554,4.6123985326903991,0.45028301648864194,1.0200304961675584,0.4022262842616689,-5.7176160587947287,-136.97524444805191,43.02475555194809,null,49548.5,2455053852.25,null,21.428175973876282,-21.672357250064803,null,11.807461279726194,-105.56591927929975,null,0,0,null,0,0]
[49833.75,49.833750000000002,33.853721354353155,1.5412531793634818,1.0051644443369279,0.10141317085730411,1,0,1008.2297830480964,1.569804489238845,6.341634055686808,1.4124473404420306,1.0249809880597447,0.22123198911344599,1.0410846013993411,0.28187086975865022,4.6173993028020641,0.45254064718092957,1.0202810572624299,0.40457151649858519,-5.7782679470116918,-137.14721393326226,42.852786066737735,null,49833.75,2483402639.0625,null,21.424541477731012,-21.691559796540414,null,11.756018690988823,-105.67699618881439,null,0,0,null,0,0]
[50119,50.119,34.047332551915318,1.5414212258513198,1.0052235823826985,0.10198965732810573,1,0,1014.0009173395749,1.5698101342333359,6.3770336680192896,1.4133337117433991,1.0252642563823398,0.22245707305373189,1.0415468769428811,0.28339951761344145,4.6224233233332566,0.45479340620597647,1.0205334910688977,0.40691716202652661,-5.8386549395861937,-137.31942638822693,42.68057361177307,null,50119,2511914161,null,21.420915475861694,-21.711290035600371,null,11.704847393622382,-105.78798989071777,null,0,0,null,0,0]
[50410.75,50.41075,34.245356556659061,1.5415911360214472,1.0052844135457939,0.10257920984953316,1,0,1019.9035586681085,1.5698158417757728,6.4132450571657058,1.4142301579657324,1.0255555704004038,0.2237093710199172,1.0420222017814806,0.28496159203442389,4.6275857986096209,0.45709245256916975,1.0207936217349969,0.4093166850172405,-5.9001475953012292,-137.49580639606299,42.504193603937011,null,50410.75,2541243715.5625,null,21.417215175999381,-21.732005856772158,null,11.652787287701569,-105.90142869542548,null,0,0,null,0,0]
[50702.5,50.702500000000001,34.443381538679979,1.5417590924707623,1.0053455940754255,0.10316869082112749,1,0,1025.8062000294842,1.5698214836341147,6.4494615422216954,1.4151165370358085,1.0258484918312758,0.2249609557840532,1.0425000669117521,0.28652223820141831,4.6327724357468449,0.45938638894916611,1.0210557265600007,0.41171663958243326,-5.9613704675724355,-137.67242452174426,42.327575478255739,null,50702.5,2570743506.25,null,21.413522843753906,-21.753253856391815,null,11.601004130552298,-106.01478438707584,null,0,0,null,0,0]
[50994.25,50.994250000000001,34.641407481218486,1.5419251286947606,1.0054071239078144,0.10375809984631318,1,0,1031.7088414231382,1.5698270609357421,6.4856830378195669,1.4159930162193053,1.0261430192984062,0.22621182403746881,1.0429804688420188,0.28808145048055755,4.6379831536928542,0.4616752087489403,1.021319813243563,0.41411702526361166,-6.0223271528303375,-137.84927291709269,42.150727082907309,null,50994.25,2600413533.0625,null,21.409838035099845,-21.775024325863193,null,11.549494546598728,-106.12805888127177,null,0,0,null,0,0]
[51286,51.286000000000001,{"$f":"SQRT(1+(A461/pole1)^2)","v":34.839434367895954},{"$f":"ATAN(A461/pole1)","v":1.542089277427815},{"$f":"SQRT(1+(A461/Zero1)^2)","v":1.0054690029788338},{"$f":"ATAN(A461/Zero1)","v":0.10434743652881136},{"$f":"IF(VIN_nom>Vout, 1, SQRT(1+(A461/z_RHP)^2))","v":1},{"$f":"IF(VIN_nom>Vout, 0, -ATAN(A461/z_RHP))","v":0},{"$f":"SQRT(1+(A461/Pole2)^2)","v":1037.6114828485197},{"$f":"ATAN(A461/Pole2)","v":1.5698325747823825},6.5219094604764134,1.4168597591271588,{"$f":"SQRT(1+(A461/pole4)^2)","v":1.0264391514192817},{"$f":"ATAN(A461/pole4)","v":0.22746197248424879},{"$f":"IF(VOUT_setting=1,1,SQRT(1+(A461*zterm1)^2))","v":1.0434634040685153},{"$f":"IF(VOUT_setting=1,0,ATAN(((A461*zterm1))))","v":0.28963922327620983},4.6432178713839516,{"$f":"IF(VOUT_setting=1,0,ATAN(A461*$Q$4/(1+Afbr-$Q$5*(A461)^2)))","v":0.46395890561328912},{"$f":"SQRT((1-(Z461/pterm2))^2+(A461/pterm1)^2)","v":1.0215858895190619},{"$f":"IF((ATAN((A461/pterm1)/(1-A461^2/pterm2))>0),ATAN((A461/pterm1)/(1-A461^2/pterm2)),PI()+ATAN((A461/pterm1)/(1-A461^2/pterm2)))","v":0.41651784155435534},{"$f":"20*LOG10(((E461*K461*G461*O461)/(C461*I461*S461*M461*Q461))*Adc)","v":-6.0830211786733575},{"$f":"((F461+L461+H461+P461)-(D461+J461+T461+N461+R461))*radconv","v":-138.02634390788504},{"$f":"IF(V461>0,V461,V461+180)","v":41.973656092114965},null,{"$f":"IF(U461<0,A461,1000000000)","v":51286},{"$f":"A461^2","v":2630253796},null,{"$f":"20*LOG10((K461/(I461*M461))*AEA)","v":21.406160319030874},{"$f":"(L461-(J461+N461))*radconv","v":-21.797307765252455},null,{"$f":"20*LOG10((E461*G461/(C461*S461))*Acs*Am)","v":11.498255216784104},{"$f":"(F461+H461-(D461+T461))*radconv","v":-106.24125404724403},null,{"$f":"SUM((U462<0)*(U461>0))*A461","v":0},0,null,0,0]
[51584.75,{"$f":"A462/1000","v":51.58475},35.042213504013304,1.5422554420567673,1.0055327285641682,0.10495083787094907,1,0,1043.6557472367324,1.5698381562912005,6.5590100894617915,1.4177373756049574,1.0267440500973144,0.22874136657493807,1.0439605479553593,0.2912328744309276,4.6486029721277262,0.46629208037815473,1.0218604196838861,0.41897670662953385,-6.1449028713022393,-138.20788622111041,41.792113778889586,null,51584.75,2660986432.5625,null,21.402401275890842,-21.820647723699189,null,11.446063143678293,-106.35708482026253,null,0,0,null,{"$f":"SUM((V463<-183)*(V462>-183))*A462","v":0},{"$f":"IF(AK462>0,U462,0)","v":0}]
[51883.5,51.883499999999998,35.244993596536801,1.5424196946524782,1.0055968202106322,0.10555416251724106,1,0,1049.7000116570835,1.5698436735223875,6.5961157134354407,1.4186051189013837,1.0270506284011121,0.23001999895004882,1.0444603406859312,0.29282500444551907,{"$f":"IF(VOUT_setting=1,1,SQRT((1+Afbr-$Q$5*(A463)^2)^2+(A463*$Q$4)^2))","v":4.654013066032193},0.46861987071003269,1.022137052579063,0.4214360219960292,-6.2065164220108979,-138.38964619236356,41.610353807636443,null,51883.5,2691897572.25,null,21.398648795058101,-21.844506047844703,null,11.394147580935979,-106.47283623598619,null,0,0,null,0,0]
[52182.25,52.182250000000003,35.447774629053001,1.542582068019696,1.0056612778482374,0.1061574100431721,1,0,1055.7442761090217,1.5698491275799347,6.6332262485729236,1.4194631534093509,1.0273588848270025,0.23129786611250566,1.0449627784595032,0.29441560743671169,4.6594480660475535,0.47094227056242233,1.0224157966167275,0.42389578695274643,-6.2678654051531071,-138.57161611988511,41.428383880114893,null,52182.25,2722987215.0625,null,21.394902453456432,-21.868873181555244,null,11.342505140808738,-106.5885101581418,null,0,0,null,0,0]
[52481,52.481000000000002,35.650556585521805,1.5427425942171915,1.0057261014066143,0.10676058002455997,1,0,1061.7885405920072,1.5698545195426956,6.6703416129042639,1.4203116399207993,1.0276688178648932,0.23257496457941407,1.04546785746256,0.29600467756342014,4.664907885129896,0.47325927414716679,1.022696660245223,0.42635600074515484,-6.328953326701483,-138.75378847417142,41.246211525828585,null,52481,2754255361,null,21.391161840533055,-21.893739774389857,null,11.29113249224357,-106.70410840463404,null,0,0,null,0,0]
[52786.5,52.786499999999997,35.857921165532417,1.542904869766087,1.0057927679396415,0.10737729748027949,1,0,1067.9693700781331,1.5698599702156306,6.7083004776334407,1.4211695870943355,1.0279874858561873,0.23388011943293122,1.0459870757238852,0.29762806011845555,4.6705166400084757,0.47562304214720869,1.0229860705541796,0.42887226427746572,-6.3911550846577629,-138.94027852602898,41.059721473971024,null,52786.5,2786414582.25,null,21.38734222088231,-21.919675187602927,null,11.23887471405428,-106.82224208201821,null,0,0,null,0,0]
[53092,53.091999999999999,36.06528667894392,1.5430652792393087,1.0058598169655191,0.10799393295168239,1,0,1074.150199595623,1.5698653581605038,6.7462642245951789,1.422017878908453,1.0283079038643157,0.23518446314159186,1.0465090478095966,0.29924982754007962,4.6761511640936488,0.47798115585313472,1.023277715300045,0.43138899538906977,-6.4530910544742532,-139.12696486255493,40.873035137445072,null,53092,2818760464,null,21.383527761706645,-21.946113742930883,null,11.186892187293244,-106.94030032881737,null,0,0,null,0,0]
[53397.5,53.397500000000001,36.272653109747957,1.5432238546329264,1.0059272484077635,0.10861048598627139,1,0,1080.3310291439386,1.5698706844539609,6.7842327718283295,1.4228566762430988,1.0286300702538889,0.23648799202729959,1.0470337696011471,0.3008699737193275,4.6818113643561148,0.48033360990090535,1.0235716036328379,0.4339061930985989,-6.5147647742869319,-139.31383996257404,40.686160037425964,null,53397.5,2851293006.25,null,21.379718061999178,-21.973046073579624,null,11.13518152567625,-107.0582849479692,null,0,0,null,0,0]
[53703,53.703000000000003,36.480020442300109,1.5433806272158679,1.0059950621894747,0.10922695613192093,1,0,1086.5118587225541,1.5698759501481494,6.8222060391860904,1.4236861364504292,1.0289539833826475,0.23779070242762818,1.0475612369665661,0.30248849259348654,4.6874971477930139,0.48268039920033057,1.0238677447411688,0.43642385636547171,-6.5761797146684202,-139.50089647449676,40.499103525503244,null,53703,2884012209,null,21.375912732732832,-22.000463014376709,null,11.083739399482184,-107.17619769733523,null,0,0,null,0,0]
[54015.75,54.015749999999997,36.692309849001418,1.5435392846724403,1.0060648812765747,0.10985796975824134,1,0,1092.8393692303664,1.5698812791056316,6.8610852801150148,1.4245257696141822,1.029287391172768,0.23912347655475163,1.0481040617241724,0.30414372951758462,4.6933442679010771,0.48507700851253693,1.0241732569848017,0.43900174889084376,-6.6387876192646225,-139.6925725530696,40.307427446930404,null,54015.75,2917701248.0625,null,21.372021230204531,-22.029023237088417,null,11.031351221749965,-107.29683604426171,null,0,0,null,0,0]
[54328.5,54.328499999999998,36.904600168702359,1.5436961168080565,1.0061351009010848,0.11048889555704547,1,0,1099.1668797688556,1.5698865467093102,{"$f":"SQRT(1+(A471/Zero2)^2)","v":6.8999693034867269},{"$f":"ATAN(A471/Zero2)","v":1.4253559400357343},1.0296226260866073,0.24045538517037537,1.0486497551094964,0.3057972482730979,4.6992180027044537,0.48746767109292277,1.02448114980773,0.44158012693465931,-6.7011314673018187,-139.88442368965318,40.115576310346825,null,54328.5,2951585912.25,null,21.368133519702891,-22.058072529521365,null,10.979237590273094,-107.41740265830474,null,0,0,null,0,0]
[54641.25,54.641249999999999,37.116891385737212,1.5438511549348752,1.0062057209791484,0.11111973304447173,1,0,1105.4943903374947,1.5698917540126955,6.9388580289015618,1.4261768056624684,1.0299596863400691,0.2417864243963847,1.0491983126465747,0.30744904250613719,4.7051182525388091,0.48985238235751055,1.0247914331923822,0.44415898918639729,-6.7632147731660543,-140.07644252079004,39.923557479209961,null,54641.25,2985666201.5625,null,21.364249220340206,-22.087601680119199,null,10.927395108575308,-107.53789928615478,null,0,0,null,0,0]
[54954,54.954000000000001,37.329183484796538,1.5440044296531117,1.0062767414264551,0.11175048173707512,1,0,1111.8219009357692,1.569896902045316,6.9777513777425924,1.42698852097103,1.0302985701416842,0.24311659037204822,1.0497497298453311,0.30909910591370121,4.7110449177903391,0.49223113801318918,1.0251041171624204,0.44673833426967746,-6.8250409841901014,-140.26862185066437,39.731378149335626,null,54954,3019942116,null,21.360367962738763,-22.117601675806107,null,10.875820436865069,-107.65832762991359,null,0,0,null,0,0]
[55274,55.274000000000001,37.546397720888514,1.5441594634938709,1.0063498225411673,0.11239575969192558,1,0,1118.2960924653523,1.5699021091185508,7.0175510362465063,1.4278097396512806,1.0306471953334508,0.24447668367178899,1.0503168848657334,0.31078562219564104,4.7171362089586593,0.49465886821161537,1.025426544803792,0.44937797056997431,-6.8880378401866746,-140.46541496551171,39.534585034488288,null,55274,3055215076,null,21.356399506688184,-22.148775260545197,null,10.823323958100271,-107.7814787308423,null,0,{"$f":"IF(AH474>0,W474,0)","v":0},null,0,0]
[55594,55.594000000000001,37.763612849044975,1.5443127138386052,1.0064233226225239,0.11304094366482487,1,0,1124.7702840249071,1.5699072562478311,7.0573553740068196,1.4286216953286439,1.0309977257804024,0.24583585464409713,1.0508870241119272,0.3124703132888883,4.7232549436305344,0.49708035530975725,1.0257515069804133,0.4520181092195058,-6.9507726374069003,-140.66236138410213,39.337638615897873,null,55594,3090692836,null,21.352433487977699,-22.180423296251078,null,10.771100952021616,-107.90456181223605,null,0,0,null,0,0]
[55914,55.914000000000001,37.98082885396056,1.5444642112800082,1.006497241578739,0.11368603313928979,1,0,1131.2444756139193,1.5699123444623466,7.0971643122929198,1.4294245427956573,1.0313501595398915,0.24719409921025423,1.051460142729451,0.31415317260736719,4.7294010153013222,0.49949559563781376,1.0260790145614038,0.45465874852855798,-7.0132488613175381,-140.85945391545272,39.140546084547282,null,55914,3126375396,null,21.348469545940606,-22.212536739239511,null,10.719148017169484,-108.02757855970593,null,0,0,null,0,0]
[56234,56.234000000000002,38.198045720678017,1.544613985715227,1.0065715793175305,0.11433102759930297,1,0,1137.718667231886,1.5699173747678612,7.1369777741217799,1.4302184334383987,1.031704494661384,0.24855141331077238,1.0520362358490818,0.31583419362081661,4.735574317544696,0.50190458583346609,1.0264090784597473,0.45729988673438021,-7.0754699309837532,-141.05668553387207,38.94331446612793,null,56234,3162262756,null,21.344507330943919,-22.24510674076166,null,10.667461808770023,-108.15053061479971,null,0,0,null,0,0]
[56561.5,56.561500000000002,38.420354484792234,1.5447655169238399,1.0066480928706805,0.11499104019808962,1,0,1144.3445977453664,1.5699224640360363,7.1777289692286397,1.4310218112168678,1.0320691011976251,0.24993957181171247,1.0526289059461813,0.31755270337055047,4.7419203909660119,0.50436356196761345,1.0267495365543069,0.46000344127369358,-7.1388886122939033,-141.25867662089476,38.741323379105239,null,56561.5,3199203282.25,null,21.340453686114419,-22.278903801725722,null,10.614836949484939,-108.27629904211162,null,0,0,null,0,0]
[56889,56.889000000000003,38.642664120952922,1.5449153046304036,1.0067250448697134,0.11565095218428781,1,0,1150.970528288145,1.5699274947082065,7.2184847446479088,1.4318161177144408,1.0324356951076177,0.25132674717852477,1.0532246812427046,0.31926927397373805,4.7482947610668775,0.50681598540900297,1.02709269546602,0.46270751439846108,-7.2020470792715514,-141.46079901268664,38.539200987313365,null,56889,3236358321,null,21.336401143068251,-22.31316092206043,null,10.562484553442763,-108.40200305154896,null,0,0,null,0,0]
[57216.5,57.216500000000003,38.864974614195631,1.5450633787470158,1.006802435214095,0.11631076300627183,1,0,1157.5964588597183,1.5699324677905588,7.2592450232334738,1.4326015047245835,1.0328042742751069,0.25271293512239335,1.0538235564721126,0.32098389861170962,4.7546973140525042,0.50926185353476938,1.0274385670337793,0.46541210398010191,-7.2649487916913005,-141.66304568792816,38.336954312071839,null,57216.5,3273727872.25,null,21.332349360587394,-22.347869216560063,null,10.510401211318285,-108.52764426659587,null,0,0,null,0,0]
[57544,57.543999999999997,39.087285949896305,1.545209768505571,1.0068802638027501,0.11697047211293743,1,0,1164.222389459595,1.5699373842663751,7.300009729553798,1.4333781206947596,1.0331748365754054,0.25409813137578441,1.0544255263524585,0.32269657052701428,4.7611279362384522,0.5117011640465382,1.0277871631430715,0.46811720780902755,-7.3275971435081075,-141.86540978835853,38.134590211641466,null,57544,3311311936,null,21.32829800804074,-22.383019991637674,null,10.458583570532516,-108.65322426709236,null,0,0,null,0,0]
[57879,57.878999999999998,39.314689241607091,1.5453577978236241,1.00696032803294,0.11764518325172939,1,0,1171.0000589569531,1.5699423557691095,7.3417124828703617,1.4341635984741454,1.0335559345871737,0.25551401923796424,1.0550444780473791,0.32444643664304218,4.7677347469558926,0.51418954997669442,1.0281465736556525,0.47088479023903895,-7.3914215310955402,-142.07252268748226,37.927477312517738,null,57879,3349978641,null,21.324153987290934,-22.419424674910385,null,10.405850727421456,-108.78161841445868,null,0,0,null,0,0]
[58214,58.213999999999999,39.542093384899324,1.5455041245298735,1.0070408505938242,0.11831978679834863,1,0,1177.7777284829206,1.5699472700535728,7.3834197146724145,1.4349402027632423,1.0339391030783929,0.2569288605042816,1.0556666565276136,0.32619424546774767,4.7743706869596636,0.51667107066558848,1.028508860231341,0.47365290580211628,-7.4549878007820194,-142.27974443939982,37.720255560600179,null,58214,3388869796,null,21.320009749003944,-22.456274527835486,null,10.353388974706935,-108.90995172020642,null,0,0,null,0,0]
[58549,58.548999999999999,39.769498365164829,1.5456487778249857,1.0071218313754684,0.11899428216466557,1,0,1184.5553980370059,1.5699521281019222,7.4251313494925117,1.4357080821612407,1.0343243397480169,0.25834265067664935,1.0562920560912266,0.32793998996742252,4.781035634971845,0.51914572468567832,1.0288740357397617,0.47642155186893281,-7.518299381881258,-142.48706820588947,37.512931794110528,null,58549,3427985401,null,21.31586497146877,-22.493560834858567,null,10.301194900217748,-109.03822574045859,null,0,0,null,0,0]
[58884,58.884,39.9969041681276,1.545791786245819,1.007203270267347,0.11966866876313292,1,0,1191.3330676187293,1.5699569308739643,7.4668473135416482,1.4364673819882252,1.0347116422860168,0.25975538528046854,1.0569206710202936,0.32968366317529368,4.7877294698611772,0.52161351095017061,1.0292421130997942,0.4791907257205838,-7.5813596386032946,-142.69448730916267,37.305512690837332,null,58884,3467325456,null,21.31171934311082,-22.531275068369339,null,10.249265148474427,-109.16644198813889,null,0,0,null,0,0]
[59227,59.226999999999997,40.229741395261279,1.5459365346539253,1.0072871285033171,0.12035904680817266,1,0,1198.2725920245807,1.5699617920465176,7.5095638899104511,1.4372360734179823,1.0351103318766848,0.26120075850076491,1.0575676231206184,0.33146682305693681,4.7946129610486459,0.52413311292003695,1.0296220005360575,0.48202657300427515,-7.6456688599443474,-142.90695167358413,37.093048326415868,null,59227,3507837529,null,21.307473518033568,-22.57032460375601,null,10.196365703552848,-109.29766179361444,null,0,0,null,0,0]
[59570,59.57,40.462579455591865,1.5460796171831401,1.007371466754273,0.12104930958373723,1,0,1205.2121164584223,1.5699665972385091,7.5522848533820248,1.4379960687883815,1.0355111822524277,0.26264501571721732,1.0582179338076481,0.33324779697165224,4.8015264787529377,0.52664551397833337,1.0300049576409327,0.48486296752409858,-7.7097215457130917,-143.11950231152818,36.88049768847182,null,59570,3548584900,null,21.303226171080446,-22.609805236882661,null,10.143736413797191,-109.42882411003546,null,0,0,null,0,0]
[59913,59.912999999999997,40.695418334817994,1.5462210624215373,1.0074562848996622,0.12173945646108972,1,0,1212.1516409197734,1.5699713474113988,7.5950101299256882,1.4387475139714851,1.0359141909048768,0.26408815220376858,1.0588715968933102,0.33502657765941524,4.8084698934747498,0.5291507140446613,1.0303909984386337,0.48769990606843105,-7.7735211052850541,-143.33213255079562,36.66786744920438,null,59913,3589567569,null,21.298976998711176,-22.649708394200243,null,10.091373854030259,-109.55993042738947,null,0,0,null,0,0]
[60256,60.256,40.928258018963703,1.5463608983069095,1.0075415828182879,0.12242948681214591,1,0,1219.0911654081642,1.5699760435047545,7.6377396471598686,1.4394905516141374,1.0363193553160703,0.26553016326036594,1.0595286061729419,0.33680315793358662,4.8154430759033051,0.53164871339673214,1.0307801370054837,0.49053738532631552,-7.837070883397514,-143.54483587754044,36.455164122459564,null,60256,3630785536,null,21.294725707127022,-22.690025687186701,null,10.039274655933333,-109.69098219267678,null,0,0,null,0,0]
[60607,60.606999999999999,41.166529185345993,1.5465023580606472,1.0076293667544216,0.12313548987625074,1,0,1226.1925447226324,1.5699807940996826,7.6814700875828263,1.4402423611448878,1.0367361987543022,0.2670046372419384,1.0602043969657871,0.33861888906696647,4.822609580688618,0.53419752119267638,1.0311815734190499,0.49344160107735424,-7.9018477074281517,-143.76256924498307,36.237430755016931,null,60607,3673208449,null,21.290372769483888,-22.731703499310122,null,9.9862295074410081,-109.8250355491235,null,0,0,null,0,0]
[60958,60.957999999999998,41.404801166024846,1.5466421897018285,1.0077176528460172,0.12384136958635918,1,0,1233.293924064455,1.5699854899861978,7.7252048205516584,1.4409856586471974,1.0371552943186322,0.2684779228082288,1.0608836786649605,0.34043230095455151,4.8298069846036693,0.53673879018290305,1.0315862837791561,0.49634637572415463,-7.9663698489741916,-143.98036583728853,36.019634162711469,null,60958,3715877764,null,21.286017019989071,-22.773797788997644,null,9.9334531890289774,-109.95903471162383,null,0,0,null,0,0]
[61309,61.308999999999997,41.643073947022643,1.5467804211720755,1.0078064409611054,0.12454712527155037,1,0,1240.3953034331616,1.5699901321039322,7.7689437735725946,1.4417205870602225,1.0375766392800394,0.26995001500745242,1.0615664445691138,0.34224338613330907,4.8370351497333104,0.53927252180249918,1.0319942833362581,0.49925170539425834,-8.0306406924871325,-144.19821916209423,35.801780837905767,null,61309,3758793481,null,21.281658173434998,-22.816300136559459,null,9.8809422678228493,-110.09298109768017,null,0,0,null,0,0]
[61660,61.66,41.881347514679753,1.5469170797773899,1.0078957309670122,0.12525275626163343,1,0,1247.4966828282936,1.5699947213711227,7.8126868757683559,1.4424472861584916,1.0380002308992988,0.27142090891653148,1.0622526879597993,0.3440521372203979,4.8442939383978612,0.54179871786088563,1.0324055873956288,0.50215758610541517,-8.0946635583879996,-144.41612288287851,35.583877117121489,null,61660,3801955600,null,21.277295953954809,-22.859202304044491,null,9.8286933678538055,-110.22687608204419,null,0,0,null,0,0]
[62019,62.018999999999998,42.125052618766048,1.547055253875991,1.0079875751135847,0.12597434032097274,1,0,1254.7599170513224,1.5699993615011623,7.8574311916226458,1.443182177864671,1.0384357982128836,0.27292408280332209,1.0629581624833637,0.3458996912963464,4.8517497047362568,0.54437469816638684,1.0328297002511304,0.50513026347313861,-8.159892510485097,-144.63903875661342,35.360961243386583,null,62019,3846356361,null,21.272830543482641,-22.903487490386894,null,9.7755211965577811,-110.36377102074903,null,0,0,null,0,0]
[62378,62.378,42.368758517855127,1.5471918384171257,1.0080799440069168,0.12669579252051566,1,0,1262.0231513010558,1.5700039482211652,7.9021797029495549,1.4439087468610954,1.0388737099344902,0.27442599282921082,1.0636672605476925,0.34774478830473704,4.8592372159091202,0.54694280050234956,1.03325730251778,0.50810350850779695,-8.224868880307115,-144.86199442261679,35.138005577383211,null,62378,3891014884,null,21.26836104943413,-22.94817405880756,null,9.7226161596371714,-110.50061496444907,null,0,0,null,0,0]
[62737,62.737000000000002,42.612465198306829,1.5473268606683621,1.0081728375027765,0.12741711214558682,1,0,1269.2863855770361,1.5700084824480156,7.9469323388760209,1.4446271329805029,1.0393139631006916,0.27592663382024896,1.0643799749106935,0.34958742060607845,4.866756325416068,0.54950302798963546,1.0336884107454314,0.51107731659091982,-8.2895960229494534,-145.08498358031949,34.915016419680512,null,62737,3935931169,null,21.263887205006796,-22.993253753568943,null,9.6699748214904222,-110.63740925178986,null,0,0,null,0,0]
[63096,63.095999999999997,42.856172646791237,1.5474603472772557,1.0082662554561659,0.12813829848232539,1,0,1276.5496198788151,1.5700129650777306,7.9916890301100425,1.4453374729573714,1.039756554737248,0.27742600063408968,1.0650962983127756,0.35142758064822222,4.874306887044356,0.5520553841382686,1.0341230415412599,0.5140516829830819,-8.3540772302136084,-145.30800008207666,34.69199991792334,null,63096,3981105216,null,21.259408752335641,-23.038718497065741,null,9.6175938033581883,-110.77415517891608,null,0,0,null,0,0]
[63463.25,63.463250000000002,43.105481395762588,1.5475953396454183,1.0083623627234366,0.1288759193811464,1,0,1283.97976697282,1.570017498244153,8.0374783780810919,1.4460559506874624,1.040211733935821,0.27895849988505111,1.0658328099968186,0.35330746257527684,4.8820633568281888,0.55465825402530433,1.0345713226696358,0.51709497443941455,-8.419789137585358,-145.53616365482077,34.463836345179232,null,63463.25,4027584100.5625,null,21.25482235446302,-23.08561822600187,null,9.5642749407066141,-110.91399486393105,null,0,0,null,0,0]
[63830.5,63.830500000000001,43.35479092120849,1.5477287794824617,1.0084590185203852,0.12961339928654297,1,0,1291.4099140929063,1.5700219792472876,8.0832718280735687,1.4467662881232115,1.0406693539873442,0.28048965493840045,1.0665730830774336,0.35518474160122993,4.8898524323305832,0.55725289529767874,1.0350233254657872,0.52013883973829922,-8.4852504490745702,-145.76434330044847,34.235656699551527,null,63830.5,4074332730.25,null,21.25023061558764,-23.132904353861967,null,9.511221523851777,-111.05378655254978,null,0,0,null,0,0]
[64197.75,64.197749999999999,43.604101209810288,1.5478606934137926,1.0085562226893057,0.13035073743697137,1,0,1298.840061238627,1.570026408982351,8.1290693107637733,1.4474686221238153,1.0411294116732457,0.28201946039199222,1.0673171097280978,0.3570594099241457,4.8976739580064548,0.55983931294344569,1.0354790678900394,0.52318327341195825,-8.5504644932519565,-145.99253290796605,34.007467092033949,null,64197.75,4121351105.0625,null,21.245633286808506,-23.180568780963693,null,9.458430112139844,-111.19353150064833,null,0,0,null,0,0]
[64565,64.564999999999998,43.853412248552175,1.5479911074595609,1.0086539750716577,0.13108793307179728,1,0,1306.2702084095442,1.5700307883241904,8.1748707583754427,1.4481630865133304,1.0415919037635106,0.28354791087846754,1.0680648821044669,0.35893145983717234,4.9055277786568157,0.56241751235408743,1.0359385679624384,0.52622826985943749,-8.61543453607805,-146.22072651641193,33.779273483588071,null,64565,4168639225,null,21.241030127782427,-23.22860358235144,null,9.4058973217476343,-111.33323092174162,null,0,0,null,0,0]
[64941,64.941000000000003,44.108664069114759,1.5481231013541112,1.008754624271035,0.13184254448940164,1,0,1313.8773842997764,1.570035220691316,8.2217674975460842,1.4488660805768687,1.04206793377894,0.28511136847168134,1.0688343431509404,0.36084539202977911,4.9136020189543288,0.56504863102427716,1.036412927847437,0.52934639263302186,-8.6817030932116275,-146.45435507818124,33.545644921818763,null,64941,4217333481,null,21.236311012571246,-23.27815846701294,null,9.3523773614648125,-111.47621284051313,null,0,0,null,0,0]
[65317,65.316999999999993,44.363916649312593,1.5482535763686909,1.0088558477792169,0.13259700490874474,1,0,1321.4845602155235,1.5700396020282632,8.2686682538285492,1.4495611000680657,1.0425465086950807,0.28667339448795282,1.0696077138418769,0.36275656351031393,4.9217097833643422,0.56767114789177908,1.0368912649874806,0.53246509300660816,-8.747722617546831,-146.68797565251194,33.312024347488062,null,65317,4266310489,null,21.231585302396848,-23.328085313882774,null,9.2991214915699736,-111.61914947947811,null,0,0,null,0,0]
[65693,65.692999999999998,44.619169976108743,1.5483825585660338,1.0089576454233509,0.13335131351650931,1,0,1329.0917361563479,1.5700439332112595,8.3155729592519663,1.4502482792535005,1.0430276250088832,0.2882339832806548,1.0703849857029306,0.364664966316529,4.929850906504317,0.570285070019522,1.0373735989109674,0.53558436453447533,-8.8134964202211581,-146.92158230462283,33.078417695377169,null,65693,4315570249,null,21.226852765398384,-23.378376156728809,null,9.2461262574908645,-111.76204200920826,null,0,0,null,0,0]
[66069,66.069000000000003,44.874424036762875,1.5485100734160766,1.0090600170296742,0.13410546950039656,1,0,1336.698912121821,1.5700482150965851,8.3624815473647871,1.450927749417128,1.0435112792051742,0.28979312924154832,1.0711661502416661,0.36657059258989644,4.9380252234041651,0.57289040488842402,1.0378599492084033,0.53870420062399216,-8.879027750237757,-147.15516924724693,32.844830752753069,null,66069,4365112761,null,21.22211317793553,-23.429023201267348,null,9.193388261671128,-111.90489155783483,null,0,0,null,0,0]
[66453.75,66.453749999999999,45.135618931949658,1.5486390627003603,1.0091653649245931,0.13487701681762546,1,0,1344.4831168083783,1.5700525464679445,8.4104857097068297,1.4516151854246877,1.0440088121317186,0.29138705912181107,1.0719695142115844,0.36851768292503173,4.9464239568761261,0.57554748812296275,1.0383617956600306,0.54189721667195723,-8.9458364015060088,-147.39416576658479,32.605834233415209,null,66453.75,4416100889.0625,null,21.217255770775072,-23.481209643685727,null,9.1396857867940042,-112.05102203808775,null,0,0,null,0,0]
[66838.5,66.838499999999996,45.396814569471843,1.5487665676782685,1.0092713134351621,0.1356484026072205,1,0,1352.267321519869,1.5700568279730076,8.4584938014634439,1.4522948183537794,1.0445089949492681,0.29297946647781697,1.0727769360945159,0.37046184967986323,4.954857098867091,0.57819559693689226,1.0388678892914309,0.54509080942519605,-9.0123978540564629,-147.63312984357069,32.366870156429314,null,66838.5,4467385082.25,null,21.212390532599258,-23.533753078225505,null,9.0862456415336368,-112.19710977147975,null,0,0,null,0,0]
[67223.25,67.223249999999993,45.658010936589413,1.5488926138194907,1.0093778623722516,0.13641962600218607,1,0,1360.0515262558649,1.5700610604679981,8.5065057561054189,1.4529667796963073,1.0450118238528034,0.29457034542567045,1.0735884067348631,0.37240308477023182,4.9633244740107152,0.58083474066336083,1.0393782512889027,0.54828497134165388,-9.0787153970124717,-147.87205573100024,32.127944268999755,null,67223.25,4518965340.5625,null,21.207517248785528,-23.586645682891138,null,9.0330643627542084,-112.34315583486372,null,0,0,null,0,0]
[67608,67.608000000000004,45.919208020852182,1.5490172260143986,1.0094850115457403,0.1371906861366643,1,0,1367.8357310159472,1.5700652447896493,8.5545215085918294,1.4536311980200367,1.0455172950245155,0.29615969012371113,1.074403916958848,0.37434138022472074,4.9718259074258855,0.58346492906586922,1.0398929029028137,0.5514796947178191,-9.1447922579731813,-148.11093782620242,31.889062173797583,null,67608,4570841664,null,21.202635712589757,-23.639879804531073,null,8.9801385444076516,-112.4891612625843,null,0,0,null,0,0]
[68001.75,68.001750000000001,46.186515708240016,1.549143293842637,1.0095952883947694,0.13797961282965834,1,0,1375.8020224615959,1.5700694779665585,8.6036643023687596,1.4543034797109005,1.0460373217885974,0.29778461792158578,1.0752426762830998,0.37632196413890801,4.980561285437763,0.58614738097924668,1.0404240566933725,0.55474972157139213,-9.2121688885177004,-148.3553567673236,31.644643232676401,null,68001.75,4624238003.0625,null,21.197631236486359,-23.694704949065841,null,8.9262356936542382,-112.63854098499586,null,0,0,null,0,0]
[68395.5,68.395499999999998,46.453824121226823,1.5492679108131187,1.0097061934837974,0.13876836670369552,1,0,1383.768313931615,1.5700736624030525,8.652810940510669,1.4549681247856721,1.0465601077505007,0.29940792660856269,1.0760856468904785,0.37829945274966353,4.989331964715479,0.58882047574681184,1.0409597483653641,0.55802031961591647,-9.2793000944445687,-148.59971841693658,31.400281583063418,null,68395.5,4677944420.25,null,21.192617703447066,-23.749872078631761,null,8.8725933541819497,-112.78788020800884,null,0,0,null,0,0]
[68789.25,68.789249999999996,46.721133247358374,1.5493911018246433,1.009817726605831,0.13955694683445954,1,0,1391.7346054255856,1.5700777989361019,8.7019613578813377,1.4556252620515049,1.0470856487774116,0.30102961006096374,1.0769328188918217,0.38027383787796692,4.9981377594455605,0.59148422518767041,1.0415000008971917,0.56129148006902152,-9.3461891449763392,-148.84401721420011,31.155982785799893,null,68789.25,4731960915.5625,null,21.187594915842524,-23.805373510216523,null,8.8192080527825141,-112.93717990798613,null,0,0,null,0,0]
[69183,69.183000000000007,46.988443074463802,1.5495128912096052,1.0099298875527973,0.14034535229890574,1,0,1399.7008969430992,1.5700818883836229,8.7511154908029418,1.4562750174478367,1.047613940723052,0.30264966220155937,1.0777841823798489,0.38224511146723278,5.0069784843804079,0.59413864156225482,1.042044837332923,0.56456319397111099,-9.4128392483886518,-149.0882477397418,30.911752260258197,null,69183,4786287489,null,21.182562683596473,-23.861201726685408,null,8.7660763734471541,-113.08644101861067,null,0,0,null,0,0]
[69586,69.585999999999999,47.262033274455135,1.5496361150906974,1.0100453332950972,0.14115209720318733,1,0,1407.8543331107001,1.5700860259771421,8.8014281382738275,1.4569325214159288,1.0481574876104367,0.30430607717008312,1.0786598761382744,0.3842594640186171,5.0160628741777824,0.59684576438421366,1.0426072439146206,0.56791233075164371,-9.4808109530295148,-149.33813953648269,30.661860463517314,null,69586,4842211396,null,21.177402263069961,-23.918672177830999,null,8.7119556442107218,-113.23916955148455,null,0,0,null,0,0]
[69989,69.989000000000004,47.535624183818435,1.5497579205454735,1.0101614362621105,0.14195865718575723,1,0,1416.0077693021256,1.5700901159217633,8.8517445474478897,1.4575825506977524,1.0487039073528595,0.30596077054810189,1.0795399395734737,0.38627054043483977,5.0251834638062407,0.59954313785449043,1.0431745013523628,0.5712620277298941,-9.5485389634659796,-149.58794876561961,30.412051234380385,null,69989,4898460121,null,21.172231569210087,-23.976469527002585,null,8.6580935304459548,-113.39185950671543,null,0,0,null,0,0]
[70392,70.391999999999996,47.809215790375454,1.5498783319214213,1.0102781962272491,0.14276503126115433,1,0,1424.1612055169662,1.5700941590358681,8.9020646545392292,1.4582252314942541,1.049253195462029,0.3076137359712417,1.080424362007441,0.38827833247427934,5.0343400565464203,0.60223077650408552,1.0437466345586321,0.57461227472336618,-9.6160265309413067,-149.83767005144131,30.162329948558693,null,70392,4955033664,null,21.167050421209154,-24.0345862256566,null,8.6044865476224857,-113.54451175236036,null,0,0,null,0,0]
[70795,70.795000000000002,48.082808082225064,1.549997373012042,1.0103956129627476,0.14357121844533877,1,0,1432.3146417548223,1.5700981561192027,8.9523883971914362,1.4588606871933398,1.0498053474355109,0.30926496712618373,1.0813131327443022,0.39028283202813152,5.0435324563338648,0.60490869531458824,1.0443236685126864,0.57796306135531694,-9.6832768463006431,-150.0872981565239,29.9127018434761,null,70795,5011932025,null,21.16185864550221,-24.093014888282344,null,8.551131268558338,-113.69712711352427,null,0,0,null,0,0]
[71207.25,71.207250000000002,48.362680794836443,1.5501177528540793,1.0105164040641781,0.14439571552648989,1,0,1440.6552226443732,1.5701021981341425,9.0038709114733084,1.4595033784358882,1.0503731313829543,0.31095229778466993,1.0822267912931973,0.39232992554051244,5.0529726934947288,0.60763803904056668,1.0449190439227503,0.58139130543981155,-9.7518285303380896,-150.34255420576832,29.657445794231677,null,71207.25,5070472452.5625,null,21.156536533699658,-24.153099908394033,null,8.4968082552090944,-113.85320808480124,null,0,0,null,0,0]
[71619.5,71.619500000000002,48.642554200221454,1.55023674744506,1.0106378819455699,0.14522001496007794,1,0,1448.9958035571901,1.5701061936165079,9.0553571025333799,1.4601387616183139,1.0509439025954572,0.31263780044753881,1.0831449773507378,0.39437355694716159,5.0624499874016484,0.61035724473245678,1.0455196007210579,0.58482009163143656,-9.8201385136614316,-150.59770208672356,29.402297913276442,null,71619.5,5129352780.25,null,21.151202955485324,-24.213496246953561,null,8.4427415562032433,-114.00925207186086,null,0,0,null,0,0]
[72031.75,72.031750000000002,48.922428286490543,1.5503543805557045,1.0107600463593018,0.14604411569739578,1,0,1457.3363844928742,1.57011014336524,9.1068469080108816,1.4607669601817701,1.0515176562084942,0.3143214685226064,1.0840676794127657,0.39641371799668013,5.071964130355898,0.61306632983623288,1.0461253658546941,0.58824940819231486,-9.8882100254604097,-150.8527366166729,29.1472633833271,null,72031.75,5188573008.0625,null,21.14585774706104,-24.274196499375474,null,8.3889276809962166,-114.16525982422077,null,0,0,null,0,0]
[72444,72.444000000000003,49.202303042024624,1.5504706754160298,1.0108828970564729,0.14686801669132113,1,0,1465.6769654510344,1.570114048161094,9.1583402669431404,1.4613880948141618,1.0520943873427602,0.31600329547363548,1.0849948859577707,0.39845040058122433,5.0815149154097607,0.61576531225455911,1.0467363663378364,0.59167924317254827,-9.9560462351934085,-151.1076527475351,28.892347252464901,null,72444,5248133136,null,21.140500751557919,-24.335193420987345,null,8.3353631964381378,-114.32123204817982,null,0,0,null,0,0]
[72865.75,72.865750000000006,49.488627987518932,1.5505882890151175,1.0110092886853106,0.14771069609050119,1,0,1474.2097490253918,1.5701179972170671,9.2110238677865048,1.4620163561024557,1.0526874849552326,0.3177219668866485,1.085948108650806,0.40053040909635995,5.091323494735267,0.61851605530696541,1.0473668928260342,0.59518863998722693,-10.02520542670135,-151.36831558422051,28.631684415779489,null,72865.75,5309417523.0625,null,21.135007953808127,-24.397895583384042,null,8.2808189137144002,-114.4807624642653,null,0,0,null,0,0]
[73287.5,73.287499999999994,49.774953609711496,1.550704549494017,1.01113639806073,0.14855316422231429,1,0,1482.7425326224748,1.570121900821535,9.263711062979775,1.462637471183341,1.0532836885218879,0.3194386976829317,1.0869060213755175,0.40260676027260711,5.1011699886576354,0.62125626402169365,1.0480029561405519,0.59869855340919853,-10.094124872320338,-151.62884422816569,28.37115577183431,null,73287.5,5371057656.25,null,21.129502508549628,-24.46089339997744,null,8.2265285574163247,-114.64025705642081,null,0,0,null,0,0]
[73709.25,73.709249999999997,50.061279896991195,1.5508194800671358,1.0112642249120827,0.14939541997076383,1,0,1491.2753162418935,1.5701257597546914,9.3164017915414021,1.4632515608237853,1.0538829927714173,0.32115348104566482,1.0878686117426115,0.40467944589170329,5.1110541780810834,0.62398595899228504,1.0486445854143598,0.60220896995606765,-10.162807781246562,-151.88923368639993,28.110766313600067,null,73709.25,5433053535.5625,null,21.123984268863964,-24.52417960545673,null,8.1724886298581794,-114.79971644619144,null,0,0,null,0,0]
[74131,74.131,{"$f":"SQRT(1+(A525/pole1)^2)","v":50.347606838010996},{"$f":"ATAN(A525/pole1)","v":1.5509331034209417},{"$f":"SQRT(1+(A525/Zero1)^2)","v":1.0113927689673301},{"$f":"ATAN(A525/Zero1)","v":0.15023746222162124},{"$f":"IF(VIN_nom>Vout, 1, SQRT(1+(A525/z_RHP)^2))","v":1},{"$f":"IF(VIN_nom>Vout, 0, -ATAN(A525/z_RHP))","v":0},{"$f":"SQRT(1+(A525/Pole2)^2)","v":1499.8080998832666},{"$f":"ATAN(A525/Pole2)","v":1.5701295747789747},9.3690959938575986,1.4638587430953274,{"$f":"SQRT(1+(A525/pole4)^2)","v":1.0544853924171118},{"$f":"ATAN(A525/pole4)","v":0.32286631021929524},{"$f":"IF(VOUT_setting=1,1,SQRT(1+(A525*zterm1)^2))","v":1.0888358673462146},{"$f":"IF(VOUT_setting=1,0,ATAN(((A525*zterm1))))","v":0.40674845789035469},5.1209758447658889,{"$f":"IF(VOUT_setting=1,0,ATAN(A525*$Q$4/(1+Afbr-$Q$5*(A525)^2)))","v":0.62670516127269149},{"$f":"SQRT((1-(Z525/pterm2))^2+(A525/pterm1)^2)","v":1.0492918098470487},{"$f":"IF((ATAN((A525/pterm1)/(1-A525^2/pterm2))>0),ATAN((A525/pterm1)/(1-A525^2/pterm2)),PI()+ATAN((A525/pterm1)/(1-A525^2/pterm2)))","v":0.60571987591445808},{"$f":"20*LOG10(((E525*K525*G525*O525)/(C525*I525*S525*M525*Q525))*Adc)","v":-10.231257303575802},{"$f":"((F525+L525+H525+P525)-(D525+J525+T525+N525+R525))*radconv","v":-152.14947909679839},{"$f":"IF(V525>0,V525,V525+180)","v":27.850520903201613},null,{"$f":"IF(U525<0,A525,1000000000)","v":74131},{"$f":"A525^2","v":5495405161},null,{"$f":"20*LOG10((K525/(I525*M525))*AEA)","v":21.118453094462932},{"$f":"(L525-(J525+N525))*radconv","v":-24.587747091440917},null,{"$f":"20*LOG10((E525*G525/(C525*S525))*Acs*Am)","v":8.1186956908376615},{"$f":"(F525+H525-(D525+T525))*radconv","v":-114.95914121153807},null,{"$f":"SUM((U526<0)*(U525>0))*A525","v":0},0,null,0,0]
[74562.75,{"$f":"A526/1000","v":74.562749999999994},50.640723465162424,1.5510480899345891,1.0115251035240154,0.15109924759587454,1,0,1508.5432020684239,1.5701334355552778,9.423043151566759,1.4644732876410425,1.0551052762195796,0.32461772059147065,1.0898308767886222,0.40886271410635566,5.1311713551752236,0.6294779914522497,1.0499602067260347,0.60931452040910217,-10.301091289434044,-152.41574096116341,27.584259038836592,null,74562.75,5559603687.5625,null,21.112777233760806,-24.653105911432242,null,8.0638795917418946,-115.12231074725968,null,0,0,null,{"$f":"SUM((V527<-183)*(V526>-183))*A526","v":0},{"$f":"IF(AK526>0,U526,0)","v":0}]
[74994.5,74.994500000000002,50.933840754173822,1.5511617529863986,1.0116581891172647,0.15196080687077701,1,0,1517.2783042758078,1.570137251877936,9.4769938275127839,1.4650808354497562,1.05572839268592,0.32636706887475997,1.0908307489614455,0.41097310382232771,{"$f":"IF(VOUT_setting=1,1,SQRT((1+Afbr-$Q$5*(A527)^2)^2+(A527*$Q$4)^2))","v":5.1414056810772513},0.63223987155128247,1.0506345293733492,0.61290964797567171,-10.370687187307936,-152.68184195750962,27.318158042490381,null,74994.5,5624175030.25,null,21.10708754050977,-24.718744918928028,null,8.0093152156956187,-115.28544508672465,null,0,0,null,0,0]
[75426.25,75.426249999999996,51.226958693683848,1.5512741152917429,1.0117920254507162,0.15282213885675769,1,0,1526.0134065050368,1.5701410245103247,9.5309479619499076,1.4656815048934544,1.0563547360955379,0.32811434802100647,1.0918354705052298,0.41307961888837158,5.1516785911749841,0.63499082559209863,1.0513148093206335,0.61650524315258648,-10.440048193776001,-152.94777727063106,27.052222729368935,null,75426.25,5689119189.0625,null,21.101383884385939,-24.78465697162164,null,7.9549990509769479,-115.44854471370209,null,0,0,null,0,0]
[75858,75.858000000000004,51.520077272589674,1.5513851990491805,1.0119266122264936,0.1536832423662223,1,0,1534.7485087557382,1.5701447541984401,9.5849054964738318,1.4662754116987675,1.0569843007118065,0.32985955104925296,1.0928450280449753,0.4151822513220324,5.1619898551441814,0.63773087805945439,1.0520010781648481,0.62010129022660054,-10.509177446779299,-153.21354221250272,26.786457787497284,null,75858,5754436164,null,21.095666141424012,-24.850835081628613,null,7.9009276436094202,-115.61161006781721,null,0,0,null,0,0]
[76299.75,76.299750000000003,51.819985583116036,1.5514975549946077,1.0120650926443115,0.15456405265706122,1,0,1543.6859295517502,1.5701485265845059,9.6401162308078039,1.4668761929103109,1.0576317750045581,0.33164301967314636,1.0938829598451156,0.41732955726945042,5.1725794014498421,0.64052313716193876,1.0527094736540887,0.62378107839724206,-10.579671186183408,-153.48528158653258,26.514718413467421,null,76299.75,5821651850.0625,null,21.08980126378734,-24.918814220717454,null,7.8458536417211686,-115.77841720894716,null,0,0,null,0,0]
[76741.5,76.741500000000002,52.119894540282132,1.5516086179014159,1.0122043580341202,0.15544462125616379,1,0,1552.6233503694777,1.5701522555403324,9.6953304049976019,1.467470131526976,1.0582826092478805,0.33342430032289322,1.09492592587909,0.41947278227309154,5.1832086142036724,0.64330403714249618,1.0534242057993743,0.6274613055564775,-10.649928776600175,-153.75683306788008,26.243166932119919,null,76741.5,5889257822.25,null,21.083921396135356,-24.987057561560349,null,7.7910287306972581,-115.94518926453156,null,0,0,null,0,0]
[77183.25,77.183250000000001,52.419804132989114,1.5517184099604389,1.0123444080719608,0.15632494689797199,1,0,1561.5607712085475,1.5701559418116244,9.7505479606068768,1.4680573433753936,1.0589367972465857,0.33520338573933883,1.0959739117746539,0.42161191832237838,5.1938772499135375,0.64607360566058503,1.0541453086435459,0.63114195405984141,-10.719953397909158,-154.02819202371612,25.971807976283884,null,77183.25,5957254080.5625,null,21.078026425002573,-25.055558094586999,null,7.736449390515614,-116.1119265675693,null,0,0,null,0,0]
[77625,77.625,52.719714350390667,1.5518269528576811,1.0124852424322284,0.1572050283191323,1,0,1570.498192068595,1.5701595861271114,9.8057688405119965,1.468637941691896,1.0595943327889004,0.33698026873679476,1.09702690314544,0.42374695758695391,5.2045850661844701,0.64883187083591032,1.0548728162920959,0.63482300599000674,-10.789748171923545,-154.29935394422122,25.700646055778776,null,77625,6025640625,null,21.07211624300588,-25.124308961876977,null,7.6821121590644195,-116.27862940637451,null,0,0,null,0,0]
[78077,78.076999999999998,53.026584070864338,1.5519367434249582,1.0126301560863447,0.15810527631654397,1,0,1579.6429894385315,1.5701632723177275,9.862274402483866,1.4692252817073592,1.0602705836983322,0.33879609396636651,1.0981094932699984,0.42592728807422281,5.2155816408274989,0.65164246651109381,1.0556238695079387,0.63858986859299727,-10.86092769384782,-154.57659915543252,25.423400844567482,null,78077,6096017929,null,21.066053075845215,-25.194907183085068,null,7.6267611802433244,-116.44916486109493,null,0,0,null,0,0]
[78529,78.528999999999996,53.333454423163353,1.5520452705662724,1.0127758901877395,0.15900526595953288,1,0,1588.787786829685,1.5701669160741472,{"$f":"SQRT(1+(A535/Zero2)^2)","v":9.9187833278638795},{"$f":"ATAN(A535/Zero2)","v":1.4698059295776211},1.0609503260911191,0.34060959839967686,1.0991972933353291,0.42810331344228753,5.2266187254630934,0.6544412892001642,1.0563817006326135,0.64235711473834201,-10.931873010948053,-154.85362890693327,25.146371093066733,null,78529,6166803841,null,21.059973774927116,-25.265753432838121,null,7.5716565227590351,-116.61966470481609,null,0,0,null,0,0]
[78981,78.980999999999995,53.640325396443913,1.552152555962848,1.0129224443822875,0.15990499590197749,1,0,1597.9325842416915,1.5701705181249099,9.9752955594920518,1.4703799986451829,1.0616335532606831,0.34242077457759185,1.1002902878890357,0.43027502588317862,5.2376960640404642,0.65722837044760773,1.0571463463898796,0.64612472435107127,-11.002587287947797,-155.13043874292998,24.869561257070018,null,78981,6237998361,null,21.053878243692665,-25.336840831454513,null,7.5167946580079583,-116.79012910669672,null,0,0,null,0,0]
[79433,79.433000000000007,53.94719698010892,1.5522586208027025,1.0130698183140761,0.16080446480021496,1,0,1607.0773816741948,1.5701740791819718,10.031811041493091,1.470947599715998,1.0623202584833624,0.34422961512121747,1.1013884614664182,0.43244241778257553,5.2488134017405086,0.66000374225243874,1.0579178435620173,0.64989267706122589,-11.073073632040877,-155.40702432625636,24.592975673743638,null,79433,6309601489,null,21.047766391399144,-25.408162648233347,null,7.462172115502467,-116.96055819059431,null,0,0,null,0,0]
[79895.5,79.895499999999998,54.26119783883464,1.552365907720751,1.0132214639044819,0.161724556830771,1,0,1616.4346135811832,1.5701776812552719,10.089642690676879,1.4715218040876206,1.0630265090826254,0.34607804992772129,1.1025174904542527,0.43465567838987806,5.2602301353586585,0.66283149941388686,1.0587143931110905,0.65374849323476569,-11.144964625737927,-155.68979848610954,24.310201513890462,null,79895.5,6383290920.25,null,21.041495577303916,-25.481377057960422,null,7.4065248520126143,-117.13490988160233,null,0,{"$f":"IF(AH538>0,W538,0)","v":0},null,0,0]
[80358,80.358000000000004,54.575199314945934,1.5524719600773849,1.0133739669999766,0.16264437270970872,1,0,1625.791845508903,1.5701812418651639,10.147477628604717,1.4720894633581278,1.0637363869063825,0.34792402395157712,1.1036519090836454,0.4368643998779515,5.2716882122385202,0.66564706597996826,1.0595181941834413,0.65760462454039625,-11.216623377405652,-155.97232903010718,24.027670969892824,null,80358,6457408164,null,21.035207500656419,-25.554823106219821,null,7.3511209882103561,-117.3092247155127,null,0,0,null,0,0]
[80820.5,80.820499999999996,54.889201397847266,1.5525767990576902,1.0135273272134797,0.1635639110055955,1,0,1635.1490774569986,1.5701847617234779,10.205315799363296,1.4726506884407353,1.0644498846976844,0.34976752954791196,1.1047917007520742,0.43906857471230476,5.2831873634323792,0.66845047762990917,1.0603292863579876,0.6614610482041039,-11.288053037974684,-156.25461167309587,23.745388326904134,null,80820.5,6531953220.25,null,21.02890208190383,-25.628494040918319,null,7.2959569869348737,-117.48350268330167,null,0,0,null,0,0]
[81283,81.283000000000001,55.203204077184175,1.5526804453648486,1.0136815441559703,0.16448317028974022,1,0,1644.5063094251223,1.5701882415258426,10.263157148296624,1.473205587764733,1.0651669951820695,0.35160855915939565,1.1059368488469852,0.4412681955661476,5.2947273213691028,0.67124177048783551,1.0611477092662838,0.66531774113401165,-11.359256701346343,-156.53664224393842,23.463357756061583,null,81283,6606926089,null,21.022579247052093,-25.702383256368684,null,7.2410293693885333,-117.65774372996499,null,0,0,null,0,0]
[81756.25,81.756249999999994,55.524505804011675,1.552785287275992,1.0138402320226783,0.1654235058387557,1,0,1654.0810338323415,1.5701917614559182,10.322346151880184,1.4737669473096418,1.0659045056584473,0.35348980949966352,1.1071141411829946,0.44351422133166568,5.3065774681747069,0.67408543559507239,1.0619927846703052,0.66926433042237776,-11.43188460024518,-156.82496295578389,23.175037044216111,null,81756.25,6684084414.0625,null,21.016091349445816,-25.778209105585084,null,7.1850661759233709,-117.83599638060348,null,0,0,null,0,0]
[82229.5,82.229500000000002,55.845808134132156,1.5528889227968987,1.0139998160772408,0.16636354623733304,1,0,1663.6557582598189,1.5701952408699675,10.381538371196596,1.4743219056417536,1.0666457832560865,0.35536845168839115,1.1082970066203892,0.44575546409765976,5.318469778349102,0.67691648989848219,1.0628456196597755,0.67321115170958512,-11.504282251285185,-157.11301125484363,22.886988745156373,null,82229.5,6761690670.25,null,21.009585076993499,-25.854249959805863,null,7.1293432948577005,-118.01421011360179,null,0,0,null,0,0]
[82702.75,82.702749999999995,56.167111057192244,1.552991372628723,1.0141602958965967,0.16730328996381483,1,0,1673.2304827072064,1.5701986804635244,10.440733751552479,1.474870571294342,1.0673908201264579,0.35724447791275904,1.1094854273340711,0.44799191668194294,5.3304039697383176,0.67973497346170852,1.0637062568463607,0.6771581792327076,-11.576452792776443,-157.4007830189818,22.599216981018202,null,82702.75,6839744857.5625,null,21.003060367295138,-25.930499192742083,null,7.0738571808200916,-118.19238472612636,null,0,0,null,0,0]
[83176,83.176000000000002,56.48841456307413,1.5530926570017303,1.0143216710555785,0.16824273549959998,1,0,1682.8052071741645,1.5702020809162938,10.499932239484927,1.4754130503683951,1.0681396084031836,0.35911788045534471,1.1106793854916968,0.45022357212466779,5.3423797617204372,0.68254092677936962,1.0645747388863946,0.68110538688758693,-11.648399306461021,-157.68827423522879,22.311725764771211,null,83176,6918246976,null,20.996517163259469,-26.006950322023389,null,7.0186043470922366,-118.37051996863725,null,0,0,null,0,0]
[83660.5,83.660499999999999,56.817356622128202,1.5531951623828426,1.0144878094632794,0.16920420284797488,1,0,1692.6075400081245,1.5702055223499571,10.560541146185273,1.4759621245176415,1.0689100747189022,0.36103309119564153,1.1119074440076084,0.45250330142673301,5.3546830440555073,0.68540064476724727,1.065472037682119,0.68514658572991216,-11.721827198044801,-157.98230492230908,22.017695077690917,null,83660.5,6999079260.25,null,20.989799202292311,-26.085421362643022,null,6.9622761386513075,-118.5528487111976,null,0,0,null,0,0]
[84145,84.144999999999996,57.146299271309466,1.5532964876923872,1.0146548853756372,0.17016535444880643,1,0,1702.4098728619001,1.5702089241526493,10.621153200366086,1.476504931993083,1.0696844561746912,0.36294553596823942,1.1131412685225439,0.454777988748294,5.3670293380366267,0.68824731691482077,1.0663776493457167,0.68918791691246306,-11.795026645213953,-158.27603338741824,21.723966612581762,null,84145,7080381025,null,20.98306175242891,-26.164090708260677,null,6.9061852205192844,-118.73513551417555,null,0,0,null,0,0]
[84629.5,84.629499999999993,57.475242500485663,1.5533966531896788,1.0148228983296119,0.17112618868263735,1,0,1712.2122057351505,1.5702122870050266,10.681768348447688,1.4770415791553793,1.0704627442738182,0.36485520680180766,1.1143808398844395,0.45704762733632304,5.3794183475700041,0.69108098798737827,1.06729161977214,0.69322935132678287,-11.868000779423616,-158.56945565636593,21.430544343634068,null,84629.5,7162152270.25,null,20.976304768546001,-26.242951847134567,null,6.850328034344221,-118.91737996334069,null,0,0,null,0,0]
[85114,85.114000000000004,57.804186299755166,1.5534956786729712,1.0149918478598747,0.17208670393342357,1,0,1722.014538627544,1.570215611572247,10.74238653805701,1.4775721699788391,1.0712449305014402,0.36676209582905123,1.1156261389373434,0.45931221067579303,5.391849778263615,0.69390170316341637,1.0682139948906453,0.69727085949889922,-11.940752675864402,-158.86256785924655,21.137432140753447,null,85114,7244392996,null,20.96952821059563,-26.321998409323569,null,6.7947010808825192,-119.09958159690764,null,0,0,null,0,0]
[85609.5,85.609499999999997,58.140598958868139,1.5535957934441111,1.0151656014157142,0.17306869493899438,1,0,1732.0394219249836,1.5702189726983917,10.804384084575158,1.4781086490119313,1.0720488983376215,0.36870939316867979,1.1169056152954395,0.46162297345062342,5.4046070216681494,0.69677310638633372,1.0691660524292235,0.70140417053074733,-12.014929601888637,-159.16201019530922,20.837989804690778,null,85609.5,7328986490.25,null,20.96257751658371,-26.403024922382993,null,6.7380457298941465,-119.2858750883745,null,0,0,null,0,0]
[86105,86.105000000000004,58.477012194017533,1.5536947563128518,1.0153403335665783,0.17405034890492616,1,0,1742.0643052417654,1.5702222951406632,10.866384705216523,1.4786390061908004,1.0728569252461406,0.37065376464096966,1.1181910418435457,0.46392843579605691,5.4174080169939343,0.69963105557715743,1.0701269978907029,0.7055374951935669,-12.088880415862825,-159.46112035728646,20.538879642713539,null,86105,7414071025,null,20.955606280385815,-26.484232335579801,null,6.681623965538682,-119.47212267264142,null,0,0,null,0,0]
[86600.5,86.600499999999997,58.813425995318532,1.5537925870439422,1.0155160438073285,0.17503166411375401,1,0,1752.089188577557,1.5702255795630711,10.928388347659334,1.4791633454139466,1.0736690020626094,0.37259520216674552,1.1194823980850497,0.46622859150496537,5.4302524548840809,0.70247560030794598,1.0710968804909717,0.70967080079077649,-12.162608233403908,-159.759894520751,20.240105479248996,null,86600.5,7499646600.25,null,20.948614474525936,-26.565614271110739,null,6.6254322285808325,-119.65832370717241,null,0,0,null,0,0]
[87096,87.096000000000004,59.149840353111223,1.5538893049525715,1.0156927316303492,0.17601263885180785,1,0,1762.1140719320342,1.5702288266145141,10.990394960760018,1.4796817682485421,1.0744851196044822,0.3745336977796635,1.1207796635234699,0.46852343462336793,5.4431400278569306,0.70530679053945255,1.0720757494668376,0.71380405423776716,-12.236116114351788,-160.05832896000859,19.941671039991405,null,87096,7585713216,null,20.941602076354098,-26.647164490346768,null,6.5694670191520164,-119.84447750122393,null,0,0,null,0,0]
[87603.25,87.603250000000003,59.494232812715794,1.5539871833621608,1.0158746214233616,0.17701652139437757,1,0,1772.3766795828619,1.5702321126159493,11.053874987735302,1.4802064598233127,1.0753247660701062,0.37651510617154454,1.1221137912145269,0.47086718731624061,5.4563775717508483,0.70819133725386962,1.0730871907461033,0.71803523229733512,-12.311142434439351,-160.36348460709797,19.636515392902027,null,87603.25,7674329410.5625,null,20.934402040905766,-26.730816490022221,null,6.5124057390341239,-120.03499593358205,null,0,0,null,0,0]
[88110.5,88.110500000000002,59.838625835725288,1.5540839351210818,1.0160575346275158,0.17802004350511069,1,0,1782.6392872526069,1.5702353607825361,11.117358023103012,1.4807251592860193,1.076168627641052,0.37849341493645183,1.1234540682154635,0.47320536064916202,5.4696596746580894,0.71106199573790452,1.0741081541215556,0.72226628430535711,-12.385944579432469,-160.66827662706274,19.331723372937262,null,88110.5,7763460210.25,null,20.92718039168302,-26.814632049108702,null,6.4555746199682105,-120.22546324261326,null,0,0,null,0,0]
[88617.75,88.617750000000001,60.18301941246758,1.5541795795690718,1.0162414706902014,0.17902320335797034,1,0,1792.9018949409447,1.5702385717639771,11.180844015619641,1.4812379684266483,1.0770166944094925,0.38046861589343273,1.1248004725443044,0.47553794904662205,5.4829860128202812,0.71391882075743662,1.07513869245689,0.72649717352513477,-12.460525659054122,-160.97270132141611,19.02729867858389,null,88617.75,7853105615.0625,null,20.919937119033815,-26.898604903960752,null,6.3989700924759187,-120.41587853616939,null,0,0,null,0,0]
[89125,89.125,60.527413533490659,1.5542741356057868,1.016426429056118,0.18002599913115422,1,0,1803.1645026475574,1.5702417461951834,11.244332915196617,1.4817449867487915,1.0778689564494852,0.38244070098421601,1.1261529822239453,0.47786494720281097,5.4963562645460637,0.71676186743870196,1.0761788586200682,0.73072786280866064,-12.534888727458071,-161.27675508502435,18.723244914975652,null,89125,7943265625,null,20.912672217906348,-26.982728928115311,null,6.3425886469936819,-120.60624087307841,null,0,0,null,0,0]
[89644,89.644000000000005,60.879785795053003,1.5543697746923972,1.0166167293365065,0.18105164506279689,1,0,1813.6648346518207,1.5702449569764152,11.30929543706271,1.482257857574822,1.0787452921852796,0.38445523444811958,1.1275431178109447,0.4802400569902126,5.5100813442074497,0.71965656787379728,1.0772531393995581,0.73505630617773721,-12.610751834759133,-161.58746440195367,18.412535598046333,null,89644,8036046736,null,20.905216645334814,-27.068951823829959,null,6.2851284690847296,-120.80095694307175,null,0,0,null,0,0]
[90163,90.162999999999997,61.232158607063596,1.5544643130310207,1.0168080986454804,0.18207690600734192,1,0,1824.1651666745661,1.570248130793594,11.374260899705828,1.482764869885818,1.0796259987242223,0.38646648934588923,1.128939598348442,0.48260930416845421,5.5238517207265723,0.72253696209371454,1.0783376111798364,0.73938446026073001,-12.686393009945565,-161.89777805324326,18.102221946756742,null,90163,8129366569,null,20.897738434031019,-27.155320421843907,null,6.227894581456896,-120.99561542811527,null,0,0,null,0,0]
[90682,90.682000000000002,61.584531960073832,1.5545577695146773,1.0170005363795609,0.18310178002730312,1,0,1834.6654987154759,1.5702512682813883,11.439229253022347,1.4832661232380244,1.0805110653786072,0.38847445744274212,1.1303424003198466,0.48497268391701531,5.5376670562569732,0.72540311021196158,1.0794323305713591,0.74371228395759781,-12.761815352240271,-162.20769245837278,17.792307541627224,null,90682,8223225124,null,20.890237592507614,-27.241828582550021,null,6.1708834117327873,-121.19021516685015,null,0,0,null,0,0]
[91201,91.200999999999993,61.936905844850088,1.5546501626065159,1.0171940419323584,0.18412626518990771,1,0,1845.1658307742405,1.5702543700600198,11.504200448038256,1.4837617149503939,1.0814004814428926,0.39047913063680395,1.1317515002189737,0.48733019170140263,5.551527015217804,0.72825507266755174,1.0805373541682863,0.7480397357359494,-12.837021905557883,-162.51720412438721,17.482795875612794,null,91201,8317622401,null,20.882714133644601,-27.328470301315921,null,6.1140914479296828,-121.38475494824586,null,0,0,null,0,0]
[91732,91.731999999999999,62.297427643624822,1.5547436102156995,1.0173931261048397,0.18517403341226701,1,0,1855.9089450953009,1.5702575072310216,11.570676758306757,1.4842630051353582,1.0823149522762716,0.39252673628788715,1.1331996739960017,0.48973612671893052,5.5657532710385782,0.73115835836603726,1.0816786507755924,0.75246681552245787,-12.913747125985036,-162.83345176026506,17.166548239734936,null,91732,8414759824,null,20.874993332024722,-27.41724739807978,null,6.0562096414795255,-121.58372939237051,null,0,0,null,0,0]
[92263,92.263000000000005,62.657949980148828,1.5548359824649203,1.0175933267523145,0.1862213905095845,1,0,1866.6520594344167,1.5702606082913981,11.637155942972543,1.4847585680369155,1.0832339532467745,0.39457087617568909,1.1346543905595587,0.49213590640052102,5.5800255342341867,0.73404692380064251,1.0828308533696627,0.75689341667312604,-12.99025273794657,-163.14927068682056,16.850729313179443,null,92263,8512461169,null,20.867248895699866,-27.506152001415867,null,5.9985500455917329,-121.78263835482397,null,0,0,null,0,0]
[92794,92.793999999999997,63.018472845192868,1.5549272978086934,1.0177946432159493,0.18726833442733523,1,0,1877.3951737912776,1.5702636738610622,11.703637953054034,1.4852485010103234,1.0841574728343024,0.39661154205247895,1.1361156247769038,0.49452952680336787,5.59434345275828,0.73692083464990799,1.0839940224740476,0.76131949333526305,-13.066541830008447,-163.46465742589137,16.535342574108626,null,92794,8610726436,null,20.859480851667158,-27.595178096237017,null,5.9411090873322561,-121.98148038352197,null,0,0,null,0,0]
[93325,93.325000000000003,63.378996229737709,1.555017574281701,1.0179970748337615,0.18831486311623813,1,0,1888.1382881655811,1.5702667045458178,11.770122740674246,1.4857328992221042,1.0850854995014294,0.3986487258142703,1.1375833515321141,0.49691698428718889,5.6087066770390903,0.73978015687704002,1.0851682185710125,0.76574499920503669,-13.142617435621204,-163.7796085809216,16.220391419078396,null,93325,8709555625,null,20.851689231059936,-27.684319800288911,null,5.8838832546977518,-122.18025397617664,null,0,0,null,0,0]
[93868.5,93.868499999999997,63.748007040071563,1.5551089184599862,1.0182054259368343,0.18938559546363104,1,0,1899.1343007302919,1.5702697710658859,11.838175440291248,1.4862230657664073,1.0860400277880209,0.4007302515355905,1.1390923266921016,0.49935425796061367,5.6234545744834108,0.74269175027749956,1.0863815383147659,0.77027404374904862,-13.2202659238124,-164.10151929198224,15.898480708017757,null,93868.5,8811295292.25,null,20.84368981295469,-27.775673663583476,null,5.8255294765607504,-122.38363430541278,null,0,0,null,0,0]
[94412,94.412000000000006,64.117018376180994,1.5551992112165363,1.0184149439011827,0.19045588847526887,1,0,1910.130313312656,1.570272802279993,11.906230951672052,1.4867076288836512,1.0869992533377679,0.40280811255009474,1.1406080504784804,0.50178506838520542,5.6382492026883426,0.74558820080170141,1.0876065383837556,0.77480239072831636,-13.297697015397373,-164.42296671716906,15.577033282830939,null,94412,8913625744,null,20.835665773838198,-27.867136584483209,null,5.7673938166348071,-122.58693959718966,null,0,0,null,0,0]
[94955.5,94.955500000000001,64.486030229039955,1.5552884705996863,1.0186256280067829,0.19152573997090891,1,0,1921.1263259123696,1.5702757987943845,11.97428922687493,1.4871866838889267,1.0879631637263494,0.40488230063240715,1.1421304960229024,0.50420941262384478,5.6530901948400096,0.74846957999621033,1.0888432834598227,0.77932998906313888,-13.37491379195283,-164.74394745874719,15.256052541252814,null,94955.5,9016546980.25,null,20.827617159600301,-27.958702665291657,null,5.7094726993849747,-122.79016808386818,null,0,0,null,0,0]
[95499,95.498999999999995,64.855042589827889,1.5553767142470725,1.0188374775301998,0.19259514777614953,1,0,1932.1223385291371,1.5702787612015052,12.042350219040019,1.487660323952761,1.0889317465128614,0.40695280771261932,1.1436596364812519,0.50662728805905299,5.6679771868230553,0.75133595964561317,1.0900918381533686,0.78385678720622298,-13.451919279957092,-165.06445819463966,14.935541805360344,null,95499,9120059001,null,20.819544020043693,-28.050366139303705,null,5.6517626109145898,-122.99331794715214,null,0,0,null,0,0]
[96611.5,96.611500000000007,65.610382226709049,1.5555542463911709,1.0192747473320576,0.19478274527575229,1,0,1954.6302760901285,1.5702847210677902,12.181673778381448,1.4886133213851509,1.0909288741409096,0.41117945423150909,1.1468104264054153,0.51155629948220993,5.6985915687897721,0.75715673269794259,1.0926846258177729,0.7931200577758053,-13.608896774417774,-165.71903817122785,14.280961828772149,null,96611.5,9333781932.25,null,20.802942714068426,-28.238273890966315,null,5.5342783938557796,-123.40889599433594,null,0,0,null,0,0]
[97724,97.724000000000004,66.365723884404844,1.5557277373755216,1.0197168907606582,0.19696845616813458,1,0,1977.138213718968,1.5702905452386569,12.321008150956656,1.4895447653563252,1.0929454192857901,0.41539057895377518,1.1499889251967439,0.51645818248155129,5.7293941083039472,0.7629155815364016,1.0953277168791202,0.80237930533438662,-13.765026207442155,-166.37160836173061,13.628391638269392,null,97724,9549980176,null,20.786239384562958,-28.426519456779097,null,5.4176351045605102,-123.82412009320151,null,0,0,null,0,0]
[98862,98.861999999999995,67.138381011050654,1.5559011660309179,1.0201742045782198,0.19920229533293213,1,0,2000.1620636938517,1.570296367286709,12.463547064987154,1.4904760110671353,1.0950281647500624,0.41968210292888797,1.1532687094353569,0.52144434428729736,5.7610942139431538,0.76874301094836994,1.0980840112943844,0.8118461457716224,-13.923881840230877,-167.03702996320851,12.962970036791489,null,98862,9773695044,null,20.769048223493577,-28.619382798315076,null,5.2991592221624444,-124.24847726981072,null,0,0,null,0,0]
[100000,100,67.911040111100604,1.5560706483159226,1.0206366045264623,0.20143412154225263,1,0,2023.1859137349907,1.5703020568249801,12.606096543202595,1.4913861965381057,1.0971310007572559,0.42395725453564576,1.1565770029902722,0.52640210375433727,5.7929848646880409,0.77450696620042414,1.1008941048871574,0.82130779584238212,-14.081899828575876,-167.70029493774078,12.299705062259221,null,100000,10000000000,null,20.751751563560678,-28.812507142851139,null,5.1815053439612537,-124.67242628381159,null,0,0,null,0,0]
[101165,101.16500000000001,68.702033167988432,1.556240202787833,1.0211152366562364,0.20371679418933403,1,0,2046.7560239049137,1.5703077487581862,12.752038700025423,1.4922968970863828,1.0993044191198762,0.4283168134628178,1.1599930658368298,0.53144806947022594,5.8258262614112599,0.7803426261331583,1.1038272098234079,0.83098802483033773,-14.242824097267066,-168.3770357499246,11.622964250075398,null,101165,10234357225,null,20.733935993986371,-29.010438296076288,null,5.0618825374237195,-125.1059897969874,null,0,0,null,0,0]
[102330,102.33,69.493028155009256,1.5564058974027628,1.0215991844016421,0.20599731603344282,1,0,2070.3261341396378,1.5703133110891128,12.897991193729213,1.4931869875500898,1.1014986479104578,0.4326590858185651,1.1634384902800019,0.53646427588111067,5.8588607712427336,0.78611318977735745,1.10681793451165,0.84066172943946749,-14.402920097446172,-169.05146315874913,10.948536841250871,null,102330,10471428900,null,20.716011440960319,-29.208552446914421,null,4.943063376676454,-125.53908156921035,null,0,0,null,0,0]
[103520,103.52,70.300999208344408,1.5565712981708741,1.0220989973832677,0.2083245341144607,1,0,2094.4020407959579,1.5703188635292404,13.047086026476256,1.4940756181827612,1.1037613191815767,0.43707663046027762,1.1669878939167857,0.54155741493519016,5.8928001735579461,0.79194113019272416,1.1099329716443216,0.85053570553992575,-14.56562120200754,-169.73794833614517,10.262051663854834,null,103520,10716390400,null,20.697590638175857,-29.411062457513772,null,4.822495343324082,-125.98095571917671,null,0,0,null,0,0]
[104710,104.71,71.108972141227383,1.5567329402237227,1.0226043405671006,0.21064946468140641,1,0,2118.4779475153796,1.5703242897655241,13.196190929228822,1.4949441680596718,1.1060454416514931,0.44147601509389012,1.1705673852590071,0.54661953589925949,5.9269342757969232,0.79770267538298378,1.1131094347900528,0.86040168412257623,-14.727507275731046,-170.42196685515691,9.57803314484309,null,104710,10964184100,null,20.679058028953271,-29.613675287900111,null,4.7027084456859045,-126.42228735150645,null,0,0,null,0,0]
[105930,105.93,71.937316024567053,1.5568948878154532,1.0231281560009362,0.21303060945710894,1,0,2143.160809929665,1.5703297262338689,13.349064879865843,1.4958144707272043,1.1084092773991188,0.44596739591546913,1.1742680628612239,0.55177709911954487,5.9621275260792803,0.80354134909151564,1.1164304302261019,0.87050744075620679,-14.892653000410101,-171.12064216586384,8.8793578341361581,null,105930,11221164900,null,20.659943225173663,-29.821459270343038,null,4.5806839227328497,-126.87415392336722,null,0,0,null,0,0]
[107150,107.15,72.765661751652942,1.5570531482711298,1.023657766462388,0.21540930383934728,1,0,2167.8436724058502,1.5703350389039876,13.501948712477645,1.4966650649893085,1.1107953771082006,0.45043957075907248,1.1779997797934869,0.55690212126297012,5.9975183630896085,0.8093118767821984,1.119817375944703,0.8806034792704821,-15.056991180193485,-171.81667149022132,8.1833285097786757,null,107150,11481122500,null,20.640713157936453,-30.029264946642662,null,4.4594231169360521,-127.3253928278727,null,0,0,null,0,0]
[108400,108.4,73.614378483188958,1.5572116062728154,1.0242064012615235,0.21784392503866357,1,0,2193.1334905787107,1.5703403581824309,13.658601886062966,1.4975168249645816,1.1132630935977414,0.45500173962013402,1.1818551463945901,0.5621194595427611,6.0339807664464553,0.81515448802590407,1.1233567369052728,0.89093699519830605,-15.224557449750906,-172.52704484002567,7.4729551599743331,null,108400,11750560000,null,20.620891932923552,-30.242160488514315,null,4.3359439472755419,-127.7870451338885,null,0,0,null,0,0]
[109650,109.65,74.463097020968874,1.5573664521201089,1.0247611004001993,0.22027592493873979,1,0,2218.423308812211,1.5703455561823207,13.815264744167644,1.4983492678928994,1.1157538780859941,0.45954363369201234,1.1857424741122984,0.56730272919525826,6.0706432736141087,0.8209273175033347,1.1269668029081119,0.90125886630738361,-15.391324958792495,-173.23458618356753,6.7654138164324706,null,109650,12023122500,null,20.600952315628756,-30.454994207049104,null,4.2132093689655221,-128.24797346911777,null,0,0,null,0,0]
[110925,110.925,75.328791726981692,1.5575208002539171,1.0253331307965357,0.22275383897661155,1,0,2244.2189234707253,1.5703507374530399,13.975070498658086,1.4991791318048278,1.1183180830601556,0.46415542539444066,1.1897401498135562,0.57255462570307458,6.1082414421585902,0.82674463218163585,1.1307226730232915,0.91177441023895611,-15.560629208115772,-173.95333339182133,6.0466666081786684,null,110925,12304355625,null,20.580493372155601,-30.671979573060668,null,4.0887588802168544,-128.71733923649427,null,0,0,null,0,0]
[112200,112.2,76.19448818679956,1.5576716410868205,1.0259114497545685,0.22522897453624474,1,0,2270.0145381881175,1.5703558009676295,14.134885659794451,1.4999902306606672,1.1209059640029881,0.46874601949855393,1.1937704211111353,0.57777120358529255,6.1460403000472956,0.8324912020068721,1.1345536425235241,0.92227627578348992,-15.729150677918662,-174.66907923311095,5.3309207668890508,null,112200,12588840000,null,20.559914198010247,-30.888818817739761,null,3.965026832588372,-129.18587953155921,null,0,0,null,0,0]
[113510,113.51,77.083950627735618,1.5578230938040762,1.0265121828344654,0.22776913414908548,1,0,2296.5182678785604,1.5703608850021669,14.299097369793362,1.5008047103972169,1.1235893726358095,0.47344050281417999,1.1979449315451685,0.58309427326594065,6.1850819359657017,0.83832281470970849,1.1385688001167356,0.93305134172782445,-15.901507068936215,-175.40131870509316,4.5986812949068394,null,113510,12884520100,null,20.538646499664182,-31.111417941292732,null,3.838618402112016,-129.66638251108293,null,0,0,null,0,0]
[114820,114.82,77.973414796478181,1.5579710911991362,1.0271195316200348,0.23030630605966004,1,0,2323.0219976270077,1.570365853027577,14.463318350089541,1.5016006949432619,1.1262974248183597,0.47811251399510585,1.2021531495329281,0.58838022432773263,6.2243276351078363,0.84408173211900195,1.1426648655236271,0.94381025320872602,-16.073085325131892,-176.13033289958855,3.8696671004114478,null,114820,13183632400,null,20.517255214817883,-31.333782555894299,null,3.71291229974883,-130.14593311538223,null,0,0,null,0,0]
[116155,116.155,78.87985518932355,1.5581184791229863,1.0277452651785783,0.23288879520518135,1,0,2350.0315238023431,1.5703708005753332,14.630682532718758,1.5023934858176309,1.1290823272725619,0.48285052321509081,1.2064759904252396,0.59372896235288053,6.2645282702579417,0.8498767963248911,1.146923178891871,0.9547569597587362,-16.24716124163939,-176.86991240313796,3.1300875968620403,null,116155,13491984025,null,20.495330353985306,-31.56011039021967,null,3.5855021141155157,-130.63361217813434,null,0,0,null,0,0]
[117490,117.49,79.786297256757592,1.558262518138652,1.0283778446595628,0.23546812443531356,1,0,2377.0410500338967,1.5703756356884124,14.798055702979699,1.5031683434730869,1.1318924511370227,0.48756511193858126,1.2108331003594295,0.59903935717364698,6.3049328734372239,0.85559844973110066,1.1512672086974822,0.96568504639003139,-16.420476309616852,-177.6060841703495,2.3939158296504957,null,117490,13803900100,null,20.473280823213955,-31.786117384665761,null,3.4587664295166927,-131.12021356963848,null,0,0,null,0,0]
[118860,118.86,80.71650540481491,1.5584069700191505,1.0290341128764886,0.23811176141473717,1,0,2404.7586912418396,1.5703804846430571,14.969825961888715,1.503945501013876,1.1348022740772739,0.49237891806515444,1.2153396835551131,0.60444923173122311,6.3466047484212336,0.86139487811962867,1.1558151216567636,0.97687929704844367,-16.597567704709636,-178.35798338540405,1.6420166145959456,null,118860,14127699600,null,20.450525590888063,-32.017678136909431,null,3.3293820876867795,-131.61840412935592,null,0,0,null,0,0]
[120230,120.23,{"$f":"SQRT(1+(A589/pole1)^2)","v":81.646715198752887},{"$f":"ATAN(A589/pole1)","v":1.5585481303909656},{"$f":"SQRT(1+(A589/Zero1)^2)","v":1.0296975636275161},{"$f":"ATAN(A589/Zero1)","v":0.24075201015075662},{"$f":"IF(VIN_nom>Vout, 1, SQRT(1+(A589/z_RHP)^2))","v":1},{"$f":"IF(VIN_nom>Vout, 0, -ATAN(A589/z_RHP))","v":0},{"$f":"SQRT(1+(A589/Pole2)^2)","v":2432.4763325050349},{"$f":"ATAN(A589/Pole2)","v":1.5703852230917259},15.141605057042355,1.5047050255479872,{"$f":"SQRT(1+(A589/pole4)^2)","v":1.1377382586200924},{"$f":"ATAN(A589/pole4)","v":0.49716799020800351},{"$f":"IF(VOUT_setting=1,1,SQRT(1+(A589*zterm1)^2))","v":1.2198815723761207},{"$f":"IF(VOUT_setting=1,0,ATAN(((A589*zterm1))))","v":0.60981897815512776},6.3884832033962011,{"$f":"IF(VOUT_setting=1,0,ATAN(A589*$Q$4/(1+Afbr-$Q$5*(A589)^2)))","v":0.86711620895722696},{"$f":"SQRT((1-(Z589/pterm2))^2+(A589/pterm1)^2)","v":1.1604550783255956},{"$f":"IF((ATAN((A589/pterm1)/(1-A589^2/pterm2))>0),ATAN((A589/pterm1)/(1-A589^2/pterm2)),PI()+ATAN((A589/pterm1)/(1-A589^2/pterm2)))","v":0.9880519387530774},{"$f":"20*LOG10(((E589*K589*G589*O589)/(C589*I589*S589*M589*Q589))*Adc)","v":-16.773904692671881},{"$f":"((F589+L589+H589+P589)-(D589+J589+T589+N589+R589))*radconv","v":-179.10623325353237},{"$f":"IF(V589>0,V589,V589+180)","v":0.89376674646763377},null,{"$f":"IF(U589<0,A589,1000000000)","v":120230},{"$f":"A589^2","v":14455252900},null,{"$f":"20*LOG10((K589/(I589*M589))*AEA)","v":20.427643143815008},{"$f":"(L589-(J589+N589))*radconv","v":-32.248825701611423},null,{"$f":"20*LOG10((E589*G589/(C589*S589))*Acs*Am)","v":3.2006538050364561},{"$f":"(F589+H589-(D589+T589))*radconv","v":-132.11536212971197},null,{"$f":"SUM((U590<0)*(U589>0))*A589","v":0},0,null,0,0]
[126030,{"$f":"A590/1000","v":126.03},85.584846653154457,1.5591117495086131,1.0325855825459511,0.25189147845553045,1,0,2549.8210917081774,1.570404142406397,15.868936307407719,1.5077383494821821,1.1504531583619912,0.51716832919795819,1.2394921455286623,0.63211097568950991,6.5679761314879448,0.89053122360499626,1.1811383619661255,1.0350893880165739,-17.512578525012021,-182.23289554720492,-2.2328955472049188,null,126030,15883560900,null,20.32940791620037,-33.222048053235412,null,2.6623692080828327,-134.204457930769,null,0,0,null,{"$f":"SUM((V591<-183)*(V590>-183))*A590","v":126030},{"$f":"IF(AK590>0,U590,0)","v":-17.512578525012021}]
[131830,131.83000000000001,89.523002903031013,1.559625781072312,1.0356010087978975,0.26296744359955176,1,0,2667.1658517436949,1.5704213969708758,16.596400770221702,1.5105057797130343,1.1636180918335328,0.53672378667390896,1.2596993106450489,0.65369823593238052,{"$f":"IF(VOUT_setting=1,1,SQRT((1+Afbr-$Q$5*(A591)^2)^2+(A591*$Q$4)^2))","v":6.7508118559802126},0.91270165025449501,1.2035506337262547,1.0816444080629741,-18.239618806602863,-185.29143219192594,-5.2914321919259351,null,131830,17379148900,null,20.229093103555982,-34.184919775552395,null,2.1336702580429545,-136.26670987928117,null,0,0,null,0,0]
[144540,144.54,98.153069152842988,1.560607982108019,1.0426489961583965,0.28700664381154783,1,0,2924.3127334839905,1.5704543660982724,18.190939073851816,1.5157961784621605,1.1939676502368977,0.57802451502672481,1.3059305350734873,0.69860906362239361,7.1619063353521648,0.95730901578766403,1.2589907643761695,1.1816111603776001,-19.797936537057833,-191.74577825371216,-11.74577825371216,null,144540,20891811600,null,20.00279945275966,-36.250048674932636,null,1.0020351300630777,-140.67331414253621,null,0,0,null,0,0]
[158490,158.49,107.62518375038249,1.5615046874741421,1.0510681468354115,0.31300329165975727,1,0,3206.547118925314,1.570484464851466,19.941529848623222,1.5206286818736892,1.229498556817193,0.62092661698188012,1.3594840534865722,0.74428395261377089,7.6273175849309611,1.0007048702862487,1.3303400150050098,1.287371939211531,-21.46178571191582,-198.41967655432637,-18.419676554326372,null,158490,25119080100,null,19.745881044354945,-38.433000533260795,null,-0.20711260119698416,-145.29483964277316,null,0,0,null,0,0]
[173780,173.78,118.00724723579759,1.5623221695538678,1.061098055668301,0.34100219785949842,1,0,3515.8921936288975,1.5705119039632482,21.860722877055185,1.5250362168091103,1.2708866220142545,0.66510457550928848,1.4211781111454627,0.79028677965398197,8.1515823006195856,1.0425671699555583,1.4217562687109155,1.3976006627008741,-23.237765425674716,-205.22095113917592,-25.220951139175924,null,173780,30199488400,null,19.456467788117614,-40.713250102433463,null,-1.5017651453400938,-150.05309940203222,null,0,0,null,0,0]
[190550,190.55,129.39432100292149,1.5630679354173569,1.0730360877063994,0.37108317522410866,1,0,3855.1804174019194,1.5705369355594825,23.966091076703062,1.5290585901070586,1.3189418257651606,0.71027352735131055,1.491997834655534,0.83626115467578432,8.7405347452613444,1.0827175267503295,1.5384036112178625,1.5107842188448466,-25.133056865250531,-212.05037524675495,-32.050375246754953,null,190550,36309302500,null,19.132561723593092,-43.072209601926652,null,-2.8896224614058212,-154.8572556747155,null,0,0,null,0,0]
[208930,208.93,141.8746769269853,1.5637477942307343,1.0872091582219492,0.40326096824146423,1,0,4227.0419315134104,1.5705597547368169,26.273955243798074,1.5327266268997264,1.3744709790538647,0.75604845646095109,1.57289225895781,0.88178876485254898,9.3996249685230318,1.1209755435872095,1.68623098354467,1.6249634500625449,-27.148115716512887,-218.78500226157999,-38.78500226157999,null,208930,43651744900,null,18.773091080828539,-45.486064265412473,null,-4.3723758604960929,-159.59454504368244,null,0,0,null,0,0]
[229090,229.09,155.5637481069385,1.5643680496459667,1.1040136117530615,0.4375654931895312,1,0,4634.9161514907591,1.5705805731598634,28.805661339423718,1.536073952014686,1.4384172777936501,0.80208632393188106,1.6649832749302218,0.9265367099954146,10.135696939499237,1.1572716434048365,1.872413053295122,1.7382372889438773,-29.281340112948037,-225.3080743296311,-45.308074329631097,null,229090,52482228100,null,18.377046125661963,-47.933244978107055,null,-5.9489115006420255,-164.15469146582586,null,0,0,null,0,0]
[251190,251.19,170.57017797493651,1.5649336036595722,1.1238799939485884,0.47394501064505046,1,0,5082.0401743182265,1.5705995554251018,31.581302433189535,1.5391267279156235,1.5117048284457382,0.84797277932959692,1.769344222639085,0.97014350685090234,10.955219440054572,1.191534295587068,2.1050681743225494,1.8486531935770616,-31.523436908075112,-231.50234731738001,-51.502347317380014,null,251190,63096416100,null,17.944523424069242,-50.388521640777817,null,-7.6111854415828653,-168.42906784445299,null,0,0,null,0,0]
[275420,275.42,187.0229810630544,1.5654493648368948,1.1473069621666567,0.51232666667193849,1,0,5572.2580526799529,1.570616866332744,{"$f":"SQRT(1+(A599/Zero2)^2)","v":34.624741460089822},{"$f":"ATAN(A599/Zero2)","v":1.5419112281770857},1.5953567795400263,0.89333238182950636,1.8871773283120832,1.0123232207328621,11.865748567769206,1.2237615078884003,2.3937743200764969,1.9546249331508789,-33.862443916678998,-237.27465396323004,-57.274653963230037,null,275420,75856176400,null,17.475974504367862,-52.828887156114781,null,-9.3481698874675967,-172.33124531178487,null,0,0,null,0,0]
[302000,302,205.07154314718514,1.5659199604896441,1.1748669182273679,0.55260461445728504,1,0,6110.0207949647838,1.5706326612300776,37.963612003913788,1.5444522666587399,1.6905007973720103,0.9378279546859527,2.0198239493630856,1.0528548572168501,12.875980698899218,1.2539972224901681,2.7499204367273546,2.0550007409483042,-36.284658123034944,-242.5597807125086,-62.559780712508598,null,302000,91204000000,null,16.972213731798004,-55.233609890929777,null,-11.146935949246693,-175.80156219697017,null,0,0,null,0,0]
[331130,331.13,224.85166980890986,1.5663489357774971,1.2071529342578167,0.59455926987025787,1,0,6699.374772446412,1.5706470591337074,41.6230372801543,1.546768858073061,1.7981857088175641,0.98109106720750239,2.1685148916128973,1.0915110606223981,13.993861698575685,1.2822695503124342,3.1863650116358682,2.1489112398942258,-38.771565494271677,-247.31314528531792,-67.313145285317916,null,331130,109647076900,null,16.435323628353188,-57.580497677910842,null,-12.990785837692648,-178.80299122938922,null,0,0,null,0,0]
[363080,363.08,246.54669897728857,1.5667402889486768,1.2448722032453141,0.63798864263945743,1,0,7345.7825863575499,1.5706601942601621,45.636935727856624,1.5488824970312789,1.9197058954193746,1.0228760011160041,2.334825480189918,1.1281884045335886,15.230032473498751,1.3086812041558378,3.7191233912307333,2.2360553892540622,-41.309128385816358,-251.52581001724562,-71.525810017245618,null,363080,131827086400,null,15.866898719002583,-59.854248036288119,null,-14.866499088015521,-181.33008631828531,null,0,{"$f":"IF(AH602>0,W602,0)","v":0},null,0,0]
[398110,398.11,270.33317863312936,1.5670971793736472,1.2887572504733524,0.68259034915124295,1,0,8054.5045193783271,1.5706721726647248,50.037971405066386,1.5508101732916788,2.0563114518287042,1.0629372449555798,2.5202759138143027,1.1627879785436381,16.594788898134535,1.3333176573078056,4.366769475824408,2.3163393653547097,-43.881577581281817,-255.20543580358299,-75.205435803582986,null,398110,158491572100,null,15.269463992189339,-62.039826830875924,null,-16.759968795796489,-183.39497808663401,null,0,0,null,0,0]
[436520,436.52,296.41481827637585,1.5674226698949338,1.3396173831355604,0.72803734190241898,1,0,8831.6101284571414,1.5706830971586705,54.863835171700927,1.5525683743487733,2.2093957609233992,1.1011034562297324,2.7265910958834718,1.1952741902939821,18.100014327522477,1.356289039915741,5.1518297971550178,2.3899442611072841,-46.476110070614133,-258.3789057429243,-78.378905742924303,null,436520,190549710400,null,14.645479728707642,-64.126478086563282,null,-18.659811755511427,-185.02695632355892,null,0,0,null,0,0]
[478630,478.63,325.00890831248927,1.5677194831999881,1.3983098127095548,0.77395893443898867,1,0,9683.5736076814137,1.5706930591333605,60.154732075154975,1.5541717649414417,2.3804230483617315,1.1372480923710586,2.955601149361748,1.2256433401581843,19.758418465886106,1.3777078620905836,6.1011924908176205,2.4571854106822189,-49.081433169770811,-261.08425490139433,-81.084254901394331,null,478630,229086676900,null,13.997624415295826,-66.106116456993846,null,-20.556330623909421,-186.2654831140438,null,0,0,null,0,0]
[524810,524.80999999999995,356.3666910441396,1.5679902247166149,1.4657759395810603,0.81998453945342842,1,0,10617.880743973839,1.5707021460421089,65.957150660745071,1.5556343874892007,2.5710542431428225,1.1713096288704756,3.2094086836574052,1.2539368937359228,21.584729487222837,1.3976999833691239,7.2476714836943454,2.5184920895591545,-51.689510214509006,-263.36797208199687,-83.367972081996868,null,524810,275425536100,null,13.328280641997313,-67.974417286788935,null,-22.442759206387105,-187.15653650005237,null,0,0,null,0,0]
[575440,575.44000000000005,390.74619933263085,1.5682371180468644,1.5429797677058301,0.86571385601422657,1,0,11642.21964283018,1.5707104325211318,72.318837139143852,1.556968230137824,2.7829883746184718,1.203250801614816,3.4901746463989309,1.2802052056390434,23.594128028795797,1.4163812716376747,8.6301369172467464,2.5742951304963029,-54.292868942969328,-265.27874110433294,-85.278741104332937,null,575440,331131193600,null,12.640109646336072,-69.728562905716714,null,-24.313243229194992,-187.74786433728423,null,0,0,null,0,0]
[630960,630.96,428.44620828425792,1.5684623093882666,1.6309764526687121,0.91078014325135725,1,0,12765.492321147458,1.5707179906073165,79.295077750123426,1.5581848692238873,3.0181731746053226,1.2330874516888362,3.8003963566919818,1.3045307579546745,25.804234965784154,1.4338766166065677,10.296016885851575,2.6250594707182717,-56.887083188046262,-266.86701483856632,-86.86701483856632,null,630960,398110521600,null,11.935314689605001,-71.368801793258498,null,-26.164556069945508,-188.08724123859039,null,0,0,null,0,0]
[691830,691.83,469.77907388070457,1.5686676650242906,1.7308488603112011,0.95482549916513704,1,0,13997.00543296071,1.5707248829417353,86.943672761950438,1.5592943736598746,3.2786425361311111,1.2608534053352809,4.1426892689194013,1.3269993088747731,28.233537668701342,1.4503020296638778,12.30172283063421,2.6712145611268729,-59.468266552587039,-268.18111037744148,-88.181110377441485,null,691830,478628748900,null,11.216200213746072,-72.896498733241373,null,-27.994208065037949,-188.21988613243178,null,0,0,null,0,0]
[758580,758.58,515.10468471696231,1.5688549726239627,1.8437860106907273,0.99754999735682082,1,0,15347.481862272918,1.5707311695261224,95.331219113328387,1.5603063912907909,3.5667325656856694,1.2866181840032946,4.520069195517066,1.3477150923578112,30.903395250165513,1.4657781494886091,14.715999054017614,2.7131849574363054,-62.034941782008147,-269.26701377822383,-89.267013778223827,null,758580,575443616400,null,10.484573994510189,-74.315087668336844,null,-29.801693598637598,-188.18741121215075,null,0,0,null,0,0]
[831760,831.76,564.79651024503744,1.5690257766864319,1.9710010749104425,1.0386820823276806,1,0,16828.049130224459,1.5707369022001114,104.52682767298306,1.5612292589212839,3.8848709507486374,1.3104566391096844,4.9356731795795925,1.3667773222053212,33.836059678797014,1.4804153476820983,17.620412488702623,2.7513446778999682,-64.585518230936387,-270.16625545718716,-90.166255457187162,null,831760,691824697600,null,9.7423726125827965,-75.628382575294125,null,-31.586623179499735,-188.02689362243368,null,0,0,null,0,0]
[912010,912.01,619.28913325149063,1.5691815714554604,2.1138523823268431,1.0780242960255404,1,0,18451.655625056501,1.570742131116156,114.61091917816715,1.5620710439360708,4.2358824495601821,1.3324682246689974,5.3931573150418828,1.384296924680849,37.057497718828763,1.4943283838497727,21.114566885447953,2.7860557236513506,-67.120518778539889,-270.91643425441225,-90.916434254412252,null,912010,831762240100,null,8.9909596867239401,-76.841622395836339,null,-33.350218512497207,-187.77047362732677,null,0,0,null,0,0]
[1000000,1000,679.03750772483227,1.5693236535624389,2.2737431363130325,1.1154165545890451,1,0,20231.856690713503,1.5707468997939202,125.66768481059256,1.562838747601569,4.6227311496843271,1.3527502943073753,5.8963578914950547,1.4003763891572458,40.595014662057451,1.5076228703555021,25.31692680831403,2.8176328548362704,-69.640033785287073,-271.55018925556004,-91.550189255560042,null,1000000,1000000000000,null,8.2318093276808213,-77.959986432343698,null,-35.093465868547149,-187.44543207590567,null,0,0,null,0,0]
[]
[]
["Pole/Zero Locations for Chart"]
[{"$f":"U4*1000","v":28023.5},null,{"$f":"SQRT(1+(A617/pole1)^2)","v":19.055244549409313},{"$f":"ATAN(A617/pole1)","v":1.5182932180257254},{"$f":"SQRT(1+(A617/Zero1)^2)","v":1.0016360105626734},{"$f":"ATAN(A617/Zero1)","v":5.7162631673968768E-2},{"$f":"IF(VIN_nom>Vout, 1, SQRT(1+(A617/z_RHP)^2))","v":1},{"$f":"IF(VIN_nom>Vout, 0, -ATAN(A617/z_RHP))","v":0},{"$f":"SQRT(1+(A617/Pole2)^2)","v":566.96831716383008},{"$f":"ATAN(A617/Pole2)","v":1.5690325588942808},{"$f":"SQRT(1+(A617/Zero2)^2)","v":3.6607679374954851},{"$f":"ATAN(A617/Zero2)","v":1.2941128954628014},{"$f":"SQRT(1+(A617/pole4)^2)","v":1.0079665758510985},{"$f":"ATAN(A617/pole4)","v":0.12580973182129906},{"$f":"IF(VOUT_setting=1,1,SQRT(1+(A617*zterm1)^2))","v":1.0131721534829365},{"$f":"IF(VOUT_setting=1,0,ATAN(((A617*zterm1))))","v":0.16142597215232643},{"$f":"IF(VOUT_setting=1,1,SQRT((1+Afbr-$Q$5*(A617)^2)^2+(A617*$Q$4)^2))","v":4.3076261988373847},{"$f":"IF(VOUT_setting=1,0,ATAN(A617*$Q$4/(1+Afbr-$Q$5*(A617)^2)))","v":0.26671736906553034},{"$f":"SQRT((1-(A617^2/(pole3^2)))^2+(A617/(Q*pole3))^2)","v":1.0060434421092752},{"$f":"ATAN((A617/(Q*pole3))/(1-A617^2/pole3^2))","v":0.22641299668814072},{"$f":"20*LOG10(((E617*K617*G617*O617)/(C617*I617*S617*M617*Q617))*Adc)","v":4.5049390646474431E-2},{"$f":"((F617+L617+H617+P617)-(D617+J617+T617+N617+R617))*radconv","v":-125.68198093316087},{"$f":"IF(V617>0,V617,V617+180)","v":54.318019066839128},"crossover",null,null,null,{"$f":"20*LOG10((K617/(I617*M617))*AEA)","v":21.797370118302872},{"$f":"(L617-(J617+N617))*radconv","v":-22.960103101049764},null,{"$f":"20*LOG10((E617*G617/(C617*S617))*Acs*Am)","v":16.839374480430074},{"$f":"(F617+H617-(D617+T617))*radconv","v":-96.689125163054314}]
[{"$f":"A617","v":28023.5},null,null,null,null,null,null,null,null,null,null,null,null,null,null,null,null,null,null,null,null,-180]
[{"$f":"A618","v":28023.5}]
[1000000,null,null,null,null,null,null,null,null,null,null,null,null,null,null,null,null,null,null,null,null,{"$f":"V617","v":-125.68198093316087}]
[]
[{"$f":"pole1","v":1472.6742970867483},null,1.4142135623730951,0.78539816339744828,1.000004521774436,3.0072437205377498E-3,{"$f":"IF(VIN_nom>Vout, 1, SQRT(1+(A622/z_RHP)^2))","v":1},{"$f":"IF(VIN_nom>Vout, 0, -ATAN(A622/z_RHP))","v":0},29.811711946736349,1.537246169440547,1.0169797620760073,0.18299143334946938,1.0000220882874606,{"$f":"ATAN(A622/pole4)","v":6.6464849193232046E-3},{"$f":"IF(VOUT_setting=1,1,SQRT(1+(A622*zterm1)^2))","v":1.0000366157903902},{"$f":"IF(VOUT_setting=1,0,ATAN(((A622*zterm1))))","v":8.5574146985813466E-3},{"$f":"IF(VOUT_setting=1,1,SQRT((1+Afbr-$Q$5*(A622)^2)^2+(A622*$Q$4)^2))","v":4.1569903913614565},{"$f":"IF(VOUT_setting=1,0,ATAN(A622*$Q$4/(1+Afbr-$Q$5*(A622)^2)))","v":1.4353179429925823E-2},{"$f":"SQRT((1-(A622^2/(pole3^2)))^2+(A622/(Q*pole3))^2)","v":1.0000162094026939},{"$f":"ATAN((A622/(Q*pole3))/(1-A622^2/pole3^2))","v":1.1868304632617158E-2},{"$f":"20*LOG10(((E622*K622*G622*O622)/(C622*I622*S622*M622*Q622))*Adc)","v":37.395877949796372},{"$f":"((F622+L622+H622+P622)-(D622+J622+T622+N622+R622))*radconv","v":-123.81367069000147},56.186329309998527,"p1",null,null,null,{"$f":"20*LOG10((K622/(I622*M622))*AEA)","v":36.324340605644082},{"$f":"(L622-(J622+N622))*radconv","v":-77.973896387194614},null,{"$f":"20*LOG10((E622*G622/(C622*S622))*Acs*Am)","v":39.467399635765076},{"$f":"(F622+H622-(D622+T622))*radconv","v":-45.507701444270623}]
[{"$f":"Zero1","v":489707.51776540431},null,332.53091541088583,1.5677890830743588,1.4142135623730951,0.78539816339744828,1,0,9907.6923581581486,1.5706953951182208,61.546586002155401,1.5545477569068618,2.425884269910715,1.1459060482385992,{"$f":"IF(VOUT_setting=1,1,SQRT(1+(A623*zterm1)^2))","v":3.016254231904083},{"$f":"IF(VOUT_setting=1,0,ATAN(((A623*zterm1))))","v":1.2328640339955295},{"$f":"IF(VOUT_setting=1,1,SQRT((1+Afbr-$Q$5*(A623)^2)^2+(A623*$Q$4)^2))","v":20.195854758823163},{"$f":"IF(VOUT_setting=1,0,ATAN(A623*$Q$4/(1+Afbr-$Q$5*(A623)^2)))","v":1.3828028745731948},6.366199594945015,-0.66864018947517589,-49.729378209880295,-81.689071401820499,98.310928598179501,"z1",null,null,null,{"$f":"20*LOG10((K623/(I623*M623))*AEA)","v":13.833252098284907},{"$f":"(L623-(J623+N623))*radconv","v":-66.580771877280924},null,-21.026144504857882,-6.5174367645379601]
[{"$f":"Pole2","v":49.427001016694518},null,1.0005630706094577,3.3550157354349484E-2,1.0000000050936018,1.0093167667589633E-4,1,0,1.4142135623730951,0.78539816339744828,1.0000192891932314,6.2111002528663179E-3,1.0000000248818086,2.2307760081747828E-4,1.0000000412469141,2.8721738340646059E-4,4.156566135036095,4.8176483642731562E-4,1.0000000182577096,3.9833006403560491E-4,66.733510091315409,-46.607380466472414,133.39261953352758,"p2",null,null,{"$f":"Pole2","v":49.427001016694518},{"$f":"20*LOG10((K624/(I624*M624))*AEA)","v":62.655891943498283},{"$f":"(L624-(J624+N624))*radconv","v":-44.656911625436827},null,42.472911601695159,-1.9393220930497321]
[{"$f":"Zero2","v":7957.747163687819},null,5.4953548338540381,1.3878048934454272,1.0001320225350252,1.6248569888034858E-2,1,0,161.00310556011027,1.5645852265420304,1.4142135623730951,0.78539816339744828,1.0006447535128438,3.5900063530806735E-2,1.0010685903393433,4.6209082119117242E-2,4.1689496424275569,7.7411028733382889E-2,1.0004743986916216,6.414470913503742E-2,13.797098188344211,-130.74840211278669,49.251597887213308,"z2",null,null,{"$f":"Zero2","v":7957.747163687819},{"$f":"20*LOG10((K625/(I625*M625))*AEA)","v":24.534041014647066},{"$f":"(L625-(J625+N625))*radconv","v":-46.701052347308604},null,27.674913369405797,-82.259609909845352]
[{"$f":"pole3","v":200000},null,135.8110359134561,1.5634330883839349,1.0801834631196801,0.38773275398359974,1,0,4046.371456767502,1.5705491917948444,25.152627700226027,1.5310285681469391,1.3471398336069167,0.73427992065309866,1.5331932218033837,0.8602690958699768,9.0778096708859621,1.1030684002371396,1.6117913390700369,{"$error":"#DIV/0!"},-26.177286262017724,{"$error":"#DIV/0!"},{"$error":"#DIV/0!"},"p3",null,null,null,{"$f":"20*LOG10((K626/(I626*M626))*AEA)","v":18.948123296546058},{"$f":"(L626-(J626+N626))*radconv","v":-44.335505424034118},null,-3.6571259988947524,{"$error":"#DIV/0!"}]
[{"$f":"Fp2_u","v":221568.6380688971},null,{"$f":"SQRT(1+(A627/pole1)^2)","v":150.45657588985216},{"$f":"ATAN(A627/pole1)","v":1.5641498418755735},{"$f":"SQRT(1+(A627/Zero1)^2)","v":1.0975936743825294},{"$f":"ATAN(A627/Zero1)","v":0.4248902785562973},1,0,{"$f":"SQRT(1+(A627/Pole2)^2)","v":4482.7450386295586},{"$f":"ATAN(A627/Pole2)","v":1.5705732491940791},{"$f":"SQRT(1+(A627/Zero2)^2)","v":27.861088152979388},{"$f":"ATAN(A627/Zero2)","v":1.5348962632640899},{"$f":"SQRT(1+(A627/pole4)^2)","v":1.4142135623730951},0.78539816339744828,1.6302495768716252,0.91043404500590408,9.8596549133247517,1.1443503898100145,1.8000231201096586,-1.4441728870833741,-28.495099081958983,-42.976313516057218,{"$f":"IF(V627>0,V627,V627+180)","v":137.02368648394278},"p4",null,null,null,null,null,null,-5.3671521266698115,17.470246588951504]
[{"$f":"z_RHP","v":0},null,{"$f":"SQRT(1+(A628/pole1)^2)","v":1},{"$f":"ATAN(A628/pole1)","v":0},{"$f":"SQRT(1+(A628/Zero1)^2)","v":1},{"$f":"ATAN(A628/Zero1)","v":0},1,0,{"$f":"SQRT(1+(A628/Pole2)^2)","v":1},{"$f":"ATAN(A628/Pole2)","v":0},{"$f":"SQRT(1+(A628/Zero2)^2)","v":1},{"$f":"ATAN(A628/Zero2)","v":0},{"$f":"SQRT(1+(A628/pole4)^2)","v":1},0,1,0,4.1565656565656566,0,1,0,69.748532870578387,0,{"$f":"IF(V628>0,V628,V628+180)","v":180},"z_RHP",null,null,null,null,null,null,42.477801108801792,0]
[{"$f":"Fp2_u","v":221568.6380688971},null,null,null,null,null,null,null,null,null,null,null,null,null,null,null,null,null,null,null,-25]
[]
[null,null,null,"System","Plant"]
["p1","p-dom",{"$f":"pole1","v":1472.6742970867483},{"$f":"U622","v":37.395877949796372},{"$f":"AE622","v":39.467399635765076}]
["z1","ESR zero",{"$f":"Zero1","v":489707.51776540431},{"$f":"U623","v":-49.729378209880295},{"$f":"AE623","v":-21.026144504857882}]
["p2","EA pole",{"$f":"Pole2","v":49.427001016694518},{"$f":"U624","v":66.733510091315409},{"$f":"AE624","v":42.472911601695159}]
["z2","EA zero",{"$f":"Zero2","v":7957.747163687819},{"$f":"U625","v":13.797098188344211},{"$f":"AE625","v":27.674913369405797}]
["p3","p_sampling",{"$f":"pole3","v":200000},{"$f":"U626","v":-26.177286262017724},{"$f":"AE626","v":-3.6571259988947524}]
[]
[]
[{"$f":"U4*1000","v":28023.5}]
[{"$f":"U4*1000","v":28023.5}]
[]
[]
[]
[]
["Gain Margin"]
[{"$f":"AL7*1000","v":126030},0]
[{"$f":"AL7*1000","v":126030},{"$f":"AL9","v":-17.512578525012021}]
[]
[]
[]
[]
[]
[]
[]
[]
[]
[]
[]
[]
[]
[]
[]
[]
[]
[]
[]
[]
[]
[]
[]
[]
[]
[]
[]
[]
[]
[]
[]
[]
[]
[]
[]
[]
[]
[]
[]
[null,null,null,null,null,null,null,null,null,null,null,null,null,null,null,null,null,null,null,null,null,null,null,null,null,null,null,null,null,null,null,null,null,"phase margin",{"$f":"SUM(AI689:AI1306)","v":0}]

{"sheet":"Variable Management","index":7,"n_rows":454,"n_cols":30,"rows_kept":454,"cut":false,"hidden":true,"merged":[[4,4,4,7],[0,0,0,8]]}
["EXCEL Variables Names/Calculations"]
[null,"Input from user ="]
[null,"Output ="]
[null,"Constant"]
["Variable Name","Value","STD Units",null,"Notes",null,null,null,"Iteration"]
["Step 1: Operational Specs"]
["VIN_min",{"$f":"'Design Regulator'!E6","v":42},"V","Minimum input voltage",null,null,null,null,1]
["VIN_nom",{"$f":"'Design Regulator'!E7","v":48},"V","Nominal input voltage",null,null,null,null,null,null,{"$f":"CHOOSE(SCH_MODE, \"Efficiency vs. IOUT (Ch1)\", \"Efficiency vs. IOUT - 2 Ph\", \"Efficiency vs. IOUT - 3 Ph\", \"Efficiency vs. IOUT - 4 Ph\")","v":"Efficiency vs. IOUT (Ch1)"},1,null,"DITHER Enabled",1,null,null,null,null,"Dual  Outputs",1,null,"FPWM",1,null,"Internal Compensation",1,null,{"$f":"CHOOSE(SCH_MODE, \"Bode Plot (Ch1)\", \"Bode Plot - 2 Ph\", \"Bode Plot - 3 Ph\", \"Bode Plot - 4 Ph\")","v":"Bode Plot (Ch1)"},1]
["VIN_max",{"$f":"'Design Regulator'!E8","v":54},"V","Maximum input voltage",null,{"$f":"CHOOSE(GPN_setting,80,80,80,80,65,65,45)","v":80},"IC max voltage",null,null,null,{"$f":"IF(MODE=1, \"Efficiency vs. IOUT (Ch2)\", \"N/A - Do Not Use\")","v":"Efficiency vs. IOUT (Ch2)"},2,null,"DITHER Disabled",2,null,null,null,null,"Single Output – 2  Phases",2,null,"PFM",2,null,"External Compensation",2,null,{"$f":"IF(MODE=1, \"Bode Plot (Ch2)\", \"N/A - Do Not Use\")","v":"Bode Plot (Ch2)"},2]
[null,null,null,null,null,null,null,null,null,null,"PLOT_TYPE",1,null,"DITHER Yes/No",2,"1 = Yes, 2 = No",null,null,null,"Single Output – 3  Phases",3,null,"FPWM/PFM",2,null,"COMP_TYPE",1,null,"BODE_PLOT_TYPE",1]
["Vout",{"$f":"'Design Regulator'!E9","v":3.3},"V","Output voltage - channel 1",null,null,null,null,null,null,null,null,null,null,null,null,null,null,null,"Single Output – 4  Phases",4]
["Iout",{"$f":"'Design Regulator'!E10","v":8},"A","Output current - channel 1",null,{"$f":"CHOOSE(GPN_setting,10,8,6,4,10,6,10)","v":8},"IC max current",null,1,null,null,null,null,null,null,null,null,null,null,"Single/Dual Yes/No",1]
[null,null,null,null,null,null,null,null,1,null,"Adjustable",1,null,"3.3V",1,null,null,null,null,"MODE (Single/Dual), DUAL = 1, SINGLE = 2",{"$f":"IF(U12=1, 1, 2)","v":1},null,"BIAS connected to ext. power supply",1,null,"UVLO Divider",1]
["Rout",{"$f":"Vout/Iout","v":0.41249999999999998},"W","Load resistance - Channel 1",null,null,null,null,null,null,"5V",2,null,"5V",2,null,null,null,null,"SINGLE OUTPUT (1 = YES)",{"$f":"IF(U12=1, 2, 1)","v":2},null,"BIAS connected to VOUT",2,null,"No UVLO Divider",2]
[null,null,null,null,null,null,null,null,null,null,"3.3V",3,null,"Adjustable",3,null,null,null,null,"Number of Phases",{"$f":"SCH_MODE","v":1},null,"BIAS connected to GND",3,null,"UVLO_TYPE",2]
["Pout",{"$f":"Vout*Iout","v":26.4},"W","Output power",null,null,null,null,null,null,"12V",4,null,"Ch2 Output Setting",{"$f":"IF(Vout2=3.3, 1, IF(Vout2=5, 2, 3))","v":3},null,null,null,null,null,null,null,"Ext_VCC",3]
[null,null,null,null,null,null,null,null,null,null,"Output Voltage Setting",{"$f":"IF(Vout=3.3, 3, IF(Vout=5, 2,  IF(Vout=12,4,1)))","v":3},null,null,null,null,null,null,null,null,null,null,"BIAS pin connection",{"$f":"IF(AND(VOUT_setting=3,Ext_VCC=1),\"Connect BIAS pin to an external bias supply from 5V to 30V\", IF(AND(VOUT_setting=3,Ext_VCC=2), \"BIAS pin cannot be connected to VOUT. Connect BIAS pin to an external bias supply from 5V to 30V\", IF(AND(VOUT_setting=2,Ext_VCC=2),\"Connect BIAS pin to VOUT\", IF(AND(VOUT_setting=2,Ext_VCC=1),\"Connect BIAS pin to an external bias supply from 5V to 30V\",IF(AND(VOUT_setting=4,Ext_VCC=2),\"Connect BIAS pin to VOUT\",IF(AND(VOUT_setting=4,Ext_VCC=1),\"Connect BIAS pin to an external bias supply from 10V to 30V\",IF(AND(VOUT_setting=1,Ext_VCC=2),\"Connect BIAS pin to VOUT. If VOUT < 5V, connect BIAS pin to an external bias supply from 10V to 30V\", IF(AND(VOUT_setting=1,Ext_VCC=1),\"Connect BIAS pin to an external bias supply from 10V to 30V\",\"\"))))))))","v":""}]
["Efficiency",0.9,null,"Estimate of efficiency"]
["Pin",{"$f":"Pout/Efficiency","v":29.333333333333332},"W","Calculate input power assuming finite efficiency"]
[]
["Iin_Vinmin",{"$f":"Pin/VIN_min","v":0.69841269841269837},"A",null,null,null,null,null,null,null,null,{"$f":"Vout","v":3.3}]
["Iin_Vinnom",{"$f":"Pin/VIN_nom","v":0.61111111111111105},"A","Input currents at min, nom, max Vin",null,null,null,{"$f":"AND(OSC=1, OR(Fsw/1000>2530, Fsw/1000<1800))","v":false}]
["Iin_Vinmax",{"$f":"Pin/VIN_max","v":0.54320987654320985},"A",null,null,null,null,{"$f":"AND(OSC=2, OR(Fsw/1000>500, Fsw/1000<300))","v":false}]
[null,null,null,null,null,null,null,{"$f":"OR(H22,H23)","v":false}]
["OSC setting",{"$f":"CHOOSE(OSC, 2200, 440)","v":{"$error":"#VALUE!"}},"kHz",null,null,null,null,null,null,null,null,"SetVout_IntComp_nEN",1,null,"LM708A0(-Q1)",1]
["Fsw",{"$f":"'Design Regulator'!E11*1000","v":400000},"Hz","Nominal switching frequency - determines RT resistor (SYNCIN must be 80-120% of this)",null,null,null,null,null,null,null,"SetVout_IntComp_EN",2,null,"LM70880(-Q1)",2]
["RT resistor to AGND",{"$f":"((1000000000/Fsw)-53)/45+0.1","v":54.477777777777781},"kΩ",null,null,null,null,null,null,null,null,"SetVout_ExtComp_nEN",3,null,"LM70860(-Q1)",3]
[null,null,"kΩ",null,null,null,null,null,1,null,null,"SetVout_ExtComp_EN",4,null,"LM70840(-Q1)",4]
["Tsw",{"$f":"1/Fsw","v":2.5000000000000002E-6},"sec","Switching period",null,null,null,null,null,null,null,"AdjVout_IntComp_nEN",5,null,"LM706A0(-Q1)",5]
["Vref",0.8,"V","Reference voltage",null,null,null,null,null,null,null,"AdjVout_IntComp_EN",6,null,"LM70660(-Q1)",6]
["Rt",{"$f":"'Standard Value Calculator'!S12/1000","v":54.9},"kΩ","Frequency set resistor",null,{"$f":"IF(OR((Fsw=440000),(Fsw=2200000)),\"N/A\",Rfadj/1000)","v":5.4899999999999997E-2},null,null,null,null,null,"AdjVout_ExtComp_nEN",7,null,"LM704A0(-Q1)",7]
[null,null,null,null,null,null,null,null,null,null,null,"AdjVout_ExtComp_EN",8,null,"GPN setting",2]
["Step 2: Buck Inductor","Channel 1",null,null,null,null,null,null,null,null,null,"SetVout_IntComp_nEN_BIAS_GND",9]
["Don1",{"$f":"Vout/VIN_nom","v":6.8749999999999992E-2},null,null,null,"Ideal Duty Cycle at VIN(nom)",null,null,null,null,null,"SetVout_IntComp_EN_BIAS_GND",10]
["Doff1",{"$f":"1-34:34","v":0.93125000000000002},null,null,null,"Ideal 1- Duty Cycle at VIN(nom)",null,null,null,null,null,"SetVout_ExtComp_nEN_BIAS_GND",11]
[null,null,null,null,null,null,null,null,null,null,null,"SetVout_ExtComp_EN_BIAS_GND",12]
["D_Vinmin",{"$f":"Vout/VIN_min","v":7.857142857142857E-2},null,null,null,null,null,null,null,null,null,"AdjVout_IntComp_nEN_BIAS_GND",13]
["D_Vinnom",{"$f":"Vout/VIN_nom","v":6.8749999999999992E-2},null,null,null,null,null,null,null,null,null,"AdjVout_IntComp_EN_BIAS_GND",14]
["D_Vinmax",{"$f":"Vout/VIN_max","v":6.1111111111111109E-2},null,null,null,null,null,null,null,null,null,"AdjVout_ExtComp_nEN_BIAS_GND",15]
[null,null,null,null,null,null,null,null,null,null,null,"AdjVout_ExtComp_EN_BIAS_GND",16]
["L_Vinnom",{"$f":"(VIN_nom-Vout)*D1_Vinnom/(Fsw*(Iout/Number_of_Phases)*0.3)","v":3.2011718749999997E-6},"H",null,null,"Calculated inductance for 35% ripple at VIN(nom)",null,null,null,null,null,"PRE_schematic setting",{"$f":"IF(OR(Vout=3.3,Vout=5,Vout=12),CHOOSE(COMP_TYPE,IF(UVLO_TYPE=2,1,2),IF(UVLO_TYPE=2,3,4)),CHOOSE(COMP_TYPE,IF(UVLO_TYPE=2,5,6),IF(UVLO_TYPE=2,7,8)))","v":1}]
["L_slopecomp",{"$f":"1000*Vout*Rs/24/Fsw","v":1.7187500000000001E-6},"H",null,null,"Calculated inductance based on one times inductor downslope",null,null,null,null,null,"Schematic_setting",{"$f":"IF(Ext_VCC=3, PRE_schematic_setting+8, PRE_schematic_setting)","v":9}]
[]
["Lopt",{"$f":"B42","v":1.7187500000000001E-6},"H",null,null,"Slope comp"]
[]
["Lo",{"$f":"'Design Regulator'!E28/1000000","v":2.2000000000000001E-6},"H",null,null,"Chosen inductance"]
["Rdcr",{"$f":"'Design Regulator'!E29/1000","v":3.8E-3},"W",null,null,"Chosen inductor DCR"]
[]
["Don2",{"$f":"(Vout+Iout*(Rdcr+Rs))/(Vin+Iout*Rs)","v":7.015820149875103E-2}]
["Doff2",{"$f":"1-_Don2","v":0.92984179850124893}]
[]
["D_Vinmin_2",{"$f":"CHOOSE(MODE, (Vout+Iout*(Rdcr+Rs))/(VIN_min+Iout*Rs), (Vout+Iout/Number_of_Phases*(Rdcr+Rs))/(VIN_min+Iout/Number_of_Phases*Rs))","v":8.017126546146526E-2},null,null,null,"Duty cycles adjusted for DCR/shunt voltage drops"]
["D_Vinnom_2",{"$f":"CHOOSE(MODE, (Vout+Iout*(Rdcr+Rs))/(VIN_nom+Iout*Rs), (Vout+Iout/Number_of_Phases*(Rdcr+Rs))/(VIN_nom+Iout/Number_of_Phases*Rs))","v":7.015820149875103E-2},null,null,null,"need to include RDS(on) later"]
["D_Vinmax_2",{"$f":"CHOOSE(MODE, (Vout+Iout*(Rdcr+Rs))/(VIN_max+Iout*Rs), (Vout+Iout/Number_of_Phases*(Rdcr+Rs))/(VIN_max+Iout/Number_of_Phases*Rs))","v":6.2368615840118422E-2}]
[]
["Iripple_Vinmin",{"$f":"(VIN_min-Vout)*D1_Vinmin_2/(Fsw*Lf)","v":3.5257136060894383},"A"]
["Iripple_Vinnom",{"$f":"(VIN_nom-Vout)*D1_Vinnom_2/(Fsw*Lf)","v":3.5637177352206493},"A"]
["Iripple_Vinmax",{"$f":"(VIN_max-Vout)*D1_Vinmax_2/(Fsw*Lf)","v":3.593282753515914},"A"]
[]
["Ishunt_rms_Vinmin",{"$f":"SQRT((Iout/Number_of_Phases)^2+(Iripple_Vinmin^2)/12)","v":8.064483122681434},"A"]
["Ishunt_rms_Vinnom",{"$f":"SQRT((Iout/Number_of_Phases)^2+(Iripple_Vinnom^2)/12)","v":8.0658750511869766},"A"]
["Ishunt_rms_Vinmax",{"$f":"SQRT((Iout/Number_of_Phases)^2+(Iripple_Vinmax^2)/12)","v":8.0669680433373632},"A"]
["Max shunt power loss at full load",{"$f":"B61^2*Rs","v":0.32529170170680255},"W",null,null,"Note this is power loss at full load - not loss near OCP!"]
[]
["Max inductor ripple current",{"$f":"MAX(B56:B58)","v":3.593282753515914},"A",null,null,"Ripple current at Vin(max)"]
[]
[null,{"$f":"B56/(Iout/Number_of_Phases)","v":0.44071420076117979}]
["% ripple current",{"$f":"B57/(Iout/Number_of_Phases)","v":0.44546471690258116}]
[null,{"$f":"B58/(Iout/Number_of_Phases)","v":0.44916034418948925}]
[]
["Inductor copper temerature",100,"°C"]
["DCR at hot",{"$f":"Rdcr*(1+0.0039*(B71-25))","v":4.9115000000000001E-3},"W"]
[]
[]
["Step 3: Sense Resistors, Slope Comp, Current Limit"]
[]
["Ilimit_DC",{"$f":"'Design Regulator'!E17","v":9},"A",null,null,"Chosen OCP level - based on output current"]
[]
["Ilimit_inductor_Vinmin",{"$f":"CHOOSE(MODE, Ilimit_DC+Iripple_Vinmin/2, Ilimit_DC/Number_of_Phases+Iripple_Vinmin/2)","v":10.76285680304472},"A",null,null,"Peak inductor current at current limit inception"]
["Ilimit_inductor_Vinnom",{"$f":"CHOOSE(MODE, Ilimit_DC+Iripple_Vinnom/2, Ilimit_DC/Number_of_Phases+Iripple_Vinnom/2)","v":10.781858867610325},"A"]
["Ilimit_inductor_Vinmax",{"$f":"CHOOSE(MODE, Ilimit_DC+Iripple_Vinmax/2, Ilimit_DC/Number_of_Phases+Iripple_Vinmax/2)","v":10.796641376757957},"A"]
[]
[]
["CS threshold_min",0.05,"V"]
["CS threshold",5.6000000000000001E-2,"V"]
["CS threshold_max",6.2E-2,"V"]
[]
["Shunt required to get OCP at VIN(min)",{"$f":"Buck_CS_threshold/B79","v":5.2030795377820214E-3},"W"]
["Shunt required to get OCP at VIN(nom)",{"$f":"Buck_CS_threshold/B80","v":5.1939095741856765E-3},"W"]
["Shunt required to get OCP at VIN(max)",{"$f":"Buck_CS_threshold/B81","v":5.1867981945340688E-3},"W"]
[]
["Rs_ideal",{"$f":"B89","v":5.1939095741856765E-3},"W",null,null,"Ideal Rs for the required OCP -- based on 73mV CL threshold"]
["Rs",{"$f":"'Design Regulator'!E19/1000","v":5.0000000000000001E-3},"W",null,null,"Selected (starndard value) current limit sense resistor"]
[]
["Current limit - peak",{"$f":"Buck_CS_threshold/Rs","v":11.2},"A",null,null,"Peak inductor current limit = min sat current"]
[]
["Iout_OCP_Vinmin",{"$f":"Number_of_Phases*(Buck_CS_threshold/Rs-Iripple_Vinmin/2)","v":9.4371431969552795},"A",null,null,"Current limit setpoints (i.e. IOUT) after standard components are selected"]
["Iout_OCP_Vinnom",{"$f":"Number_of_Phases*(Buck_CS_threshold/Rs-Iripple_Vinnom/2)","v":9.4181411323896747},"A"]
["Iout_OCP_Vinmax",{"$f":"Number_of_Phases*(Buck_CS_threshold/Rs-Iripple_Vinmax/2)","v":9.4033586232420419},"A"]
[]
["Irms_OCP_Vinmin",{"$f":"SQRT((Iout_OCP_Vinmin/Number_of_Phases)^2+(Iripple_Vinmin^2)/12)","v":9.491868085674863},"A"]
["Irms_OCP_Vinnom",{"$f":"SQRT((Iout_OCP_Vinnom/Number_of_Phases)^2+(Iripple_Vinnom^2)/12)","v":9.4741607929658223},"A"]
["Irms_OCP_Vinmax",{"$f":"SQRT((Iout_OCP_Vinmax/Number_of_Phases)^2+(Iripple_Vinmax^2)/12)","v":9.4603978145491698},"A"]
[]
["Pshunt_Vinmin",{"$f":"B101^2*Rs","v":0.45047779877926497},"W",null,null,"Max power dissipations in shunt"]
["Pshunt_Vinnom",{"$f":"B102^2*Rs","v":0.44879861365485391},"W"]
["Pshunt_Vinmax",{"$f":"B103^2*Rs","v":0.44749563404763359},"W"]
[]
[]
["Step 4: Output Capacitor"]
["Icoutrms_VINmin",{"$f":"Iripple_Vinmin/SQRT(12)","v":1.0177858497806318},"A",null,null,"Output Cap RMS current"]
["Icoutrms_VINnom",{"$f":"Iripple_Vinnom/SQRT(12)","v":1.0287566968727426},"A"]
["Icoutrms_VINmax",{"$f":"Iripple_Vinmax/SQRT(12)","v":1.0372913825084265},"A"]
["Max Cout rms current",{"$f":"MAX(B111:B113)","v":1.0372913825084265},"A"]
[]
["Vripple1",{"$f":"'Design Regulator'!E33/1000","v":3.3000000000000002E-2},"V",null,null,"Output voltage ripple spec(pk-pk)"]
[]
["Output Ripple Spec (pk-pk)",{"$f":"Vo1_ripple*1000","v":33},"mV",null,null,"Vout ripple spec at Vin(nom)"]
[]
["Coutmin",{"$f":"Iripple_Vinnom/(Fsw*8*Vo1_ripple)","v":3.3747327038074329E-5},"F",null,null,"Minimum output capacitnace",null,{"$f":"Vo2_ripple","v":0},1]
["Reported Coutmin",{"$f":"IF(Cout_min*1000000<2, 2.2,Cout_min*1000000)","v":33.747327038074332},"uF"]
["Cout",{"$f":"'Design Regulator'!E36/1000000","v":3.2499999999999999E-4},"F",null,null,"Chosen output capacitance",null,null,1]
["Resrmax",{"$f":"SQRT((Vo1_ripple/Iripple_Vinnom)^2-(1/(Fsw*Cout*8))^2)","v":9.2099352594952732E-3},"W",null,null,"Max ESR before ripple exceeds Vripple1",null,null,1]
["Cout_min_loadoff",{"$f":"Lf*((Load_Step/100)*Iout)^2/((Vout+Vo1_ripple)^2-Vout^2)*1000000","v":160.81210111060932},"uF",{"$f":"IF(Load_Step=0, Cout_min*1000000, Cout_min_loadoff)","v":160.81210111060932}]
["Total COUT with stead-state+load step",{"$f":"Lf*((Load_Step/100)*Iout)^2/((Vout+Vo1_ripple)^2-Vout^2)*1000000 + (Cout_min*1000000)","v":194.55942814868365},"uF"]
[]
[]
["Reported Cout ESR max",{"$f":"IF(OR(CoutEsrMax>0.3, CoutEsrMax<0, (ISERROR(CoutEsrMax))), \"N/A\", CoutEsrMax*1000)","v":9.209935259495273},"mΩ"]
["CoutEsr",{"$f":"'Design Regulator'!E38/1000","v":1E-3},"W",null,null,"Chosen ESR",null,null,1,null,{"$f":"ISERROR(CoutEsrMax)","v":false},{"$f":"ISERROR(B128)","v":false}]
["Vripple",{"$f":"Iripple_Vinnom*SQRT(Cout_ESR^2+(1/(8*Fsw*Cout))^2)","v":4.9438877165073761E-3},"Vp-p",null,null,null,null,null,null,null,null,{"$f":"OR(CoutEsrMax>0.3,CoutEsrMax<0)","v":false}]
[null,null,null,null,null,null,null,null,null,null,{"$f":"OR(TRUE, FALSE, TRUE)","v":true}]
["Step 5: Input Capacitor"]
[null,null,null,null,null,null,null,null,null,null,"Two channels operating at full load"]
["Icinrms_VINmin",{"$f":"SQRT(D1_Vinmin_2*(Iout^2*(1-D1_Vinmin_2)+Iripple_Vinmin^2/12))","v":2.1914957925337322},"A",{"$f":"D1_Vinmax","v":6.1111111111111109E-2},null,"Calculate input cap rms current with one output unloaded",null,null,null,null,{"$f":"SQRT(Iout^2*D1_Vinmin*(1-D1_Vinmin)+Iout2^2*D2_Vinmin*(1-D2_Vinmin)-2*Iout*Iout2*D1_Vinmin*D2_Vinmin)","v":{"$error":"#NAME?"}},"A",{"$f":"SQRT(Iout^2*D1_Vinmin*(1-D1_Vinmin)+Iout2^2*D2_Vinmin*(1-D2_Vinmin)-2*Iout*Iout2*(0.5-D2_Vinmin*(1-D1_Vinmin)))","v":{"$error":"#NAME?"}},"A"]
["Icinrms_VINnom",{"$f":"SQRT(D1_Vinnom_2*(Iout^2*(1-D1_Vinnom_2)+Iripple_Vinnom^2/12))","v":2.0613968719392624},"A",{"$f":"D1_Vinmin","v":7.857142857142857E-2},null,null,null,null,null,null,{"$f":"SQRT(Iout^2*D1_Vinnom*(1-D1_Vinnom)+Iout2^2*D2_Vinnom*(1-D2_Vinnom)-2*Iout*Iout2*D1_Vinnom*D2_Vinnom)","v":{"$error":"#NAME?"}},"A"]
["Icinrms_VINmax",{"$f":"SQRT(D1_Vinmax_2*(Iout^2*(1-D1_Vinmax_2)+Iripple_Vinmax^2/12))","v":1.9518576676317649},"A",null,null,null,null,null,null,null,{"$f":"SQRT(Iout^2*D1_Vinmax*(1-D1_Vinmax)+Iout2^2*D2_Vinmax*(1-D2_Vinmax)-2*Iout*Iout2*D1_Vinmax*D2_Vinmax)","v":{"$error":"#NAME?"}},"A"]
["Icinrms - multiphase",{"$f":"Iout*SQRT((D1_Vinmin-F139/Number_of_Phases)*((F139+1)/Number_of_Phases-D1_Vinmin))","v":2.152549508781413},"A",null,null,null,null,null,null,null,{"$f":"MAX(K134:K136)","v":{"$error":"#NAME?"}},"A"]
["Max Cin rms current",{"$f":"MAX(B134:B136)","v":2.1914957925337322},"A",null,null,{"$f":"Number_of_Phases*D1_Vinnom","v":6.8749999999999992E-2},"N*D"]
[null,null,null,null,null,{"$f":"FLOOR(Number_of_Phases*D1_Vinnom,1)","v":0},"floor(N*D)"]
["Icinrms - multiphase - max",{"$f":"Iout/2/Number_of_Phases","v":4},"A"]
["Final result",{"$f":"IF(D1_Vinmin<0.5, B138, B140)","v":2.1914957925337322},"A","…report this"]
[]
["Vinripple1",{"$f":"'Design Regulator'!E43/1000","v":0.48},"Vp-p",null,null,"Input voltage ripple spec (pk-pk)"]
[]
["Cinmin_Vinmin",{"$f":"Iout/Number_of_Phases*D1_Vinmin*(1-D1_Vinmin)/(Vinripple1*Fsw)","v":3.0165816326530615E-6},"F"]
["Cinmin_Vinnom",{"$f":"Iout/Number_of_Phases*D1_Vinnom*(1-D1_Vinnom)/(Vinripple1*Fsw)","v":2.6676432291666661E-6},"F"]
["Cinmin_Vinmax",{"$f":"Iout/Number_of_Phases*D1_Vinmax*(1-D1_Vinmax)/(Vinripple1*Fsw)","v":2.3906893004115225E-6},"F",null,null,"Calculate cap at Vinmax and 50% duty cycle (Vin = 2*Vout)"]
[]
["Cinmin_50%D",{"$f":"Iout*0.5*(1-0.5)/(Vinripple1*Fsw)","v":1.0416666666666666E-5},"F",null,null,"Buck 50% typically worst case"]
["Cinmin",{"$f":"IF(D1_Vinmin<0.5, B145,B149)","v":3.0165816326530615E-6},"F",{"$f":"(VIN_min+VIN_max)/2","v":48}]
["Reported Cinmin",{"$f":"IF(Cinmin*1000000<2.2, 2.2,Cinmin*1000000)","v":3.0165816326530615},"uF",{"$f":"2*Vout","v":6.6},null,"…report this"]
[]
["Cin",{"$f":"'Design Regulator'!E45/1000000","v":1.5E-5},"F",null,null,"Input capacitance"]
["CinEsrMax_Vinmax",{"$f":"-(Iout/Number_of_Phases*D1_Vinmax*(1-D1_Vinmax)/(Cin*Fsw)-Vinripple1)/(Iout/Number_of_Phases+Iripple_Vinmax/2)","v":4.1187375026721908E-2},"W"]
["CinEsrMax_50%D",{"$f":"-(Iout/Number_of_Phases*0.5*(1-0.5)/(Cin*Fsw)-Vinripple1)/(Iout/Number_of_Phases+Iripple_Vinmax/2)","v":1.4971117245817124E-2},"W",null,null,"Calculate ESR at Vinmax and 50% duty cycle (Vin = 2*Vout)"]
["CinEsrMax",{"$f":"IF(VIN_max<2*Vout, B154,B155)","v":1.4971117245817124E-2},"W"]
["Reported Cin ESR max",{"$f":"IF(OR(CinEsrMax>0.3, CinEsrMax<0), \"N/A\",CinEsrMax*1000)","v":14.971117245817124},"mΩ",null,null,"…report this"]
["RCinEsr",{"$f":"'Design Regulator'!E47/1000","v":1E-3},"W",null,null,"Input capacitance series resistance (ESR)"]
[]
["Vinripple2_Vinmin",{"$f":"Iout/Number_of_Phases*D1_Vinmin_2*(1-D1_Vinmin_2)/(Cin*Fsw)+(Iout/Number_of_Phases +Iripple_Vinmin/2)*RCinEsr","v":0.10808796834407475},"Vp-p"]
["Vinripple2_Vinnom",{"$f":"Iout/Number_of_Phases*D1_Vinnom_2*(1-D1_Vinnom_2)/(Cin*Fsw)+(Iout/Number_of_Phases +Iripple_Vinnom/2)*RCinEsr","v":9.6763229882559226E-2},"Vp-p"]
["Vinripple2_Vinmax",{"$f":"Iout/Number_of_Phases*D1_Vinmax_2*(1-D1_Vinmax_2)/(Cin*Fsw)+(Iout/Number_of_Phases +Iripple_Vinmax/2)*RCinEsr","v":8.7768336841166153E-2},"Vp-p"]
["Vinripple2_50%D",{"$f":"Iout/Number_of_Phases*0.5*(1-0.5)/(Cin*Fsw)+(Iout/Number_of_Phases +Iripple_Vinmax/2)*RCinEsr","v":0.34312997471009127},"Vp-p",null,null,"Calculate ripple at Vinmax and 50% duty cycle (Vin = 2*Vout)"]
["Vinripple2",{"$f":"IF(D1_Vinmin<0.5, B160,B163)","v":0.10808796834407475},"Vp-p",null,null,"…report highest of these"]
[]
[null,{"$f":"Iout*D1_Vinmax_2*(1-D1_Vinmax_2)/(Cin*Fsw)","v":7.79716954644082E-2},"Vp-p"]
[]
["Step 6a: Soft Start"]
["Tss",{"$f":"'Design Regulator'!E52/1000","v":0},"s","Soft-start time"]
["Iss",{"$f":"Cout*Vout/Tss","v":{"$error":"#DIV/0!"}},"A","Load cap current during soft start"]
["Css",{"$f":"0.000022*Tss/1.2","v":0},"F"]
["Css_u",{"$f":"'Standard Value Calculator'!B4","v":0},"F"]
[]
["Step 6b: Other Components - Dither, Hiccup, DEMB, MODE"]
["Tres",{"$f":"'Design Regulator'!E55/1000","v":5.3100000000000005E-3},"s","Hiccup time"]
["Cres",{"$f":"0.00002*Tres/1.2","v":8.8500000000000018E-8},"F"]
["Cres_u",{"$f":"'Standard Value Calculator'!G4","v":8.2000000000000006E-8},"F"]
[]
["RPG1/2",100,"kΩ"]
["RFB1/2",null,"W",null,"Tie to VDDA or AGND for 3.3V/5V output, respectively. "]
["R_MODE",null,"W",null,"Tie to VDDA or AGND for Single/Dual operation, respectively. "]
["R_DEMB",null,"W",null,"Tie to VDDA or AGND for FPWM/DEM, respectively. "]
[]
["Enable Hysteresis Current",1.0000000000000001E-5,"A",null,"10 µA Hysteresis Current"]
["Turn ON Voltage",{"$f":"'Design Regulator'!E54","v":5.9}]
["Hysteresis Voltage",1]
[]
["Upper FB resistor",{"$f":"((B185/B186)-1)*B189","v":100450.00000000001},"W"]
["Lower FB resister",{"$f":"'Design Regulator'!E57*1000","v":20500},"W"]
["Standard upper FB resistor",{"$f":"'Standard Value Calculator'!S40","v":100},"kΩ"]
["Standard lower FB resistor",{"$f":"'Standard Value Calculator'!S41","v":20.5},"kΩ"]
[]
["Dither Modulation Frequency",{"$f":"'Design Regulator'!E58*1000","v":29400},"Hz"]
["Cdither_calculated",{"$f":"10*10^-6/Fdither/0.12","v":2.8344671201814057E-9},"F"]
["Cdither_stdvalue",{"$f":"'Standard Value Calculator'!S21","v":2.7000000000000002E-9},"F"]
[]
[]
["Step 7: Compensation"]
["Pi",3.1415926500000002,null,"p"]
["CS Amp Gain",10]
["Ri",{"$f":"Rs*CSAmp_gain","v":0.05},"W",null,null,"Current Sense effective resistance = shunt resistor Rs * CS amp gain"]
["gm",{"$f":"IF(COMP_TYPE=1,0.00003,0.0012)","v":3.0000000000000001E-5},"S",null,null,"Error Amp Transconductance"]
[]
["Se_ext",{"$f":"B208/Ri*1000","v":1818181.8181818181},"A/s",null,null,"Slope Comp Slope - referred to inductor current"]
["Sn",{"$f":"(Vin-Vout)/Lf","v":20318181.81818182},"A/s",null,null,"On-time Slope"]
["Sf",{"$f":"Vout/Lf","v":1499999.9999999998},"A/s",null,null,"Off-time Slope"]
[]
["Se_int",{"$f":"Fsw*0.001*(5/22)","v":90.909090909090907},"mV/μs",null,null,"Slope Comp Slope - referred to IC"]
["Sn_int",{"$f":"Sn*Ri/1000","v":1015.9090909090911},"mV/μs",null,null,"etc"]
["Sf_int",{"$f":"Sf*Ri/1000","v":74.999999999999986},"mV/μs",null,null,"etc"]
[]
["mc_buck",{"$f":"1+Se_ext/Sn","v":1.0894854586129754},null,null,null,"mc = 1 + Se/Sn for peak current-mode buck"]
["k_buck",{"$f":"mc_buck*(1-D1_Vinnom_2)","v":1.0130491182776471},null,null,null,"mc*(1-d)"]
[]
["mc",{"$f":"1+Se_ext/Sn","v":1.0894854586129754}]
["k",{"$f":"mc_buck*(1-D1_Vinnom_2)","v":1.0130491182776471}]
["Q",{"$f":"1/Pi/(k-0.5)","v":0.62042770410776305},null,null,null,"1/(Pi*(k-0.5))",null,"Q = 2/Pi = 0.636 gives ideal one-cycle damping"]
[]
["Error Amp (EA)"]
["GBW",6,"MHz",null,null,"EA gain-bandwidth product"]
["Cbw",{"$f":"gm/(2*Pi*GBW*1000000)","v":7.9577471636878183E-13},"F",null,null,"EA effective bandwidth limiting capacitance = gm/(2*Pi*GBW)"]
["RoEA",64000000,"W",null,null,"EA output resistance"]
["AEA",{"$f":"gm*RoEA","v":1920},"V/V",null,null,"EA DC gain = gm*RoEA"]
["Afb",{"$f":"IF(VOUT_setting=1,Vref/Vout,SQRT((1+(Fcross*zterm1)^2)/((1+Afbr-pterm4*(Fcross)^2)^2+(Fcross*pterm3)^2)))","v":0.24012003827269846},"V/V",null,null,"Feedback gain from Vout to FB"]
["Acs",{"$f":"1/Ri","v":20},null,null,null,"Acs = 1/Ri"]
["Am_buck",{"$f":"(Ro/Number_of_Phases)/Ri/((1+Ro/Number_of_Phases*(k-0.5)/(Fsw*Lf)))","v":6.650588235757847}]
["Am",{"$f":"(Ro*Number_of_Phases)/Ri/((1+Ro*Number_of_Phases*(k-0.5)/(Fsw*Lf)))","v":6.650588235757847},null,null,null,"Buck modulator gain"]
[]
["Scaling factor to calculate Rcomp - buck",{"$f":"2*Pi*Ri/gm","v":10471.9755},null,null,null,"2*Pi*Ri/gm -- scaling factor to calculate Rcomp given desired buck crossover frequency"]
["DC Gain is Adc = AEA*Afb*Am"]
[]
["Ro",{"$f":"Rout","v":0.41249999999999998},"W",null,null,"Output Resistance"]
[]
["Fp_load_buck",{"$f":"1/(2*Pi*Ro*Cout)+(k-0.5)/(2*Pi*Fsw*Lf*Cout/Number_of_Phases)","v":1472.6742970867483},"Hz",null,null,"Buck dominant pole frequency -- note slope comp influence"]
["Fp_dominant",{"$f":"Fload_u","v":1472.6742970867483},"Hz"]
[null,{"$f":"Cbw","v":7.9577471636878183E-13}]
["Fp_EA",{"$f":"1/(2*Pi*(RoEA+Rcea1_u)*Cc1ea_u)","v":49.427001016694518},"Hz",null,null,"Error Amp LF pole -- related to amplifier ouptut resistance and comp cap"]
["Fp_HF",{"$f":"1/(2*Pi*Rcea1_u*(Cc2ea_u+Cbw))","v":221568.6380688971},"Hz",null,null,"Error Amp HF pole cancels zero related to Output Cap ESR"]
["Fesr",{"$f":"1/(2*Pi*Cout*Cout_ESR)","v":489707.51776540431},"Hz",null,null,"Cout ESR zero frequency"]
["F_mod",{"$f":"Fsw/2","v":200000},"Hz",null,null,"Zero-order sample-and-hold effects of current-mode control modeled as pole at Fsw/2"]
[null,null,null,"Internal Comp Crossover"]
["Desired Crossover Frequency",{"$f":"CHOOSE(COMP_TYPE,Fcross_Ch2,'Design Regulator'!E64*1000)","v":8000},"Hz",{"$f":"Fsw/50","v":8000}]
["Rcea1",{"$f":"Fcross*Cout/Number_of_Phases*2*Pi*Ri/(gm*Afb)","v":113389.68832363257},"W",null,null,"This component will largely determine the crossover frequency",null,null,null,null,{"$f":"Fcross/Fp_dominant/(gm*Afb*Am)","v":113389.68832363258}]
["Cc1ea, Cc3ea",{"$f":"10/(Rcea1*Fcross*2*Pi)","v":1.7545129723293526E-9},"F",null,null,"This along with Rcea1 will set a zero at Fcrossover/5 to optimize phase margin"]
["Cc2ea, Cc4ea",{"$f":"MAX(1/(Rcea1*2*Pi*Fesr)-Cbw, 1/(Rcea1*2*Pi*(Fsw/2))-Cbw)","v":6.2222771729486292E-12},"F",null,null,"This along with Rcea1 places a pole at the output cap ESR zero"]
[]
[{"$f":"CHOOSE(COMP_TYPE,\"Internal Compensation\",\"External Compensation\")","v":"Internal Compensation"}]
["Chosen Compensation Components from the standard value sheet",null,null,"Internal Values"]
["Rcea1_u",{"$f":"CHOOSE(COMP_TYPE,D249,'Design Regulator'!D71*1000)","v":400000},"W",400000,null,null,{"$f":"1/(Rcea1*2*Pi*(Fsw/2))-Cbw","v":6.2222771729486292E-12}]
["Cc1ea_u",{"$f":"CHOOSE(COMP_TYPE,Cc3ea_u,'Design Regulator'!D72*0.000000001)","v":5.0000000000000002E-11},"F",{"$f":"50*0.000000000001","v":5.0000000000000002E-11}]
["Cc2ea_u",{"$f":"CHOOSE(COMP_TYPE,Cc4ea_u,'Design Regulator'!D73*0.000000000001)","v":9.9999999999999998E-13},"F",{"$f":"0.000000000001","v":9.9999999999999998E-13}]
[]
["Resulting Pole/Zero Locations",null,null,null,null,{"$f":"Cout","v":3.2499999999999999E-4},{"$f":"Cout_ESR","v":1E-3}]
["Fz1",{"$f":"1/(2*Pi*Rcea1_u*Cc1ea_u)","v":7957.747163687819},"Hz",null,null,"This zero is set at or close to the dominant load pole"]
["Fp2",{"$f":"1/(2*Pi*Rcea1_u*(Cc1ea_u*(Cc2ea_u+Cbw)/(Cc1ea_u+Cc2ea_u+Cbw)))","v":229526.3852325849},"Hz",null,null,"This pole cancels the zero from the Output Cap ESR"]
[null,null,null,"Internal Values"]
["Rfb1",{"$f":"IF(VOUT_setting=1,'Design Regulator'!E66*1000,2500000)","v":2500000},"W",null,null,"Upper Feedback Resistance - chosen by user"]
["Rfb2",{"$f":"IF(Vout=Vref,100000000,Vref*B257/((Vout-Vref)))","v":800000},"W",null,null,"Lower Feedback Resistance"]
["Rfb2_u",{"$f":"IF(Vout=Vref,\"N/A\",CHOOSE(VOUT_setting,'Standard Value Calculator'!S11,471000,792000,177000))","v":792000},"W",null,null,"Std Value Lower Feedback Resistance"]
[]
["Rff",20000,"W"]
["Cff",3.67E-13,"F"]
["Cfb",2.1999999999999999E-12,"F"]
[]
["wff",{"$f":"1/(2*Pi*Rff*Cff)","v":21683234.778440922},"Hz"]
["wfbt",{"$f":"1/(2*Pi*Rfb1_*Cfb)","v":28937.262413410252},"Hz"]
["wfbb",{"$f":"1/(2*Pi*Rfb2_u*Cfb)","v":91342.368729199035},"Hz"]
["w1",{"$f":"1/(2*Pi*Rff*Cfb)","v":3617157.8016762817},"Hz"]
["wfft",{"$f":"1/(2*Pi*Cff*Rfb1_)","v":173465.8782275274},"Hz"]
["Cfb*(Rff+RFBT)/(Rff*RFBT))",{"$f":"2*Pi*Cfb*(Rff+Rfb1_)/(Rff*Rfb1_)","v":6.96679586064E-16},"Hz"]
[]
[]
[]
[]
["Other Input Variables"]
["Rfets",0,"W","Series resistance due to FETs"]
["Diode loss eq res",{"$f":"0.00000002*Fsw*0.6*4/Iripple1","v":{"$error":"#NAME?"}}]
["Fet loss eq res",{"$f":"_Don2*RdsonTop+Doff2*RdsonBot","v":{"$error":"#NAME?"}}]
["cap loss eq res",{"$f":"B280*Vin^2*Fsw/2/(((Iripple1/SQRT(3))^2))","v":{"$error":"#NAME?"}}]
["Sw cap",5.0000000000000001E-9]
[]
["Step 8: AEF"]
[]
["VinRipple_dBuV",{"$f":"20*LOG10(Vinripple2*1000000)","v":100.67554707562715},"dBuV"]
["CISPR 25 limit",{"$f":"CHOOSE(OSC,35,50)","v":{"$error":"#VALUE!"}},"dBuV","Chooses CISPR conducted limit 35 at 2.1MHz and 50 at 440kHz"]
["Attenuation required",{"$f":"VinRipple_dBuV-B285+3","v":{"$error":"#VALUE!"}},"dBuV","Margin of attenuation req"]
["Filter Frequency Required",{"$f":"Fsw/(POWER(10,Attn_req/40))","v":{"$error":"#VALUE!"}},"Hz","assume 40db/decade drop and set frequency based on attenuation"]
[]
["Lfilter",{"$f":"'Design Regulator'!E50","v":0},"uH","user input"]
[]
["Gop_AEF",{"$f":"CHOOSE(OSC,20,100)","v":{"$error":"#VALUE!"}}]
["n",3,null,null,null,"n should be 2 or 3"]
[]
["Passive Cf",{"$f":"1000000/(LinfilterPssv*POWER(2*Pi*Fx_infilter,2))","v":{"$error":"#REF!"}},"uF",{"$f":"#REF!*0.000001","v":{"$error":"#REF!"}}]
["Cinj_AEF",{"$f":"1000000/(L_infilter*Gop_AEF*0.000001*POWER(2*Pi*Fx_infilter,2))","v":{"$error":"#VALUE!"}},"uF",{"$f":"'Design Regulator'!#REF!*0.000001","v":{"$error":"#REF!"}}]
[]
["Cdamp_AEF",{"$f":"CHOOSE(OSC,0,Cinj_AEF/nAEF)","v":{"$error":"#VALUE!"}},"uF",{"$f":"'Design Regulator'!#REF!*0.000001","v":{"$error":"#REF!"}}]
["Rdamp_AEF",{"$f":"CHOOSE(OSC,SQRT(L_infilter*Gop_AEF/(Cinj_AEF)),1.09*SQRT(L_infilter*Gop_AEF/Cinj_AEF))","v":{"$error":"#VALUE!"}},"Ω",{"$f":"'Design Regulator'!#REF!","v":{"$error":"#REF!"}}]
["Ccomp_AEF",{"$f":"CHOOSE(OSC,5,1)","v":{"$error":"#VALUE!"}},"nF",{"$f":"B299*0.000000001","v":{"$error":"#VALUE!"}},null,"AEF Comp network & sense is specifically defined at 2.2MHz at 440kHz"]
["Rcomp_AEF",{"$f":"CHOOSE(OSC,200,1000)","v":{"$error":"#VALUE!"}},"Ω"]
["Csen_AEF",{"$f":"Gop_AEF*B299","v":{"$error":"#VALUE!"}},"nF",{"$f":"B301*0.000000001","v":{"$error":"#VALUE!"}}]
[]
["Rd_AEF",{"$f":"SQRT(L_infilter*0.000001/Cin)","v":0},null,{"$f":"'Standard Value Calculator'!S14","v":{"$error":"#NUM!"}}]
[]
["Attenuation at Fsw",{"$f":"#REF!","v":{"$error":"#REF!"}},"dBuV"]
["Conducted EMC at Fsw",{"$f":"VinRipple_dBuV+B305","v":{"$error":"#REF!"}},"dBuV"]
[]
[]
["Step 8: Efficiency"]
["VAR",0]
["Design"]
["Ta",{"$f":"'Design Regulator'!E13","v":25},"°C","Ambient Temperature"]
["Components"]
["LTc",{"$f":"4000/1000000","v":4.0000000000000001E-3},"%/°C","Inductor DCR Temp Co"]
["θCA",20,"°C/W","Inductor Core to Ambient Thermal Resistance"]
["RCinEsr",{"$f":"RCinEsr","v":1E-3},"W","Input Capacitor ESR"]
[]
["Controller Characteristics"]
["BIAS",{"$f":"'Design Regulator'!G102","v":12},"V"]
["VCC",{"$f":"CHOOSE(VOUT_setting,8,5,5,8)","v":5},"V","with 170mA current limit"]
["Top Driver"]
["RdsonDRT",3,"W","Drain-Source Resistance of Pullup High-side FET Driver"]
["RdsonDRT2",1,"W","Drain-Source Resistance of Pulldown High-side FET Driver"]
["Bottom Driver"]
["RdsonDRB",3,"W","Drain-Source Resistance of Pullup Low-side FET Driver"]
["RdsonDRB2",1,"W","Drain-Source Resistance of Pulldown Low-side FET Driver"]
["Deadtime"]
["Deadtime",1.4E-8,"s","Total Deadtime",null,null,"14ns for LM513-Q1"]
["IQ"]
["IQ ",2.2000000000000001E-6,"A","Quiescent Current of LM5143-Q1 Controller (One channel disabled)"]
[]
["High- & low-side MOSFETs - Ch1","Q1: high-side",null,"Q2: low-side"]
["Rdson",{"$f":"CHOOSE(VOUT_setting,0.024,0.04,0.04,0.024)","v":0.04},"W",{"$f":"CHOOSE(VOUT_setting,0.018,0.029,0.029,0.018)","v":2.9000000000000001E-2},"W","Drain-Source Resistances of Channel 1 FETs"]
["RdsonTopTc",{"$f":"7000/1000000","v":7.0000000000000001E-3},"%/°C",7.0000000000000001E-3,"%/°C","Drain-Source Resistance Temp Co"]
["Qg",{"$f":"'Design Regulator'!E83/1000000000","v":3E-9},"C",{"$f":"'Design Regulator'!F83/1000000000","v":4.0999999999999995E-9},"C","Gate Charge at VCC = 5V"]
["Qgd",{"$f":"'Design Regulator'!E84/1000000000","v":6.9999999999999996E-10},"C",{"$f":"'Design Regulator'!F84/1000000000","v":1.0000000000000001E-9},"C","Gate to Drain Charge"]
["Qgs",{"$f":"'Design Regulator'!E85/1000000000","v":6.9999999999999996E-10},"C",{"$f":"'Design Regulator'!F85/1000000000","v":8.9999999999999999E-10},"C","Gate to Source Charge"]
["Qoss",{"$f":"0.00000000225","v":2.2499999999999999E-9},"C",{"$f":"'Design Regulator'!F86/1000000000","v":3E-9},"C","Output Charge"]
["Coss",{"$f":"'Design Regulator'!E87/1000000000000","v":2.5000000000000002E-10},"F",{"$f":"'Design Regulator'!F87/1000000000000","v":3.4999999999999998E-10},"F","Output Capacitance"]
["Rgate",{"$f":"'Design Regulator'!E88","v":3.5},"W",{"$f":"'Design Regulator'!F88","v":3},"W","Gate Resistance"]
["Gfs",{"$f":"'Design Regulator'!E89","v":71},"S",{"$f":"'Design Regulator'!F89","v":90},"S","Transconductance"]
["Vth",{"$f":"'Design Regulator'!E90","v":1.8},"V",{"$f":"'Design Regulator'!F90","v":1.8},"V","Threshold Voltage"]
["Vsp",{"$f":"Vth_Q1+(Iout/Number_of_Phases)/Gfs_Q1","v":1.9126760563380283},"V",{"$f":"Vth_Q2+(Iout/Number_of_Phases)/Gfs_Q2","v":1.8888888888888888},"V","Switch Point Voltage of FETs"]
[]
["Vsd - Buck",{"$f":"'Design Regulator'!E91","v":0.8},"V",{"$f":"'Design Regulator'!F91","v":0.8},"V","Diode Forward Voltage of MOSFET Body diode"]
["QrrTop",null,"C",{"$f":"0.00000003","v":2.9999999999999997E-8},"C","Reverse Recovery Charge of Body Diode"]
["TrrTop",4.0000000000000001E-8,"s",4.0000000000000001E-8,"s","Reverse Recovery Time of Body Diode"]
["θJA-MOSFET",{"$f":"'Design Regulator'!E93","v":15},"°C/W",{"$f":"'Design Regulator'!F93","v":15},"°C/W","Junction-to-Ambient Resistance"]
[]
[]
[]
["Anti-parallel Schottky Diode (optional)"]
["VfdSky",{"$f":"'Design Regulator'!F96","v":0},"V",{"$f":"'Design Regulator'!#REF!","v":{"$error":"#REF!"}},"V","Diode Forward Voltage"]
["QrrSky",{"$f":"'Design Regulator'!F97/1000000000","v":0},"C",{"$f":"'Design Regulator'!#REF!/1000000000","v":{"$error":"#REF!"}},"C","Diode Reverse Recovery Charge"]
["Ireverse",0,"A",0,"A","Reverse Leakage Current"]
[]
["Controller"]
["Outputs"]
["Top FET","Fixed",null,null,"Calculated"]
["Tr",{"$f":"CHOOSE(VOUT_setting, 0.000000003, 0.000000005,0.000000005,0.000000003)","v":5.0000000000000001E-9},"s",null,{"$f":"(Qgd_Q1+Qgs_Q1/2)*(RdsonDRT+Rgate1)/(VCC-Vsp_Q1)","v":2.2106523722627737E-9},"s"]
["Tf",{"$f":"0.000000003","v":3E-9},"s",null,{"$f":"(Qgd_Q1+Qgs_Q1/2)*(RdsonDRT2+Rgate1)/(Vsp_Q1)","v":2.4703608247422675E-9},"s"]
[]
["IC Power Disipation","Value","Units"]
["Power Dis",{"$f":"'Efficiency Calculations'!AU109","v":3.8528574310056856},"W"]
["Temp rise",{"$f":"B364*ThetaJaCtrl","v":71.66314821670575},"°C"]
["Junction temperature",{"$f":"B365 + Ta","v":96.66314821670575},"°C"]
[]
["Current (switching)",{"$f":"(Qg_Q1+Qg_Q2)*Fsw+Iq","v":2.8421999999999996E-3},"A"]
["Qrr Current",{"$f":"Qrr_Q2*Fsw","v":1.1999999999999999E-2},"A"]
["Diode Current",{"$f":"C370/Vin","v":{"$error":"#NAME?"}},{"$f":"Deadtime*Fsw*(Ipp/2)*(Vsd_Q1+Vsd_Q2)","v":{"$error":"#NAME?"}}]
["Total Application Switching IQ",{"$f":"SUM(B368:B370)","v":{"$error":"#NAME?"}},"A"]
[]
["Low-side MOSFET/Diode"]
["Part Power"]
["Power Dis"]
[]
["SCHEMATIC LABELS"]
[{"$f":"\"RC1 = \"&'Design Regulator'!D71&\"kΩ\"","v":"RC1 = 113kΩ"},{"$f":"'Design Regulator'!D71&\"kΩ\"","v":"113kΩ"},null,{"$f":"'Design Regulator'!D74&\"kΩ\"","v":"kΩ"}]
[{"$f":"\"RC2 = \"&'Design Regulator'!D74&\"kΩ\"","v":"RC2 = kΩ"},{"$f":"'Design Regulator'!D74&\"kΩ\"","v":"kΩ"}]
[]
[{"$f":"\"Lo = \"&'Design Regulator'!E28&\"µH\"","v":"Lo = 2.2µH"},{"$f":"'Design Regulator'!E28&\"µH\"","v":"2.2µH"},null,{"$f":"IF(MODE = 1, 'Design Regulator'!I28&\"µH\", 'Design Regulator'!E28&\"µH\")","v":"µH"}]
[{"$f":"\"Rdcr = \"&Rdcr*1000&\"mΩ\"","v":"Rdcr = 3.8mΩ"},{"$f":"Rdcr*1000&\"mΩ\"","v":"3.8mΩ"},null,{"$f":"IF(MODE=1, Rdcr2*1000&\"mΩ\", Rdcr*1000&\"mΩ\")","v":"0mΩ"}]
[{"$f":"\"Rs = \"&'Design Regulator'!E19&\"mΩ\"","v":"Rs = 5mΩ"},{"$f":"'Design Regulator'!E19&\"mΩ\"","v":"5mΩ"},null,{"$f":"IF(MODE = 1, 'Design Regulator'!I19&\"mΩ\", 'Design Regulator'!E19&\"mΩ\")","v":"mΩ"}]
[]
["IC",{"$f":"CHOOSE(GPN_setting,\"LM708A0(-Q1)\",\"LM70880(-Q1)\",\"LM70860(-Q1)\",\"LM70840(-Q1)\",\"LM706A0(-Q1)\",\"LM70660(-Q1)\",\"LM704A0(-Q1)\")","v":"LM70880(-Q1)"},null,null,null,{"$f":"GPN_setting","v":2}]
[]
[{"$f":"IF((INFILTER_TYPE=1),\"AEF IS DISABLED!\",\"AEF\")","v":"AEF"},{"$f":"IF((INFILTER_TYPE=1),\"\",\"0.1µF\")","v":"0.1µF"},{"$f":"IF((INFILTER_TYPE=1),\"\",\"0.47Ω\")","v":"0.47Ω"},{"$f":"IF((INFILTER_TYPE=1),\"\",\"3Ω\")","v":"3Ω"},{"$f":"IF((INFILTER_TYPE=1),\"\",\"50kΩ\")","v":"50kΩ"}]
[{"$f":"\"LAEF =\"&L_infilter&\" uF\"","v":"LAEF =0 uF"},{"$f":"IF((INFILTER_TYPE=1),\"\",L_infilter&\"µH\")","v":"0µH"}]
[{"$f":"\"Cinj =\"&CinjSel*1000000&\" uF\"","v":{"$error":"#REF!"}},{"$f":"IF((INFILTER_TYPE=1),\"\",CinjSel*1000000&\"µF\")","v":{"$error":"#REF!"}}]
[{"$f":"\"Cdamp =\"&CdampSel*1000000&\" uF\"","v":{"$error":"#REF!"}},{"$f":"IF((INFILTER_TYPE=1),\"\",IF(OSC=1,\"DNP\",CdampSel*1000000&\"µF\"))","v":{"$error":"#REF!"}}]
[{"$f":"\"Rdamp =\"&RdampSel&\"Ω\"","v":{"$error":"#REF!"}},{"$f":"IF((INFILTER_TYPE=1),\"\",RdampSel&\"Ω\")","v":{"$error":"#REF!"}}]
[{"$f":"\"Rcomp =\"&Rcomp_AEF&\"Ω\"","v":{"$error":"#VALUE!"}},{"$f":"IF((INFILTER_TYPE=1),\"\",Rcomp_AEF&\"Ω\")","v":{"$error":"#VALUE!"}}]
[{"$f":"\"Ccomp =\"&Ccomp_AEF*1000000000000&\"pF\"","v":{"$error":"#VALUE!"}},{"$f":"IF((INFILTER_TYPE=1),\"\",Ccomp_AEF*1000000000000&\"pF\")","v":{"$error":"#VALUE!"}}]
[{"$f":"\"Csen =\"&Csen_AEF*1000000&\"µF\"","v":{"$error":"#VALUE!"}},{"$f":"IF((INFILTER_TYPE=1),\"\",Csen_AEF*1000000&\"µF\")","v":{"$error":"#VALUE!"}}]
[null,"CDAMP"]
[]
[{"$f":"\"VOUT = \"&'Design Regulator'!E9&\"V\"","v":"VOUT = 3.3V"},{"$f":"'Design Regulator'!E9&\"V\"","v":"3.3V"},null,{"$f":"IF(MODE=1, 'Design Regulator'!I10&\"V\", \"\")","v":"V"}]
[]
[{"$f":"\"COUT = \"&'Design Regulator'!$E$36&\"µF\"","v":"COUT = 325µF"},{"$f":"ROUND('Design Regulator'!$E$36/Number_of_Phases, 0)&\"µF\"","v":"325µF"},null,{"$f":"IF(MODE=1, 'Design Regulator'!$I$36&\"µF\", ROUND('Design Regulator'!$E$36/Number_of_Phases, 0)&\"µF\")","v":"µF"}]
["Capacitance per component (Cout)",{"$f":"\"22µF\"","v":"22µF"}]
["# of output caps",{"$f":"ROUNDUP(Cout*1000000/22,0)&\" x\"","v":"15 x"}]
[]
["CIN",{"$f":"Cin*1000000&\"µF\"","v":"15µF"}]
["Capacitance per component (Cin)",{"$f":"\"10µF\"","v":"10µF"}]
["# of input caps",{"$f":"ROUNDUP(Cin*1000000/10,0)&\" x\"","v":"2 x"}]
["Cd",{"$f":"CHOOSE(INFILTER_TYPE,\"\",4*Cin*1000000&\"µF\")","v":{"$error":"#VALUE!"}}]
["Rd",{"$f":"CHOOSE(INFILTER_TYPE,\"\",D303&\"Ω\")","v":{"$error":"#VALUE!"}}]
[]
[{"$f":"\"RC1 = \"&Rcea1_u/1000&\"kΩ\"","v":"RC1 = 400kΩ"},{"$f":"IF(COMP_TYPE=1,\"100kΩ\",ROUND(Rcea1_u/1000,2)&\"kΩ\")","v":"100kΩ"}]
[{"$f":"\"CC1 = \"&Cc1ea_u*10^9&\"nF\"","v":"CC1 = 0.05nF"},{"$f":"IF(COMP_TYPE=1,\"\",Cc1ea_u*10^9&\"nF\")","v":""}]
[{"$f":"\"CC2 = \"&IF(Cc2ea_u>0, Cc2ea_u*10^12&\"pF\", \"OPEN\")","v":"CC2 = 1pF"},{"$f":"IF(COMP_TYPE=1,\"\",IF(Cc2ea_u>0, ROUND(Cc2ea_u*10^12,1)&\"pF\", \"N/A\"))","v":""}]
[]
[{"$f":"\"gm = \"&$B$202*1000&\"mS\"","v":"gm = 0.03mS"},{"$f":"$B$202*1000&\"mS\"","v":"0.03mS"}]
[{"$f":"\"RoEA = \"&RoEA/1000000&\"MΩ\"","v":"RoEA = 64MΩ"},{"$f":"RoEA/1000000&\"MΩ\"","v":"64MΩ"}]
[{"$f":"\"GBW = \"&GBW&\"MHz\"","v":"GBW = 6MHz"},{"$f":"GBW&\"MHz\"","v":"6MHz"}]
[]
[{"$f":"\"Cslope = \"&Cslope&\"pF\"","v":{"$error":"#NAME?"}},{"$f":"ROUND(Cslope*1,0)&\"pF\"","v":{"$error":"#NAME?"}}]
["Cd",{"$f":"IF(DITHER=1, ROUND(Cdither*1000000000,1)&\"nF\", \"\")","v":""},{"$f":"IF(DITHER=1, \"Cd\", \"\")","v":""}]
[{"$f":"\"RFB1 = \"&'Design Regulator'!E66&\"kΩ\"","v":"RFB1 = 100kΩ"},{"$f":"IF(VOUT_setting=1, 'Design Regulator'!E66&\" kΩ\", \"\")","v":""},null,{"$f":"'Design Regulator'!I66&\"kΩ\"","v":"kΩ"}]
[{"$f":"\"RFB2 = \"&IF(Vout=Vref,\"OPEN\",'Design Regulator'!E67&\"kΩ\")","v":"RFB2 = 792kΩ"},{"$f":"IF(VOUT_setting=1, IF(Vout=Vref,\"OPEN\",Rfb2_u/1000&\" kΩ\"), \"\")","v":""},null,{"$f":"IF(Vout2=Vref,\"OPEN\",Rfb4_u/1000&\"kΩ\")","v":"0kΩ"}]
[{"$f":"\"RFBSET = \"&CHOOSE(VOUT_setting,\"\",\"24.9kΩ\",\"0Ω\",\"49.9kΩ\")","v":"RFBSET = 0Ω"},null,null,{"$f":"CHOOSE(VOUT_setting,\"\",\"24.9kΩ\",\"0Ω\",\"49.9kΩ\")","v":"0Ω"}]
["Rboot resistor",null,null,{"$f":"IF(OR(VOUT_setting=1,VOUT_setting=4),\"1Ω\",\"0Ω\")","v":"0Ω"}]
["RENT",{"$f":"IF((UVLO_TYPE=1),B190&\"kΩ\",\"\")","v":""}]
["RENB",{"$f":"IF((UVLO_TYPE=1),B191&\"kΩ\",\"\")","v":""}]
[]
[{"$f":"\"Crossover Frequency = \"&ROUND('Stability Calculations'!U4,1)&\"kHz\"","v":"Crossover Frequency = 28kHz"},{"$f":" ROUND('Stability Calculations'!U4,1)&\"kHz\"","v":"28kHz"},null,{"$f":"'Stability Calculations'!U4","v":28.023499999999999}]
[{"$f":"\"Phase Margin = \"&ROUND('Stability Calculations'!U5,0)&\"°\"","v":"Phase Margin = 54°"},{"$f":"ROUND('Stability Calculations'!U5,0)&\"°\"","v":"54°"}]
[{"$f":"IF(loopPM<45,CHOOSE(COMP_TYPE,\"Phase Margin too low, Increase COUT\",\"Phase Margin too low, Re-compensate\"),\"\")","v":""}]
[{"$f":"\"Gain Margin = \"&ROUND('Stability Calculations'!U7*-1,1)&\"dB\"","v":"Gain Margin = 17.5dB"},{"$f":"ROUND('Stability Calculations'!U7*-1,1)&\"dB\"","v":"17.5dB"}]
["Full-load/high line efficiency",{"$f":"IF(PLOT_TYPE=1, ROUND('Efficiency Calculations'!BA109,1)&\"%\", ROUND(#REF!,1)&\"%\")","v":"84.2%"}]
["Half-load/mid-line efficiency",{"$f":"IF(PLOT_TYPE=1, ROUND('Efficiency Calculations'!BA59,1)&\"%\", ROUND(#REF!,1)&\"%\")","v":"86.8%"}]
["OSC pin setting",{"$f":"IF(VOUT_setting=1, \"\", IF(OSC=1, \"Tie OSC to VDDA\", \"Tie OSC to AGND\"))","v":"Tie OSC to AGND"}]
[]
[{"$f":"\"CDITH = \"&Cdither*1000000000&\"nF\"","v":"CDITH = 2.7nF"},{"$f":"Cdither*1000000000&\"nF\"","v":"2.7nF"}]
[{"$f":"\"Rs = \"&Rs&\"Ω\"","v":"Rs = 0.005Ω"},{"$f":"'Standard Value Calculator'!S6&\"Ω\"","v":"Ω"}]
["Rset",{"$f":"'Standard Value Calculator'!S16&\"mΩ\"","v":"5.23mΩ"}]
["Rs",{"$f":"'Standard Value Calculator'!S6&\"mΩ\"","v":"mΩ"}]
[{"$f":"\"Rshunt = \"&ROUND(Rshunt,1)&\"mΩ\"","v":{"$error":"#NAME?"}},{"$f":"IF(Rshunt=\"0\", \"N/A\",ROUND(Rshunt,1)&\"mΩ\")","v":{"$error":"#NAME?"}}]
[]
["Rpgood","20kΩ"]
["RFB1"]
["RFB2"]
["VCCX",{"$f":"IF((Ext_VCC=1),\"5V\",\"GND\")","v":"GND"}]
["RCNFG",{"$f":" 'Design Regulator'!E58&\"kΩ\"","v":"29.4kΩ"}]
["Rt",{"$f":" Rfadj&\"kΩ\"","v":"54.9kΩ"},{"$f":"Rfadj","v":54.9},{"$f":"Fsw","v":400000},null,{"$f":"OR((Fsw=440000),(Fsw=2200000))","v":false},null,{"$f":"OR(OR(AND(OSC=1, OR(Fsw/1000>2530, Fsw/1000<1800)), AND(OSC=2, OR(Fsw/1000>500, Fsw/1000<300))), OR((Fsw=440000),(Fsw=2200000)))","v":false}]
["Css",{"$f":"'Standard Value Calculator'!B4*1000000000&\"nF\"","v":"0nF"},{"$f":"IF(MODE=1,\"Css\",\"\")","v":"Css"}]
["Cres",{"$f":"IF(Cres_u = 0, \"N/A\", Cres_u*1000000000 &\"nF\")","v":"82nF"},{"$f":"IF(Cres_u = 0, \"N/A\", Cres_u*1000000 &\"µF\")","v":"0.082µF"},{"$f":"Cres_u","v":8.2000000000000006E-8}]
[]
["Blank out",{"$f":"IF(B76=\"y\",\"\",\"|\")","v":"|"}]
["OUTPUT CURRENT",{"$f":"'Design Regulator'!$E$10&\"A\"","v":"8A"},null,{"$f":"IF(MODE=1,'Design Regulator'!#REF!&\"A\",\"\")","v":{"$error":"#REF!"}}]
["VIN",{"$f":"VIN_nom&\"V\"","v":"48V"}]
["VIN range",{"$f":"VIN_min&\"V\"&\"...\"&VIN_max&\"V\"","v":"42V...54V"}]
[null,{"$f":"IF(INFILTER_TYPE=1,B452,\"\")","v":""},{"$f":"IF(INFILTER_TYPE=1,\"\",B452)","v":"42V...54V"}]
["PFM/FPWM",{"$f":"IF((DEMB=1),\"GND\",\"VDDA\")","v":"VDDA"}]

{"sheet":"Schematic Management","index":8,"n_rows":17,"n_cols":14,"rows_kept":17,"cut":false,"hidden":true,"merged":[]}
[null,null,null,null,null,null,null,null,null,null,null,null,null,"3.3V or 5V fixed (FB1/2)"]
[{"$f":"IF(MODE=1, CHOOSE(SCH_SETTING, \"SCH_SetVout_IntComp_nEN\",\"SCH_SetVout_IntComp_EN\",\"SCH_SetVout_ExtComp_nEN\",\"SCH_SetVout_ExtComp_EN\",\"SCH_AdjVout_IntComp_nEN\",\"SCH_AdjVout_IntComp_EN\",\"SCH_AdjVout_ExtComp_nEN\",\"SCH_AdjVout_ExtComp_EN\",  \"SCH_SetVout_IntComp_nEN_BIAS_GND\",\"SCH_SetVout_IntComp_EN_BIAS_GND\",\"SCH_SetVout_ExtComp_nEN_BIAS_GND\",\"SCH_SetVout_ExtComp_EN_BIAS_GND\",\"SCH_AdjVout_IntComp_nEN_BIAS_GND\",\"SCH_AdjVout_IntComp_EN_BIAS_GND\",\"SCH_AdjVout_ExtComp_nEN_BIAS_GND\",\"SCH_AdjVout_ExtComp_EN_BIAS_GND\", \"\"))","v":"SCH_SetVout_IntComp_nEN_BIAS_GND"},null,null,null,null,null,null,null,null,"With/without dither (DITH)",null,null,null,"With/without VOUT connected to VCCX"]
[null,null,null,null,null,null,null,null,null,"FPWM or DEM (DEMB)"]
[null,null,null,null,null,null,null,null,null,"Shunt or inductor DCR current sensing"]
[]
[]
[]
[]
[]
[]
[]
[]
[]
[]
[]
[]
[null," "]

{"sheet":"Efficiency Plot Management","index":9,"n_rows":2,"n_cols":1,"rows_kept":2,"cut":false,"hidden":true,"merged":[]}
[]
[{"$f":"IF(PLOT_TYPE=1, \"EFF_Ch1\", \"EFF_Ch2\")","v":"EFF_Ch1"}]

{"sheet":"Standard Value Calculator","index":10,"n_rows":159,"n_cols":20,"rows_kept":159,"cut":false,"hidden":true,"merged":[]}
[]
["Capacitors","Css","Cc1ea","Cc2ea","Cout","Cin","Cres","Cdither","Cc3ea","Cc4ea","Cin_Passive","Cdamp_Pssv","Cinj_AEF","Cdamp_AEF"]
["Inputs",{"$f":"Css","v":0},{"$f":"Cc1ea","v":1.7545129723293526E-9},{"$f":"Cc2ea","v":6.2222771729486292E-12},{"$f":"Cout","v":3.2499999999999999E-4},{"$f":"Cin","v":1.5E-5},{"$f":"Cres","v":8.8500000000000018E-8},{"$f":"Cdither_init","v":2.8344671201814057E-9},{"$f":"Cc3ea","v":0},{"$f":"Cc4ea","v":0},{"$f":"'Variable Management'!B294*0.000001","v":{"$error":"#REF!"}},{"$f":"K3*4","v":{"$error":"#REF!"}},{"$f":"Cinj_AEF*0.000001","v":{"$error":"#VALUE!"}},{"$f":"'Variable Management'!B297*0.000001","v":{"$error":"#VALUE!"}},null,null,"Resistors","inputs","Standard Result"]
["Standard Result",{"$f":"SUM(B6:B158)/1000000000000","v":0},{"$f":"IF(C3=\"OPEN\",\"OPEN\",SUM(C6:C158)/1000000000000)","v":1.8E-9},{"$f":"SUM(D6:D158)/1000000000000","v":6.8000000000000001E-12},{"$f":"SUM(E6:E158)/1000000000000","v":3.3E-4},{"$f":"SUM(F6:F158)/1000000000000","v":1.5E-5},{"$f":"SUM(G6:G158)/1000000000000","v":8.2000000000000006E-8},{"$f":"IF(H3=\"OPEN\",\"OPEN\",SUM(H6:H158)/1000000000000)","v":2.7000000000000002E-9},0,0,{"$error":"#REF!"},{"$error":"#REF!"},{"$error":"#VALUE!"},{"$error":"#VALUE!"},null,null,"Rt",{"$f":"Rfadj","v":54.9},{"$f":"IF(R4>(INT(0.5+100*POWER(10,IF(96*(LOG(R4)-INT(LOG(R4)))-ROUND(96*(LOG(R4)-INT(LOG(R4))),0)<0,ROUND(96*(LOG(R4)-INT(LOG(R4))),0)-1,ROUND(96*(LOG(R4)-INT(LOG(R4))),0))/96))*POWER(10,INT(LOG(R4))-2)+INT(0.5+100*POWER(10,(IF(96*(LOG(R4)-INT(LOG(R4)))-ROUND(96*(LOG(R4)-INT(LOG(R4))),0)<0,ROUND(96*(LOG(R4)-INT(LOG(R4))),0)-1,ROUND(96*(LOG(R4)-INT(LOG(R4))),0))+1)/96))*POWER(10,INT(LOG(R4))-2))/2,INT(0.5+100*POWER(10,(IF(96*(LOG(R4)-INT(LOG(R4)))-ROUND(96*(LOG(R4)-INT(LOG(R4))),0)<0,ROUND(96*(LOG(R4)-INT(LOG(R4))),0)-1,ROUND(96*(LOG(R4)-INT(LOG(R4))),0))+1)/96))*POWER(10,INT(LOG(R4))-2),INT(0.5+100*POWER(10,IF(96*(LOG(R4)-INT(LOG(R4)))-ROUND(96*(LOG(R4)-INT(LOG(R4))),0)<0,ROUND(96*(LOG(R4)-INT(LOG(R4))),0)-1,ROUND(96*(LOG(R4)-INT(LOG(R4))),0))/96))*POWER(10,INT(LOG(R4))-2))","v":54.900000000000006},"Ω"]
["(pF)"]
[0.47,{"$f":"IF(IF((B$3*10^12-$A7)*(B$3*10^12-$A6)*-1<0,0,1)*IF(ABS(B$3*10^12-$A7)>(B$3*10^12-$A6),$A6,$A7)=B7,0,IF((B$3*10^12-$A7)*(B$3*10^12-$A6)*-1<0,0,1)*IF(ABS(B$3*10^12-$A7)>(B$3*10^12-$A6),$A6,$A7))","v":0},0,0,0,0,0,0,0,0,{"$error":"#REF!"},{"$error":"#REF!"},{"$error":"#VALUE!"},{"$error":"#VALUE!"}]
[0.56000000000000005,{"$f":"IF(IF((B$3*10^12-$A8)*(B$3*10^12-$A7)*-1<0,0,1)*IF(ABS(B$3*10^12-$A8)>(B$3*10^12-$A7),$A7,$A8)=B8,0,IF((B$3*10^12-$A8)*(B$3*10^12-$A7)*-1<0,0,1)*IF(ABS(B$3*10^12-$A8)>(B$3*10^12-$A7),$A7,$A8))","v":0},{"$f":"IF(IF((C$3*10^12-$A8)*(C$3*10^12-$A7)*-1<0,0,1)*IF(ABS(C$3*10^12-$A8)>(C$3*10^12-$A7),$A7,$A8)=C8,0,IF((C$3*10^12-$A8)*(C$3*10^12-$A7)*-1<0,0,1)*IF(ABS(C$3*10^12-$A8)>(C$3*10^12-$A7),$A7,$A8))","v":0},{"$f":"IF(IF((D$3*10^12-$A8)*(D$3*10^12-$A7)*-1<0,0,1)*IF(ABS(D$3*10^12-$A8)>(D$3*10^12-$A7),$A7,$A8)=D8,0,IF((D$3*10^12-$A8)*(D$3*10^12-$A7)*-1<0,0,1)*IF(ABS(D$3*10^12-$A8)>(D$3*10^12-$A7),$A7,$A8))","v":0},{"$f":"IF(IF((E$3*10^12-$A8)*(E$3*10^12-$A7)*-1<0,0,1)*IF(ABS(E$3*10^12-$A8)>(E$3*10^12-$A7),$A7,$A8)=E8,0,IF((E$3*10^12-$A8)*(E$3*10^12-$A7)*-1<0,0,1)*IF(ABS(E$3*10^12-$A8)>(E$3*10^12-$A7),$A7,$A8))","v":0},{"$f":"IF(IF((F$3*10^12-$A8)*(F$3*10^12-$A7)*-1<0,0,1)*IF(ABS(F$3*10^12-$A8)>(F$3*10^12-$A7),$A7,$A8)=F8,0,IF((F$3*10^12-$A8)*(F$3*10^12-$A7)*-1<0,0,1)*IF(ABS(F$3*10^12-$A8)>(F$3*10^12-$A7),$A7,$A8))","v":0},{"$f":"IF(IF((G$3*10^12-$A8)*(G$3*10^12-$A7)*-1<0,0,1)*IF(ABS(G$3*10^12-$A8)>(G$3*10^12-$A7),$A7,$A8)=G8,0,IF((G$3*10^12-$A8)*(G$3*10^12-$A7)*-1<0,0,1)*IF(ABS(G$3*10^12-$A8)>(G$3*10^12-$A7),$A7,$A8))","v":0},0,0,0,{"$f":"IF(IF((K$3*10^12-$A8)*(K$3*10^12-$A7)*-1<0,0,1)*IF(ABS(K$3*10^12-$A8)>(K$3*10^12-$A7),$A7,$A8)=K8,0,IF((K$3*10^12-$A8)*(K$3*10^12-$A7)*-1<0,0,1)*IF(ABS(K$3*10^12-$A8)>(K$3*10^12-$A7),$A7,$A8))","v":{"$error":"#REF!"}},{"$error":"#REF!"},{"$error":"#VALUE!"},{"$error":"#VALUE!"},null,null,"Rc1ea",{"$f":"Rcea1","v":113389.68832363257},{"$f":"IF(R7>(INT(0.5+100*POWER(10,IF(96*(LOG(R7)-INT(LOG(R7)))-ROUND(96*(LOG(R7)-INT(LOG(R7))),0)<0,ROUND(96*(LOG(R7)-INT(LOG(R7))),0)-1,ROUND(96*(LOG(R7)-INT(LOG(R7))),0))/96))*POWER(10,INT(LOG(R7))-2)+INT(0.5+100*POWER(10,(IF(96*(LOG(R7)-INT(LOG(R7)))-ROUND(96*(LOG(R7)-INT(LOG(R7))),0)<0,ROUND(96*(LOG(R7)-INT(LOG(R7))),0)-1,ROUND(96*(LOG(R7)-INT(LOG(R7))),0))+1)/96))*POWER(10,INT(LOG(R7))-2))/2,INT(0.5+100*POWER(10,(IF(96*(LOG(R7)-INT(LOG(R7)))-ROUND(96*(LOG(R7)-INT(LOG(R7))),0)<0,ROUND(96*(LOG(R7)-INT(LOG(R7))),0)-1,ROUND(96*(LOG(R7)-INT(LOG(R7))),0))+1)/96))*POWER(10,INT(LOG(R7))-2),INT(0.5+100*POWER(10,IF(96*(LOG(R7)-INT(LOG(R7)))-ROUND(96*(LOG(R7)-INT(LOG(R7))),0)<0,ROUND(96*(LOG(R7)-INT(LOG(R7))),0)-1,ROUND(96*(LOG(R7)-INT(LOG(R7))),0))/96))*POWER(10,INT(LOG(R7))-2))","v":113000},"Ω"]
[0.68,0,0,0,0,0,0,0,0,0,{"$error":"#REF!"},{"$error":"#REF!"},{"$error":"#VALUE!"},{"$error":"#VALUE!"},null,null,"Rc1ea",{"$f":"Rcea2","v":0},{"$f":"IF(R8>(INT(0.5+100*POWER(10,IF(96*(LOG(R8)-INT(LOG(R8)))-ROUND(96*(LOG(R8)-INT(LOG(R8))),0)<0,ROUND(96*(LOG(R8)-INT(LOG(R8))),0)-1,ROUND(96*(LOG(R8)-INT(LOG(R8))),0))/96))*POWER(10,INT(LOG(R8))-2)+INT(0.5+100*POWER(10,(IF(96*(LOG(R8)-INT(LOG(R8)))-ROUND(96*(LOG(R8)-INT(LOG(R8))),0)<0,ROUND(96*(LOG(R8)-INT(LOG(R8))),0)-1,ROUND(96*(LOG(R8)-INT(LOG(R8))),0))+1)/96))*POWER(10,INT(LOG(R8))-2))/2,INT(0.5+100*POWER(10,(IF(96*(LOG(R8)-INT(LOG(R8)))-ROUND(96*(LOG(R8)-INT(LOG(R8))),0)<0,ROUND(96*(LOG(R8)-INT(LOG(R8))),0)-1,ROUND(96*(LOG(R8)-INT(LOG(R8))),0))+1)/96))*POWER(10,INT(LOG(R8))-2),INT(0.5+100*POWER(10,IF(96*(LOG(R8)-INT(LOG(R8)))-ROUND(96*(LOG(R8)-INT(LOG(R8))),0)<0,ROUND(96*(LOG(R8)-INT(LOG(R8))),0)-1,ROUND(96*(LOG(R8)-INT(LOG(R8))),0))/96))*POWER(10,INT(LOG(R8))-2))","v":{"$error":"#NUM!"}},"Ω"]
[0.82,0,0,0,0,0,0,0,0,0,{"$error":"#REF!"},{"$error":"#REF!"},{"$error":"#VALUE!"},{"$error":"#VALUE!"}]
[1,0,0,0,0,0,0,0,0,0,{"$error":"#REF!"},{"$error":"#REF!"},{"$error":"#VALUE!"},{"$error":"#VALUE!"},null,null,"Rfb1",{"$f":"Rfb1_","v":2500000},{"$f":"IF(R10>(INT(0.5+100*POWER(10,IF(96*(LOG(R10)-INT(LOG(R10)))-ROUND(96*(LOG(R10)-INT(LOG(R10))),0)<0,ROUND(96*(LOG(R10)-INT(LOG(R10))),0)-1,ROUND(96*(LOG(R10)-INT(LOG(R10))),0))/96))*POWER(10,INT(LOG(R10))-2)+INT(0.5+100*POWER(10,(IF(96*(LOG(R10)-INT(LOG(R10)))-ROUND(96*(LOG(R10)-INT(LOG(R10))),0)<0,ROUND(96*(LOG(R10)-INT(LOG(R10))),0)-1,ROUND(96*(LOG(R10)-INT(LOG(R10))),0))+1)/96))*POWER(10,INT(LOG(R10))-2))/2,INT(0.5+100*POWER(10,(IF(96*(LOG(R10)-INT(LOG(R10)))-ROUND(96*(LOG(R10)-INT(LOG(R10))),0)<0,ROUND(96*(LOG(R10)-INT(LOG(R10))),0)-1,ROUND(96*(LOG(R10)-INT(LOG(R10))),0))+1)/96))*POWER(10,INT(LOG(R10))-2),INT(0.5+100*POWER(10,IF(96*(LOG(R10)-INT(LOG(R10)))-ROUND(96*(LOG(R10)-INT(LOG(R10))),0)<0,ROUND(96*(LOG(R10)-INT(LOG(R10))),0)-1,ROUND(96*(LOG(R10)-INT(LOG(R10))),0))/96))*POWER(10,INT(LOG(R10))-2))","v":2490000},"Ω"]
[1.2,0,0,0,0,0,0,0,0,0,{"$error":"#REF!"},{"$error":"#REF!"},{"$f":"IF(IF((M$3*10^12-$A12)*(M$3*10^12-$A11)*-1<0,0,1)*IF(ABS(M$3*10^12-$A12)>(M$3*10^12-$A11),$A11,$A12)=M12,0,IF((M$3*10^12-$A12)*(M$3*10^12-$A11)*-1<0,0,1)*IF(ABS(M$3*10^12-$A12)>(M$3*10^12-$A11),$A11,$A12))","v":{"$error":"#VALUE!"}},{"$error":"#VALUE!"},null,null,"Rfb2",{"$f":"Rfb2_","v":800000},{"$f":"IF(R11=\"OPEN\",\"OPEN\",IF(R11>(INT(0.5+100*POWER(10,IF(96*(LOG(R11)-INT(LOG(R11)))-ROUND(96*(LOG(R11)-INT(LOG(R11))),0)<0,ROUND(96*(LOG(R11)-INT(LOG(R11))),0)-1,ROUND(96*(LOG(R11)-INT(LOG(R11))),0))/96))*POWER(10,INT(LOG(R11))-2)+INT(0.5+100*POWER(10,(IF(96*(LOG(R11)-INT(LOG(R11)))-ROUND(96*(LOG(R11)-INT(LOG(R11))),0)<0,ROUND(96*(LOG(R11)-INT(LOG(R11))),0)-1,ROUND(96*(LOG(R11)-INT(LOG(R11))),0))+1)/96))*POWER(10,INT(LOG(R11))-2))/2,INT(0.5+100*POWER(10,(IF(96*(LOG(R11)-INT(LOG(R11)))-ROUND(96*(LOG(R11)-INT(LOG(R11))),0)<0,ROUND(96*(LOG(R11)-INT(LOG(R11))),0)-1,ROUND(96*(LOG(R11)-INT(LOG(R11))),0))+1)/96))*POWER(10,INT(LOG(R11))-2),INT(0.5+100*POWER(10,IF(96*(LOG(R11)-INT(LOG(R11)))-ROUND(96*(LOG(R11)-INT(LOG(R11))),0)<0,ROUND(96*(LOG(R11)-INT(LOG(R11))),0)-1,ROUND(96*(LOG(R11)-INT(LOG(R11))),0))/96))*POWER(10,INT(LOG(R11))-2)))","v":806000},"Ω"]
[1.5,0,0,0,0,0,0,0,0,0,{"$error":"#REF!"},{"$error":"#REF!"},{"$error":"#VALUE!"},{"$error":"#VALUE!"},null,null,"Rt1",{"$f":"'Variable Management'!B27*1000","v":54477.777777777781},{"$f":"IF(R12>(INT(0.5+100*POWER(10,IF(96*(LOG(R12)-INT(LOG(R12)))-ROUND(96*(LOG(R12)-INT(LOG(R12))),0)<0,ROUND(96*(LOG(R12)-INT(LOG(R12))),0)-1,ROUND(96*(LOG(R12)-INT(LOG(R12))),0))/96))*POWER(10,INT(LOG(R12))-2)+INT(0.5+100*POWER(10,(IF(96*(LOG(R12)-INT(LOG(R12)))-ROUND(96*(LOG(R12)-INT(LOG(R12))),0)<0,ROUND(96*(LOG(R12)-INT(LOG(R12))),0)-1,ROUND(96*(LOG(R12)-INT(LOG(R12))),0))+1)/96))*POWER(10,INT(LOG(R12))-2))/2,INT(0.5+100*POWER(10,(IF(96*(LOG(R12)-INT(LOG(R12)))-ROUND(96*(LOG(R12)-INT(LOG(R12))),0)<0,ROUND(96*(LOG(R12)-INT(LOG(R12))),0)-1,ROUND(96*(LOG(R12)-INT(LOG(R12))),0))+1)/96))*POWER(10,INT(LOG(R12))-2),INT(0.5+100*POWER(10,IF(96*(LOG(R12)-INT(LOG(R12)))-ROUND(96*(LOG(R12)-INT(LOG(R12))),0)<0,ROUND(96*(LOG(R12)-INT(LOG(R12))),0)-1,ROUND(96*(LOG(R12)-INT(LOG(R12))),0))/96))*POWER(10,INT(LOG(R12))-2))","v":54900},"Ω"]
[1.8,0,0,0,0,0,0,0,0,0,{"$error":"#REF!"},{"$error":"#REF!"},{"$error":"#VALUE!"},{"$error":"#VALUE!"},null,null,"Rd",{"$f":"'Variable Management'!B28*1000","v":0},{"$f":"IF(R13=\"OPEN\",\"OPEN\",IF(R13>(INT(0.5+100*POWER(10,IF(96*(LOG(R13)-INT(LOG(R13)))-ROUND(96*(LOG(R13)-INT(LOG(R13))),0)<0,ROUND(96*(LOG(R13)-INT(LOG(R13))),0)-1,ROUND(96*(LOG(R13)-INT(LOG(R13))),0))/96))*POWER(10,INT(LOG(R13))-2)+INT(0.5+100*POWER(10,(IF(96*(LOG(R13)-INT(LOG(R13)))-ROUND(96*(LOG(R13)-INT(LOG(R13))),0)<0,ROUND(96*(LOG(R13)-INT(LOG(R13))),0)-1,ROUND(96*(LOG(R13)-INT(LOG(R13))),0))+1)/96))*POWER(10,INT(LOG(R13))-2))/2,INT(0.5+100*POWER(10,(IF(96*(LOG(R13)-INT(LOG(R13)))-ROUND(96*(LOG(R13)-INT(LOG(R13))),0)<0,ROUND(96*(LOG(R13)-INT(LOG(R13))),0)-1,ROUND(96*(LOG(R13)-INT(LOG(R13))),0))+1)/96))*POWER(10,INT(LOG(R13))-2),INT(0.5+100*POWER(10,IF(96*(LOG(R13)-INT(LOG(R13)))-ROUND(96*(LOG(R13)-INT(LOG(R13))),0)<0,ROUND(96*(LOG(R13)-INT(LOG(R13))),0)-1,ROUND(96*(LOG(R13)-INT(LOG(R13))),0))/96))*POWER(10,INT(LOG(R13))-2)))","v":{"$error":"#NUM!"}},"Ω"]
[2.2000000000000002,{"$f":"IF(IF((B$3*10^12-$A15)*(B$3*10^12-$A14)*-1<0,0,1)*IF(ABS(B$3*10^12-$A15)>(B$3*10^12-$A14),$A14,$A15)=B15,0,IF((B$3*10^12-$A15)*(B$3*10^12-$A14)*-1<0,0,1)*IF(ABS(B$3*10^12-$A15)>(B$3*10^12-$A14),$A14,$A15))","v":0},0,0,0,0,0,0,0,0,{"$error":"#REF!"},{"$error":"#REF!"},{"$error":"#VALUE!"},{"$error":"#VALUE!"},null,null,"Rd_AEF",{"$f":"'Variable Management'!B303","v":0},{"$f":"IF(R14=\"OPEN\",\"OPEN\",IF(R14>(INT(0.5+100*POWER(10,IF(96*(LOG(R14)-INT(LOG(R14)))-ROUND(96*(LOG(R14)-INT(LOG(R14))),0)<0,ROUND(96*(LOG(R14)-INT(LOG(R14))),0)-1,ROUND(96*(LOG(R14)-INT(LOG(R14))),0))/96))*POWER(10,INT(LOG(R14))-2)+INT(0.5+100*POWER(10,(IF(96*(LOG(R14)-INT(LOG(R14)))-ROUND(96*(LOG(R14)-INT(LOG(R14))),0)<0,ROUND(96*(LOG(R14)-INT(LOG(R14))),0)-1,ROUND(96*(LOG(R14)-INT(LOG(R14))),0))+1)/96))*POWER(10,INT(LOG(R14))-2))/2,INT(0.5+100*POWER(10,(IF(96*(LOG(R14)-INT(LOG(R14)))-ROUND(96*(LOG(R14)-INT(LOG(R14))),0)<0,ROUND(96*(LOG(R14)-INT(LOG(R14))),0)-1,ROUND(96*(LOG(R14)-INT(LOG(R14))),0))+1)/96))*POWER(10,INT(LOG(R14))-2),INT(0.5+100*POWER(10,IF(96*(LOG(R14)-INT(LOG(R14)))-ROUND(96*(LOG(R14)-INT(LOG(R14))),0)<0,ROUND(96*(LOG(R14)-INT(LOG(R14))),0)-1,ROUND(96*(LOG(R14)-INT(LOG(R14))),0))/96))*POWER(10,INT(LOG(R14))-2)))","v":{"$error":"#NUM!"}},"Ω"]
[2.7,0,0,0,0,0,0,0,0,0,{"$f":"IF(IF((K$3*10^12-$A16)*(K$3*10^12-$A15)*-1<0,0,1)*IF(ABS(K$3*10^12-$A16)>(K$3*10^12-$A15),$A15,$A16)=K16,0,IF((K$3*10^12-$A16)*(K$3*10^12-$A15)*-1<0,0,1)*IF(ABS(K$3*10^12-$A16)>(K$3*10^12-$A15),$A15,$A16))","v":{"$error":"#REF!"}},{"$error":"#REF!"},{"$error":"#VALUE!"},{"$error":"#VALUE!"}]
[3.3,0,0,0,0,0,0,0,0,0,{"$error":"#REF!"},{"$error":"#REF!"},{"$error":"#VALUE!"},{"$error":"#VALUE!"},null,null,"Rs",{"$f":"Rs_ideal*1000","v":5.1939095741856764},{"$f":"IF(R16=0,0,IF(R16>(INT(0.5+100*POWER(10,IF(96*(LOG(R16)-INT(LOG(R16)))-ROUND(96*(LOG(R16)-INT(LOG(R16))),0)<0,ROUND(96*(LOG(R16)-INT(LOG(R16))),0)-1,ROUND(96*(LOG(R16)-INT(LOG(R16))),0))/96))*POWER(10,INT(LOG(R16))-2)+INT(0.5+100*POWER(10,(IF(96*(LOG(R16)-INT(LOG(R16)))-ROUND(96*(LOG(R16)-INT(LOG(R16))),0)<0,ROUND(96*(LOG(R16)-INT(LOG(R16))),0)-1,ROUND(96*(LOG(R16)-INT(LOG(R16))),0))+1)/96))*POWER(10,INT(LOG(R16))-2))/2,INT(0.5+100*POWER(10,(IF(96*(LOG(R16)-INT(LOG(R16)))-ROUND(96*(LOG(R16)-INT(LOG(R16))),0)<0,ROUND(96*(LOG(R16)-INT(LOG(R16))),0)-1,ROUND(96*(LOG(R16)-INT(LOG(R16))),0))+1)/96))*POWER(10,INT(LOG(R16))-2),INT(0.5+100*POWER(10,IF(96*(LOG(R16)-INT(LOG(R16)))-ROUND(96*(LOG(R16)-INT(LOG(R16))),0)<0,ROUND(96*(LOG(R16)-INT(LOG(R16))),0)-1,ROUND(96*(LOG(R16)-INT(LOG(R16))),0))/96))*POWER(10,INT(LOG(R16))-2)))","v":5.23},"mΩ"]
[3.9,0,0,0,0,0,0,0,0,0,{"$error":"#REF!"},{"$error":"#REF!"},{"$error":"#VALUE!"},{"$error":"#VALUE!"},null,null,"Cres",{"$f":"Cres","v":8.8500000000000018E-8},{"$f":"G4*1000000000000","v":82000},"pF"]
[4.7,0,0,0,0,0,0,0,0,0,{"$error":"#REF!"},{"$error":"#REF!"},{"$error":"#VALUE!"},{"$error":"#VALUE!"}]
[5.6,0,0,6.8,0,0,0,0,0,0,{"$error":"#REF!"},{"$error":"#REF!"},{"$error":"#VALUE!"},{"$error":"#VALUE!"}]
[6.8,0,0,0,0,0,0,0,0,0,{"$error":"#REF!"},{"$error":"#REF!"},{"$error":"#VALUE!"},{"$error":"#VALUE!"}]
[8.1999999999999993,0,0,0,0,0,0,0,0,0,{"$error":"#REF!"},{"$error":"#REF!"},{"$error":"#VALUE!"},{"$error":"#VALUE!"},null,null,"Cdither",{"$f":"Cdither_init","v":2.8344671201814057E-9},{"$f":"H4","v":2.7000000000000002E-9}]
[10,0,0,0,0,0,0,0,0,0,{"$f":"IF(IF((K$3*10^12-$A23)*(K$3*10^12-$A22)*-1<0,0,1)*IF(ABS(K$3*10^12-$A23)>(K$3*10^12-$A22),$A22,$A23)=K23,0,IF((K$3*10^12-$A23)*(K$3*10^12-$A22)*-1<0,0,1)*IF(ABS(K$3*10^12-$A23)>(K$3*10^12-$A22),$A22,$A23))","v":{"$error":"#REF!"}},{"$error":"#REF!"},{"$error":"#VALUE!"},{"$error":"#VALUE!"}]
[12,0,0,0,0,0,0,0,0,0,{"$error":"#REF!"},{"$error":"#REF!"},{"$error":"#VALUE!"},{"$error":"#VALUE!"},null,null,"Cin_Passive",{"$f":"K4","v":{"$error":"#REF!"}},{"$f":"R23*1000000","v":{"$error":"#REF!"}},"uF"]
[15,0,0,0,0,0,0,0,0,0,{"$error":"#REF!"},{"$error":"#REF!"},{"$error":"#VALUE!"},{"$error":"#VALUE!"},null,null,"Cinj_AEF",{"$f":"Cinj_AEF","v":{"$error":"#VALUE!"}},{"$f":"M4*1000000","v":{"$error":"#VALUE!"}},"uF"]
[18,0,0,0,0,0,0,0,0,0,{"$error":"#REF!"},{"$error":"#REF!"},{"$error":"#VALUE!"},{"$error":"#VALUE!"},null,null,"Cdamp_AEF",{"$f":"'Variable Management'!B297","v":{"$error":"#VALUE!"}},{"$f":"N4*1000000","v":{"$error":"#VALUE!"}},"uF"]
[22,0,0,0,0,0,0,0,0,0,{"$error":"#REF!"},{"$error":"#REF!"},{"$error":"#VALUE!"},{"$error":"#VALUE!"},null,null,"Rdamp_AEF",{"$f":"'Variable Management'!B298","v":{"$error":"#VALUE!"}},{"$f":"IF(R26=\"OPEN\",\"OPEN\",IF(R26>(INT(0.5+100*POWER(10,IF(96*(LOG(R26)-INT(LOG(R26)))-ROUND(96*(LOG(R26)-INT(LOG(R26))),0)<0,ROUND(96*(LOG(R26)-INT(LOG(R26))),0)-1,ROUND(96*(LOG(R26)-INT(LOG(R26))),0))/96))*POWER(10,INT(LOG(R26))-2)+INT(0.5+100*POWER(10,(IF(96*(LOG(R26)-INT(LOG(R26)))-ROUND(96*(LOG(R26)-INT(LOG(R26))),0)<0,ROUND(96*(LOG(R26)-INT(LOG(R26))),0)-1,ROUND(96*(LOG(R26)-INT(LOG(R26))),0))+1)/96))*POWER(10,INT(LOG(R26))-2))/2,INT(0.5+100*POWER(10,(IF(96*(LOG(R26)-INT(LOG(R26)))-ROUND(96*(LOG(R26)-INT(LOG(R26))),0)<0,ROUND(96*(LOG(R26)-INT(LOG(R26))),0)-1,ROUND(96*(LOG(R26)-INT(LOG(R26))),0))+1)/96))*POWER(10,INT(LOG(R26))-2),INT(0.5+100*POWER(10,IF(96*(LOG(R26)-INT(LOG(R26)))-ROUND(96*(LOG(R26)-INT(LOG(R26))),0)<0,ROUND(96*(LOG(R26)-INT(LOG(R26))),0)-1,ROUND(96*(LOG(R26)-INT(LOG(R26))),0))/96))*POWER(10,INT(LOG(R26))-2)))","v":{"$error":"#VALUE!"}},"Ω"]
[27,0,0,0,0,0,0,0,0,0,{"$error":"#REF!"},{"$error":"#REF!"},{"$f":"IF(IF((M$3*10^12-$A28)*(M$3*10^12-$A27)*-1<0,0,1)*IF(ABS(M$3*10^12-$A28)>(M$3*10^12-$A27),$A27,$A28)=M28,0,IF((M$3*10^12-$A28)*(M$3*10^12-$A27)*-1<0,0,1)*IF(ABS(M$3*10^12-$A28)>(M$3*10^12-$A27),$A27,$A28))","v":{"$error":"#VALUE!"}},{"$error":"#VALUE!"},null,null,"Rdamp_Passive",{"$f":"SQRT(L_infilterStd/K4)","v":{"$error":"#REF!"}},{"$f":"IF(R27=\"OPEN\",\"OPEN\",IF(R27>(INT(0.5+100*POWER(10,IF(96*(LOG(R27)-INT(LOG(R27)))-ROUND(96*(LOG(R27)-INT(LOG(R27))),0)<0,ROUND(96*(LOG(R27)-INT(LOG(R27))),0)-1,ROUND(96*(LOG(R27)-INT(LOG(R27))),0))/96))*POWER(10,INT(LOG(R27))-2)+INT(0.5+100*POWER(10,(IF(96*(LOG(R27)-INT(LOG(R27)))-ROUND(96*(LOG(R27)-INT(LOG(R27))),0)<0,ROUND(96*(LOG(R27)-INT(LOG(R27))),0)-1,ROUND(96*(LOG(R27)-INT(LOG(R27))),0))+1)/96))*POWER(10,INT(LOG(R27))-2))/2,INT(0.5+100*POWER(10,(IF(96*(LOG(R27)-INT(LOG(R27)))-ROUND(96*(LOG(R27)-INT(LOG(R27))),0)<0,ROUND(96*(LOG(R27)-INT(LOG(R27))),0)-1,ROUND(96*(LOG(R27)-INT(LOG(R27))),0))+1)/96))*POWER(10,INT(LOG(R27))-2),INT(0.5+100*POWER(10,IF(96*(LOG(R27)-INT(LOG(R27)))-ROUND(96*(LOG(R27)-INT(LOG(R27))),0)<0,ROUND(96*(LOG(R27)-INT(LOG(R27))),0)-1,ROUND(96*(LOG(R27)-INT(LOG(R27))),0))/96))*POWER(10,INT(LOG(R27))-2)))","v":{"$error":"#REF!"}},"Ω"]
[33,0,0,0,0,0,0,0,0,0,{"$error":"#REF!"},{"$error":"#REF!"},{"$error":"#VALUE!"},{"$error":"#VALUE!"},null,null,"Cdamp_Passive",{"$f":"L4","v":{"$error":"#REF!"}},{"$f":"R28*1000000","v":{"$error":"#REF!"}},"uF"]
[39,0,0,0,0,0,0,0,0,0,{"$error":"#REF!"},{"$error":"#REF!"},{"$error":"#VALUE!"},{"$error":"#VALUE!"}]
[47,0,0,0,0,0,0,0,0,0,{"$error":"#REF!"},{"$error":"#REF!"},{"$error":"#VALUE!"},{"$error":"#VALUE!"}]
[56,0,0,0,0,0,0,0,0,0,{"$error":"#REF!"},{"$error":"#REF!"},{"$error":"#VALUE!"},{"$error":"#VALUE!"}]
[68,0,0,0,0,0,0,0,0,0,{"$error":"#REF!"},{"$error":"#REF!"},{"$error":"#VALUE!"},{"$error":"#VALUE!"},null,null,"Rc1",{"$f":"S7/1000&\" kΩ\"","v":"113 kΩ"},{"$f":"S7/1000","v":113},"kΩ"]
[82,0,0,0,0,0,0,0,0,0,{"$error":"#REF!"},{"$error":"#REF!"},{"$error":"#VALUE!"},{"$error":"#VALUE!"},null,null,"Cc1",{"$f":"C4*1000000000&\" nF\"","v":"1.8 nF"},{"$f":"C4*1000000000","v":1.8},"nF"]
[{"$f":"A22*10","v":100},0,0,0,0,0,0,0,0,0,{"$error":"#REF!"},{"$error":"#REF!"},{"$error":"#VALUE!"},{"$error":"#VALUE!"},null,null,"Cc2",{"$f":"D4*1000000000000&\" pF\"","v":"6.8 pF"},{"$f":"D4*1000000000000","v":6.8},"pF"]
[{"$f":"A23*10","v":120},0,0,0,0,0,0,0,0,0,{"$error":"#REF!"},{"$error":"#REF!"},{"$error":"#VALUE!"},{"$error":"#VALUE!"}]
[150,0,0,0,0,0,0,0,0,0,{"$error":"#REF!"},{"$error":"#REF!"},{"$error":"#VALUE!"},{"$error":"#VALUE!"},null,null,"Rc2",{"$f":"S8/1000&\" kΩ\"","v":{"$error":"#NUM!"}},{"$f":"S8/1000","v":{"$error":"#NUM!"}},"kΩ"]
[180,0,0,0,0,0,0,0,0,0,{"$error":"#REF!"},{"$error":"#REF!"},{"$error":"#VALUE!"},{"$error":"#VALUE!"},null,null,"Cc3",{"$f":"I4*1000000000&\" nF\"","v":"0 nF"},{"$f":"I4*1000000000","v":0},"nF"]
[220,0,0,0,0,0,0,0,0,0,{"$error":"#REF!"},{"$error":"#REF!"},{"$error":"#VALUE!"},{"$error":"#VALUE!"},null,null,"Cc4",{"$f":"J4*1000000000000&\" pF\"","v":"0 pF"},{"$f":"J4*1000000000000","v":0},"pF"]
[270,0,{"$f":"IF(IF((C$3*10^12-$A40)*(C$3*10^12-$A39)*-1<0,0,1)*IF(ABS(C$3*10^12-$A40)>(C$3*10^12-$A39),$A39,$A40)=C40,0,IF((C$3*10^12-$A40)*(C$3*10^12-$A39)*-1<0,0,1)*IF(ABS(C$3*10^12-$A40)>(C$3*10^12-$A39),$A39,$A40))","v":0},0,0,0,0,0,0,0,{"$error":"#REF!"},{"$error":"#REF!"},{"$error":"#VALUE!"},{"$error":"#VALUE!"}]
[330,0,0,0,0,0,0,0,0,0,{"$error":"#REF!"},{"$error":"#REF!"},{"$error":"#VALUE!"},{"$error":"#VALUE!"},null,null,"Rent",{"$f":"'Variable Management'!B188/1000","v":100.45000000000002},{"$f":"IF(R40>(INT(0.5+100*POWER(10,IF(96*(LOG(R40)-INT(LOG(R40)))-ROUND(96*(LOG(R40)-INT(LOG(R40))),0)<0,ROUND(96*(LOG(R40)-INT(LOG(R40))),0)-1,ROUND(96*(LOG(R40)-INT(LOG(R40))),0))/96))*POWER(10,INT(LOG(R40))-2)+INT(0.5+100*POWER(10,(IF(96*(LOG(R40)-INT(LOG(R40)))-ROUND(96*(LOG(R40)-INT(LOG(R40))),0)<0,ROUND(96*(LOG(R40)-INT(LOG(R40))),0)-1,ROUND(96*(LOG(R40)-INT(LOG(R40))),0))+1)/96))*POWER(10,INT(LOG(R40))-2))/2,INT(0.5+100*POWER(10,(IF(96*(LOG(R40)-INT(LOG(R40)))-ROUND(96*(LOG(R40)-INT(LOG(R40))),0)<0,ROUND(96*(LOG(R40)-INT(LOG(R40))),0)-1,ROUND(96*(LOG(R40)-INT(LOG(R40))),0))+1)/96))*POWER(10,INT(LOG(R40))-2),INT(0.5+100*POWER(10,IF(96*(LOG(R40)-INT(LOG(R40)))-ROUND(96*(LOG(R40)-INT(LOG(R40))),0)<0,ROUND(96*(LOG(R40)-INT(LOG(R40))),0)-1,ROUND(96*(LOG(R40)-INT(LOG(R40))),0))/96))*POWER(10,INT(LOG(R40))-2))","v":100},"kΩ"]
[390,0,0,0,0,0,0,0,0,0,{"$error":"#REF!"},{"$error":"#REF!"},{"$error":"#VALUE!"},{"$error":"#VALUE!"},null,null,"Renb",{"$f":"'Variable Management'!B189/1000","v":20.5},{"$f":"IF(R41>(INT(0.5+100*POWER(10,IF(96*(LOG(R41)-INT(LOG(R41)))-ROUND(96*(LOG(R41)-INT(LOG(R41))),0)<0,ROUND(96*(LOG(R41)-INT(LOG(R41))),0)-1,ROUND(96*(LOG(R41)-INT(LOG(R41))),0))/96))*POWER(10,INT(LOG(R41))-2)+INT(0.5+100*POWER(10,(IF(96*(LOG(R41)-INT(LOG(R41)))-ROUND(96*(LOG(R41)-INT(LOG(R41))),0)<0,ROUND(96*(LOG(R41)-INT(LOG(R41))),0)-1,ROUND(96*(LOG(R41)-INT(LOG(R41))),0))+1)/96))*POWER(10,INT(LOG(R41))-2))/2,INT(0.5+100*POWER(10,(IF(96*(LOG(R41)-INT(LOG(R41)))-ROUND(96*(LOG(R41)-INT(LOG(R41))),0)<0,ROUND(96*(LOG(R41)-INT(LOG(R41))),0)-1,ROUND(96*(LOG(R41)-INT(LOG(R41))),0))+1)/96))*POWER(10,INT(LOG(R41))-2),INT(0.5+100*POWER(10,IF(96*(LOG(R41)-INT(LOG(R41)))-ROUND(96*(LOG(R41)-INT(LOG(R41))),0)<0,ROUND(96*(LOG(R41)-INT(LOG(R41))),0)-1,ROUND(96*(LOG(R41)-INT(LOG(R41))),0))/96))*POWER(10,INT(LOG(R41))-2))","v":20.5},"kΩ"]
[470,0,0,0,0,0,0,0,0,0,{"$error":"#REF!"},{"$error":"#REF!"},{"$error":"#VALUE!"},{"$error":"#VALUE!"}]
[560,0,0,0,0,0,0,0,0,0,{"$error":"#REF!"},{"$error":"#REF!"},{"$f":"IF(IF((M$3*10^12-$A44)*(M$3*10^12-$A43)*-1<0,0,1)*IF(ABS(M$3*10^12-$A44)>(M$3*10^12-$A43),$A43,$A44)=M44,0,IF((M$3*10^12-$A44)*(M$3*10^12-$A43)*-1<0,0,1)*IF(ABS(M$3*10^12-$A44)>(M$3*10^12-$A43),$A43,$A44))","v":{"$error":"#VALUE!"}},{"$error":"#VALUE!"}]
[680,0,0,0,0,0,0,0,0,0,{"$error":"#REF!"},{"$error":"#REF!"},{"$error":"#VALUE!"},{"$error":"#VALUE!"}]
[{"$f":"A33*10","v":820},0,0,0,0,0,0,0,0,0,{"$error":"#REF!"},{"$error":"#REF!"},{"$error":"#VALUE!"},{"$error":"#VALUE!"}]
[1000,0,0,0,0,0,0,0,0,0,{"$error":"#REF!"},{"$error":"#REF!"},{"$error":"#VALUE!"},{"$error":"#VALUE!"}]
[1200,0,0,0,0,0,0,0,0,0,{"$error":"#REF!"},{"$error":"#REF!"},{"$error":"#VALUE!"},{"$error":"#VALUE!"}]
[1500,0,1800,0,0,0,0,0,0,0,{"$error":"#REF!"},{"$error":"#REF!"},{"$error":"#VALUE!"},{"$error":"#VALUE!"}]
[1800,0,0,0,0,0,0,0,0,0,{"$error":"#REF!"},{"$error":"#REF!"},{"$error":"#VALUE!"},{"$error":"#VALUE!"}]
[2200,0,0,0,0,0,0,0,0,0,{"$error":"#REF!"},{"$error":"#REF!"},{"$error":"#VALUE!"},{"$error":"#VALUE!"}]
[2700,0,0,0,0,0,0,2700,0,0,{"$error":"#REF!"},{"$error":"#REF!"},{"$error":"#VALUE!"},{"$error":"#VALUE!"}]
[3300,0,0,0,0,0,0,0,0,0,{"$error":"#REF!"},{"$error":"#REF!"},{"$error":"#VALUE!"},{"$error":"#VALUE!"}]
[3900,0,0,0,0,0,0,0,0,0,{"$error":"#REF!"},{"$error":"#REF!"},{"$error":"#VALUE!"},{"$error":"#VALUE!"}]
[4700,0,0,0,0,0,0,0,0,0,{"$error":"#REF!"},{"$error":"#REF!"},{"$error":"#VALUE!"},{"$error":"#VALUE!"}]
[5600,0,0,0,0,0,0,0,0,0,{"$error":"#REF!"},{"$error":"#REF!"},{"$error":"#VALUE!"},{"$error":"#VALUE!"}]
[6800,0,0,0,0,0,0,0,0,0,{"$error":"#REF!"},{"$error":"#REF!"},{"$error":"#VALUE!"},{"$error":"#VALUE!"}]
[8200,0,0,0,0,0,0,0,0,0,{"$error":"#REF!"},{"$error":"#REF!"},{"$error":"#VALUE!"},{"$error":"#VALUE!"}]
[10000,0,0,0,0,0,0,0,0,0,{"$error":"#REF!"},{"$error":"#REF!"},{"$error":"#VALUE!"},{"$error":"#VALUE!"}]
[12000,0,0,0,0,0,0,0,0,0,{"$error":"#REF!"},{"$error":"#REF!"},{"$f":"IF(IF((M$3*10^12-$A60)*(M$3*10^12-$A59)*-1<0,0,1)*IF(ABS(M$3*10^12-$A60)>(M$3*10^12-$A59),$A59,$A60)=M60,0,IF((M$3*10^12-$A60)*(M$3*10^12-$A59)*-1<0,0,1)*IF(ABS(M$3*10^12-$A60)>(M$3*10^12-$A59),$A59,$A60))","v":{"$error":"#VALUE!"}},{"$error":"#VALUE!"}]
[15000,0,0,0,0,0,0,0,0,0,{"$error":"#REF!"},{"$error":"#REF!"},{"$error":"#VALUE!"},{"$error":"#VALUE!"}]
[18000,0,0,0,0,0,0,0,0,0,{"$error":"#REF!"},{"$error":"#REF!"},{"$error":"#VALUE!"},{"$error":"#VALUE!"}]
[22000,0,0,0,0,0,0,0,0,0,{"$error":"#REF!"},{"$error":"#REF!"},{"$error":"#VALUE!"},{"$error":"#VALUE!"}]
[27000,0,0,0,0,0,0,0,0,0,{"$error":"#REF!"},{"$error":"#REF!"},{"$error":"#VALUE!"},{"$error":"#VALUE!"}]
[33000,0,0,0,0,0,0,0,0,0,{"$error":"#REF!"},{"$error":"#REF!"},{"$error":"#VALUE!"},{"$error":"#VALUE!"}]
[39000,0,0,0,0,0,0,0,0,0,{"$error":"#REF!"},{"$error":"#REF!"},{"$error":"#VALUE!"},{"$error":"#VALUE!"}]
[47000,0,0,0,0,0,0,0,0,0,{"$error":"#REF!"},{"$error":"#REF!"},{"$error":"#VALUE!"},{"$error":"#VALUE!"}]
[56000,0,0,0,0,0,0,0,0,0,{"$error":"#REF!"},{"$error":"#REF!"},{"$error":"#VALUE!"},{"$error":"#VALUE!"}]
[68000,0,0,0,0,0,0,0,0,0,{"$error":"#REF!"},{"$error":"#REF!"},{"$error":"#VALUE!"},{"$error":"#VALUE!"}]
[82000,0,0,0,0,0,82000,0,0,{"$f":"IF(IF((J$3*10^12-$A70)*(J$3*10^12-$A69)*-1<0,0,1)*IF(ABS(J$3*10^12-$A70)>(J$3*10^12-$A69),$A69,$A70)=J70,0,IF((J$3*10^12-$A70)*(J$3*10^12-$A69)*-1<0,0,1)*IF(ABS(J$3*10^12-$A70)>(J$3*10^12-$A69),$A69,$A70))","v":0},{"$error":"#REF!"},{"$error":"#REF!"},{"$error":"#VALUE!"},{"$error":"#VALUE!"}]
[100000,0,0,{"$f":"IF(IF((D$3*10^12-$A71)*(D$3*10^12-$A70)*-1<0,0,1)*IF(ABS(D$3*10^12-$A71)>(D$3*10^12-$A70),$A70,$A71)=D71,0,IF((D$3*10^12-$A71)*(D$3*10^12-$A70)*-1<0,0,1)*IF(ABS(D$3*10^12-$A71)>(D$3*10^12-$A70),$A70,$A71))","v":0},0,0,0,0,0,0,{"$error":"#REF!"},{"$error":"#REF!"},{"$error":"#VALUE!"},{"$error":"#VALUE!"}]
[120000,{"$f":"IF(IF((B$3*10^12-$A72)*(B$3*10^12-$A71)*-1<0,0,1)*IF(ABS(B$3*10^12-$A72)>(B$3*10^12-$A71),$A71,$A72)=B72,0,IF((B$3*10^12-$A72)*(B$3*10^12-$A71)*-1<0,0,1)*IF(ABS(B$3*10^12-$A72)>(B$3*10^12-$A71),$A71,$A72))","v":0},{"$f":"IF(IF((C$3*10^12-$A72)*(C$3*10^12-$A71)*-1<0,0,1)*IF(ABS(C$3*10^12-$A72)>(C$3*10^12-$A71),$A71,$A72)=C72,0,IF((C$3*10^12-$A72)*(C$3*10^12-$A71)*-1<0,0,1)*IF(ABS(C$3*10^12-$A72)>(C$3*10^12-$A71),$A71,$A72))","v":0},0,0,{"$f":"IF(IF((F$3*10^12-$A72)*(F$3*10^12-$A71)*-1<0,0,1)*IF(ABS(F$3*10^12-$A72)>(F$3*10^12-$A71),$A71,$A72)=F72,0,IF((F$3*10^12-$A72)*(F$3*10^12-$A71)*-1<0,0,1)*IF(ABS(F$3*10^12-$A72)>(F$3*10^12-$A71),$A71,$A72))","v":0},{"$f":"IF(IF((G$3*10^12-$A72)*(G$3*10^12-$A71)*-1<0,0,1)*IF(ABS(G$3*10^12-$A72)>(G$3*10^12-$A71),$A71,$A72)=G72,0,IF((G$3*10^12-$A72)*(G$3*10^12-$A71)*-1<0,0,1)*IF(ABS(G$3*10^12-$A72)>(G$3*10^12-$A71),$A71,$A72))","v":0},{"$f":"IF(IF((H$3*10^12-$A72)*(H$3*10^12-$A71)*-1<0,0,1)*IF(ABS(H$3*10^12-$A72)>(H$3*10^12-$A71),$A71,$A72)=H72,0,IF((H$3*10^12-$A72)*(H$3*10^12-$A71)*-1<0,0,1)*IF(ABS(H$3*10^12-$A72)>(H$3*10^12-$A71),$A71,$A72))","v":0},{"$f":"IF(IF((I$3*10^12-$A72)*(I$3*10^12-$A71)*-1<0,0,1)*IF(ABS(I$3*10^12-$A72)>(I$3*10^12-$A71),$A71,$A72)=I72,0,IF((I$3*10^12-$A72)*(I$3*10^12-$A71)*-1<0,0,1)*IF(ABS(I$3*10^12-$A72)>(I$3*10^12-$A71),$A71,$A72))","v":0},0,{"$error":"#REF!"},{"$error":"#REF!"},{"$error":"#VALUE!"},{"$error":"#VALUE!"}]
[150000,0,0,0,0,0,0,0,0,0,{"$error":"#REF!"},{"$error":"#REF!"},{"$error":"#VALUE!"},{"$error":"#VALUE!"}]
[180000,0,0,0,0,0,0,0,0,0,{"$error":"#REF!"},{"$error":"#REF!"},{"$error":"#VALUE!"},{"$error":"#VALUE!"}]
[220000,0,0,0,0,0,0,0,0,0,{"$error":"#REF!"},{"$error":"#REF!"},{"$error":"#VALUE!"},{"$error":"#VALUE!"}]
[270000,0,0,0,0,0,0,0,0,0,{"$error":"#REF!"},{"$error":"#REF!"},{"$error":"#VALUE!"},{"$error":"#VALUE!"}]
[330000,0,0,0,0,0,0,0,0,0,{"$error":"#REF!"},{"$error":"#REF!"},{"$error":"#VALUE!"},{"$error":"#VALUE!"}]
[390000,0,0,0,0,0,0,0,0,0,{"$error":"#REF!"},{"$error":"#REF!"},{"$error":"#VALUE!"},{"$error":"#VALUE!"}]
[470000,0,0,0,0,0,0,0,0,0,{"$error":"#REF!"},{"$error":"#REF!"},{"$error":"#VALUE!"},{"$error":"#VALUE!"}]
[560000,0,0,0,0,0,0,0,0,0,{"$error":"#REF!"},{"$error":"#REF!"},{"$error":"#VALUE!"},{"$error":"#VALUE!"}]
[680000,0,0,0,0,0,0,0,0,0,{"$error":"#REF!"},{"$error":"#REF!"},{"$error":"#VALUE!"},{"$error":"#VALUE!"}]
[820000,0,0,0,0,0,0,0,0,0,{"$error":"#REF!"},{"$error":"#REF!"},{"$error":"#VALUE!"},{"$error":"#VALUE!"}]
[1000000,0,0,0,0,0,0,0,0,0,{"$error":"#REF!"},{"$error":"#REF!"},{"$error":"#VALUE!"},{"$error":"#VALUE!"}]
[1200000,0,0,0,0,0,0,0,0,0,{"$error":"#REF!"},{"$error":"#REF!"},{"$error":"#VALUE!"},{"$error":"#VALUE!"}]
[1500000,0,0,0,0,0,0,0,0,0,{"$error":"#REF!"},{"$error":"#REF!"},{"$error":"#VALUE!"},{"$error":"#VALUE!"}]
[1800000,0,0,0,0,0,0,0,0,0,{"$error":"#REF!"},{"$f":"IF(IF((L$3*10^12-$A86)*(L$3*10^12-$A85)*-1<0,0,1)*IF(ABS(L$3*10^12-$A86)>(L$3*10^12-$A85),$A85,$A86)=L86,0,IF((L$3*10^12-$A86)*(L$3*10^12-$A85)*-1<0,0,1)*IF(ABS(L$3*10^12-$A86)>(L$3*10^12-$A85),$A85,$A86))","v":{"$error":"#REF!"}},{"$error":"#VALUE!"},{"$error":"#VALUE!"}]
[2200000,0,0,0,0,0,0,0,0,0,{"$error":"#REF!"},{"$error":"#REF!"},{"$error":"#VALUE!"},{"$error":"#VALUE!"}]
[2700000,0,0,0,0,0,0,0,0,0,{"$error":"#REF!"},{"$error":"#REF!"},{"$error":"#VALUE!"},{"$error":"#VALUE!"}]
[3300000,0,0,0,0,0,0,0,0,0,{"$error":"#REF!"},{"$error":"#REF!"},{"$error":"#VALUE!"},{"$error":"#VALUE!"}]
[3900000,0,0,0,0,0,0,0,0,0,{"$error":"#REF!"},{"$error":"#REF!"},{"$error":"#VALUE!"},{"$error":"#VALUE!"}]
[4700000,0,0,0,0,0,0,0,0,0,{"$error":"#REF!"},{"$error":"#REF!"},{"$error":"#VALUE!"},{"$error":"#VALUE!"}]
[5600000,0,0,0,0,0,0,0,0,0,{"$error":"#REF!"},{"$error":"#REF!"},{"$error":"#VALUE!"},{"$error":"#VALUE!"}]
[6800000,0,0,0,0,0,0,0,0,0,{"$error":"#REF!"},{"$error":"#REF!"},{"$error":"#VALUE!"},{"$error":"#VALUE!"}]
[8200000,0,0,0,0,0,0,0,0,0,{"$error":"#REF!"},{"$error":"#REF!"},{"$error":"#VALUE!"},{"$error":"#VALUE!"}]
[10000000,0,0,0,0,0,0,0,0,0,{"$error":"#REF!"},{"$error":"#REF!"},{"$error":"#VALUE!"},{"$error":"#VALUE!"}]
[12000000,0,0,0,0,0,0,0,0,0,{"$error":"#REF!"},{"$error":"#REF!"},{"$error":"#VALUE!"},{"$error":"#VALUE!"}]
[15000000,0,0,0,0,15000000,0,0,0,0,{"$error":"#REF!"},{"$error":"#REF!"},{"$error":"#VALUE!"},{"$error":"#VALUE!"}]
[18000000,0,0,0,0,0,0,0,0,0,{"$error":"#REF!"},{"$error":"#REF!"},{"$error":"#VALUE!"},{"$error":"#VALUE!"}]
[22000000,0,0,0,0,0,0,0,0,0,{"$error":"#REF!"},{"$error":"#REF!"},{"$error":"#VALUE!"},{"$error":"#VALUE!"}]
[{"$f":"A87*10","v":27000000},0,0,0,0,0,0,0,0,0,{"$error":"#REF!"},{"$error":"#REF!"},{"$error":"#VALUE!"},{"$error":"#VALUE!"}]
[33000000,0,0,0,0,0,0,0,0,0,{"$error":"#REF!"},{"$error":"#REF!"},{"$error":"#VALUE!"},{"$error":"#VALUE!"}]
[39000000,0,0,0,0,0,0,0,0,0,{"$error":"#REF!"},{"$error":"#REF!"},{"$error":"#VALUE!"},{"$error":"#VALUE!"}]
[47000000,0,0,0,0,0,0,0,0,0,{"$error":"#REF!"},{"$error":"#REF!"},{"$error":"#VALUE!"},{"$error":"#VALUE!"}]
[56000000,0,0,0,0,{"$f":"IF(IF((F$3*10^12-$A104)*(F$3*10^12-$A103)*-1<0,0,1)*IF(ABS(F$3*10^12-$A104)>(F$3*10^12-$A103),$A103,$A104)=F104,0,IF((F$3*10^12-$A104)*(F$3*10^12-$A103)*-1<0,0,1)*IF(ABS(F$3*10^12-$A104)>(F$3*10^12-$A103),$A103,$A104))","v":0},{"$f":"IF(IF((G$3*10^12-$A104)*(G$3*10^12-$A103)*-1<0,0,1)*IF(ABS(G$3*10^12-$A104)>(G$3*10^12-$A103),$A103,$A104)=G104,0,IF((G$3*10^12-$A104)*(G$3*10^12-$A103)*-1<0,0,1)*IF(ABS(G$3*10^12-$A104)>(G$3*10^12-$A103),$A103,$A104))","v":0},{"$f":"IF(IF((H$3*10^12-$A104)*(H$3*10^12-$A103)*-1<0,0,1)*IF(ABS(H$3*10^12-$A104)>(H$3*10^12-$A103),$A103,$A104)=H104,0,IF((H$3*10^12-$A104)*(H$3*10^12-$A103)*-1<0,0,1)*IF(ABS(H$3*10^12-$A104)>(H$3*10^12-$A103),$A103,$A104))","v":0},{"$f":"IF(IF((I$3*10^12-$A104)*(I$3*10^12-$A103)*-1<0,0,1)*IF(ABS(I$3*10^12-$A104)>(I$3*10^12-$A103),$A103,$A104)=I104,0,IF((I$3*10^12-$A104)*(I$3*10^12-$A103)*-1<0,0,1)*IF(ABS(I$3*10^12-$A104)>(I$3*10^12-$A103),$A103,$A104))","v":0},0,{"$error":"#REF!"},{"$error":"#REF!"},{"$error":"#VALUE!"},{"$error":"#VALUE!"}]
[68000000,0,0,0,0,0,0,0,0,0,{"$error":"#REF!"},{"$error":"#REF!"},{"$error":"#VALUE!"},{"$error":"#VALUE!"}]
[82000000,0,0,0,0,0,0,0,0,0,{"$error":"#REF!"},{"$error":"#REF!"},{"$error":"#VALUE!"},{"$error":"#VALUE!"}]
[100000000,0,0,0,0,0,0,0,0,0,{"$error":"#REF!"},{"$error":"#REF!"},{"$error":"#VALUE!"},{"$error":"#VALUE!"}]
[120000000,0,0,0,0,0,0,0,0,0,{"$error":"#REF!"},{"$error":"#REF!"},{"$error":"#VALUE!"},{"$error":"#VALUE!"}]
[150000000,0,0,0,0,0,0,0,0,0,{"$error":"#REF!"},{"$error":"#REF!"},{"$error":"#VALUE!"},{"$error":"#VALUE!"}]
[180000000,0,0,0,0,0,0,0,0,0,{"$error":"#REF!"},{"$error":"#REF!"},{"$error":"#VALUE!"},{"$error":"#VALUE!"}]
[220000000,0,0,0,0,0,0,0,0,0,{"$error":"#REF!"},{"$error":"#REF!"},{"$error":"#VALUE!"},{"$error":"#VALUE!"}]
[270000000,0,0,0,330000000,0,0,0,0,0,{"$error":"#REF!"},{"$error":"#REF!"},{"$error":"#VALUE!"},{"$error":"#VALUE!"}]
[330000000,0,0,0,0,0,0,0,0,0,{"$error":"#REF!"},{"$error":"#REF!"},{"$error":"#VALUE!"},{"$error":"#VALUE!"}]
[390000000,0,0,0,0,0,0,0,0,0,{"$error":"#REF!"},{"$error":"#REF!"},{"$error":"#VALUE!"},{"$error":"#VALUE!"}]
[470000000,0,0,0,0,0,0,0,0,0,{"$error":"#REF!"},{"$error":"#REF!"},{"$error":"#VALUE!"},{"$error":"#VALUE!"}]
[560000000,0,0,0,0,0,0,0,0,0,{"$error":"#REF!"},{"$error":"#REF!"},{"$error":"#VALUE!"},{"$error":"#VALUE!"}]
[680000000,0,0,0,0,0,0,0,0,0,{"$error":"#REF!"},{"$error":"#REF!"},{"$error":"#VALUE!"},{"$error":"#VALUE!"}]
[820000000,0,0,0,0,0,0,0,0,0,{"$error":"#REF!"},{"$error":"#REF!"},{"$error":"#VALUE!"},{"$error":"#VALUE!"}]
[1000000000,0,0,0,0,0,0,0,0,0,{"$error":"#REF!"},{"$error":"#REF!"},{"$error":"#VALUE!"},{"$error":"#VALUE!"}]
[1200000000,0,0,0,0,0,0,0,0,0,{"$error":"#REF!"},{"$error":"#REF!"},{"$error":"#VALUE!"},{"$error":"#VALUE!"}]
[1500000000,0,0,0,0,0,0,0,0,0,{"$error":"#REF!"},{"$error":"#REF!"},{"$error":"#VALUE!"},{"$error":"#VALUE!"}]
[1800000000,0,0,0,0,0,0,0,0,0,{"$error":"#REF!"},{"$error":"#REF!"},{"$error":"#VALUE!"},{"$error":"#VALUE!"}]
[2200000000,0,0,0,0,0,0,0,0,0,{"$error":"#REF!"},{"$error":"#REF!"},{"$error":"#VALUE!"},{"$error":"#VALUE!"}]
[2700000000,0,0,0,0,0,0,0,0,0,{"$error":"#REF!"},{"$error":"#REF!"},{"$error":"#VALUE!"},{"$error":"#VALUE!"}]
[3300000000,0,0,0,0,0,0,0,0,0,{"$error":"#REF!"},{"$error":"#REF!"},{"$error":"#VALUE!"},{"$error":"#VALUE!"}]
[3900000000,0,0,0,0,0,0,0,0,0,{"$error":"#REF!"},{"$error":"#REF!"},{"$error":"#VALUE!"},{"$error":"#VALUE!"}]
[4700000000,0,0,0,0,0,0,0,0,0,{"$error":"#REF!"},{"$error":"#REF!"},{"$error":"#VALUE!"},{"$error":"#VALUE!"}]
[5600000000,0,0,0,0,0,0,0,0,0,{"$error":"#REF!"},{"$error":"#REF!"},{"$error":"#VALUE!"},{"$error":"#VALUE!"}]
[6800000000,0,0,0,0,0,0,0,0,0,{"$error":"#REF!"},{"$error":"#REF!"},{"$error":"#VALUE!"},{"$error":"#VALUE!"}]
[8200000000,0,0,0,0,0,0,0,0,0,{"$error":"#REF!"},{"$error":"#REF!"},{"$error":"#VALUE!"},{"$error":"#VALUE!"}]
[10000000000,0,0,0,0,0,0,0,0,0,{"$error":"#REF!"},{"$error":"#REF!"},{"$error":"#VALUE!"},{"$error":"#VALUE!"}]
[12000000000,0,0,0,0,0,0,0,0,0,{"$error":"#REF!"},{"$error":"#REF!"},{"$error":"#VALUE!"},{"$error":"#VALUE!"}]
[15000000000,0,0,0,0,0,0,0,0,0,{"$f":"IF(IF((K$3*10^12-$A133)*(K$3*10^12-$A132)*-1<0,0,1)*IF(ABS(K$3*10^12-$A133)>(K$3*10^12-$A132),$A132,$A133)=K133,0,IF((K$3*10^12-$A133)*(K$3*10^12-$A132)*-1<0,0,1)*IF(ABS(K$3*10^12-$A133)>(K$3*10^12-$A132),$A132,$A133))","v":{"$error":"#REF!"}},{"$f":"IF(IF((L$3*10^12-$A133)*(L$3*10^12-$A132)*-1<0,0,1)*IF(ABS(L$3*10^12-$A133)>(L$3*10^12-$A132),$A132,$A133)=L133,0,IF((L$3*10^12-$A133)*(L$3*10^12-$A132)*-1<0,0,1)*IF(ABS(L$3*10^12-$A133)>(L$3*10^12-$A132),$A132,$A133))","v":{"$error":"#REF!"}},{"$error":"#VALUE!"},{"$error":"#VALUE!"}]
[18000000000,0,0,0,0,0,0,0,0,{"$f":"IF(IF((J$3*10^12-$A134)*(J$3*10^12-$A133)*-1<0,0,1)*IF(ABS(J$3*10^12-$A134)>(J$3*10^12-$A133),$A133,$A134)=J134,0,IF((J$3*10^12-$A134)*(J$3*10^12-$A133)*-1<0,0,1)*IF(ABS(J$3*10^12-$A134)>(J$3*10^12-$A133),$A133,$A134))","v":0},{"$error":"#REF!"},{"$error":"#REF!"},{"$f":"IF(IF((M$3*10^12-$A134)*(M$3*10^12-$A133)*-1<0,0,1)*IF(ABS(M$3*10^12-$A134)>(M$3*10^12-$A133),$A133,$A134)=M134,0,IF((M$3*10^12-$A134)*(M$3*10^12-$A133)*-1<0,0,1)*IF(ABS(M$3*10^12-$A134)>(M$3*10^12-$A133),$A133,$A134))","v":{"$error":"#VALUE!"}},{"$f":"IF(IF((N$3*10^12-$A134)*(N$3*10^12-$A133)*-1<0,0,1)*IF(ABS(N$3*10^12-$A134)>(N$3*10^12-$A133),$A133,$A134)=N134,0,IF((N$3*10^12-$A134)*(N$3*10^12-$A133)*-1<0,0,1)*IF(ABS(N$3*10^12-$A134)>(N$3*10^12-$A133),$A133,$A134))","v":{"$error":"#VALUE!"}}]
[22000000000,0,0,0,{"$f":"IF(IF((E$3*10^12-$A135)*(E$3*10^12-$A134)*-1<0,0,1)*IF(ABS(E$3*10^12-$A135)>(E$3*10^12-$A134),$A134,$A135)=E135,0,IF((E$3*10^12-$A135)*(E$3*10^12-$A134)*-1<0,0,1)*IF(ABS(E$3*10^12-$A135)>(E$3*10^12-$A134),$A134,$A135))","v":0},0,0,0,0,0,{"$error":"#REF!"},{"$error":"#REF!"},{"$f":"IF(IF((M$3*10^12-$A135)*(M$3*10^12-$A134)*-1<0,0,1)*IF(ABS(M$3*10^12-$A135)>(M$3*10^12-$A134),$A134,$A135)=M135,0,IF((M$3*10^12-$A135)*(M$3*10^12-$A134)*-1<0,0,1)*IF(ABS(M$3*10^12-$A135)>(M$3*10^12-$A134),$A134,$A135))","v":{"$error":"#VALUE!"}},{"$f":"IF(IF((N$3*10^12-$A135)*(N$3*10^12-$A134)*-1<0,0,1)*IF(ABS(N$3*10^12-$A135)>(N$3*10^12-$A134),$A134,$A135)=N135,0,IF((N$3*10^12-$A135)*(N$3*10^12-$A134)*-1<0,0,1)*IF(ABS(N$3*10^12-$A135)>(N$3*10^12-$A134),$A134,$A135))","v":{"$error":"#VALUE!"}}]
[27000000000,{"$f":"IF(IF((B$3*10^12-$A136)*(B$3*10^12-$A135)*-1<0,0,1)*IF(ABS(B$3*10^12-$A136)>(B$3*10^12-$A135),$A135,$A136)=B136,0,IF((B$3*10^12-$A136)*(B$3*10^12-$A135)*-1<0,0,1)*IF(ABS(B$3*10^12-$A136)>(B$3*10^12-$A135),$A135,$A136))","v":0},{"$f":"IF(IF((C$3*10^12-$A136)*(C$3*10^12-$A135)*-1<0,0,1)*IF(ABS(C$3*10^12-$A136)>(C$3*10^12-$A135),$A135,$A136)=C136,0,IF((C$3*10^12-$A136)*(C$3*10^12-$A135)*-1<0,0,1)*IF(ABS(C$3*10^12-$A136)>(C$3*10^12-$A135),$A135,$A136))","v":0},0,0,0,0,0,0,0,{"$error":"#REF!"},{"$error":"#REF!"},{"$error":"#VALUE!"},{"$error":"#VALUE!"}]
[33000000000,0,0,0,0,0,0,0,0,0,{"$error":"#REF!"},{"$error":"#REF!"},{"$error":"#VALUE!"},{"$error":"#VALUE!"}]
[39000000000,0,0,0,0,0,0,0,0,0,{"$error":"#REF!"},{"$error":"#REF!"},{"$error":"#VALUE!"},{"$error":"#VALUE!"}]
[47000000000,0,0,0,0,0,0,0,0,0,{"$error":"#REF!"},{"$error":"#REF!"},{"$error":"#VALUE!"},{"$error":"#VALUE!"}]
[56000000000,0,0,0,0,0,0,0,0,0,{"$error":"#REF!"},{"$error":"#REF!"},{"$error":"#VALUE!"},{"$error":"#VALUE!"}]
[68000000000,0,0,0,0,0,0,0,0,0,{"$error":"#REF!"},{"$error":"#REF!"},{"$error":"#VALUE!"},{"$error":"#VALUE!"}]
[82000000000,0,0,0,0,0,0,0,0,0,{"$error":"#REF!"},{"$error":"#REF!"},{"$error":"#VALUE!"},{"$error":"#VALUE!"}]
[100000000000,0,0,0,0,0,0,0,0,0,{"$error":"#REF!"},{"$error":"#REF!"},{"$error":"#VALUE!"},{"$error":"#VALUE!"}]
[120000000000,0,0,0,0,0,0,0,0,0,{"$error":"#REF!"},{"$error":"#REF!"},{"$error":"#VALUE!"},{"$error":"#VALUE!"}]
[150000000000,0,0,0,0,0,0,0,0,0,{"$error":"#REF!"},{"$error":"#REF!"},{"$error":"#VALUE!"},{"$error":"#VALUE!"}]
[180000000000,0,0,0,0,0,0,0,0,0,{"$error":"#REF!"},{"$error":"#REF!"},{"$error":"#VALUE!"},{"$error":"#VALUE!"}]
[220000000000,0,0,0,0,0,0,0,0,0,{"$error":"#REF!"},{"$error":"#REF!"},{"$error":"#VALUE!"},{"$error":"#VALUE!"}]
[270000000000,0,0,0,0,0,0,0,0,0,{"$error":"#REF!"},{"$error":"#REF!"},{"$error":"#VALUE!"},{"$error":"#VALUE!"}]
[330000000000,0,0,0,0,0,0,0,0,0,{"$error":"#REF!"},{"$error":"#REF!"},{"$error":"#VALUE!"},{"$error":"#VALUE!"}]
[390000000000,0,0,0,0,0,0,0,0,0,{"$error":"#REF!"},{"$error":"#REF!"},{"$error":"#VALUE!"},{"$error":"#VALUE!"}]
[470000000000,0,0,0,0,0,0,0,0,0,{"$error":"#REF!"},{"$error":"#REF!"},{"$error":"#VALUE!"},{"$error":"#VALUE!"}]
[560000000000,0,0,0,0,0,0,0,0,0,{"$error":"#REF!"},{"$error":"#REF!"},{"$error":"#VALUE!"},{"$error":"#VALUE!"}]
[680000000000,0,0,0,0,0,0,0,0,0,{"$error":"#REF!"},{"$error":"#REF!"},{"$error":"#VALUE!"},{"$error":"#VALUE!"}]
[820000000000,0,0,0,0,0,0,0,0,0,{"$error":"#REF!"},{"$error":"#REF!"},{"$error":"#VALUE!"},{"$error":"#VALUE!"}]
[1000000000000,0,0,0,0,0,0,0,0,0,{"$error":"#REF!"},{"$error":"#REF!"},{"$error":"#VALUE!"},{"$error":"#VALUE!"}]
[1200000000000,0,0,0,0,0,0,0,0,0,{"$error":"#REF!"},{"$error":"#REF!"},{"$error":"#VALUE!"},{"$error":"#VALUE!"}]
[1500000000000,0,0,0,0,0,0,0,0,0,{"$error":"#REF!"},{"$error":"#REF!"},{"$error":"#VALUE!"},{"$error":"#VALUE!"}]
[1800000000000,0,0,0,0,0,0,0,0,0,{"$error":"#REF!"},{"$error":"#REF!"},{"$error":"#VALUE!"},{"$error":"#VALUE!"}]
[2200000000000,0,0,0,0,0,0,0,0,0,{"$error":"#REF!"},{"$error":"#REF!"},{"$error":"#VALUE!"},{"$error":"#VALUE!"}]
[2700000000000,2700000000000,2700000000000,2700000000000,2700000000000,2700000000000,2700000000000,2700000000000,2700000000000,2700000000000,{"$error":"#REF!"},{"$error":"#REF!"},{"$error":"#VALUE!"},{"$error":"#VALUE!"}]

{"sheet":"Snubber","index":11,"n_rows":6,"n_cols":5,"rows_kept":6,"cut":false,"hidden":true,"merged":[]}
[null,null,"UNITS","STD UNITS"]
["Frequency of Ringing",85,"MHz",{"$f":"B2*1000000","v":85000000},"Hz"]
["SW capacitance",3000,"pF",{"$f":"B3*0.000000000001","v":3E-9},"F"]
["Lpar",{"$f":"1000000000*1/((D2*2*3.14159)^2*D3)","v":1.1686430773614742},"nH",{"$f":"B4/1000000000","v":1.1686430773614743E-9},"H"]
["Csnub",{"$f":"4*B3","v":12000},"pF",{"$f":"B5*0.000000000001","v":1.2E-8},"F"]
["Rsnub",{"$f":"SQRT(D4/D3)","v":0.62413755891936573},"Ω",{"$f":"B6","v":0.62413755891936573},"Ω"]

{"sheet":"Parallel Output Caps","index":12,"n_rows":17,"n_cols":5,"rows_kept":17,"cut":false,"hidden":true,"merged":[]}
[]
[]
[]
["Fsw",{"$f":"Fsw","v":400000}]
[]
["C1",20,"uF",{"$f":"B6/1000000","v":2.0000000000000002E-5},"F"]
["R1",0.5,"mOhms",{"$f":"B7/1000","v":5.0000000000000001E-4},"Ohms"]
[]
["C2",68,"uF",{"$f":"B9/1000000","v":6.7999999999999999E-5},"F"]
["R2",20,"mOhms",{"$f":"B10/1000","v":0.02},"Ohms"]
[]
[]
["I1 ",{"$f":"(D6/(D6+D9))*SQRT((D10*D9*B4)^2+1)/SQRT((((D7+D10)*D6*D9/(D9+D6))*B4)^2+1)","v":0.25667257397349275},"%"]
["I2 ",{"$f":"1-B13","v":0.74332742602650725},"%"]
[]
["I1 ",{"$f":"B13*(Iripple1/(2*SQRT(3)))","v":{"$error":"#NAME?"}},"A"]
["I2 ",{"$f":"B14*(Iripple1/(2*SQRT(3)))","v":{"$error":"#NAME?"}},"A"]