{"text_format":"1","workbook":"xlsx","n_sheets":12,"sheets":["Design Regulator","BOM & Schematic","EVM","Variable Management","Stability Calculations","Bode Plot Management","Efficiency Calculations","Efficiency Plot Management","Schematic Management","Standard Value Calculator","Snubber","Parallel Output Caps"],"not_rendered":{"charts":7,"images":25,"macros":1,"external_links":0,"defined_names":260,"comments":1,"pivot_tables":0},"unopened":[],"bounds":{"document_bytes":16777216,"sheet_cells":100000,"rows_first":2000,"rows_last":500,"rows_between":2000,"halvings":0,"cell_chars":16384,"cell_head_chars":4096},"cells_cut":0,"cells_raw":0,"read":"whole","date_system":"1900"}

{"sheet":"Design Regulator","index":0,"n_rows":103,"n_cols":17,"rows_kept":103,"cut":false,"hidden":false,"merged":[[70,5,70,7],[2,14,2,15],[0,0,0,16],[81,5,81,6],[80,7,80,8],[36,11,37,16]]}
["                        LM5141-Q1 Synchronous Buck Controller Design Tool"]
[null,null,null,null,null,null,null,null,null,null,null,null,null,null,"http://www.ti.com/product/lm5175"]
["About",null,"xx",null,null,"= Input Box",null,null,null,null,null,null,null,null,"TERMS OF USE",null,"                "]
[]
["Step 1: Operating Specifications"]
[null,null,null,"Input Voltage – Min, VIN(min) ",8,"V"]
[null,null,null,"Input Voltage – Nom, VIN(nom)",13.5,"V"]
[null,null,null,"Input Voltage – Max, VIN(max)",40,"V"]
[null,null,null,"Output Voltage, VOUT ",5,"V"]
[null,null,null,"Full Load Output Current, IOUT ",15,"A"]
[null,null,null,{"$f":"IF(OSC=1, \"* Tie OSC to VDDA\", \"* Tie OSC to AGND\")","v":"* Tie OSC to AGND"}]
[null,null,null,"Switching Frequency, FSW",400,"kHz"]
[null,null,null,"Frequency Set Resistor, RT ",{"$f":"'Variable Management'!C367","v":54.9},"kΩ"]
[null,null,null,"Ambient Temperature, TA",25,"°C"]
[]
["Step 2: Current Sense Resistor"]
[null,null,null,"Required IOCP Setpoint at VIN(nom)",20,"A"]
[null,null,null,"Recommended Sense Resistance",{"$f":"Rs_ideal*1000","v":3.3083880072461311},"mΩ"]
[null,null,null,"Sense Resistance, RS",3,"mΩ"]
[null,null,null,"Min Inductor Sat Current, ILO(SAT)",{"$f":"'Variable Management'!B95","v":25},"A"]
[null,null,null,"Max power loss in shunt",{"$f":"'Variable Management'!B105","v":1.6471081617888195},"W"]
[null,null,null,"VIN(min)",{"$f":"'Variable Management'!B97","v":23.413610938471098},"A"]
[null,null,"IOUT(typ) at OCP Inception:","VIN(nom)",{"$f":"'Variable Management'!B98","v":22.330349452442476},"A"]
[null,null,null,"VIN(max)",{"$f":"'Variable Management'!B99","v":21.281787156116035},"A"]
[]
["Step 3: Buck Inductance"]
[null,null,null,"Recommended Inductance",{"$f":"Lopt*1000000","v":1.5625},"µH"]
[null,null,null,"Inductance, LO ",1.5,"µH"]
[null,null,null,"Inductor DCR ",4,"mΩ"]
[null,null,null,"DIL as a % at VIN(nom)",{"$f":"'Variable Management'!B68*100","v":35.595340634100324},"%"]
[]
[]
[]
["Step 4: Output Capacitors"]
[null,null,null,"Output Voltage Ripple Spec",100,"mVPK-PK"]
[null,null,null,"Minimum Output Capacitance",{"$f":"'Variable Management'!B121","v":16.685315922234526},"µF"]
[null,null,null,"Output Capacitance (derated), COUT ",85,"µF",null,null,null,null,null,{"$f":"CHOOSE(SCH_MODE, \"\", \"** For Single-Output Operation in 2-Phase Mode, tie MODE to VDDA and use FB1 to set VOUT **\", \"** For Single-Output Operation in 3-Phase Mode, tie both MODE pins to VDDA. Use FB1 of master IC to set VOUT. Connect FB2 of master IC to AGND. Connect FB2 of slave IC to VDDA to configure it as a slave **\", \"** For Single-Output Operation in 4-Phase Mode, tie both MODE pins to VDDA. Use FB1 of master IC to set VOUT. Connect FB2 of master IC to AGND. Connect FB2 of slave IC to VDDA to configure it as a slave **\")","v":""}]
[null,null,null,"Maximum Permitted ESR",{"$f":"'Variable Management'!B125","v":18.364656738155894},"mΩ"]
[null,null,null,"Output Capacitor ESR",1,"mΩ",null,null,null,null,null,{"$f":"CHOOSE(SCH_MODE,  \"\", \"** Tie VCCX to GND if not used **\", \"** Slave controller (CNTRL2) not shown **\",\"** Slave controller (CNTRL2) not shown **\")","v":""}]
[null,null,null,"Resulting Output Voltage Ripple (max) ",{"$f":"'Variable Management'!B127*1000","v":20.342972595076951},"mVPK-PK",null,null,null,null,null,{"$f":"IF(OR(SCH_MODE=3, SCH_MODE=4),\"** Tie VCCX to GND if not used **\", \"\")","v":""}]
[null,null,null,"Output Capacitor RMS Current (max) ",{"$f":"'Variable Management'!B114","v":2.1467111863207302},"ARMS"]
[]
["Step 5: Input Capacitors"]
[null,null,null,"Input Voltage Ripple Spec",500,"mVPK-PK"]
[null,null,null,"Minimum Input Capacitance",{"$f":"'Variable Management'!B146","v":18.75},"µF"]
[null,null,null,"Input Capacitance (derated), CIN ",18,"µF"]
[null,null,null,"Maximum Permitted ESR",{"$f":"'Variable Management'!B152","v":"N/A"},"mΩ",null,null,null,null,null,null,null,null,null,null," "]
[null,null,null,"Input Capacitor ESR",1,"mΩ"]
[null,null,null,"Resulting Input Voltage Ripple (max)",{"$f":"'Variable Management'!B158*1000","v":539.55154617721735},"mVPK-PK"]
[null,null,null,"Input Capacitor RMS Current (max)",{"$f":"'Variable Management'!B138","v":7.3304406065591978},"ARMS"]
[]
["Step 6: Soft-start, Hiccup, Dither, Diode Emulation Mode"]
[null,null,null,"Soft-Start Time, tSS ",2.5,"ms"]
[null,null,null,"Soft-Start Capacitance, CSS ",{"$f":"IF(Tss>0.5/1000,Css_u*1000000000,\"N/A\")","v":47},"nF"]
[null,null,null,"Hiccup Fault Time, tRES ",3,"ms"]
[null,null,null,"RES Capacitance, CRES ",{"$f":"IF(Tres>1/1000,Cres_u*1000000000,\"N/A\")","v":47},"nF"]
[null,null,null,"Modulating Frequency",9,{"$f":"IF(DITHER=1, \"kHz\", \"\")","v":"kHz"}]
[null,null,null,{"$f":"IF(DITHER=1, \"DITH Capacitance, Cd\", \"* Tie DITH to VDDA\")","v":"DITH Capacitance, Cd"},{"$f":"IF(DITHER=1,IF(E57>0,'Standard Value Calculator'!O22*1000000000,\"N/A\"),\"\")","v":10},{"$f":"IF(DITHER=1, \"nF\", \"\")","v":"nF"}]
[null,null,null,{"$f":"IF(DEMB=1, \"* Tie DEMB to VDDA\", \"* Tie DEMB to AGND\")","v":"* Tie DEMB to VDDA"}]
[]
[]
["Step 7: Compensation Design"]
[null,null,null,"Load Pole Frequency",{"$f":"Fp_dominant","v":7110.5912127177653},"Hz"]
[null,null,null,"ESR Zero Frequency",{"$f":"Fesr/1000","v":1872.4110973383101},"kHz"]
[null,null,null,"Desired Crossover Frequency",60,{"$f":"\"     kHz \"","v":"     kHz "}]
[null,null,null,"Error Amp Pole Frequency",{"$f":"Fp1_u","v":0.36568232302797354},"Hz"]
[null,null,null,{"$f":"CHOOSE(VOUT_setting, \"Upper Feedback Resistor\", \"* Tie FB to AGND for Fixed 5V Output\", \"* Tie FB to VDDA for Fixed 3.3V Output\")","v":"* Tie FB to AGND for Fixed 5V Output"},49.9,"kΩ"]
[null,null,null,{"$f":"CHOOSE(VOUT_setting, \"Lower Feedback Resistor\", \"\", \"\")","v":""},{"$f":"IF(Vout=Vref,\"OPEN\",Rfb2_u/1000)","v":15.8},{"$f":"IF(Vout=Vref,\"\",\"kΩ\")","v":"kΩ"}]
[]
["Compensation Components"]
[null,"Calculated /","Std Values",{"$f":"C71","v":"Std Values"},null,"Actual P/Z Frequencies"]
["RC1",{"$f":"Rcea1/1000","v":4.0055306287500017},{"$f":"'Standard Value Calculator'!O30","v":4.0199999999999996},{"$f":"C72","v":4.0199999999999996},"kΩ",{"$f":"Fp1_u","v":0.36568232302797354},"Hz   (FPEA)"]
["CC1",{"$f":"Cc1ea*1000000000","v":6.6222995996006802},{"$f":"'Standard Value Calculator'!O31","v":6.8},{"$f":"C73","v":6.8},"nF",{"$f":"Fz1_u/1000","v":5.8221738101315621},"kHz (FZCOMP)"]
["CC2",{"$f":"IF(Cc2ea<0, \"N/A\", Cc2ea*1000000000000)","v":166.8379993332691},{"$f":"'Standard Value Calculator'!O32","v":180},{"$f":"C74","v":180},"pF",{"$f":"Fp2_u/1000","v":186.89797069030783},"kHz (FPCOMP)"]
[null,null,null,null,null,null,null,null,null,null,null,null,null,"** Specify Inductor Core Loss **",0.25,"W"]
[]
["Efficiency / Power Loss Analyzer"]
[]
["Step 8: Efficiency"]
[null,null,null,null,null,"Power MOSFETs","(Q1, Q2) "]
[null,null,null,null,"IAUC60N04S6L039, L032"]
[null,null,null,null,"High-side","  Low-side"]
[null,null,null,"On-State Resistance, RDS(on) ",4.5,3.65,"mΩ"]
[null,null,null,"Total Gate Charge, QG ",8,9,"nC"]
[null,null,null,"Gate-Drain Charge, QGD ",3.1,3.9,"nC"]
[null,null,null,"Gate-Source Charge, QGS ",2.9,3.8,"nC"]
[null,null,null,"Output Charge, QOSS ",null,12,"nC"]
[null,null,null,"Output Capacitance, COSS ",259,330,"pF"]
[null,null,null,"Gate Resistance, RG ",0,0,"Ω"]
[null,null,null,"Transconductance, gFS ",71,71,"S"]
[null,null,null,"Gate-Source Threshold Voltage, VTH ",3.2,3.2,"V"]
[null,null,null,"Body Diode Forward Voltage, VBD ",0.8,0.8,"V"]
[null,null,null,"Body Diode Rev Recovery Charge, QRR ",null,13,"nC"]
[null,null,null,"Thermal Resistance, θJA ",50,50,"°C/W"]
[]
["External Schottky Diode (if applicable)"]
[null,null,null,"Schottky Fwd Voltage, VFWDsch ",null,0,"V"]
[null,null,null,"Schottky Rev Recovery Charge, QRRsch ",null,0,"nC"]
[]
["Step 9: IC Power Loss"]
[null,null,null,"IC Power Dissipation",{"$f":"'Variable Management'!B308","v":3.3999999999999996E-2},"W"]
[null,null,null,"IC Junction Temperature (estimate)",{"$f":"'Variable Management'!B310","v":26.159400000000002},"°C"]
[null,null,null,null,{"$f":"CHOOSE(Ext_VCC, \"* Tie VCCX to VOUT\", \"* Tie VCCX to PGND\")","v":"* Tie VCCX to VOUT"}]

{"sheet":"BOM & Schematic","index":1,"n_rows":71,"n_cols":10,"rows_kept":71,"cut":false,"hidden":false,"merged":[[64,0,65,0],[64,9,65,9],[64,3,65,6],[64,2,65,2],[64,1,65,1],[64,7,65,7],[64,8,65,8],[41,3,41,6],[46,3,46,5],[60,3,60,6],[58,3,58,6],[59,3,59,6],[54,3,54,6],[57,3,57,6],[56,3,56,6],[53,3,53,6],[42,3,42,5],[43,3,43,5],[48,3,48,5],[49,3,49,5],[51,3,51,5],[44,3,44,5],[45,3,45,5],[50,3,50,5],[47,3,47,5],[62,3,62,6],[63,3,63,6],[61,3,61,6],[52,3,52,5],[55,3,55,6]]}
[]
[]
[]
[]
[]
[]
[]
[]
[]
[]
[]
[]
[]
[]
[]
[]
[]
[]
[]
[]
[]
[]
[]
[]
[]
[]
[]
[]
[]
[]
[]
[]
[]
[]
[]
["   ** Tie DEMB to VDDA for FPWM, AGND for DEM **"]
["   ** Tie VCCX to GND if not used **",null,null,null,null,null,null,null,{"$f":"IF(OR(SCH_MODE=3, SCH_MODE=4),\"** Tie VCCX to GND if not used **\", \"\")","v":""}]
["   ** Tie DITH to VDDA to disable spread spectrum **"]
["   ** Tie OSC to VDDA for 2.2MHz, AGND for 440kHz **"]
[{"$f":"\"VIN = \"&VIN_min&\" V to \"&VIN_max&\" V, VOUT = \"& Vout &\" V, IOUT = \" &Iout & \" A,  Fsw = \" & Fsw/1000 &\" kHz, Current Limit = \"&ROUNDUP(Ilimit_DC,0)&\" A\"","v":"VIN = 8 V to 40 V, VOUT = 5 V, IOUT = 15 A,  Fsw = 400 kHz, Current Limit = 20 A"}]
["High Efficiency Synchronous Buck Regulator BOM"]
["Count","Ref Des","Value","Description",null,null,null,"Size","Part Number","MFR"]
[1,"CBOOT",0.1,{"$f":"C43","v":0.1},null,null,null,"0603","Std","Std"]
[1,"CC1",{"$f":"'Design Regulator'!D73","v":6.8},6.8,null,null,null,"0603","Std","Std"]
[1,"CC2",{"$f":"'Design Regulator'!D74","v":180},180,null,null,null,"0603","Std","Std"]
[1,"CRES",{"$f":"Cres_u*1000000000","v":47},{"$f":"C46","v":47},null,null,null,"0603","Std","Std"]
[1,"CDITH",{"$f":"Cdither*1000000000","v":10},{"$f":"C47","v":10},null,null,null,"0603","Std","Std"]
[{"$f":"ROUNDUP('Design Regulator'!E46/10,0)","v":2},"CIN",10,{"$f":"C48","v":10},null,null,null,1210,"Std","Std"]
[{"$f":"ROUNDUP('Design Regulator'!E37/47,0)","v":2},"COUT",47,{"$f":"C49","v":47},null,null,null,1210,"Std","Std"]
[1,"CSS",{"$f":"'Design Regulator'!E54","v":47},{"$f":"C50","v":47},null,null,null,"0603","Std","Std"]
[2,"CVCC, CVCCX",2.2000000000000002,2.2000000000000002,null,null,null,"0603","Std","Std"]
[1,"CVDDA",0.47,0.47,null,null,null,"0603","Std","Std"]
[1,"DBOOT","See description","Schottky Diode, 75V, 200mA",null,null,null,"-","-","Various"]
[1,"LO",{"$f":"'Design Regulator'!E28","v":1.5},{"$f":"\"Inductor, \"&Lf*1000000&\"µH, \"&Rdcr*1000&\"mΩ, >\"&ROUNDUP(Ilimit_DC*1.1,0)&\"A\"","v":"Inductor, 1.5µH, 4mΩ, >22A"},null,null,null,"-","-","Various"]
[2,"Q1, Q2","See description",{"$f":"'Design Regulator'!E83","v":4.5},null,null,null,"Std",{"$f":"'Design Regulator'!E81","v":"IAUC60N04S6L039, L032"},"-"]
[1,"RC1",{"$f":"'Design Regulator'!D72","v":4.0199999999999996},{"$f":"C56","v":4.0199999999999996},null,null,null,"0603","Std","Std"]
[1,"RS",{"$f":"Rs*1000","v":3},3,null,null,null,"0508","Std","Std"]
[1,"RT",{"$f":"'Design Regulator'!E13","v":54.9},54.9,null,null,null,"0603","Std","Std"]
[1,"RFB1",{"$f":"'Design Regulator'!E67","v":49.9},49.9,null,null,null,"0603","Std","Std"]
[1,"RFB2",{"$f":"'Design Regulator'!E68","v":15.8},15.8,null,null,null,"0603","Std","Std"]
[1,"RPGOOD",100,100,null,null,null,"0603","Std","Std"]
[1,"RCS",100,100,null,null,null,"0603","Std","Std"]
[1,"RDEMB",100,100,null,null,null,"0603","Std","Std"]
[1,"RVIN",2.2000000000000002,2.2000000000000002,null,null,null,"0603","Std","Std"]
[1,"U1","LM5141-Q1","IC, LM5141-Q1, Synchronous Buck PWM Controller, 3.8V–42V Input",null,null,null,"VQFN-24","LM5141QRGEQ1","TI"]
[]
[]
["NOTES:"]
["** For information on TI NexFETTM MOSFETs, see **",null,null,"www.ti.com","   **"]
["** Inductor saturation current should be higher than the peak inductor current at the OCP setpoint for all input voltages and operating temperatures **"]
["** Effective input and output capacitances should be appropriately derated for applied voltage and temperature, particularly with ceramics **"]

{"sheet":"EVM","index":2,"n_rows":6,"n_cols":2,"rows_kept":6,"cut":false,"hidden":true,"merged":[[0,0,0,16]]}
[" LM5143-Q1 Quickstart Design Tool"]
[]
[]
[]
[]
[null,"LM5143-Q1EVM-2100 PCB Layout"]

{"sheet":"Variable Management","index":3,"n_rows":374,"n_cols":27,"rows_kept":374,"cut":false,"hidden":true,"merged":[[4,4,4,7],[0,0,0,8]]}
["EXCEL Variables Names/Calculations"]
[null,"Input from user ="]
[null,"Output ="]
[null,"Constant"]
["Variable Name","Value","STD Units",null,"Notes",null,null,null,"Iteration"]
["Step 1: Operational Specs"]
["VIN_min",{"$f":"'Design Regulator'!E6","v":8},"V","Minimum input voltage",null,null,null,null,1]
["VIN_nom",{"$f":"'Design Regulator'!E7","v":13.5},"V","Nominal input voltage",null,null,null,null,null,null,{"$f":"CHOOSE(SCH_MODE, \"Efficiency vs. IOUT (Ch1)\", \"Efficiency vs. IOUT - 2 Ph\", \"Efficiency vs. IOUT - 3 Ph\", \"Efficiency vs. IOUT - 4 Ph\")","v":"Efficiency vs. IOUT (Ch1)"},1,null,"DITHER Enabled",1,null,null,null,null,"Dual  Outputs",1,null,"FPWM",1,null,{"$f":"CHOOSE(SCH_MODE, \"Bode Plot (Ch1)\", \"Bode Plot - 2 Ph\", \"Bode Plot - 3 Ph\", \"Bode Plot - 4 Ph\")","v":"Bode Plot (Ch1)"},1]
["VIN_max",{"$f":"'Design Regulator'!E8","v":40},"V","Maximum input voltage",null,null,null,null,null,null,{"$f":"IF(MODE=1, \"Efficiency vs. IOUT (Ch2)\", \"N/A - Do Not Use\")","v":"Efficiency vs. IOUT (Ch2)"},2,null,"DITHER Disabled",2,null,null,null,null,"Single Output – 2  Phases",2,null,"DEM",2,null,{"$f":"IF(MODE=1, \"Bode Plot (Ch2)\", \"N/A - Do Not Use\")","v":"Bode Plot (Ch2)"},2]
[null,null,null,null,null,null,null,null,null,null,"PLOT_TYPE",1,null,"DITHER Yes/No",1,"1 = Yes, 2 = No",null,null,null,"Single Output – 3  Phases",3,null,"FPWM/DEM",1,null,"BODE_PLOT_TYPE",1]
["Vout",{"$f":"'Design Regulator'!E9","v":5},"V","Output voltage - channel 1",null,null,null,null,null,null,null,null,null,null,null,null,null,null,null,"Single Output – 4  Phases",4]
["Iout",{"$f":"'Design Regulator'!E10","v":15},"A","Output current - channel 1",null,null,null,null,1,null,null,null,null,null,null,null,null,null,null,"Single/Dual Yes/No",1]
[null,null,null,null,null,null,null,null,1,null,"Adjustable",1,null,"3.3V",1,null,null,null,null,"MODE (Single/Dual), DUAL = 1, SINGLE = 2",{"$f":"IF(U12=1, 1, 2)","v":1},null,"VCCX Connected",1]
["Rout",{"$f":"Vout/Iout","v":0.33333333333333331},"W","Load resistance - Channel 1",null,null,null,null,null,null,"5V",2,null,"5V",2,null,null,null,null,"SINGLE OUTPUT (1 = YES)",{"$f":"IF(U12=1, 2, 1)","v":2},null,"No External VCC",2]
[null,null,null,null,null,null,null,null,null,null,"3.3V",3,null,"Adjustable",3,null,null,null,null,"Number of Phases",{"$f":"SCH_MODE","v":1},null,"Ext_VCC",1]
["Pout",{"$f":"Vout*Iout","v":75},"W","Output power",null,null,null,null,null,null,"Output Voltage Setting",{"$f":"IF(Vout=3.3, 3, IF(Vout=5, 2, 1))","v":2},null,"Ch2 Output Setting",{"$f":"IF(Vout2=3.3, 1, IF(Vout2=5, 2, 3))","v":3}]
[]
["Efficiency",0.9,null,"Estimate of efficiency"]
["Pin",{"$f":"Pout/Efficiency","v":83.333333333333329},"W","Calculate input power assuming finite efficiency",null,null,null,null,null,null,null,null,null,null,null,null,null,null,null,null,null,null,"2.2 MHz Fsw Setting",1]
[null,null,null,null,null,null,null,null,null,null,null,null,null,null,null,null,null,null,null,null,null,null,"440 kHz Fsw Setting",2]
["Iin_Vinmin",{"$f":"Pin/VIN_min","v":10.416666666666666},"A",null,null,null,null,null,null,null,null,{"$f":"Vout","v":5},null,null,null,null,null,null,null,null,null,null,"OSC",2]
["Iin_Vinnom",{"$f":"Pin/VIN_nom","v":6.1728395061728394},"A","Input currents at min, nom, max Vin",null,null,null,{"$f":"AND(OSC=1, OR(Fsw/1000>2530, Fsw/1000<1800))","v":false}]
["Iin_Vinmax",{"$f":"Pin/VIN_max","v":2.083333333333333},"A",null,null,null,null,{"$f":"AND(OSC=2, OR(Fsw/1000>500, Fsw/1000<300))","v":false}]
[null,null,null,null,null,null,null,{"$f":"OR(H22,H23)","v":false}]
["OSC setting",{"$f":"CHOOSE(OSC, 2200, 440)","v":440},"kHz"]
["Fsw",{"$f":"'Design Regulator'!E12*1000","v":400000},"Hz","Nominal switching frequency - determines RT resistor (SYNCIN must be 80-120% of this)",null,null,null,null,null,null,null,null,null,"Min CS Gain - 11.4",1]
["RT resistor to AGND - 2.2MHz setting",{"$f":"(1/(Fsw/1000000)-0.0216)/0.0086","v":288.18604651162792},"kΩ",null,null,null,null,null,null,null,"Adjustable",1,null,"Nom CS Gain - 12",2]
["RT resistor to AGND - 440kHz setting",{"$f":"(1/(Fsw/1000)-0.0000138)/0.000045","v":55.248888888888885},"kΩ",null,null,null,null,null,1,null,"5V",2,null,"Max CS Gain - 12.6",3]
["Tsw",{"$f":"1/Fsw","v":2.5000000000000002E-6},"sec","Switching period",null,null,null,null,null,null,"3.3V",3,null,"CS Gain",2]
["Vref",1.2,"V","Reference voltage",null,null,null,null,null,null,"Adjustable_NoRT",4,null,null,{"$f":"CHOOSE(O29, 11.4, 12, 12.6)","v":12}]
["Rt",{"$f":"CHOOSE(OSC, 'Standard Value Calculator'!O12/1000, 'Standard Value Calculator'!O13/1000)","v":54.9},"kΩ","Frequency set resistor",null,{"$f":"IF(OR((Fsw=440000),(Fsw=2200000)),\"N/A\",Rfadj/1000)","v":5.4899999999999997E-2},null,null,null,null,"5V_NoRT",5]
[null,null,null,null,null,null,null,null,null,null,"3.3V_NoRT",6,null,"Min EA gm - 1.01mS",1010]
["Step 2: Buck Inductor","Channel 1",null,null,null,null,null,null,null,null,"Schematic setting",{"$f":"IF(No_RT, IF(Vout=3.3, 6, IF(Vout=5, 5, 4)),IF(Vout=3.3, 3, IF(Vout=5, 2, 1)))","v":2},null,"Nom EA gm - 1.2mS",1200]
["Don1",{"$f":"Vout/VIN_nom","v":0.37037037037037035},null,null,null,"Ideal Duty Cycle at VIN(nom)",null,null,null,null,null,null,null,"Max EA gm - 1.4mS",1400]
["Doff1",{"$f":"1-34:34","v":0.62962962962962965},null,null,null,"Ideal 1- Duty Cycle at VIN(nom)",null,null,null,null,null,null,null,"EA Transconductance",2]
[null,null,null,null,null,null,null,null,null,null,null,null,null,null,{"$f":"CHOOSE(O35, 0.000101, 0.0012, 0.0014)","v":1.1999999999999999E-3}]
["D_Vinmin",{"$f":"Vout/VIN_min","v":0.625}]
["D_Vinnom",{"$f":"Vout/VIN_nom","v":0.37037037037037035}]
["D_Vinmax",{"$f":"Vout/VIN_max","v":0.125}]
[]
["L_Vinnom",{"$f":"(VIN_nom-Vout)*D1_Vinnom/(Fsw*(Iout/Number_of_Phases)*0.35)","v":1.4991181657848323E-6},"H",null,null,"Calculated inductance for 35% ripple at VIN(nom)"]
["L_slopecomp",{"$f":"1000*Vout*Rs/24/Fsw","v":1.5625000000000001E-6},"H",null,null,"Calculated inductance based on one times inductor downslope"]
[]
["Lopt",{"$f":"B42","v":1.5625000000000001E-6},"H",null,null,"min of calculated inductances at VIN(min) and VIN(nom)"]
[]
["Lo",{"$f":"'Design Regulator'!E28/1000000","v":1.5E-6},"H",null,null,"Chosen inductance"]
["Rdcr",{"$f":"'Design Regulator'!E29/1000","v":4.0000000000000001E-3},"W",null,null,"Chosen inductor DCR"]
[]
["Don2",{"$f":"(Vout+Iout*(Rdcr+Rs))/(Vin+Iout*Rs)","v":0.37689184200812109}]
["Doff2",{"$f":"1-_Don2","v":0.62310815799187891}]
[]
["D_Vinmin_2",{"$f":"CHOOSE(MODE, (Vout+Iout*(Rdcr+Rs))/(VIN_min+Iout*Rs), (Vout+Iout/Number_of_Phases*(Rdcr+Rs))/(VIN_min+Iout/Number_of_Phases*Rs))","v":0.63455562461156001},null,null,null,"Duty cycles adjusted for DCR/shunt voltage drops"]
["D_Vinnom_2",{"$f":"CHOOSE(MODE, (Vout+Iout*(Rdcr+Rs))/(VIN_nom+Iout*Rs), (Vout+Iout/Number_of_Phases*(Rdcr+Rs))/(VIN_nom+Iout/Number_of_Phases*Rs))","v":0.37689184200812109},null,null,null,"need to include RDS(on) later"]
["D_Vinmax_2",{"$f":"CHOOSE(MODE, (Vout+Iout*(Rdcr+Rs))/(VIN_max+Iout*Rs), (Vout+Iout/Number_of_Phases*(Rdcr+Rs))/(VIN_max+Iout/Number_of_Phases*Rs))","v":0.12748158321887876}]
[]
["Iripple_Vinmin",{"$f":"(VIN_min-Vout)*D1_Vinmin_2/(Fsw*Lf)","v":3.1727781230578},"A"]
["Iripple_Vinnom",{"$f":"(VIN_nom-Vout)*D1_Vinnom_2/(Fsw*Lf)","v":5.339301095115049},"A"]
["Iripple_Vinmax",{"$f":"(VIN_max-Vout)*D1_Vinmax_2/(Fsw*Lf)","v":7.4364256877679269},"A"]
[]
["Ishunt_rms_Vinmin",{"$f":"SQRT((Iout/Number_of_Phases)^2+(Iripple_Vinmin^2)/12)","v":15.027936543368583},"A"]
["Ishunt_rms_Vinnom",{"$f":"SQRT((Iout/Number_of_Phases)^2+(Iripple_Vinnom^2)/12)","v":15.07898133215099},"A"]
["Ishunt_rms_Vinmax",{"$f":"SQRT((Iout/Number_of_Phases)^2+(Iripple_Vinmax^2)/12)","v":15.152833692662062},"A"]
["Max shunt power loss at full load",{"$f":"B61^2*Rs","v":0.68212703404607411},"W",null,null,"Note this is power loss at full load - not loss near OCP!"]
[]
["Max inductor ripple current",{"$f":"MAX(B56:B58)","v":7.4364256877679269},"A",null,null,"Ripple current at Vin(max)"]
[]
[null,{"$f":"B56/(Iout/Number_of_Phases)","v":0.21151854153718666}]
["% ripple current",{"$f":"B57/(Iout/Number_of_Phases)","v":0.35595340634100325}]
[null,{"$f":"B58/(Iout/Number_of_Phases)","v":0.49576171251786177}]
[]
["Inductor copper temerature",100,"°C"]
["DCR at hot",{"$f":"Rdcr*(1+0.0039*(B71-25))","v":5.1700000000000001E-3},"W"]
[]
[]
["Step 3: Sense Resistors, Slope Comp, Current Limit"]
[]
["Ilimit_DC",{"$f":"'Design Regulator'!E17","v":20},"A",null,null,"Chosen OCP level - based on output current"]
[]
["Ilimit_inductor_Vinmin",{"$f":"CHOOSE(MODE, Ilimit_DC+Iripple_Vinmin/2, Ilimit_DC/Number_of_Phases+Iripple_Vinmin/2)","v":21.586389061528902},"A",null,null,"Peak inductor current at current limit inception"]
["Ilimit_inductor_Vinnom",{"$f":"CHOOSE(MODE, Ilimit_DC+Iripple_Vinnom/2, Ilimit_DC/Number_of_Phases+Iripple_Vinnom/2)","v":22.669650547557524},"A"]
["Ilimit_inductor_Vinmax",{"$f":"CHOOSE(MODE, Ilimit_DC+Iripple_Vinmax/2, Ilimit_DC/Number_of_Phases+Iripple_Vinmax/2)","v":23.718212843883965},"A"]
[]
[]
["CS threshold_min",6.8000000000000005E-2,"V"]
["CS threshold",7.4999999999999997E-2,"V"]
["CS threshold_max",8.2000000000000003E-2,"V"]
[]
["Shunt required to get OCP at VIN(min)",{"$f":"Buck_CS_threshold/B79","v":3.474411574174044E-3},"W"]
["Shunt required to get OCP at VIN(nom)",{"$f":"Buck_CS_threshold/B80","v":3.308388007246131E-3},"W"]
["Shunt required to get OCP at VIN(max)",{"$f":"Buck_CS_threshold/B81","v":3.1621269483353876E-3},"W"]
[]
["Rs_ideal",{"$f":"B89","v":3.308388007246131E-3},"W",null,null,"Ideal Rs for the required OCP -- based on 73mV CL threshold"]
["Rs",{"$f":"'Design Regulator'!E19/1000","v":3.0000000000000001E-3},"W",null,null,"Selected (starndard value) current limit sense resistor"]
[]
["Current limit - peak",{"$f":"Buck_CS_threshold/Rs","v":25},"A",null,null,"Peak inductor current limit = min sat current"]
[]
["Iout_OCP_Vinmin",{"$f":"Number_of_Phases*(Buck_CS_threshold/Rs-Iripple_Vinmin/2)","v":23.413610938471098},"A",null,null,"Current limit setpoints (i.e. IOUT) after standard components are selected"]
["Iout_OCP_Vinnom",{"$f":"Number_of_Phases*(Buck_CS_threshold/Rs-Iripple_Vinnom/2)","v":22.330349452442476},"A"]
["Iout_OCP_Vinmax",{"$f":"Number_of_Phases*(Buck_CS_threshold/Rs-Iripple_Vinmax/2)","v":21.281787156116035},"A"]
[]
["Irms_OCP_Vinmin",{"$f":"SQRT((Iout_OCP_Vinmin/Number_of_Phases)^2+(Iripple_Vinmin^2)/12)","v":23.431518387198182},"A"]
["Irms_OCP_Vinnom",{"$f":"SQRT((Iout_OCP_Vinnom/Number_of_Phases)^2+(Iripple_Vinnom^2)/12)","v":22.383480173636002},"A"]
["Irms_OCP_Vinmax",{"$f":"SQRT((Iout_OCP_Vinmax/Number_of_Phases)^2+(Iripple_Vinmax^2)/12)","v":21.389783390107063},"A"]
[]
["Pshunt_Vinmin",{"$f":"B101^2*Rs","v":1.6471081617888195},"W",null,null,"Max power dissipations in shunt"]
["Pshunt_Vinnom",{"$f":"B102^2*Rs","v":1.5030605540506681},"W"]
["Pshunt_Vinmax",{"$f":"B103^2*Rs","v":1.3725685004271},"W"]
[]
[]
["Step 4: Output Capacitor"]
["Icoutrms_VINmin",{"$f":"Iripple_Vinmin/SQRT(12)","v":0.91590215171318823},"A",null,null,"Output Cap RMS current"]
["Icoutrms_VINnom",{"$f":"Iripple_Vinnom/SQRT(12)","v":1.5413234622745686},"A"]
["Icoutrms_VINmax",{"$f":"Iripple_Vinmax/SQRT(12)","v":2.1467111863207302},"A"]
["Max Cout rms current",{"$f":"MAX(B111:B113)","v":2.1467111863207302},"A"]
[]
["Vripple1",{"$f":"'Design Regulator'!E35/1000","v":0.1},"V",null,null,"Output voltage ripple spec(pk-pk)"]
[]
["Output Ripple Spec (pk-pk)",{"$f":"Vo1_ripple*1000","v":100},"mV",null,null,"Vout ripple spec at Vin(nom)"]
[]
["Coutmin",{"$f":"Iripple_Vinnom/(Fsw*8*Vo1_ripple)","v":1.6685315922234527E-5},"F",null,null,"Minimum output capacitnace",null,{"$f":"Vo2_ripple","v":0},1]
["Reported Coutmin",{"$f":"IF(Cout_min*1000000<2, 2.2,Cout_min*1000000)","v":16.685315922234526},"uF"]
["Cout",{"$f":"'Design Regulator'!E37/1000000","v":8.5000000000000006E-5},"F",null,null,"Chosen output capacitance",null,null,1]
["Resrmax",{"$f":"SQRT((Vo1_ripple/Iripple_Vinnom)^2-(1/(Fsw*Cout*8))^2)","v":1.8364656738155894E-2},"W",null,null,"Max ESR before ripple exceeds Vripple1",null,null,1]
[]
["Reported Cout ESR max",{"$f":"IF(OR(CoutEsrMax>0.3, CoutEsrMax<0, (ISERROR(CoutEsrMax))), \"N/A\", CoutEsrMax*1000)","v":18.364656738155894},"mΩ"]
["CoutEsr",{"$f":"'Design Regulator'!E39/1000","v":1E-3},"W",null,null,"Chosen ESR",null,null,1,null,{"$f":"ISERROR(CoutEsrMax)","v":false},{"$f":"ISERROR(B125)","v":false}]
["Vripple",{"$f":"Iripple_Vinnom*SQRT(Cout_ESR^2+(1/(8*Fsw*Cout))^2)","v":2.034297259507695E-2},"Vp-p",null,null,null,null,null,null,null,null,{"$f":"OR(CoutEsrMax>0.3,CoutEsrMax<0)","v":false}]
[null,null,null,null,null,null,null,null,null,null,{"$f":"OR(TRUE, FALSE, TRUE)","v":true}]
["Step 5: Input Capacitor"]
[null,null,null,null,null,null,null,null,null,null,"Two channels operating at full load"]
["Icinrms_VINmin",{"$f":"SQRT(D1_Vinmin_2*(Iout^2*(1-D1_Vinmin_2)+Iripple_Vinmin^2/12))","v":7.2600716480790846},"A",null,null,"Calculate input cap rms current with one output unloaded",null,null,null,null,{"$f":"SQRT(Iout^2*D1_Vinmin*(1-D1_Vinmin)+Iout2^2*D2_Vinmin*(1-D2_Vinmin)-2*Iout*Iout2*D1_Vinmin*D2_Vinmin)","v":{"$error":"#NAME?"}},"A",{"$f":"SQRT(Iout^2*D1_Vinmin*(1-D1_Vinmin)+Iout2^2*D2_Vinmin*(1-D2_Vinmin)-2*Iout*Iout2*(0.5-D2_Vinmin*(1-D1_Vinmin)))","v":{"$error":"#NAME?"}},"A"]
["Icinrms_VINnom",{"$f":"SQRT(D1_Vinnom_2*(Iout^2*(1-D1_Vinnom_2)+Iripple_Vinnom^2/12))","v":7.3304406065591978},"A",null,null,null,null,null,null,null,{"$f":"SQRT(Iout^2*D1_Vinnom*(1-D1_Vinnom)+Iout2^2*D2_Vinnom*(1-D2_Vinnom)-2*Iout*Iout2*D1_Vinnom*D2_Vinnom)","v":{"$error":"#NAME?"}},"A"]
["Icinrms_VINmax",{"$f":"SQRT(D1_Vinmax_2*(Iout^2*(1-D1_Vinmax_2)+Iripple_Vinmax^2/12))","v":5.0610511483688709},"A",null,null,null,null,null,null,null,{"$f":"SQRT(Iout^2*D1_Vinmax*(1-D1_Vinmax)+Iout2^2*D2_Vinmax*(1-D2_Vinmax)-2*Iout*Iout2*D1_Vinmax*D2_Vinmax)","v":{"$error":"#NAME?"}},"A"]
["Max Cin rms current",{"$f":"MAX(B131:B133)","v":7.3304406065591978},"A",null,null,null,null,null,null,null,{"$f":"MAX(K131:K133)","v":{"$error":"#NAME?"}},"A"]
[null,null,null,null,null,{"$f":"Number_of_Phases*D1_Vinnom","v":0.37037037037037035},"N*D"]
["Icinrms - multiphase",{"$f":"Iout*SQRT((D1_Vinnom-F136/Number_of_Phases)*((F136+1)/Number_of_Phases-D1_Vinnom))","v":7.2435582280029438},"A",null,null,{"$f":"FLOOR(Number_of_Phases*D1_Vinnom,1)","v":0},"floor(N*D)"]
["Icinrms - multiphase - max",{"$f":"Iout/2/Number_of_Phases","v":7.5},"A"]
["Final result",{"$f":"CHOOSE(MODE, B134, B137)","v":7.3304406065591978},"A","…report this"]
[]
["Vinripple1",{"$f":"'Design Regulator'!E44/1000","v":0.5},"Vp-p",null,null,"Input voltage ripple spec (pk-pk)"]
[]
["Cinmin_Vinmin",{"$f":"Iout/Number_of_Phases*D1_Vinmin*(1-D1_Vinmin)/(Vinripple1*Fsw)","v":1.7578124999999999E-5},"F"]
["Cinmin_Vinmax",{"$f":"Iout/Number_of_Phases*D1_Vinmax*(1-D1_Vinmax)/(Vinripple1*Fsw)","v":8.2031249999999995E-6},"F",null,null,"Calculate cap at Vinmax and 50% duty cycle (Vin = 2*Vout)"]
["Cinmin_50%D",{"$f":"Iout*0.5*(1-0.5)/(Vinripple1*Fsw)","v":1.8749999999999998E-5},"F",null,null,"Buck 50% typically worst case"]
["Cinmin",{"$f":"IF(VIN_min>2*Vout, B142,B144)","v":1.8749999999999998E-5},"F"]
["Reported Cinmin",{"$f":"IF(Cinmin*1000000<10, 10,Cinmin*1000000)","v":18.75},"uF",null,null,"…report this"]
["Cin",{"$f":"'Design Regulator'!E46/1000000","v":1.8E-5},"F",null,null,"Input capacitance"]
["CinEsrMax_Vinmin",{"$f":"-(Iout/Number_of_Phases*D1_Vinmin*(1-D1_Vinmin)/(Cin*Fsw)-Vinripple1)/(Iout/Number_of_Phases+Iripple_Vinmin/2)","v":7.0652810304449643E-4},"W"]
["CinEsrMax_Vinmax",{"$f":"-(Iout/Number_of_Phases*D1_Vinmax*(1-D1_Vinmax)/(Cin*Fsw)-Vinripple1)/(Iout/Number_of_Phases+Iripple_Vinmax/2)","v":1.4538536287431141E-2},"W"]
["CinEsrMax_50%D",{"$f":"-(Iout/Number_of_Phases*0.5*(1-0.5)/(Cin*Fsw)-Vinripple1)/(Iout/Number_of_Phases+Iripple_Vinmax/2)","v":-1.1129979932961659E-3},"W",null,null,"Calculate ESR at Vinmax and 50% duty cycle (Vin = 2*Vout)"]
["CinEsrMax",{"$f":"IF(VIN_min>2*Vout, B148,B150)","v":-1.1129979932961659E-3},"W"]
["Reported Cin ESR max",{"$f":"IF(OR(CinEsrMax>0.3, CinEsrMax<0), \"N/A\",CinEsrMax*1000)","v":"N/A"},"mΩ",null,null,"…report this"]
["RCinEsr",{"$f":"'Design Regulator'!E48/1000","v":1E-3},"W",null,null,"Input capacitance series resistance (ESR)"]
[]
["Vinripple2_Vinmin",{"$f":"Iout/Number_of_Phases*D1_Vinmin_2*(1-D1_Vinmin_2)/(Cin*Fsw)+(Iout/Number_of_Phases +Iripple_Vinmin/2)*RCinEsr","v":0.49970052215609762},"Vp-p"]
["Vinripple2_Vinmax",{"$f":"Iout/Number_of_Phases*D1_Vinmax_2*(1-D1_Vinmax_2)/(Cin*Fsw)+(Iout/Number_of_Phases +Iripple_Vinmax/2)*RCinEsr","v":0.25044744025823157},"Vp-p"]
["Vinripple2_50%D",{"$f":"Iout/Number_of_Phases*0.5*(1-0.5)/(Cin*Fsw)+(Iout/Number_of_Phases +Iripple_Vinmax/2)*RCinEsr","v":0.53955154617721734},"Vp-p",null,null,"Calculate ripple at Vinmax and 50% duty cycle (Vin = 2*Vout)"]
["Vinripple2",{"$f":"IF(VIN_min>2*Vout, B155,B157)","v":0.53955154617721734},"Vp-p",null,null,"…report highest of these"]
[]
[null,{"$f":"Iout*D1_Vinmax_2*(1-D1_Vinmax_2)/(Cin*Fsw)","v":0.23172922741434762},"Vp-p"]
[]
["Step 6a: Soft Start"]
["Tss",{"$f":"'Design Regulator'!E53/1000","v":2.5000000000000001E-3},"s","Soft-start time"]
["Iss",{"$f":"Cout*Vout/Tss","v":0.17},"A","Load cap current during soft start"]
["Css",{"$f":"0.000022*Tss/1.2","v":4.583333333333334E-8},"F"]
["Css_u",{"$f":"'Standard Value Calculator'!B4","v":4.6999999999999997E-8},"F"]
[]
["Step 6b: Other Components - Dither, Hiccup, DEMB, MODE"]
["Tres",{"$f":"'Design Regulator'!E55/1000","v":3.0000000000000001E-3},"s","Hiccup time"]
["Cres",{"$f":"0.00002*Tres/1.2","v":5.0000000000000011E-8},"F"]
["Cres_u",{"$f":"'Standard Value Calculator'!G4","v":4.6999999999999997E-8},"F"]
[]
["RPG1/2",100,"kΩ"]
["RFB1/2",null,"W",null,"Tie to VDDA or AGND for 3.3V/5V output, respectively. "]
["R_MODE",null,"W",null,"Tie to VDDA or AGND for Single/Dual operation, respectively. "]
["R_DEMB",null,"W",null,"Tie to VDDA or AGND for FPWM/DEM, respectively. "]
[]
["Dither Modulation Frequency",{"$f":"'Design Regulator'!E57*1000","v":9000},"Hz"]
["Cdither_calculated",{"$f":"10*10^-6/Fdither/0.12","v":9.2592592592592591E-9},"F"]
["Cdither_stdvalue",{"$f":"'Standard Value Calculator'!O22","v":1E-8},"F"]
[]
[]
["Step 7: Compensation"]
["Pi",3.1415926500000002,null,"p"]
["CS Amp Gain",{"$f":"O30","v":12}]
["Ri",{"$f":"Rs*CSAmp_gain","v":3.6000000000000004E-2},"W",null,null,"Current Sense effective resistance = shunt resistor Rs * CS amp gain"]
["gm",{"$f":"O36","v":1.1999999999999999E-3},"S",null,null,"Error Amp Transconductance"]
[]
["Se_ext",{"$f":"B193/Ri*1000","v":3232323.2323232321},"A/s",null,null,"Slope Comp Slope - referred to inductor current"]
["Sn",{"$f":"(Vin-Vout)/Lf","v":5666666.666666667},"A/s",null,null,"On-time Slope"]
["Sf",{"$f":"Vout/Lf","v":3333333.333333333},"A/s",null,null,"Off-time Slope"]
[]
["Se_int",{"$f":"Fsw/220*64/1000","v":116.36363636363637},"mV/μs",null,null,"Slope Comp Slope - referred to IC"]
["Sn_int",{"$f":"Sn*Ri/1000","v":204.00000000000003},"mV/μs",null,null,"etc"]
["Sf_int",{"$f":"Sf*Ri/1000","v":120},"mV/μs",null,null,"etc"]
[]
["mc_buck",{"$f":"1+Se_ext/Sn","v":1.570409982174688},null,null,null,"mc = 1 + Se/Sn for peak current-mode buck"]
["k_buck",{"$f":"mc_buck*(1-D1_Vinnom_2)","v":0.97853527128492923},null,null,null,"mc*(1-d)"]
[]
["mc",{"$f":"1+Se_ext/Sn","v":1.570409982174688}]
["k",{"$f":"mc_buck*(1-D1_Vinnom_2)","v":0.97853527128492923}]
["Q",{"$f":"1/Pi/(k-0.5)","v":0.66517539175912666},null,null,null,"1/(Pi*(k-0.5))",null,"Q = 2/Pi = 0.636 gives ideal one-cycle damping"]
[]
["Error Amp (EA)"]
["GBW",6,"MHz",null,null,"EA gain-bandwidth product"]
["Cbw",{"$f":"gm/(2*Pi*GBW*1000000)","v":3.1830988654751269E-11},"F",null,null,"EA effective bandwidth limiting capacitance = gm/(2*Pi*GBW)"]
["RoEA",64000000,"W",null,null,"EA output resistance"]
["AEA",{"$f":"gm*RoEA","v":76800},"V/V",null,null,"EA DC gain = gm*RoEA"]
["Afb",{"$f":"Vref/Vout","v":0.24},"V/V",null,null,"Feedback gain from Vout to FB"]
["Acs",{"$f":"1/Ri","v":27.777777777777775},null,null,null,"Acs = 1/Ri"]
["Am_buck",{"$f":"(Ro/Number_of_Phases)/Ri/((1+Ro/Number_of_Phases*(k-0.5)/(Fsw*Lf)))","v":7.3146406275588918}]
["Am",{"$f":"(Ro*Number_of_Phases)/Ri/((1+Ro*Number_of_Phases*(k-0.5)/(Fsw*Lf)))","v":7.3146406275588918},null,null,null,"Buck modulator gain"]
[]
["Scaling factor to calculate Rcomp - buck",{"$f":"2*Pi*Ri/gm","v":188.49555900000007},null,null,null,"2*Pi*Ri/gm -- scaling factor to calculate Rcomp given desired buck crossover frequency"]
["DC Gain is Adc = AEA*Afb*Am"]
[]
["Ro",{"$f":"Rout","v":0.33333333333333331},"W",null,null,"Output Resistance"]
[]
["Fp_load_buck",{"$f":"1/(2*Pi*Ro*Cout)+(k-0.5)/(2*Pi*Fsw*Lf*Cout/Number_of_Phases)","v":7110.5912127177653},"Hz",null,null,"Buck dominant pole frequency -- note slope comp influence"]
["Fp_dominant",{"$f":"Fload_u","v":7110.5912127177653},"Hz"]
[null,{"$f":"Cbw","v":3.1830988654751269E-11}]
["Fp_EA",{"$f":"1/(2*Pi*(RoEA+Rcea1_u)*Cc1ea_u)","v":0.36568232302797354},"Hz",null,null,"Error Amp LF pole -- related to amplifier ouptut resistance and comp cap"]
["Fp_HF",{"$f":"1/(2*Pi*Rcea1_u*(Cc2ea_u+Cbw))","v":186897.97069030782},"Hz",null,null,"Error Amp HF pole cancels zero related to Output Cap ESR"]
["Fesr",{"$f":"1/(2*Pi*Cout*Cout_ESR)","v":1872411.0973383102},"Hz",null,null,"Cout ESR zero frequency"]
["F_mod",{"$f":"Fsw/2","v":200000},"Hz",null,null,"Zero-order sample-and-hold effects of current-mode control modeled as pole at Fsw/2"]
[]
["Desired Crossover Frequency",{"$f":"'Design Regulator'!E65*1000","v":60000},"Hz"]
["Rcea1",{"$f":"Fcross*Cout/Number_of_Phases*2*Pi*Ri/(gm*Afb)","v":4005.5306287500021},"W",null,null,"This component will largely determine the crossover frequency",null,null,null,null,{"$f":"Fcross/Fp_dominant/(gm*Afb*Am)","v":4005.5306287500007}]
["Cc1ea, Cc3ea",{"$f":"10/(Rcea1*Fcross*2*Pi)","v":6.6222995996006803E-9},"F",null,null,"This along with Rcea1 will set a zero at Fcrossover/5 to optimize phase margin"]
["Cc2ea, Cc4ea",{"$f":"MAX(1/(Rcea1*2*Pi*Fesr)-Cbw, 1/(Rcea1*2*Pi*(Fsw/2))-Cbw)","v":1.6683799933326911E-10},"F",null,null,"This along with Rcea1 places a pole at the output cap ESR zero"]
[]
["Chosen Compensation Components from the standard value sheet"]
["Rcea1_u",{"$f":"'Design Regulator'!D72*1000","v":4019.9999999999995},"W",null,null,{"$f":"1/(Rcea1*2*Pi*(Fsw/2))-Cbw","v":1.6683799933326911E-10}]
["Cc1ea_u",{"$f":"'Design Regulator'!D73*0.000000001","v":6.8000000000000005E-9},"F"]
["Cc2ea_u",{"$f":"'Design Regulator'!D74*0.000000000001","v":1.8E-10},"F"]
[]
["Resulting Pole/Zero Locations",null,null,null,null,{"$f":"Cout","v":8.5000000000000006E-5},{"$f":"Cout_ESR","v":1E-3}]
["Fz1",{"$f":"1/(2*Pi*Rcea1_u*Cc1ea_u)","v":5822.1738101315623},"Hz",null,null,"This zero is set at or close to the dominant load pole"]
["Fp2",{"$f":"1/(2*Pi*Rcea1_u*(Cc1ea_u*(Cc2ea_u+Cbw)/(Cc1ea_u+Cc2ea_u+Cbw)))","v":192720.14450043935},"Hz",null,null,"This pole cancels the zero from the Output Cap ESR"]
[]
["Rfb1",{"$f":"'Design Regulator'!E67*1000","v":49900},"W",null,null,"Upper Feedback Resistance - chosen by user"]
["Rfb2",{"$f":"IF(Vout=Vref,100000000,Vref*B241/((Vout-Vref)))","v":15757.894736842107},"W",null,null,"Lower Feedback Resistance"]
["Rfb2_u",{"$f":"IF(Vout=Vref,\"N/A\",'Standard Value Calculator'!O11)","v":15800},"W",null,null,"Std Value Lower Feedback Resistance"]
[]
[]
["Other Input Variables"]
["Rfets",0,"W","Series resistance due to FETs"]
["Diode loss eq res",{"$f":"0.00000002*Fsw*0.6*4/Iripple1","v":{"$error":"#NAME?"}}]
["Fet loss eq res",{"$f":"_Don2*RdsonTop+Doff2*RdsonBot","v":{"$error":"#NAME?"}}]
["cap loss eq res",{"$f":"B251*Vin^2*Fsw/2/(((Iripple1/SQRT(3))^2))","v":{"$error":"#NAME?"}}]
["Sw cap",5.0000000000000001E-9]
[]
["Step 8: Efficiency"]
["VAR",0]
["Design"]
["Ta",{"$f":"'Design Regulator'!E14","v":25},"°C","Ambient Temperature"]
["Components"]
["LTc",{"$f":"4000/1000000","v":4.0000000000000001E-3},"%/°C","Inductor DCR Temp Co"]
["θCA",20,"°C/W","Inductor Core to Ambient Thermal Resistance"]
["RCinEsr",{"$f":"RCinEsr","v":1E-3},"W","Input Capacitor ESR"]
[]
["Controller Characteristics"]
["VCC",5,"V","with 170mA current limit"]
["Top Driver"]
["RdsonDRT",1,"W","Drain-Source Resistance of Pullup High-side FET Driver"]
["RdsonDRT2",0.5,"W","Drain-Source Resistance of Pulldown High-side FET Driver"]
["Bottom Driver"]
["RdsonDRB",1,"W","Drain-Source Resistance of Pullup Low-side FET Driver"]
["RdsonDRB2",0.5,"W","Drain-Source Resistance of Pulldown Low-side FET Driver"]
["Deadtime"]
["Deadtime",1.4E-8,"s","Total Deadtime",null,null,"14ns for LM513-Q1"]
["IQ"]
["IQ ",3.4999999999999997E-5,"A","Quiescent Current of LM5143-Q1 Controller (One channel disabled)"]
[]
["High- & low-side MOSFETs - Ch1","Q1: high-side",null,"Q2: low-side"]
["Rdson",{"$f":"'Design Regulator'!E83/1000","v":4.4999999999999997E-3},"W",{"$f":"'Design Regulator'!F83/1000","v":3.65E-3},"W","Drain-Source Resistances of Channel 1 FETs"]
["RdsonTopTc",{"$f":"4000/1000000","v":4.0000000000000001E-3},"%/°C",4.0000000000000001E-3,"%/°C","Drain-Source Resistance Temp Co"]
["Qg",{"$f":"'Design Regulator'!E84/1000000000","v":8.0000000000000005E-9},"C",{"$f":"'Design Regulator'!F84/1000000000","v":8.9999999999999995E-9},"C","Gate Charge at VCC = 5V"]
["Qgd",{"$f":"'Design Regulator'!E85/1000000000","v":3.1E-9},"C",{"$f":"'Design Regulator'!F85/1000000000","v":3.9000000000000002E-9},"C","Gate to Drain Charge"]
["Qgs",{"$f":"'Design Regulator'!E86/1000000000","v":2.8999999999999999E-9},"C",{"$f":"'Design Regulator'!F86/1000000000","v":3.8000000000000001E-9},"C","Gate to Source Charge"]
["Qoss",{"$f":"'Design Regulator'!E87/1000000000","v":0},"C",{"$f":"'Design Regulator'!F87/1000000000","v":1.2E-8},"C","Output Charge"]
["Coss",{"$f":"'Design Regulator'!E88/1000000000000","v":2.5899999999999998E-10},"F",{"$f":"'Design Regulator'!F88/1000000000000","v":3.3E-10},"F","Output Capacitance"]
["Rgate",{"$f":"'Design Regulator'!E89","v":0},"W",{"$f":"'Design Regulator'!F89","v":0},"W","Gate Resistance"]
["Gfs",{"$f":"'Design Regulator'!E90","v":71},"S",{"$f":"'Design Regulator'!F90","v":71},"S","Transconductance"]
["Vth",{"$f":"'Design Regulator'!E91","v":3.2},"V",{"$f":"'Design Regulator'!F91","v":3.2},"V","Threshold Voltage"]
["Vsp",{"$f":"Vth_Q1+(Iout/Number_of_Phases)/Gfs_Q1","v":3.4112676056338032},"V",{"$f":"Vth_Q2+(Iout/Number_of_Phases)/Gfs_Q2","v":3.4112676056338032},"V","Switch Point Voltage of FETs"]
[]
["Vsd - Buck",{"$f":"'Design Regulator'!E92","v":0.8},"V",{"$f":"'Design Regulator'!F92","v":0.8},"V","Diode Forward Voltage of MOSFET Body diode"]
["QrrTop",null,"C",{"$f":"'Design Regulator'!F93/1000000000","v":1.3000000000000001E-8},"C","Reverse Recovery Charge of Body Diode"]
["TrrTop",4.0000000000000001E-8,"s",4.0000000000000001E-8,"s","Reverse Recovery Time of Body Diode"]
["θJA-MOSFET",{"$f":"'Design Regulator'!E94","v":50},"°C/W",{"$f":"'Design Regulator'!F94","v":50},"°C/W","Junction-to-Ambient Resistance"]
[]
[]
[]
["Anti-parallel Schottky Diode (optional)"]
["VfdSky",{"$f":"'Design Regulator'!F97","v":0},"V",{"$f":"'Design Regulator'!#REF!","v":{"$error":"#REF!"}},"V","Diode Forward Voltage"]
["QrrSky",{"$f":"'Design Regulator'!F98/1000000000","v":0},"C",{"$f":"'Design Regulator'!#REF!/1000000000","v":{"$error":"#REF!"}},"C","Diode Reverse Recovery Charge"]
["Ireverse",0,"A",0,"A","Reverse Leakage Current"]
[]
["Controller"]
["θJACtrl",34.1,"°C/W",null,null,"Junction-to-ambient thermal resistance of controller"]
["Outputs"]
["Top FET"]
["Tr",{"$f":"(Qgd_Q1+Qgs_Q1/2)*(RdsonDRT+Rgate1)/(VCC-Vsp_Q1)","v":2.8639184397163129E-9},"s"]
["Tf",{"$f":"(Qgd_Q1+Qgs_Q1/2)*(RdsonDRT2+Rgate1)/(Vsp_Q1)","v":6.6690751445086697E-10},"s"]
[]
["IC Power Disipation","Value","Units"]
["Power Dis",{"$f":"CHOOSE(Ext_VCC, (Qg_Q1+Qg_Q2)*Fsw*VCC, (Qg_Q1+Qg_Q2)*Fsw*Vin)","v":3.3999999999999996E-2},"W"]
["Temp rise",{"$f":"B308*ThetaJaCtrl","v":1.1594},"°C"]
["Junction temperature",{"$f":"B309 + Ta","v":26.159400000000002},"°C"]
[]
["Current (switching)",{"$f":"(Qg_Q1+Qg_Q2)*Fsw+Iq","v":6.8349999999999999E-3},"A"]
["Qrr Current",{"$f":"Qrr_Q2*Fsw","v":5.2000000000000006E-3},"A"]
["Diode Current",{"$f":"C314/Vin","v":{"$error":"#NAME?"}},{"$f":"Deadtime*Fsw*(Ipp/2)*(Vsd_Q1+Vsd_Q2)","v":{"$error":"#NAME?"}}]
["Total Application Switching IQ",{"$f":"SUM(B312:B314)","v":{"$error":"#NAME?"}},"A"]
[]
["Low-side MOSFET/Diode"]
["Part Power"]
["Power Dis"]
[]
["SCHEMATIC LABELS"]
[{"$f":"\"RC1 = \"&'Design Regulator'!D72&\"kΩ\"","v":"RC1 = 4.02kΩ"},{"$f":"'Design Regulator'!D72&\"kΩ\"","v":"4.02kΩ"},null,{"$f":"'Design Regulator'!D75&\"kΩ\"","v":"kΩ"}]
[{"$f":"\"RC2 = \"&'Design Regulator'!D75&\"kΩ\"","v":"RC2 = kΩ"},{"$f":"'Design Regulator'!D75&\"kΩ\"","v":"kΩ"}]
[]
[{"$f":"\"Lo = \"&'Design Regulator'!E28&\"µH\"","v":"Lo = 1.5µH"},{"$f":"'Design Regulator'!E28&\"µH\"","v":"1.5µH"},null,{"$f":"IF(MODE = 1, 'Design Regulator'!J28&\"µH\", 'Design Regulator'!E28&\"µH\")","v":"µH"}]
[{"$f":"\"Rdcr = \"&Rdcr*1000&\"mΩ\"","v":"Rdcr = 4mΩ"},{"$f":"Rdcr*1000&\"mΩ\"","v":"4mΩ"},null,{"$f":"IF(MODE=1, Rdcr2*1000&\"mΩ\", Rdcr*1000&\"mΩ\")","v":"0mΩ"}]
[{"$f":"\"Rs = \"&'Design Regulator'!E19&\"mΩ\"","v":"Rs = 3mΩ"},{"$f":"'Design Regulator'!E19&\"mΩ\"","v":"3mΩ"},null,{"$f":"IF(MODE = 1, 'Design Regulator'!J19&\"mΩ\", 'Design Regulator'!E19&\"mΩ\")","v":"mΩ"}]
[]
[{"$f":"\"VOUT = \"&'Design Regulator'!E9&\"V\"","v":"VOUT = 5V"},{"$f":"'Design Regulator'!E9&\"V\"","v":"5V"},null,{"$f":"IF(MODE=1, 'Design Regulator'!J10&\"V\", \"\")","v":"V"}]
[]
[{"$f":"\"COUT = \"&'Design Regulator'!$E$37&\"µF\"","v":"COUT = 85µF"},{"$f":"ROUND('Design Regulator'!$E$37/Number_of_Phases, 0)&\"µF\"","v":"85µF"},null,{"$f":"IF(MODE=1, 'Design Regulator'!$J$37&\"µF\", ROUND('Design Regulator'!$E$37/Number_of_Phases, 0)&\"µF\")","v":"µF"}]
["Capacitance per component (Cout)",{"$f":"\"22µF\"","v":"22µF"}]
["# of output caps",{"$f":"ROUNDUP(Cout*1000000/22,0)&\" x\"","v":"4 x"}]
[]
["CIN",{"$f":"Cin*1000000&\"µF\"","v":"18µF"}]
["Capacitance per component (Cin)",{"$f":"\"10µF\"","v":"10µF"}]
["# of input caps",{"$f":"ROUNDUP(Cin*1000000/10,0)&\" x\"","v":"2 x"}]
[]
[{"$f":"\"RC1 = \"&Rcea1_u/1000&\"kΩ\"","v":"RC1 = 4.02kΩ"},{"$f":"ROUND(Rcea1_u/1000,2)&\"kΩ\"","v":"4.02kΩ"}]
[{"$f":"\"CC1 = \"&Cc1ea_u*10^9&\"nF\"","v":"CC1 = 6.8nF"},{"$f":"Cc1ea_u*10^9&\"nF\"","v":"6.8nF"}]
[{"$f":"\"CC2 = \"&IF(Cc2ea_u>0, Cc2ea_u*10^12&\"pF\", \"OPEN\")","v":"CC2 = 180pF"},{"$f":"IF(Cc2ea_u>0, ROUND(Cc2ea_u*10^12,1)&\"pF\", \"N/A\")","v":"180pF"}]
[]
[{"$f":"\"gm = \"&$B$187*1000&\"mS\"","v":"gm = 1.2mS"},{"$f":"$B$187*1000&\"mS\"","v":"1.2mS"}]
[{"$f":"\"RoEA = \"&RoEA/1000000&\"MΩ\"","v":"RoEA = 64MΩ"},{"$f":"RoEA/1000000&\"MΩ\"","v":"64MΩ"}]
[{"$f":"\"GBW = \"&GBW&\"MHz\"","v":"GBW = 6MHz"},{"$f":"GBW&\"MHz\"","v":"6MHz"}]
[]
[{"$f":"\"Cslope = \"&Cslope&\"pF\"","v":{"$error":"#NAME?"}},{"$f":"ROUND(Cslope*1,0)&\"pF\"","v":{"$error":"#NAME?"}}]
["Cd",{"$f":"IF(DITHER=1, ROUND(Cdither*1000000000,1)&\"nF\", \"\")","v":"10nF"},{"$f":"IF(DITHER=1, \"Cd\", \"\")","v":"Cd"}]
[{"$f":"\"RFB1 = \"&'Design Regulator'!E67&\"kΩ\"","v":"RFB1 = 49.9kΩ"},{"$f":"IF(VOUT_setting=1, 'Design Regulator'!E67&\"kΩ\", \"\")","v":""},null,{"$f":"'Design Regulator'!J67&\"kΩ\"","v":"kΩ"}]
[{"$f":"\"RFB2 = \"&IF(Vout=Vref,\"OPEN\",'Design Regulator'!E68&\"kΩ\")","v":"RFB2 = 15.8kΩ"},{"$f":"IF(VOUT_setting=1, IF(Vout=Vref,\"OPEN\",Rfb2_u/1000&\"kΩ\"), \"\")","v":""},null,{"$f":"IF(Vout2=Vref,\"OPEN\",Rfb4_u/1000&\"kΩ\")","v":"0kΩ"}]
[{"$f":"CHOOSE(BODE_PLOT_TYPE, \"Crossover Frequency = \"&ROUND('Stability Calculations'!Q4,1)&\" kHz\",  \"Crossover Frequency = \"&ROUND(#REF!,1)&\" kHz\")","v":"Crossover Frequency = 56.6 kHz"},{"$f":"CHOOSE(BODE_PLOT_TYPE, ROUND('Stability Calculations'!Q4,1)&\" kHz\", ROUND(#REF!,1)&\" kHz\")","v":"56.6 kHz"},null,{"$f":"'Stability Calculations'!Q4","v":56.561500000000002}]
[{"$f":"CHOOSE(BODE_PLOT_TYPE, \"Phase Margin = \"&ROUND('Stability Calculations'!Q5,0)&\"°\", \"Phase Margin = \"&ROUND(#REF!,0)&\"°\")","v":"Phase Margin = 51°"},{"$f":"CHOOSE(BODE_PLOT_TYPE, ROUND('Stability Calculations'!Q5,0)&\"°\", ROUND(#REF!,0)&\"°\")","v":"51°"}]
[]
["Full-load/high line efficiency",{"$f":"IF(PLOT_TYPE=1, ROUND('Efficiency Calculations'!AZ109,1)&\"%\", ROUND(#REF!,1)&\"%\")","v":"95.4%"}]
["Half-load/mid-line efficiency",{"$f":"IF(PLOT_TYPE=1, ROUND('Efficiency Calculations'!AZ59,1)&\"%\", ROUND(#REF!,1)&\"%\")","v":"96.7%"}]
["OSC pin setting",{"$f":"IF(VOUT_setting=1, \"\", IF(OSC=1, \"Tie OSC to VDDA\", \"Tie OSC to AGND\"))","v":"Tie OSC to AGND"}]
[]
[{"$f":"\"CDITH = \"&Cdither*1000000000&\"nF\"","v":"CDITH = 10nF"},{"$f":"Cdither*1000000000&\"nF\"","v":"10nF"}]
[{"$f":"\"Rs = \"&Rs&\"Ω\"","v":"Rs = 0.003Ω"},{"$f":"'Standard Value Calculator'!O6&\"Ω\"","v":"Ω"}]
["Rset",{"$f":"'Standard Value Calculator'!O16&\"mΩ\"","v":"3.32mΩ"}]
["Rs",{"$f":"'Standard Value Calculator'!O6&\"mΩ\"","v":"mΩ"}]
[{"$f":"\"Rshunt = \"&ROUND(Rshunt,1)&\"mΩ\"","v":{"$error":"#NAME?"}},{"$f":"IF(Rshunt=\"0\", \"N/A\",ROUND(Rshunt,1)&\"mΩ\")","v":{"$error":"#NAME?"}}]
[]
["Rpgood","20kΩ"]
[]
[]
["Rt",{"$f":"IF(No_RT,\"\", Rfadj&\"kΩ\")","v":"54.9kΩ"},{"$f":"IF(OR((Fsw=440000),(Fsw=2200000)),\"N/A\",Rfadj)","v":54.9},{"$f":"Fsw","v":400000},null,{"$f":"OR((Fsw=440000),(Fsw=2200000))","v":false},null,{"$f":"OR(OR(AND(OSC=1, OR(Fsw/1000>2530, Fsw/1000<1800)), AND(OSC=2, OR(Fsw/1000>500, Fsw/1000<300))), OR((Fsw=440000),(Fsw=2200000)))","v":false}]
["Css",{"$f":"'Standard Value Calculator'!B4*1000000000&\"nF\"","v":"47nF"},{"$f":"IF(MODE=1,\"Css\",\"\")","v":"Css"}]
["Cres",{"$f":"IF(Cres_u = 0, \"N/A\", Cres_u*1000000000 &\"nF\")","v":"47nF"},{"$f":"IF(Cres_u = 0, \"N/A\", Cres_u*1000000 &\"µF\")","v":"0.047µF"},{"$f":"Cres_u","v":4.6999999999999997E-8}]
[]
["Blank out",{"$f":"IF(B76=\"y\",\"\",\"|\")","v":"|"}]
["OUTPUT CURRENT",{"$f":"'Design Regulator'!$E$10&\"A\"","v":"15A"},null,{"$f":"IF(MODE=1,'Design Regulator'!$J$11&\"A\",\"\")","v":"A"}]
["VIN",{"$f":"VIN_nom&\"V\"","v":"13.5V"}]
["VIN range",{"$f":"VIN_min&\"V\"&\"...\"&VIN_max&\"V\"","v":"8V...40V"}]

{"sheet":"Stability Calculations","index":4,"n_rows":687,"n_cols":31,"rows_kept":687,"cut":false,"hidden":true,"merged":[[9,23,9,24],[9,26,9,27],[10,2,10,3],[10,4,10,5],[10,8,10,9],[10,10,10,11],[10,12,10,13],[10,14,10,15],[9,1,10,1],[1,0,1,3],[1,9,1,11],[1,12,1,14],[9,0,11,0],[9,14,9,15],[1,15,1,17],[10,6,10,7],[1,4,1,6],[9,2,9,7],[9,8,9,13],[9,16,9,18]]}
[]
["Divider Network & EA Poles/Zeros",null,null,null,"Modulator",null,null,null,null,"Power Stage Poles/Zeros",null,null,"Complex Pole Pair",null,null,"Total System"]
[null,"Afb1",{"$f":"Afb","v":0.24},"V/V","Acs",{"$f":"Acs","v":27.777777777777775},"A/V","gm",{"$f":"gm","v":1.1999999999999999E-3},"z_ESR",{"$f":"Fesr","v":1872411.0973383102},"Hz","p3",{"$f":"Fsw/2","v":200000},"Hz","Adc",{"$f":"Am*Afb*AEA","v":134823.4560471655},"V/V"]
[null,"EA zero, z1",{"$f":"Fz1_u","v":5822.1738101315623},"Hz","Am",{"$f":"Am","v":7.3146406275588918},"V/V",null,null,"p_dom",{"$f":"Fp_dominant","v":7110.5912127177653},"Hz","pterm1",{"$f":"Q*pole3","v":133035.07835182533},null,"Crossover",{"$f":"AE7","v":56.561500000000002},"kHz"]
[null,"EA pole, p1",{"$f":"Fp1_u","v":0.36568232302797354},"Hz","Q",{"$f":"Q","v":0.66517539175912666},null,null,null,null,null,null,"pterm2",{"$f":"pole3^2","v":40000000000},null,"Phase Margin",{"$f":"AE9","v":51.378588788774124},"°"]
[null,"Aea",{"$f":"AEA","v":76800},"V/V","mc",{"$f":"mc","v":1.570409982174688},null,null,null,null,null,null,null,null,null,"radconv",{"$f":"180/Pi","v":57.295779578552292},null,null,null,null,null,null,null,null,null,null,null,null,"XOVER SEARCH"]
[null,"EA pole, p2",{"$f":"Fp2_u","v":186897.97069030782},"Hz","k",{"$f":"k","v":0.97853527128492923},null,null,null,null,null,null,null,null,null,null,null,null,null,null,null,null,null,null,null,null,null,null,null,"xover",{"$f":"SUM(AD12:AD613)/1000","v":56.561500000000002}]
[]
[null,null,null,null,null,null,null,null,null,null,null,null,null,null,null,null,null,null,null,null,null,null,null,null,null,null,null,null,null,"phase margin",{"$f":"SUM(AE13:AE613)","v":51.378588788774124}]
["Freq (Hz)",null,"Power Stage",null,null,null,null,null,"Error Amplifier",null,null,null,null,null,"Sampling Double Pole",null,"System Response",null,null,null,null,null,null,"ERROR AMP Response",null,null,"PLANT Response"]
[null,null,"p_dom",null,"z_ESR",null,"z_RHP",null,"p1",null,"z1",null,"p2",null,"p3"]
[null,null,"Gain(V/V)","Phase(rad)","Gain(V/V)","Phase(rad)","Gain(V/V)","Phase(rad)","Gain(V/V)","Phase(rad)","Gain(V/V)","Phase(rad)","Gain(V/V)","Phase(rad)","Gain(V/V)","Phase(rad)","Gain (dB)","Phase (°)","Phase Margin (°)",null,null,"Fsquare",null,"Gain(dB)","Phase(Deg)",null,"Gain(dB)","Phase(Deg)"]
[1,{"$f":"A13/1000","v":1E-3},{"$f":"SQRT(1+(A13/pole1)^2)","v":1.0000000098891413},{"$f":"ATAN(A13/pole1)","v":1.4063528101835931E-4},{"$f":"SQRT(1+(A13/Zero1)^2)","v":1.0000000000001426},{"$f":"ATAN(A13/Zero1)","v":5.3407075049994922E-7},{"$f":"IF(VIN_nom>Vout, 1, SQRT(1+(A13/z_RHP)^2))","v":1},{"$f":"IF(VIN_nom>Vout, 0, -ATAN(A13/z_RHP))","v":0},{"$f":"SQRT(1+(A13/Pole2)^2)","v":2.9117200633694691},{"$f":"ATAN(A13/Pole2)","v":1.2202194965484192},{"$f":"SQRT(1+(A13/Zero2)^2)","v":1.0000000147502599},{"$f":"ATAN(A13/Zero2)","v":1.7175715167182492E-4},{"$f":"SQRT(1+(A13/pole4)^2)","v":1.0000000000143139},{"$f":"ATAN(A13/pole4)","v":5.3505128830289407E-6},{"$f":"SQRT((1-(V13/pterm2))^2+(A13/pterm1)^2)","v":1.0000000000032512},{"$f":"IF((ATAN((A13/pterm1)/(1-A13^2/pterm2))>0),ATAN((A13/pterm1)/(1-A13^2/pterm2)),PI()+ATAN((A13/pterm1)/(1-A13^2/pterm2)))","v":7.5168144552187964E-6},{"$f":"20*LOG10(((E13*K13*G13)/(C13*I13*O13*M13))*Adc)","v":93.312316773956468},{"$f":"((F13+L13+H13)-(D13+J13+P13+N13))*radconv","v":-69.912350803400187},{"$f":"IF(R13>0,R13,R13+180)","v":110.08764919659981},null,{"$f":"IF(Q13<0,A13,1000000000)","v":1000000000},{"$f":"A13^2","v":1},null,{"$f":"20*LOG10((K13/(I13*M13))*AEA)","v":88.424232148620447},{"$f":"(L13-(J13+N13))*radconv","v":-69.903892913593822},null,{"$f":"20*LOG10((E13*G13/(C13*O13))*Acs*Am)","v":46.157809775758132},{"$f":"(F13+H13-(D13+P13))*radconv","v":-8.4578898063547691E-3},null,{"$f":"SUM((Q14<0)*(Q13>0))*A13","v":0},{"$f":"IF(AD13>0,S11,0)","v":0}]
[1.0965,{"$f":"A14/1000","v":1.0965E-3},1.0000000118898356,1.5420658543095081E-4,1.0000000000001714,5.8560857792318316E-7,1,0,3.1608587031659945,1.24889613031983,1.0000000177344179,1.8833171643348163E-4,1.0000000000172098,5.8668373762299071E-6,1.0000000000039089,8.2421870501576928E-6,92.599207513994003,-71.555297007981494,108.44470299201851,null,{"$f":"IF(Q14<0,A14,1000000000)","v":1000000000},{"$f":"A14^2","v":1.2023122500000001},null,87.711122906041282,-71.546022931820602,null,46.157809758374867,-9.2740761608839876E-3,null,{"$f":"SUM((Q15<0)*(Q14>0))*A14","v":0},0]
[1.2022999999999999,1.2022999999999999E-3,1.0000000142950038,1.6908579787172753E-4,1.0000000000002061,6.4211326332606184E-7,1,0,3.4365393224134335,1.2755344400444537,1.0000000213218734,2.065036225503271E-4,1.0000000000206912,6.432921639238345E-6,1.0000000000046998,9.0374660195343837E-6,91.872882819417271,-73.081445835745342,106.91855416425466,null,1000000000,1.4455252899999997,null,86.984798232362138,-73.07127691485961,null,46.157809737477265,-1.0168920885726051E-2,null,0,0]
[1.3183,1.3183000000000001E-3,1.0000000171864858,1.8539949006455379E-4,1.0000000000002478,7.0406547038403368E-7,1,0,3.7411662882062666,1.3002101562061963,1.0000000256346959,2.2642745140594341E-4,1.0000000000248765,7.0535811336473836E-6,1.0000000000056504,9.9094164963600272E-6,91.135168940072646,-74.495135354948886,105.50486464505111,null,1000000000,1.7379148900000001,null,86.247084378140499,-74.483985318868847,null,46.157809712354279,-1.115003608004219E-2,null,0,0]
[1.4454,1.4454000000000001E-3,1.0000000206602075,2.0327423372428307E-4,1.000000000000298,7.7194586277254677E-7,1,0,4.0771478157752137,1.3229986543404901,1.0000000308159644,2.4825778436749824E-4,1.0000000000299045,7.7336313210496492E-6,1.0000000000067923,1.0864803613646215E-5,90.388180060700989,-75.800683296800244,104.19931670319976,null,1000000000,2.0891811599999999,null,85.500095528950681,-75.788458262957761,null,46.157809682172434,-1.2225033842477384E-2,null,0,0]
[1.5849,1.5849E-3,1.0000000248406129,2.2289285466428022E-4,1.0000000000003584,8.4644873246724796E-7,1,0,4.4479583824062603,1.3440357170853923,1.0000000370512951,2.7221790563751458E-4,1.0000000000359555,8.4800278681902199E-6,1.0000000000081668,1.1913399230187328E-5,89.632094915765379,-77.005868033941724,102.99413196605828,null,1000000000,2.51190801,null,84.744010420337034,-76.992463124514913,null,46.157809645850485,-1.3404909426803011E-2,null,0,0]
[1.7378,1.7378000000000001E-3,1.0000000298647003,2.4439598809907381E-4,1.0000000000004308,9.2810815021863358E-7,1,0,4.8562867374708416,1.3633939453495314,1.0000000445450292,2.9847957224654408E-4,1.0000000000432276,9.2981212879484649E-6,1.0000000000098186,1.3062720160441917E-5,88.869222807645627,-78.114848215526209,101.88515178447379,null,1000000000,3.0199488400000001,null,83.98113835586966,-78.100150094807205,null,46.157809602198093,-1.4698120719016029E-2,null,0,0]
[1.9055,1.9055000000000001E-3,1.0000000359067815,2.6798052333233647E-4,1.0000000000005178,1.0176718150773989E-6,1,0,5.3058938310014918,1.3811926808331947,1.0000000535571634,3.2728324404342961E-4,1.0000000000519731,1.019540229835568E-5,1.000000000011805,1.4323289944651769E-5,88.100138151464634,-79.134460110200479,100.86553988979952,null,1000000000,3.63093025,null,83.212053752186023,-79.118343601440785,null,46.157809549700758,-1.6116508759703125E-2,null,0,0]
[2.0893000000000002,2.0893000000000001E-3,1.0000000431678262,2.9382928611282333E-4,1.0000000000006226,1.115834019019187E-6,1,0,5.8002819997211219,1.3975252002717697,1.000000064387456,3.5885220511299912E-4,1.0000000000624831,1.1178826566153385E-5,1.0000000000141922,1.5704880441614496E-5,87.326327121020668,-80.070046681779857,99.929953318220143,null,1000000000,4.3651744900000002,null,82.438242784830493,-80.052375612980924,null,46.157809486612294,-1.7671068798933987E-2,null,0,0]
[2.2909000000000002,2.2909000000000002E-3,1.0000000519004153,3.2218135626145989E-4,1.0000000000007485,1.2235026823198396E-6,1,0,6.3440371247387386,1.4125078278542402,1.0000000774126474,3.9347844232745158E-4,1.000000000075123,1.2257489963234089E-5,1.0000000000170632,1.7220270235911808E-5,86.547995017301247,-80.92827098529925,99.07172901470075,null,1000000000,5.2482228100000006,null,81.659910756985226,-80.908894806058854,null,46.157809410738153,-1.9376179240395579E-2,null,0,0]
[2.5118999999999998,2.5118999999999996E-3,1.0000000623969352,3.5326175002402005E-4,1.0000000000008997,1.3415323181801452E-6,1,0,6.9414852545326218,1.426231926109945,1.0000000930688491,4.3143676675811132E-4,1.0000000000903162,1.3439953310199418E-5,1.0000000000205143,1.8881486230682241E-5,85.766261268439919,-81.714365985697739,98.285634014302261,null,1000000000,6.309641609999999,null,80.878177099324162,-81.693120613001639,null,46.157809319537876,-2.124537269609858E-2,null,0,0]
[2.7542,2.7542000000000001E-3,1.0000000750152416,3.8733767416357053E-4,1.0000000000010818,1.4709376610260392E-6,1,0,7.5977701600342122,1.4387957637525175,1.0000001118898252,4.7305351649973195E-4,1.0000000001085805,1.473638258151221E-5,1.0000000000246627,2.0702810373404265E-5,84.981586399323987,-82.433960020178148,97.566039979821852,null,1000000000,7.5856176399999997,null,80.093502339843909,-82.410665301037,null,46.157809209902219,-2.3294719141156245E-2,null,0,0]
[3.02,3.0200000000000001E-3,1.00000009019292,4.2471852593777698E-4,1.0000000000013007,1.6128936665086015E-6,1,0,8.3188573998859443,1.4502961056345862,1.000000134528261,5.187065566291556E-4,1.0000000001305493,1.6158548905495272E-5,1.0000000000296527,2.2700779655897375E-5,84.194035900078191,-83.092594938106359,96.907405061893641,null,1000000000,9.1204000000000001,null,79.305951972471178,-83.067052112193863,null,46.157809078029146,-2.5542825912484173E-2,null,0,0]
[3.3113000000000001,3.3113000000000001E-3,1.0000001084315375,4.6568557544291188E-4,1.0000000000015636,1.7684684761288067E-6,1,0,9.1101773360252274,1.4608073468867402,1.0000001617322747,5.6873940060127271E-4,1.0000000001569487,1.7717153307889011E-5,1.0000000000356488,2.4890427707095287E-5,83.404772955122581,-83.694531113491649,96.305468886508351,null,1000000000,10.964707690000001,null,78.51668918598395,-83.666524504728628,null,46.15780891956075,-2.8006608763010084E-2,null,0,0]
[3.6307999999999998,3.6308E-3,1.0000001303656594,5.1061853730976375E-4,1.0000000000018801,1.9391040809129696E-6,1,0,9.9790678144539999,1.4704180857305771,1.0000001944483592,6.2361579158168149E-4,1.0000000001886971,1.9426642173443023E-5,1.0000000000428604,2.7292049926058488E-5,82.613510187349547,-84.244841943966932,95.755158056033068,null,1000000000,13.182708639999998,null,77.725426608788155,-84.214133040007695,null,46.157808728983518,-3.0708903959233431E-2,null,0,0]
[3.9811000000000001,3.9811000000000004E-3,1.0000001567345422,5.5988306245135567E-4,1.0000000000022604,2.1261890648123463E-6,1,0,10.93260262244404,1.4791987670255924,1.00000023377916,6.8378229667531438E-4,1.0000000002268647,2.1300926835608166E-5,1.0000000000515294,2.9925190030411422E-5,81.820838525032059,-84.747560823791247,95.252439176208753,null,1000000000,15.849157210000001,null,76.932755175579842,-84.713889121823428,null,46.157808499874349,-3.3671701967806625E-2,null,0,0]
[4.3651999999999997,4.3651999999999996E-3,1.0000001884372827,6.1390105562741471E-4,1.0000000000027174,2.3313256400783762E-6,1,0,11.97894989178821,1.487219289965916,1.0000002810657351,7.4975418536375792E-4,1.0000000002727527,2.3356058832973857E-5,1.0000000000619524,3.2812398463573901E-5,81.026934948478015,-85.206689452310272,94.793310547689728,null,1000000000,19.054971039999998,null,76.138851874478831,-85.169769075914189,null,46.157808224421331,-3.6920376396081721E-2,null,0,0]
[4.7862999999999998,4.7862999999999994E-3,1.0000002265470254,6.7312254831330325E-4,1.0000000000032672,2.5562228331125824E-6,1,0,13.126828342356058,1.4945425861954338,1.0000003379087445,8.2208107793854245E-4,1.0000000003279146,2.5609159806687386E-5,1.0000000000744818,3.5977729031873788E-5,80.232113954220651,-85.625830102361135,94.374169897638865,null,1000000000,22.908667689999998,null,75.344031211342454,-85.585348109951283,null,46.157807893300323,-4.0481992409859884E-2,null,0,0]
[5.2481,5.2481000000000003E-3,1.0000002723721664,7.3806788915892533E-4,1.000000000003928,2.8028567056917102E-6,1,0,14.386325042879124,1.5012297740537164,1.0000004062597405,9.0139847241821141E-4,1.000000000394244,2.8080026654311888E-5,1.0000000000895477,3.9448993948889867E-5,79.436312901206534,-86.008480613864364,93.991519386135636,null,1000000000,27.542553609999999,null,74.548230556485478,-85.964092769771227,null,46.157807495143189,-4.4387844093148804E-2,null,0,0]
[5.7544000000000004,5.7544000000000007E-3,1.0000003274602616,8.0927148975788092E-4,1.0000000000047224,3.0732567266675249E-6,1,0,15.767804934231904,1.5073333668204236,1.0000004884269962,9.8835904147190107E-4,1.0000000004739809,3.0788991324666612E-5,1.000000000107659,4.3254757109675663E-5,78.639885733306457,-86.357645685501296,93.642354314498704,null,1000000000,33.113119360000006,null,73.751803867224794,-86.308975614215839,null,46.157807016503803,-4.8670071285454537E-2,null,0,0]
[6.3095999999999997,6.3095999999999994E-3,1.0000003936970412,8.8735214206493631E-4,1.0000000000056777,3.3697728073420451E-6,1,0,17.283274448467811,1.512904588917473,1.0000005872231925,1.0837185105888828E-3,1.0000000005698551,3.375959607425617E-5,1.0000000001294356,4.742809249799818E-5,77.842790259854851,-86.676255523977147,93.323744476022853,null,1000000000,39.811052159999996,null,72.954708969279181,-86.622889635463224,null,46.157806440997803,-5.3365888513906036E-2,null,0,0]
[6.9183000000000003,6.9183000000000005E-3,1.0000004733226191,9.7295676406883075E-4,1.0000000000068261,3.6948616731673366E-6,1,0,18.945290226045433,1.5179882187090985,1.0000007059895932,1.188266954826633E-3,1.0000000006851089,3.7016453262105494E-5,1.0000000001556142,5.2003577460566571E-5,77.04528587174012,-86.966870788843423,93.033129211156577,null,1000000000,47.862874890000008,null,72.157205273000528,-86.908356587018403,null,46.15780574916171,-5.8514201825026986E-2,null,0,0]
[7.5857999999999999,7.5858000000000002E-3,1.0000005690641594,1.0668307170523567E-3,1.0000000000082068,4.051353899120734E-6,1,0,20.768323974653871,1.5226274513147746,1.0000008487939278,1.3029146766936669E-3,1.0000000008236896,4.0587920606180348E-5,1.0000000001870912,5.7021051114278739E-5,76.247282534224667,-87.231960672919129,92.768039327080871,null,1000000000,57.544361639999998,null,71.359202767346531,-87.167800835211295,null,46.157804917300275,-6.4159837707843073E-2,null,0,0]
[8.3176000000000005,8.3176000000000014E-3,1.0000006841549824,1.169747487584472E-3,1.0000000000098666,4.4421868743295814E-6,1,0,22.767397233975817,1.5268597362603533,1.0000010204588865,1.4286063269044755E-3,1.0000000009902774,4.4503425926925711E-5,1.0000000002249294,6.2521855939012166E-5,75.449044323283943,-87.473664955539164,92.526335044460836,null,1000000000,69.182469760000004,null,70.560965556385597,-87.40331564141124,null,46.157803917320479,-7.0349314127930565E-2,null,0,0]
[9.1201000000000008,9.1201000000000008E-3,1.0000008225410908,1.2826071315401055E-3,1.0000000000118623,4.870778651596532E-6,1,0,24.959993240480514,1.5307214875920643,1.0000012268701661,1.5664411331526224E-3,1.0000000011905839,4.8797212506246446E-5,1.0000000002704268,6.855409954777628E-5,74.650423343310038,-87.694063118683999,92.305936881316001,null,1000000000,83.176224010000013,null,69.762345778795108,-87.616926357672497,null,46.157802714937063,-7.7136761011498842E-2,null,0,0]
[10,0.01,1.0000009889136374,1.4063518922816612E-3,1.0000000000142615,5.3407075049492229E-6,1,0,27.36441800482573,1.5342443815405113,1.0000014750248987,1.7175698446358924E-3,1.0000000014313994,5.3505128779741852E-5,1.000000000325125,7.5168144598071915E-5,73.851589001797294,-87.894962864687557,92.105037135312443,null,1000000000,100,null,68.963512882828894,-87.810384019213288,null,46.157801269390532,-8.4578845474272746E-2,null,0,0]
[10.965,1.0964999999999999E-2,1.0000011889828615,1.5420646442072072E-3,1.0000000000171467,5.8560857791655576E-6,1,0,30.001712853402573,1.5374587216534643,1.00000177344024,1.8833149599702804E-3,1.0000000017209889,5.8668373695660436E-5,1.0000000003909018,8.242187056206737E-5,73.05239316812883,-88.078092170642293,91.921907829357707,null,1000000000,120.23122499999999,null,68.164318787484007,-87.985351478363725,null,46.157799531066956,-9.2740692278554832E-2,null,0,0]
[12.023,1.2022999999999999E-2,1.0000014294993576,1.6908563834458236E-3,1.0000000000206155,6.4211326331732508E-6,1,0,32.893468218620214,1.5403904694374122,1.0000021321850938,2.0650333195015988E-3,1.000000002069124,6.4329216304534072E-5,1.0000000004699763,9.0374660275088103E-5,72.253121853445478,-88.2449300179495,91.7550699820505,null,1000000000,144.55252899999999,null,67.365049562554375,-88.143240900489971,null,46.157797441313242,-0.10168911745951306,null,0,0]
[13.183,1.3183E-2,1.0000017186471084,1.8539927976485237E-3,1.0000000000247855,7.0406547037251643E-6,1,0,36.064283156623326,1.5430645073991727,1.0000025634663394,2.2642706831679702E-3,1.0000000024876503,7.0535811220664673E-5,1.0000000005650396,9.9094165068724664E-5,71.453770339234396,-88.396892382067094,91.603107617932906,null,1000000000,173.79148899999998,null,66.565700560634269,-88.285392141753505,null,46.157794929022259,-0.1115002403135983,null,0,0]
[14.454000000000001,1.4454E-2,1.0000020660186275,2.0327395654557378E-3,1.0000000000297951,7.7194586275736661E-6,1,0,39.538758594170091,1.5455019908717522,1.0000030815917533,2.4825727944936264E-3,1.0000000029904526,7.7336313057857909E-5,1.0000000006792449,1.0864803627501802E-4,70.654857310081027,-88.535181687548047,91.464818312451953,null,1000000000,208.91811600000003,null,65.766790549654331,-88.412931507927013,null,46.157791910848829,-0.12225017962101889,null,0,0]
[15.849,1.5848999999999999E-2,1.00000248405823,2.2289248923689263E-3,1.0000000000358238,8.4644873244723481E-6,1,0,43.352432194304988,1.5477275241965349,1.0000037051227264,2.7221723996276007E-3,1.0000000035955436,8.4800278480666168E-5,1.0000000008166841,1.1913399248454295E-4,69.855050326936151,-88.661193667207314,91.338806332792686,null,1000000000,251.19080099999999,null,64.966987198688471,-88.527144782303267,null,46.15778827866982,-0.13404888490403727,null,0,0]
[17.378,1.7378000000000001E-2,1.0000029864656095,2.4439550637914767E-3,1.0000000000430691,9.2810815019225151E-6,1,0,47.532642338223937,1.549756600557062,1.0000044544930957,2.9847869472967325E-3,1.0000000043227528,9.2981212614207676E-5,1.0000000009818608,1.3062720184522125E-4,69.055482669593104,-88.775805253164364,91.224194746835636,null,1000000000,301.99488400000001,null,64.167423906560316,-88.628824321965567,null,46.157783913454928,-0.14698093119878528,null,0,0]
[19.055,1.9054999999999999E-2,1.0000035906717697,2.6797988826207887E-3,1.0000000000517828,1.0176718150426182E-5,1,0,52.117664323969557,1.5516077967212136,1.0000053557021322,3.2728208717896488E-3,1.0000000051973112,1.019540226338315E-4,1.0000000011805061,1.432328997639767E-4,68.255625500160463,-88.880065748986453,91.119934251013547,null,1000000000,363.09302500000001,null,63.367571986828153,-88.71890102523966,null,46.157778663754442,-0.16116472374678525,null,0,{"$f":"IF(AD45>0,S43,0)","v":0}]
[20.893000000000001,2.0893000000000002E-2,1.0000043167734001,2.9382844897503754E-3,1.0000000000622542,1.1158340189733399E-5,1,0,57.143040937885743,1.5532954897382767,1.00000643872508,3.5885068015646723E-3,1.0000000062483081,1.1178826520053206E-4,1.0000000014192272,1.5704880483461388E-4,67.456060513132059,-88.974784909856268,91.025215090143732,null,1000000000,436.51744900000006,null,62.568013308595994,-88.79807470148755,null,46.15777235495819,-0.17671020836872214,null,0,0]
[22.909000000000002,2.2909000000000002E-2,1.0000051900282072,3.2218025265948421E-3,1.0000000000748479,1.2235026822593992E-5,1,0,62.655252804584038,1.5548352953476452,1.0000077412350645,3.934764319724126E-3,1.000000007512303,1.2257489902459985E-4,1.0000000017063284,1.7220270291078786E-4,66.656181459071547,-89.060839158550081,90.939160841449919,null,1000000000,524.82228100000009,null,61.768141841878659,-88.867077998431839,null,46.157764767615028,-0.19376116011824335,null,0,0]
[25.119,2.5118999999999999E-2,1.0000062396742537,3.5326029523317995E-3,1.0000000000899854,1.3415323181004711E-5,1,0,68.698047671599696,1.5562393582590635,1.0000093068420317,4.3143411666837659E-3,1.0000000090316172,1.3439953230085639E-4,1.0000000020514221,1.8881486303404582E-4,65.856447756698572,-89.138907121213094,90.861092878786906,null,1000000000,630.96416099999999,null,60.968417259429266,-88.926454227744159,null,46.157755647691445,-0.21245289346894519,null,0,0]
[27.542000000000002,2.7542000000000001E-2,1.0000075014963055,3.8733575646971029E-3,1.0000000001081828,1.4709376609210134E-5,1,0,75.323377118067611,1.5575198458887434,1.000011188920547,4.7305002317488201E-3,1.0000000108580485,1.4736382475906697E-4,1.0000000024662739,2.0702810469266431E-4,65.056745358510696,-89.209665498617767,90.790334501382233,null,1000000000,758.56176400000004,null,60.168725824658466,-88.976719405908852,null,46.157744684274363,-0.23294609270890046,null,0,0]
[30.2,3.0199999999999998E-2,1.000009019251725,4.247159977292839E-3,1.0000000001300713,1.6128936663701393E-5,1,0,82.591396912533881,1.5586882323428535,1.0000134527365196,5.1870195117791444E-3,1.0000000130549351,1.6158548766269059E-4,1.00000000296527,2.2700779782278328E-4,64.256651249590192,-89.273748042507663,90.726251957492337,null,1000000000,912.04,null,59.368644902829232,-89.018321231867105,null,46.157731497183086,-0.25542681064056655,null,0,0]
[33.113,3.3112999999999997E-2,1.0000108430955401,4.6568224281609691E-3,1.000000000156374,1.7684684759462883E-5,1,0,90.556794937667547,1.5597533087012725,1.0000161730979928,5.6873332980700627E-3,1.0000000156948758,1.7717153124363787E-4,1.0000000035649008,2.4890427873688144E-4,63.456934377142218,-89.331636936502619,90.668363063497381,null,1000000000,1096.470769,null,58.568943876909913,-89.051572758231487,null,46.157715650654445,-0.28006417827114205,null,0,0]
[36.308,3.6308E-2,1.0000130364818234,5.1061414394843602E-3,1.0000000001880063,1.9391040806723578E-5,1,0,99.293400810664011,1.5607249937825611,1.0000194446487698,6.2360778853802002E-3,1.0000000188697211,1.9426641931503315E-4,1.0000000042860282,2.7292050145676414E-4,62.656956860370485,-89.383871450995855,90.616128549004145,null,1000000000,1318.2708640000001,null,57.768985417410768,-89.076784928488181,null,46.15769659338185,-0.30708652250768159,null,0,0]
[39.811,3.9810999999999999E-2,1.0000156733326298,5.5987727086129003E-3,1.0000000002260339,2.1261890644951564E-5,1,0,108.87231057540311,1.5616111257444831,1.0000233776454923,6.8377174660399177E-3,1.000000022686474,2.1300926516667842E-4,1.0000000051529576,2.9925190319925752E-4,61.857026990277475,-89.430872728728801,90.569127271271199,null,1000000000,1584.9157210000001,null,56.969078457583826,-89.094159027221352,null,46.157673683115775,-0.33671370150744945,null,0,0]
[43.652000000000001,4.3652000000000003E-2,1.0000188435524997,6.1389342079821996E-3,1.000000000271754,2.331325639660236E-5,1,0,119.37555885103652,1.5624193046852575,1.0000281061824778,7.497402776390224E-3,1.0000000272752738,2.3356058412525552E-4,1.0000000061952481,3.2812398845230892E-4,61.057080921308504,-89.473043979124867,90.526956020875133,null,1000000000,1905.497104,null,56.16915993297566,-89.103844589380046,null,46.157646138754977,-0.36919938974482353,null,0,0]
[47.863,4.7863000000000003E-2,1.0000226544484836,6.7311248398885838E-3,1.0000000003267138,2.5562228325613818E-5,1,0,130.89064990658511,1.5631562873486331,1.0000337903092671,8.220627446487357E-3,1.0000000327914529,2.5609159252444776E-4,1.0000000074481816,3.5977729534980997E-4,60.257233005369329,-89.510737953975337,90.489262046024663,null,1000000000,2290.8667689999997,null,55.369345127777095,-89.105923796021301,null,46.157613028014374,-0.40481415795402381,null,0,0]
[52.481000000000002,5.2481E-2,1.000027236849419,7.380546216687954E-3,1.0000000003928002,2.8028567049650752E-5,1,0,143.51876122631879,1.5638285402617913,1.0000406251571083,9.0137430427072226E-3,1.000000039424394,2.8080025923666804E-4,1.0000000089547745,3.9448994612124345E-4,59.45725143792,-89.544285416294969,90.455714583705031,null,1000000000,2754.255361,null,54.569403374075776,-89.100414576694945,null,46.157573214266357,-0.44387083960000934,null,0,0]
[57.544000000000004,5.7544000000000005E-2,1.0000327454953704,8.0925400016458662E-3,1.0000000004722454,3.0732567257096462E-5,1,0,157.36380538230131,1.5644415825888538,1.000048841518804,9.8832718241800132E-3,1.0000000473980981,3.0788990361502487E-4,1.0000000107659055,4.3254757983976564E-4,58.657351429822725,-89.573961800188528,90.426038199811472,null,1000000000,3311.3119360000005,null,53.76955122707556,-89.087271107631338,null,46.157525353169298,-0.48669069255720859,null,0,0]
[63.095999999999997,6.3095999999999999E-2,1.0000393689369111,8.8732908619222686E-3,1.0000000005677683,3.3697728060793002E-5,1,0,172.54610272650618,1.565000741833229,1.0000587206124318,1.083676512162688E-2,1.0000000569855148,3.375959480454297E-4,1.0000000129435724,4.7428093650565383E-4,57.85737349984754,-89.600025137378211,90.399974862621789,null,1000000000,3981.1052159999995,null,52.969630843593585,-89.066379461620059,null,46.157467806676095,-0.53364567575814859,null,0,0]
[69.183000000000007,6.9183000000000008E-2,1.0000473311529896,9.7292637131426978E-3,1.0000000006826,3.6948616715027421E-5,1,0,189.19144318628489,1.5655106508701904,1.0000705964923204,1.1882115918472673E-2,1.0000000685108883,3.7016451588325709E-4,1.000000015561423,5.2003578979920452E-4,57.057480653945937,-89.622691555408693,90.377308444591307,null,1000000000,4786.2874890000012,null,52.169807175365143,-89.037566950052593,null,46.157398629002927,-0.58512460535608812,null,0,0]
[75.858000000000004,7.5858000000000009E-2,1.0000569048130412,1.0667906515108088E-2,1.0000000008206733,4.0513538969263415E-5,1,0,207.44475908448081,1.5659757476806255,1.0000848758268444,1.3028416943288754E-2,1.0000000823689617,4.0587918399678465E-4,1.0000000187091194,5.7021053117204822E-4,56.257501832528938,-89.642158545652293,90.357841454347707,null,1000000000,5754.4361640000006,null,51.369911531510361,-89.000583123289388,null,46.157315451440716,-0.64157542236290777,null,0,0]
[83.176000000000002,8.3176E-2,1.000068413181463,1.1696946728758846E-2,1.0000000009866512,4.4421868714368744E-5,1,0,227.45645227375934,1.5663998666747827,1.0001020407345527,1.4285101216428809E-2,1.0000000990277411,4.4503423018257235E-4,1.0000000224929637,6.2521858579321654E-4,55.457634905188648,-89.6585869476704,90.3414130523296,null,1000000000,6918.2469760000004,null,50.570144589749461,-88.955124065475673,null,46.157215465861327,-0.70346288219473163,null,0,0]
[91.201000000000008,9.1201000000000004E-2,1.0000822507603098,1.2825375086074607E-2,1.0000000011862242,4.8707786477831604E-5,1,0,249.40153619511509,1.5667867176531272,1.0001226795667382,1.5663143117155467E-2,1.0000001190583905,4.8797208671833166E-4,1.0000000270426892,6.8554103028419661E-4,54.657676493374019,-89.672120887939656,90.327879112060344,null,1000000000,8317.6224010000005,null,49.7703063983489,-88.900793166830269,null,46.157095245447259,-0.77132772110941084,null,0,0]
[100,0.1,1.0000988865233673,1.4062601129785513E-2,1.0000000014261579,5.3407074999222062E-5,1,0,273.46322837683874,1.5671395198646003,1.000147491721749,1.7174026659873678E-2,1.0000001431399304,5.3505123724986899E-4,1.0000000325125284,7.5168149186465992E-4,53.857750994601346,-89.682873302480161,90.317126697519839,null,1000000000,10000,null,48.970525428318922,-88.837137430772813,null,46.156950716704571,-0.84573587170735554,null,0,0]
[109.65,0.10965000000000001,1.0001188912892669,1.5419436512379685E-2,1.0000000017146871,5.8560857725382651E-5,1,0,299.85209256198652,1.5674613430529314,1.0001773284585762,1.8830945704118585E-2,1.0000001720988891,5.8668367031798369E-4,1.0000000390902188,8.2421876611109323E-4,53.057673116607432,-89.690937995790534,90.309062004209466,null,1000000000,12023.122500000001,null,48.170621345222415,-88.763600393400296,null,46.15677692180715,-0.92733760239023055,null,0,0]
[120.23,0.12023,1.0001429398220378,1.6906968836576029E-2,1.0000000020615472,6.4211326244365222E-5,1,0,328.78416194357328,1.5677548130678021,1.0002131960104241,2.0647427936579598E-2,1.0000002069123828,6.4329207519597819E-4,1.000000046997702,9.0374668249509926E-4,52.257699278907396,-89.696381436296036,90.303618563703964,null,1000000000,14455.252900000001,null,47.37085642875229,-88.679581643773986,null,46.156568000577245,-1.0167997925220562,null,0,0]
[131.83000000000001,0.13183,1.0001718500922923,1.8537825413038691E-2,1.0000000024785409,7.040654692207801E-5,1,0,360.50555052607797,1.5680224408423806,1.0002563141140501,2.2638877118111279E-2,1.000000248765003,7.0535799639751451E-4,1.0000000565040468,9.9094175581161247E-4,51.45780085553433,-89.699252008902903,90.300747991097097,null,1000000000,17379.148900000004,null,46.571209156227724,-88.584370067748921,null,46.156316849728746,-1.1148819411539812,null,0,0]
[144.54,0.14454,1.0002065807383715,2.0324624554380874E-2,1.000000002979502,7.7194586123935729E-5,1,0,395.26237250313358,1.5682663590156278,1.0003081121835982,2.4820680629715257E-2,1.0000002990452224,7.733629779400487E-4,1.0000000679246319,1.0864805013059916E-3,50.658478152279841,-89.69957684679926,90.30042315320074,null,1000000000,20891.811599999997,null,45.77218815730965,-88.477233814986619,null,46.156015145392331,-1.2223430318126465,null,0,0]
[158.49,0.15849000000000002,1.0002483752863878,2.2285595738610529E-2,1.0000000035823773,8.4644873044591764E-5,1,0,433.41012645781728,1.5684890413250474,1.000370444344546,2.7215070206560082E-2,1.0000003595542986,8.4800258357070201E-4,1.0000000816685974,1.1913401075149743E-3,49.85838417654665,-89.697360235906132,90.302639764093868,null,1000000000,25119.080100000003,null,44.972457235989161,-88.357080688475122,null,46.155652090979622,-1.3402795474310023,null,0,0]
[173.78,0.17377999999999999,1.0002986024251825,2.4434735164113309E-2,1.0000000043069237,9.2810814755403946E-5,1,0,475.22227301059019,1.5686920467668071,1.0004453511328835,2.9839098991484413E-2,1.0000004322752041,9.2981186086523815E-4,1.0000000981863602,1.3062722592540933E-3,49.058642966253807,-89.692587014444385,90.307412985555615,null,1000000000,30199.488400000002,null,44.173152310977287,-88.223053594969983,null,46.155215805698646,-1.4695334194744056,null,0,0]
[190.55,0.19055000000000002,1.0003590033799046,2.6791640858352946E-2,1.0000000051782796,1.0176718115645574E-4,1,0,521.08165718877206,1.568877240601745,1.0005354283056678,3.2716647501818817E-2,1.0000005197310051,1.0195398766132434E-3,1.0000001180510167,1.4323293150985089E-3,48.258719626474118,-89.68521761546333,90.31478238453667,null,1000000000,36309.302500000005,null,43.373753599753059,-88.073934071553509,null,46.154691177143185,-1.6112835439098379,null,0,0]
[208.93,0.20893,1.0004315851388679,2.9374477853026187E-2,1.0000000062254277,1.1158340143886208E-4,1,0,571.34377809064176,1.5690460661831318,1.0006436674269708,3.586983022087506E-2,1.0000006248306219,1.1178821910038975E-3,1.0000001419233113,1.5704884668146333E-3,47.459193593657993,-89.675200313732347,90.324799686267653,null,1000000000,43651.744900000005,null,42.574857953232268,-87.908577602378486,null,46.154060790847858,-1.766622711353858,null,0,0]
[229.09,0.22909000000000002,1.0005188695547202,3.2206996113692404E-2,1.0000000074847941,1.2235026762153398E-4,1,0,626.47351931317382,1.5692000894539173,1.0007738270985957,3.9327558299554151E-2,1.0000007512300189,1.2257483825054919E-3,1.0000001706336785,1.7220275807769759E-3,46.659459905718606,-89.662449246393834,90.337550753606166,null,1000000000,52482.2281,null,41.775882286413847,-87.725469537445065,null,46.153302769726892,-1.9369797089487752,null,0,0]
[251.19,0.25119000000000002,1.0006237748245461,3.5311492497051934E-2,1.0000000089985448,1.3415323101330579E-4,1,0,686.90841848745629,1.5693405281377379,1.0009302558460746,4.3116940324074829E-2,1.0000009031613171,1.3439945218716473E-3,1.0000002051434318,1.8881493575627541E-3,45.859982777804909,-89.646871554988024,90.353128445011976,null,1000000000,63096.416100000002,null,40.977316120407721,-87.523175488838831,null,46.152391807819328,-2.1236960661492028,null,0,0]
[275.42,0.27542,1.0007498712906864,3.871441595088871E-2,1.000000010818288,1.4709376504184156E-4,1,0,753.16805166381243,1.5694686014730377,1.0011182730469845,4.7270115893445999E-2,1.0000010858042687,1.4736371915368967E-3,1.0000002466291444,2.0702820055465291E-3,45.060656751972843,-89.628345308629974,90.371654691370026,null,1000000000,75856.176400000011,null,40.179084947366384,-87.29998209627945,null,46.151296955028592,-2.3283632123505287,null,0,0]
[302,0.30199999999999999,1.0009015228680964,4.2446345013182764E-2,1.0000000130071298,1.6128936525239219E-4,1,0,825.85403334752277,1.5695854587673912,1.0013443790232759,5.1824214802751727E-2,1.0000013054926618,1.6158534843669766E-3,1.00000029652954,2.2700792420346058E-3,44.261071711817124,-89.606716459886925,90.393283540113075,null,1000000000,91204,null,39.380816463760468,-87.053895272138831,null,46.149980398478789,-2.5528211877480982,null,0,0]
[331.13,0.33112999999999998,1.0010837281992384,4.6534941305388655E-2,1.0000000156374036,1.7684684576944803E-4,1,0,905.51328589826733,1.5696919805430671,1.0016160171220765,5.6812742575518382E-2,1.0000015694863753,1.7717134771876013E-3,1.0000003564937279,2.4890444532930317E-3,43.462013153932723,-89.581841956619272,90.418158043380728,null,1000000000,109647.0769,null,38.58333944988744,-86.783107052422125,null,46.148398854467416,-2.7987349041971439,null,0,0]
[363.08,0.36307999999999996,{"$f":"SQRT(1+(A77/pole1)^2)","v":1.0013028080254489},{"$f":"ATAN(A77/pole1)","v":5.1017549375977723E-2},{"$f":"SQRT(1+(A77/Zero1)^2)","v":1.0000000188006231},{"$f":"ATAN(A77/Zero1)","v":1.9391040566111572E-4},{"$f":"IF(VIN_nom>Vout, 1, SQRT(1+(A77/z_RHP)^2))","v":1},{"$f":"IF(VIN_nom>Vout, 0, -ATAN(A77/z_RHP))","v":0},{"$f":"SQRT(1+(A77/Pole2)^2)","v":992.88415459947657},{"$f":"ATAN(A77/Pole2)","v":1.5697891597810694},{"$f":"SQRT(1+(A77/Zero2)^2)","v":1.0019425969402496},{"$f":"ATAN(A77/Zero2)","v":6.2280934622021181E-2},{"$f":"SQRT(1+(A77/pole4)^2)","v":1.0000018869703509},{"$f":"ATAN(A77/pole4)","v":1.9426617737587273E-3},{"$f":"SQRT((1-(V77/pterm2))^2+(A77/pterm1)^2)","v":1.0000004286081241},{"$f":"IF((ATAN((A77/pterm1)/(1-A77^2/pterm2))>0),ATAN((A77/pterm1)/(1-A77^2/pterm2)),PI()+ATAN((A77/pterm1)/(1-A77^2/pterm2)))","v":2.7292072107398886E-3},{"$f":"20*LOG10(((E77*K77*G77)/(C77*I77*O77*M77))*Adc)","v":42.662865698235237},{"$f":"((F77+L77+H77)-(D77+J77+P77+N77))*radconv","v":-89.553517372946303},{"$f":"IF(R77>0,R77,R77+180)","v":90.446482627053697},null,1000000000,131827.0864,null,{"$f":"20*LOG10((K77/(I77*M77))*AEA)","v":37.786093228324582},{"$f":"(L77-(J77+N77))*radconv","v":-86.485165302352371},null,{"$f":"20*LOG10((E77*G77/(C77*O77))*Acs*Am)","v":46.146497620332781},{"$f":"(F77+H77-(D77+P77))*radconv","v":-3.0683520705939289},null,0,{"$f":"IF(AD77>0,S75,0)","v":0}]
[398.11,{"$f":"A78/1000","v":0.39811000000000002},1.0015661191809979,5.592991985997952E-2,1.0000000226033994,2.1261890327761503E-4,1,0,1088.6776386987578,1.5698777811161075,1.0023350656092356,6.8271968897680349E-2,1.0000022686448475,2.130089462272233E-3,1.0000005153034055,2.9925219271247504E-3,41.863965055544185,-89.521545838100508,90.478454161899492,null,{"$f":"IF(Q78<0,A78,1000000000)","v":1000000000},{"$f":"A78^2","v":158491.57210000002},null,36.989477121228717,-86.157720767052936,null,46.144213084737594,-3.363825071047577,null,{"$f":"SUM((Q79<0)*(Q78>0))*A78","v":0},0]
[436.52,0.43651999999999996,1.0018826009108557,6.131316594891241E-2,1.0000000271753957,2.3313255978461362E-4,1,0,1193.7141220157059,1.5699586051842362,1.002806718910138,7.4835417669794915E-2,1.0000027275237022,2.3356016367832512E-3,1.0000006195358582,3.2812437010755441E-3,41.065281652484067,-89.485698256728796,90.514301743271204,null,1000000000,190549.71039999998,null,36.193538777231197,-85.79806871117438,null,46.141468025675003,-3.6876295455544179,null,0,0]
[478.63,0.47863,1.0022629101284284,6.7210877848521297E-2,1.0000000326713754,2.5562227774412745E-4,1,0,1308.8686806921553,1.5700323081335603,1.0033733981085542,8.2023681314844846E-2,1.0000032791399551,2.5609103828401533E-3,1.0000007448341299,3.5977779845423373E-3,40.266971398599523,-89.445734709188812,90.554265290811188,null,1000000000,229086.67689999999,null,35.398526055047071,-85.403343650005027,null,46.138170493974584,-4.0423910591837897,null,0,0]
[524.80999999999995,0.52481,1.0027200227722513,7.3673219182933194E-2,1.0000000392800279,2.8028566323015262E-4,1,0,1435.1531215844914,1.570099536977922,1.0040543792355225,8.9896920254612905E-2,1.0000039424317153,2.8079952859504029E-3,1.0000008955005177,3.9449060935130243E-3,39.468853581434388,-89.401380949896733,90.598619050103267,null,1000000000,275425.53609999997,null,34.604370051587225,-84.970249138336456,null,46.134208680269296,-4.4311318115602578,null,0,0]
[575.44000000000005,0.57544000000000006,1.0032692591228047,8.0751188068975799E-2,1.0000000472245334,3.0732566299217939E-4,1,0,1573.606597736512,1.5701608439056249,1.00487240100931,9.8515981864709612E-2,1.0000047397987042,3.0788894045637523E-3,1.0000010766239047,4.3254845413366345E-3,38.671203906446536,-89.352372819787391,90.647627180212609,null,1000000000,331131.19360000006,null,33.811478243656865,-84.495447002075906,null,46.129450813211797,-4.8569258177114856,null,0,0]
[630.96,0.63096000000000008,1.003929251677395,8.8503432928784417E-2,1.0000000567768423,3.3697726798047665E-4,1,0,1725.4323390416107,1.5702167618746412,1.0058550925940686,0.10795060151379668,1.0000056985354031,3.3759467834090827E-3,1.0000012944054355,4.742820890617669E-3,37.873936404453467,-89.298416542075088,90.701583457924912,null,1000000000,398110.52160000004,null,33.019924613839834,-83.975107111982069,null,46.123736941035759,-5.3233094300930102,null,0,0]
[691.83,0.69183000000000006,1.0047220782991282,9.6990424078149007E-2,1.0000000682600116,3.6948615050432914E-4,1,0,1891.8882677079334,1.5702677543291577,1.0070351517452403,0.11827217234498288,1.0000068510655984,3.7016284211723407E-3,1.0000015562119913,5.2003730913549968E-3,37.077300692312242,-89.239237893042045,90.760762106957955,null,1000000000,478628.74890000006,null,32.230147820891382,-83.405306500498227,null,46.116878021842993,-5.833931392543823,null,0,0]
[758.58,0.75858000000000003,1.0056745429929286,0.10628112336605913,1.0000000820673387,4.0513536774870252E-4,1,0,2074.4237289333705,1.5703142651867579,1.0084522228442254,0.1295616895855187,1.0000082368625818,4.0587697751670194E-3,1.0000018710126588,5.7021253407026377E-3,36.281230012659989,-89.174547364940977,90.825452635059023,null,1000000000,575443.61640000006,null,31.442309976219565,-82.781592377278159,null,46.10864518686256,-6.3929549876628178,null,0,0]
[831.76,0.83175999999999994,1.0068183075058337,0.11644561378721263,1.0000000986651163,4.442186582166231E-4,1,0,2274.542760225997,1.5703566779785711,1.0101530518400015,0.14190056988419003,1.0000099027255773,4.4503132154866476E-3,1.0000022494419327,6.2522122605854959E-3,35.486043827845137,-89.104106213738689,90.895893786261311,null,1000000000,691824.69759999996,null,30.656999877027861,-82.099490472062371,null,46.098769101239412,-7.0046157416763339,null,0,0]
[912.01,0.91200999999999999,1.0081918609970708,0.12756431312443767,1.0000001186224163,4.8707782664460605E-4,1,0,2493.9955143601055,1.5703953637534487,1.0121943580040558,0.15538156455220517,1.0000119057688872,4.8796825235982487E-3,1.0000027044793367,6.8554451085760231E-3,34.691684381212305,-89.027681288857707,90.972318711142293,null,1000000000,831762.24009999994,null,29.874485872647746,-81.353903953929688,null,46.086923658986692,-7.6737773349280118,null,0,0]
[1000,1,1.0098407213654537,0.13971895683385918,1.0000001426157732,5.3407069972206316E-4,1,0,2734.6141825545164,1.5704306444881688,1.0146430504027539,0.17009745781363703,1.0000143138916122,5.3504618258172591E-3,1.0000032515569905,7.5168608014782633E-3,33.898444656161672,-88.945131437862756,91.054868562137244,null,1000000000,1000000,null,29.095444537557636,-80.539740481651179,null,46.072725269026165,-8.4053909562115781,null,0,0]
[1096.5,1.0965,1.0118199797232978,0.15300140840946272,1.0000001714686886,5.8560851098090152E-4,1,0,2998.5044174355007,1.5704628271966561,1.0175798918283878,0.18615130040864727,1.0000172097423123,5.8667700659351379E-3,1.0000039094615283,8.2422481497725353E-3,33.106338614191046,-88.856377379924055,91.143622620075945,null,1000000000,1202312.25,null,28.320351388178583,-79.651349271430817,null,46.055712376434592,-9.2050281084932433,null,0,0]
[1202.3,1.2022999999999999,1.0141942652109823,0.16750150092639143,1.0000002061547002,6.4211317507638463E-4,1,0,3287.8265639315255,1.5704921744936808,1.0210992837813246,0.20364115323656543,1.0000206910263496,6.432832904778191E-3,1.0000047004057118,9.0375465663827953E-3,32.315848778656985,-88.761520984054513,91.238479015945487,null,1000000000,1445525.2899999998,null,27.5502261136476,-78.683369006844615,null,46.035347815431521,-10.078151977209904,null,0,{"$f":"IF(AD90>0,S90,0)","v":0}]
[1318.3,1.3183,1.0170412831856257,0.18331801064311254,1.0000002478540626,7.0406535404717876E-4,1,0,3605.0417745167742,1.570518937495307,1.025314289621752,0.2226726987726875,1.0000248761939927,7.0534641582995416E-3,1.0000056513232882,9.9095226780656475E-3,31.52720864032602,-88.660816911654351,91.339183088345649,null,1000000000,1737914.89,null,26.785942501376383,-77.630034727311127,null,46.010991289371773,-11.030782184343209,null,0,0]
[1445.4,1.4454,1.0204510841948504,0.20054187270120513,1.0000002979501632,7.7194570943846838E-4,1,0,3952.611201684349,1.5705433294825777,1.0303552445789699,0.24333826458616389,1.0000299040795793,7.7334771463468373E-3,1.000006793790664,1.0864943561874252E-2,30.741206900049399,-88.554833570594283,91.445166429405717,null,1000000000,2089181.1600000001,null,26.029022439538618,-76.486344455795972,null,45.98190961093291,-12.068489114798304,null,0,0]
[1584.9,1.5849000000000002,1.0245395191528117,0.21930793182586192,1.0000003582376642,8.4644853031428963E-4,1,0,4334.0898435101826,1.5705655978425723,1.0363892086520734,0.26577789092238496,1.0000359547899509,8.4798246084286776E-3,1.0000081687787679,1.1913583733602988E-2,29.956854128104755,-88.444206075029498,91.555793924970502,null,1000000000,2511908.0100000002,null,25.279411556605211,-75.244687014133063,null,45.94716772192168,-13.199519060896423,null,0,0]
[1737.8,1.7378,1.0294315914024221,0.23969738876680469,1.0000004306922765,9.2810788373297239E-4,1,0,4752.212313916034,1.5705858984846017,1.0435947778423571,0.29006133171725079,1.000043226595476,9.2978533455722427E-3,1.0000098214097903,1.3062963376843404E-2,29.175623493568743,-88.330305836153144,91.669694163846856,null,1000000000,3019948.84,null,24.539570185317917,-73.901381078264919,null,45.905778458672955,-14.428924757888238,null,0,0]
[1905.5,1.9055,1.0352842915468186,0.26182862568403942,1.0000005178278275,1.0176714637586872E-3,1,0,5210.8070724082363,1.5706044179423442,1.0521950054436569,0.31629563776020303,1.0000519717634841,1.0195049062868453E-2,1.0000118091113293,1.4323610581863945E-2,28.39739197957531,-88.214782056001994,91.785217943998006,null,1000000000,3630930.25,null,23.810597832063554,-72.450732676657395,null,45.856519297933893,-15.764049379344591,null,0,0]
[2089.3000000000002,2.0893000000000002,1.0422742702124048,0.28578602651676055,1.0000006225425853,1.1158335559170555E-3,1,0,5713.4291171142449,1.5706213005567815,1.0624381940469667,0.34453911537984405,1.0000624811297576,1.1178360943175043E-2,1.0000141981264015,1.5705303092484645E-2,27.62314479728397,-88.100055744407001,91.899944255592999,null,1000000000,4365174.4900000012,null,23.094818337569563,-70.889807531737191,null,45.798051610136532,-17.210248212669793,null,0,0]
[2290.9,2.2909000000000002,1.0506192619143953,0.31168043384199356,1.0000007484791267,1.2235020718099573E-3,1,0,6264.7272917552737,1.570636702926582,1.0746279823999645,0.37487175045767751,1.000075120208584,1.2256876139323457E-2,1.0000170717449679,1.7220827406879441E-2,26.852727182179446,-87.989105080619652,92.010894919380348,null,1000000000,5248222.8100000005,null,22.393691428494606,-69.214552418016694,null,45.728760904106977,-18.774552662602943,null,0,0]
[2511.9,2.5119000000000002,1.0605629987946841,0.33957766270081352,1.0000008998540755,1.3415315133925745E-3,1,0,6869.0769786699757,1.5706507468273643,1.0890994935307121,0.40731001211351014,1.0000903120943638,1.3439144168606783E-2,1.000020526451326,1.8882220687004608E-2,26.087008263155322,-87.885894925377912,92.114105074622088,null,1000000000,6309641.6100000003,null,21.709823449825851,-67.424520552924932,null,45.646909963751611,-20.461374372452966,null,0,0]
[2754.2,2.7542,1.0723947448736129,0.36954316419558836,1.0000010818282161,1.4709366001599928E-3,1,0,7531.6739443968427,1.5706635541854712,1.1062457515659203,0.4418590117850405,1.0001085745915892,1.4735315999161058E-2,1.0000246804148456,2.0703778499569933E-2,25.326269686641922,-87.795232016800824,92.204767983199176,null,1000000000,7585617.6399999987,null,21.045483489747522,-65.520007666151912,null,45.55051134731653,-22.275224350648923,null,0,0]
[3020,3.02,1.0864556355265769,0.40163223385685137,1.0000013007121438,1.6128922679043544E-3,1,0,8258.5343396777807,1.5706752399335586,1.1265240965691827,0.47850065100811118,1.000130540830934,1.6157142801788243E-2,1.0000296782523446,2.2702055948483783E-2,24.570439039553889,-87.722882617401069,92.277117382598931,null,1000000000,9120400,null,20.402840748262921,-63.502730600958849,null,45.437323441713104,-24.220152016442213,null,0,0]
[3311.3,3.3113000000000001,1.1031151737369296,0.4358212440415356,1.0000015637391528,1.7684666325170706E-3,1,0,9055.1273924681882,1.570685892125268,1.1504193042317943,0.51711659120189279,1.0001569364461764,1.7715299868634553E-2,1.0000356859369408,2.4892110015577725E-2,23.820464461022329,-87.675691461459564,92.324308538540436,null,1000000000,10964707.690000001,null,19.785093295944659,-61.380086352876383,null,45.30509631549981,-26.295605108583164,null,0,0]
[3630.8,3.6308000000000002,1.1228229317060221,0.47210634384027728,1.000001880060551,1.9391016504965409E-3,1,0,9928.8365605176386,1.5706956100597993,1.1785146398484585,0.55760336841792302,1.0001886794131545,1.9424198893619155E-2,1.0000429136651712,2.7294267579765396E-2,23.075820937918238,-87.661279400722904,92.338720599277096,null,1000000000,13182708.640000001,null,19.194318107290535,-59.158834388153139,null,45.151227981049836,-28.502445012569751,null,0,0]
[3981.1,3.9811000000000001,1.1460667995926246,0.5103993413516833,1.000002260337415,2.1261858608841566E-3,1,0,10886.771840186157,1.5707044722014427,1.2114282376546583,0.59975854686029317,1.0002268390141273,2.1297706096076088E-2,1.0000516067358955,2.9928113294157749E-2,22.336683224299886,-87.688033660249602,92.311966339750398,null,1000000000,15849157.209999999,null,18.633225751582959,-56.851372395049566,null,44.973182623139067,-30.836661265200068,null,0,0]
[4365.2,4.3651999999999997,1.1734030001623781,0.55057826756484485,1.0000027175359274,2.3313214164498441E-3,1,0,11937.137073434851,1.57071255461443,1.2498526109632422,0.64334385879545686,1.0002727155553168,2.3351813273991065E-2,1.0000620640105944,3.2816251805085621E-2,21.602653730026468,-87.764741640950831,92.235258359049169,null,1000000000,19054971.039999999,null,18.104028364759472,-54.472272729799506,null,44.768350515689129,-33.292468911151325,null,0,0]
[4786.3,4.7862999999999998,1.2054435291255212,0.59245882274107953,1.0000032671322492,2.5562172654521806E-3,1,0,13088.683025029,1.5707199249140458,1.2945337396880496,0.68806085733819145,1.0003278607867978,2.560356360375847E-2,1.0000746430171275,3.5982808103288667E-2,20.873252951431244,-87.900208213351618,92.099791786648382,null,1000000000,22908667.690000001,null,17.608725578890333,-52.039615515503023,null,44.534252522963051,-35.86059269784861,null,0,0]
[5248.1,5.2481,1.2428774705651433,0.63582080600534929,1.0000039279951418,2.8028493659808832E-3,1,0,14351.527766735187,1.5707266478020352,1.3462984981804968,0.73358733612436244,1.0003941662651383,2.8072649897544936E-2,1.0000897807510649,3.9455688819374078E-2,20.14743862987336,-88.102895601730182,91.897104398269818,null,1000000000,27542553.610000003,null,17.148665905337538,-49.57299383914053,null,44.268497874957959,-38.529901762589638,null,0,0]
[5370.3,5.3703000000000003,1.2531592408130523,0.64685497751818066,1.0000041130481427,2.868112286955285E-3,1,0,14685.697596707394,1.5707282333322479,1.3604405869971363,0.745047071887742,1.0004127321622518,2.8725955360933413E-2,1.0000940219431442,4.0374721957375563E-2,19.966518765384834,-88.164952486417121,91.835047513582879,null,1000000000,28840122.090000004,null,17.039340173510197,-48.95392183483083,null,44.196903742296769,-39.211030651586277,null,0,0]
[5432.85,5.4328500000000002,1.2584804332124102,0.65243288267810695,1.000004209418508,2.9015181343856437E-3,1,0,14856.747701997476,1.5707290173123092,1.3677474856160694,0.75082083624925666,1.000422400620895,2.9060350625261615E-2,1.0000962310457815,4.0845152161213587E-2,19.875555898045636,-88.197974588075496,91.802025411924504,null,1000000000,29515859.122500002,null,16.985199787329712,-48.642313860740835,null,44.16008126113806,-39.555660727334669,null,0,0]
[5495.4,5.4954000000000001,1.2638404503265106,0.65796364629913684,1.0000043069048283,2.9349239753400833E-3,1,0,15027.797807296478,1.570729783445461,1.3750994945033765,0.75653305015307681,1.0004321809447945,2.9394739388818304E-2,1.0000984660151007,4.1315588261962431E-2,19.785668793477154,-88.231821203189085,91.768178796810915,null,1000000000,30199421.159999996,null,16.93224692038914,-48.334231073088496,null,44.12314702351015,-39.897590130100618,null,0,0]
[5559.4,5.5593999999999992,1.269364392589315,0.6635740999349321,1.0000044078060821,2.969104205507265E-3,1,0,15202.813102895108,1.5707305494947381,1.3826678740379363,0.76231461275489976,1.0004423037725207,2.9736872964032587E-2,1.0001007795776127,4.1796935929948868E-2,19.694783211735864,-88.267284889842088,91.732715110157912,null,1000000000,30906928.359999996,null,16.879261762895741,-48.022618637937278,null,44.085246599262256,-40.244666251904825,null,0,0]
[5623.4,5.6233999999999993,1.2749279439075107,0.66913576139139075,1.0000045098756289,3.0032844287368895E-3,1,0,15377.828398502455,1.5707312981071788,1.3902819671805302,0.76803303753260055,1.0004525437050267,3.0078999575613986E-2,1.0001031202409567,4.2278289914504323E-2,19.604967570320714,-88.303569485662962,91.696430514337038,null,1000000000,31622627.559999995,null,16.82745213382454,-47.714622335596111,null,44.047240586918306,-40.588947150066851,null,0,0]
[5688.9,5.6888999999999994,1.2806623646935895,0.67477756033369163,1.0000046155471172,3.0382657436817586E-3,1,0,15556.945615109324,1.5707320468246873,1.3981210695214108,0.77382080251764174,1.0004631448861061,3.0429137485940193E-2,1.0001055438359099,4.2770932248938902E-2,19.514126616335748,-88.341532615232012,91.658467384767988,null,1000000000,32363583.209999997,null,16.775611447490519,-47.403112151646212,null,44.008240319267358,-40.938420463585807,null,0,0]
[5754.4,5.7543999999999995,1.2864371846624112,0.6803688838211337,1.0000047224423034,3.073247051190801E-3,1,0,15736.062831724712,1.5707327784975005,1.4060064832786408,0.77954383750035894,1.0004738687179138,3.0779267933107202E-2,1.0001079958399612,4.3263581352819359E-2,19.424350291742766,-88.380311454300696,91.619688545699304,null,1000000000,33113119.359999996,null,16.724934249943409,-47.095309319444944,null,43.969141192221493,-41.285002134855766,null,0,0]
[5821.4,5.8213999999999997,1.2923854853547154,0.68603637377615678,1.0000048330515243,3.1090294495626338E-3,1,0,15919.281969339811,1.5707335098913087,1.414119585754156,0.78533170526843732,1.0004849650256271,3.1137408824061595E-2,1.0001105334015632,4.3767519581827528E-2,19.333591537066091,-88.42079953426294,91.57920046573706,null,1000000000,33888697.959999993,null,16.674266311575188,-46.784250790899939,null,43.929050375913036,-41.636548743362987,null,0,0]
[5888.4,5.8883999999999999,1.2983749169055416,0.69165175421247882,1.0000049449411312,3.144811839972964E-3,1,0,16102.501106963231,1.5707342246410758,1.4222795190368112,0.79105335032033897,1.0004961896575859,3.149554172493902E-2,1.0001131007135684,4.4271465057959841E-2,19.243890992180823,-88.462095245131636,91.537904754868364,null,1000000000,34673254.559999995,null,16.624747991272415,-46.476985133073072,null,43.888868151330541,-41.98511011205855,null,0,0]
[5957,5.9569999999999999,1.304549403918607,0.69734762468566891,1.000005060829344,3.1814487268842619E-3,1,0,16290.095626985989,1.5707349398010124,1.4306820012084387,0.79684381352955869,1.0005078152934721,3.1862218679073337E-2,1.0001157601726425,4.4787452648336869E-2,19.153116921498871,-88.505190270411632,91.494809729588368,null,1000000000,35485849,null,16.575204288243786,-46.166266046966612,null,43.847637783677214,-42.338924223445026,null,0,0]
[6025.6,6.0256000000000007,1.3107658148167443,0.70298965052756535,1.0000051780598249,3.2180856052548609E-3,1,0,16477.690147016885,1.5707356386771028,1.4391318922960628,0.80256646911153073,1.0005195754464868,3.2228887062630475E-2,1.0001184508476944,4.5303448012066677E-2,19.063396681277037,-88.549084338246175,91.450915661753825,null,1000000000,36307855.360000007,null,16.526797910576306,-45.859430627671102,null,43.806323921122861,-42.689653710575072,null,0,0]
[6095.8,6.0958000000000006,1.3171699975915516,0.70870794914421664,1.0000052994141366,3.2555769791328213E-3,1,0,16669.66004944732,1.5707363375691035,1.4478270797764481,0.80835325050981388,1.0005317491436914,3.2604098503157104E-2,1.0001212366104595,4.5831486393353688E-2,18.972647116801124,-88.594804912648087,91.405195087351913,null,1000000000,37158777.640000001,null,16.478405955975834,-45.549410551759593,null,43.763966311247415,-43.045394360888494,null,0,0]
[6166,6.1660000000000004,1.3236168328309028,0.7143707281073971,1.0000054221740586,3.2930683438586539E-3,1,0,16861.629951885709,1.5707370205473132,1.4565701706154963,0.81407075092671888,1.0005440636959433,3.2979300760408232E-2,1.0001240550926984,4.6359533103369127E-2,18.882945877215377,-88.641312992829867,91.358687007170133,null,1000000000,38019556,null,16.431137163205378,-45.243358545730125,null,43.721533864432132,-43.397954447099735,null,0,0]
[6237.8,6.2378,1.3302540798509717,0.72010560674688517,1.0000055491859572,3.3314142030465713E-3,1,0,17057.975236723807,1.5707377031900025,1.4655611940738644,0.81984780356806497,1.0005568046235196,3.3363045026686161E-2,1.0001269716767267,4.6899623781029923E-2,18.792257078237267,-88.689670500479579,91.310329499520421,null,1000000000,38910148.840000004,null,16.383918950805768,-44.934383850418115,null,43.678063277853632,-43.755286650061493,null,0,0]
[6309.6,6.3096000000000005,1.3369346421397863,0.7257833570552118,1.0000056776682686,3.3697600524373993E-3,1,0,17254.320521569669,1.5707383702964468,1.4746005322602591,0.82555421776617377,1.0005696928889876,3.3746779463507501E-2,1.0001299225219771,4.7439723373099679E-2,18.702610092464518,-88.738801138504655,91.261198861495345,null,1000000000,39811052.160000004,null,16.337808019273613,-44.629454986431959,null,43.634527223613027,-44.109346152072682,null,0,0]
[6383.05,6.3830499999999999,1.3438128733255763,0.73153298188376747,1.0000058106246545,3.4089870984185958E-3,1,0,17455.177919515161,1.5707390372040853,1.4838966712604735,0.83131963833076283,1.0005830297829659,3.4139322021773659E-2,1.0001329766482514,4.7992244054947356E-2,18.611953652028195,-88.789834911400916,91.210165088599084,null,1000000000,40743327.302500002,null,16.291749357872792,-44.321649963472275,null,43.589929444577535,-44.468184947928656,null,0,0]
[6456.5,6.4565000000000001,1.3507350752421272,0.73722386227362424,1.0000059451198102,3.4482141339085203E-3,1,0,17656.035317468242,1.5707396889380645,1.4932415200056821,0.83701308507111338,1.0005965208523191,3.4531854055200206E-2,1.0001360666649584,4.8544774281436796E-2,18.522333014549304,-88.841625747308342,91.158374252691658,null,1000000000,41686392.25,null,16.246781995660804,-44.017967264466073,null,43.54527616931064,-44.823658482842276,null,0,0]
[6531.7,6.5316999999999998,1.3578670560963786,0.74299002780978463,1.0000060844136105,3.4883757712297057E-3,1,0,17861.678289920648,1.570740341014373,1.5028585321234766,0.84276863616491449,1.0006104930789064,3.4933727421735151E-2,1.0001392675064418,4.91104789472925E-2,18.43162305525405,-88.895408316627993,91.104591683372007,null,1000000000,42663104.890000001,null,16.201840109725847,-43.711261486690468,null,43.499508095950333,-45.184146829937518,null,0,0]
[6606.9,6.6068999999999996,1.3650437115828893,0.74869575069115935,1.0000062253203774,3.5285373972976479E-3,1,0,18067.321262380476,1.5707409782467645,1.5125246944503012,0.84845080895397362,1.000624626901764,3.5335589500247587E-2,1.0001425060089597,4.967619384942934E-2,18.341944700961761,-88.949931133986851,91.050068866013149,null,1000000000,43651127.609999992,null,16.157974793225382,-43.40875847883936,null,43.453695058158523,-45.541172655147498,null,0,0]
[6683.85,6.6838500000000005,1.3724328920485172,0.75447228891048279,1.0000063711759308,3.5696336238900945E-3,1,0,18277.749809339814,1.5707416154649501,1.5224657032692994,0.85419033261087318,1.0006392569104332,3.5746791602331261E-2,1.000145858882902,5.0255084377977134E-2,18.251220324593152,-89.00646191089605,90.99353808910395,null,1000000000,44673850.822500005,null,16.11416945419781,-43.103504651423684,null,43.406776020817475,-45.902957259472373,null,0,0]
[6760.8,6.7608000000000006,1.3798673770362424,0.76018677014619651,1.0000065187203944,3.6107298384249861E-3,1,0,18488.178356306398,1.5707422381777698,1.5324562137115212,0.85985520574459662,1.0006540561093971,3.6157981610971994E-2,1.0001492512349779,5.0833985872658527E-2,18.161522350499077,-89.063713349476885,90.936286650523115,null,1000000000,45708416.640000001,null,16.071424244234983,-42.802526459929851,null,43.359823256686227,-46.261186889547055,null,0,0]
[6839.55,6.83955,1.387521914758528,0.76597132673940049,1.0000066714648217,3.6527873552909939E-3,1,0,18703.529208472442,1.5707428609495298,1.5427306688734117,0.86557643799036466,1.0006693766537054,3.6578777433742306E-2,1.0001527638379994,5.1426440407446559E-2,18.070762080663268,-89.123022500451611,90.876977499548389,null,1000000000,46779444.202500001,null,16.028743233892655,-42.498869505161117,null,43.311743997192742,-46.624152995290487,null,0,0]
[6918.3,6.9183000000000003,1.3952223701517776,0.77169222122183612,1.000006825978095,3.6948448592345941E-3,1,0,18918.88006064557,1.5707434695434495,1.5530549523619379,0.87122178661849237,1.0006848743802204,3.6999560297187734E-2,1.0001563178357904,5.2018906692946731E-2,17.981023401336554,-89.183031011351744,90.816968988648256,null,1000000000,47862874.890000001,null,15.987105671135996,-42.199558806577315,null,43.26364288062269,-46.983472204774444,null,0,0]
[6998.9,6.9988999999999999,1.4031504845339595,0.77748229470093311,1.000006985952868,3.7378903671945502E-3,1,0,19139.289948718113,1.5707440782525979,1.5636723424334908,0.87692237456533617,1.0007009196463803,3.7430214643940793E-2,1.0001599982150198,5.2625303542180153E-2,17.890207842398564,-89.245145361949398,90.754854638050602,null,1000000000,48984601.209999993,null,15.945537079224497,-41.897648729098094,null,43.214395913596199,-47.347496632851289,null,0,0]
[7079.5,7.0795000000000003,1.4111251099781312,0.78320711596169934,1.000007147780569,3.7809358613024552E-3,1,0,19359.699836797583,1.5707446731014574,1.574339860360416,0.8825458903495117,1.0007171504997296,3.7860855100802969E-2,1.0001637220095323,5.3231712985243686E-2,17.800409424232697,-89.307936077871176,90.692063922128824,null,1000000000,50119320.25,null,15.904994981168446,-41.600152971294591,null,43.165139593486387,-47.70778310657662,null,0,0]
[7161.95,7.16195,1.4193300830781157,0.78899658114531968,1.0000073152398878,3.8249693578357464E-3,1,0,19585.168760776629,1.5707452677505427,1.5853030401125225,0.88821999106353544,1.0007339459137743,3.8301365447433802E-2,1.0001675762255438,5.3852054436208628E-2,17.709575919438723,-89.37283944322445,90.62716055677555,null,1000000000,51293527.802499995,null,15.864551252756421,-41.300324402082929,null,43.114749817104432,-48.072515041141521,null,0,0]
[7244.4,7.2443999999999997,1.4275820813804057,0.79471930543160241,1.000007484638169,3.8690028395361306E-3,1,0,19810.637684762438,1.5707458488639821,1.5963165573513665,0.89381597487633646,1.0007509355130657,3.8741860922583263E-2,1.0001714759305393,5.447240937025994E-2,17.619754230307599,-89.438393751354084,90.561606248645916,null,1000000000,52481331.359999992,null,15.825115565320722,-41.004969974016582,null,43.06436381540901,-48.433423777337495,null,0,0]
[7328.75,7.3287500000000003,1.4360720587733478,0.80050565248368355,1.000007659946609,3.9140510251173943E-3,1,0,20041.302375347776,1.570746429838018,1.6076348850482878,0.89946138876752146,1.0007685175640368,3.9192491727120859E-2,1.000175512605856,5.5107074043664592E-2,17.528883575623549,-89.50610369360669,90.49389630639331,null,1000000000,53710576.5625,null,15.785781327432336,-40.707364114685952,null,43.012827398613354,-48.798739578920745,null,0,0]
[7413.1,7.4131,1.4446095523688645,0.80622379568326719,1.0000078372844028,3.9590991948127091E-3,1,0,20271.96706593972,1.5707469975908213,1.6190037318664559,0.90502769238870628,1.000786302832027,3.9643106606575912E-2,1.0001795969541791,5.574175315456005E-2,17.439019821593632,-89.574437685709142,90.425562314290858,null,1000000000,54954051.610000007,null,15.747436501520509,-40.414289269986782,null,42.961308470495261,-49.160148415722389,null,0,0]
[7499.45,7.4994499999999995,1.4533978214330867,0.81200773948294402,1.0000080209291042,4.0052154728100484E-3,1,0,20508.100984530975,1.5707475655760421,1.6306933692398096,0.91064540224212842,1.0008047202921548,4.0104389207251859E-2,1.0001838275613526,5.639149609690472E-2,17.348042382532544,-89.645009538928178,90.354990461071822,null,1000000000,56241750.302499995,null,15.709174659279736,-40.11888029385662,null,42.908592873674934,-49.526129245071587,null,0,0]
[7585.8,7.5857999999999999,1.4622341270821042,0.81772196758931759,1.0000082067005331,4.0513317337714308E-3,1,0,20744.234903128698,1.5707481206303859,1.6424337356331644,0.91618297229123802,1.0008233506972861,4.0565654732450059E-2,1.0001881081985742,5.7041254518738559E-2,17.25806846080205,-89.716177818361913,90.283822181638087,null,1000000000,57544361.640000001,null,15.671884514448939,-39.828061271052313,null,42.855909096775243,-49.8881165473096,null,0,0]
[7674.15,7.67415,1.4713239109322758,0.82349731412005489,1.0000083989759005,4.098516101064026E-3,1,0,20985.83804972588,1.5707486756123226,1.654497405812134,0.92176728458211343,1.0008426329994338,4.1037586005992055E-2,1.0001925398009384,5.7706078559540318E-2,17.167023522794096,-89.789582889001153,90.210417110998847,null,1000000000,58892578.222499996,null,15.634703935354541,-39.535175213284312,null,42.802044737861692,-50.254407675716834,null,0,0]
[7762.5,7.7625000000000002,1.4804621666656703,0.82920155150901309,1.0000085934776504,4.1457004501069443E-3,1,0,21227.441196329382,1.5707492179610469,1.6666119228763179,0.92727058225917303,1.0008621381997609,4.1509498990265133E-2,1.0001970238539477,5.8370919179121988E-2,17.07697787374547,-89.863554680594916,90.136445319405084,null,1000000000,60256406.25,null,15.598475948403454,-39.246929179244489,null,42.748227075764156,-50.61662550135042,null,0,0]
[7852.9,7.8529,1.4898617004991976,0.83496552339725494,1.0000087947969263,4.1939796064760244E-3,1,0,21474.650301632315,1.5707497602624356,1.679059017385016,0.93281920307348642,1.0008823266850564,4.1992342702495807E-2,1.0002016662823936,5.9051203565516443E-2,16.985851715629508,-89.939800599098433,90.060199400901567,null,1000000000,61668038.409999996,null,15.562361208497205,-38.956712602590308,null,42.69321565755444,-50.983087996508118,null,0,0]
[7943.3,7.9432999999999998,{"$f":"SQRT(1+(A141/pole1)^2)","v":1.4993101109773779},{"$f":"ATAN(A141/pole1)","v":0.84065703515806189},{"$f":"SQRT(1+(A141/Zero1)^2)","v":1.0000089984470988},{"$f":"ATAN(A141/Zero1)","v":4.242258743293697E-3},{"$f":"IF(VIN_nom>Vout, 1, SQRT(1+(A141/z_RHP)^2))","v":1},{"$f":"IF(VIN_nom>Vout, 0, -ATAN(A141/z_RHP))","v":0},{"$f":"SQRT(1+(A141/Pole2)^2)","v":21721.859406941428},{"$f":"ATAN(A141/Pole2)","v":1.5707502902203281},{"$f":"SQRT(1+(A141/Zero2)^2)","v":1.6915570437277649},{"$f":"ATAN(A141/Zero2)","v":0.9382859984439198},{"$f":"SQRT(1+(A141/pole4)^2)","v":1.0009027485046615},{"$f":"ATAN(A141/pole4)","v":4.2475166823980108E-2},{"$f":"SQRT((1-(V141/pterm2))^2+(A141/pterm1)^2)","v":1.000206363707302},{"$f":"IF((ATAN((A141/pterm1)/(1-A141^2/pterm2))>0),ATAN((A141/pterm1)/(1-A141^2/pterm2)),PI()+ATAN((A141/pterm1)/(1-A141^2/pterm2)))","v":5.9731505709268211E-2},{"$f":"20*LOG10(((E141*K141*G141)/(C141*I141*O141*M141))*Adc)","v":16.895720961046628},{"$f":"((F141+L141+H141)-(D141+J141+P141+N141))*radconv","v":-90.016582299553178},{"$f":"IF(R141>0,R141,R141+180)","v":89.983417700446822},null,1000000000,63096014.890000001,null,{"$f":"20*LOG10((K141/(I141*M141))*AEA)","v":15.52717975363632},{"$f":"(L141-(J141+N141))*radconv","v":-38.671182448835268},null,{"$f":"20*LOG10((E141*G141/(C141*O141))*Acs*Am)","v":42.63826635783245},{"$f":"(F141+H141-(D141+P141))*radconv","v":-51.345399850717932},null,0,0]
[8035.8,{"$f":"A142/1000","v":8.0358000000000001},1.5090276440992032,0.846406795569974,1.000009209240827,4.29165938825942E-3,1,0,21974.811201649951,1.5707508201467999,1.7043969518590856,0.94379662990936875,1.0009238862378764,4.2969186480298072E-2,1.0002112272263011,6.0427629923991713E-2,16.804501542114732,-90.095673513947915,89.904326486052085,null,{"$f":"IF(Q142<0,A142,1000000000)","v":1000000000},{"$f":"A142^2","v":64574081.640000001},null,15.492115258467329,-38.38378212693847,null,42.582111434069539,-51.71189138700943,null,{"$f":"SUM((Q143<0)*(Q142>0))*A142","v":0},0]
[8128.3,8.1282999999999994,1.518794425948405,0.85208279263914366,1.0000094224750002,4.3410600122780882E-3,1,0,22227.762996364501,1.5707513380121523,1.7172878426379077,0.94922469259992581,1.0009452682416395,4.3463185150865634E-2,1.0002161484181598,6.112377315920034E-2,16.71427396474456,-90.175268439989651,89.824731560010349,null,1000000000,66069260.890000001,null,15.457964541488785,-38.101110753921759,null,42.526034573677912,-52.074157686067878,null,0,0]
[8222.9500000000007,8.2229500000000009,1.5288382139470125,0.85781546024564381,1.0000096431916161,4.391608845082654E-3,1,0,22486.594211178453,1.5707518558540801,1.7305299449300506,0.95469504625232271,1.0009674000691779,4.3968643979511411E-2,1.0002212437428213,6.1836116935684408E-2,16.622950843846084,-90.257206307492652,89.742793692507348,null,1000000000,67616906.702500015,null,15.423934450552048,-37.81667290462638,null,42.468741543716163,-52.440533402866279,null,0,0]
[8270.2750000000015,8.2702750000000016,1.5338787638259466,0.86065359446190615,1.000009754508127,4.4168832530850025E-3,1,0,22616.009818587652,1.5707521103301734,1.7371701935125101,0.9573989080992561,1.0009785618806801,4.4221364979707155E-2,1.0002238140839679,6.2192296449581422E-2,16.577661512342296,-90.298353440706208,89.701646559293792,null,1000000000,68397448.575625017,null,15.407256577582354,-37.676247459361861,null,42.440130085182076,-52.622105981344355,null,0,0]
[8317.6,8.3176000000000005,1.5389315881127299,0.86347311418811612,1.0000098664634398,4.4421576554443424E-3,1,0,22745.425425998295,1.5707523619104597,1.7438230455430073,0.96008215845452527,1.0009897876211566,4.4474080327692733E-2,1.0002263995528962,6.2548481085902718E-2,16.532616307854699,-90.339614797735223,89.660385202264777,null,1000000000,69182469.760000005,null,15.390798438383014,-37.537002475815221,null,42.41154301989382,-52.80261232192003,null,0,0]
[8366.0499999999993,8.3660499999999995,1.5441171168159131,0.8663405196846905,1.000009981741891,4.4680328697298405E-3,1,0,22877.917474157097,1.5707526165226899,1.7506469541660188,0.96280804745742421,1.0010013464419387,4.4732797283207427E-2,1.000229062161289,6.2913138205676497E-2,16.486750122519677,-90.381971846808284,89.618028153191716,null,1000000000,69990792.602499992,null,15.374172836779806,-37.395658518212144,null,42.382302436162,-52.98631332859614,null,0,0]
[8414.5,8.4145000000000003,1.5493152562265409,0.86918870748642363,1.0000100976898756,4.4939080780323657E-3,1,0,23010.409522317375,1.5707528682028475,{"$f":"SQRT(1+(A148/Zero2)^2)","v":1.7574837698488608},{"$f":"ATAN(A148/Zero2)","v":0.96551274837884316},1.0010129722626584,4.4991508246532051E-2,1.0002317406390142,6.327780075577992E-2,16.441133619174771,-90.424441590875006,89.575558409124994,null,1000000000,70803810.25,null,15.357769789942923,-37.255528036932645,null,42.353088979653975,-53.168913553942389,null,0,0]
[8462.9500000000007,8.4629500000000011,1.55452587983875,0.87201782439868569,1.0000102143073932,4.5197832803172706E-3,1,0,23142.901570479087,1.5707531170012903,1.7643333425464425,0.96819646818768557,1.0010246650809813,4.5250213183244244E-2,1.0002344349930994,6.3642468767300897E-2,16.395763756696663,-90.467020585515186,89.532979414484814,null,1000000000,71621522.702500015,null,15.34158549536356,-37.116599174445099,null,42.323903411755239,-53.350421411070094,null,0,0]
[8511.4,8.5114000000000001,1.5597488625353344,0.87482801648866504,1.0000103315944435,4.5456584765499108E-3,1,0,23275.393618642214,1.5707533629672299,1.7711955242568713,0.97085941186326818,1.0010364248945598,4.5508912058926432E-2,1.0002371452306125,6.4007142271321094E-2,16.350637552527207,-90.509705457942928,89.490294542057072,null,1000000000,72443929.959999993,null,15.325616227510784,-36.97886018714739,null,42.294746475438558,-53.530845270795531,null,0,0]
[8560.9500000000007,8.5609500000000001,1.5651030811014519,0.87768258790550113,1.0000104522368642,4.5721211322420447E-3,1,0,23410.89374220368,1.5707536116379566,1.7782263932383873,0.97356153703353232,1.0010485209924438,4.5773478082026767E-2,1.0002399334367178,6.4380100969691517E-2,16.304735781868334,-90.553465509696906,89.446534490303094,null,1000000000,73289864.902500018,null,15.309502997604124,-36.839212583324944,null,42.26495793468635,-53.714252926371941,null,0,0]
[8610.5,8.6105,1.5704699660113406,0.88051767201058984,1.0000105735795641,4.5985837815306777E-3,1,0,23546.393865766568,1.5707538574466813,1.7852701435836598,0.97624235927955716,1.0010606871572036,4.6038037692957917E-2,1.0002427382707504,6.4753065478529742E-2,16.259082730403112,-90.597329390295315,89.402670609704685,null,1000000000,74140710.25,null,15.293607026211983,-36.700785015783232,null,42.235200854613254,-53.896544374512075,null,0,0]
[8660.0499999999993,8.66005,1.5758493878513522,0.88333342256484271,1.0000106956225432,4.625046424378749E-3,1,0,23681.893989330867,1.5707541004425303,1.7923266234234279,0.97890209145207141,1.0010729233862845,4.630259085492034E-2,1.0002455597404021,6.5126035831062426E-2,16.213675388408024,-90.641293716753168,89.358706283246832,null,1000000000,74996466.002499983,null,15.277924566563,-36.563565289780094,null,42.205475972267159,-54.077728426973096,null,0,0]
[8709.6,8.7096,1.5812412186686504,0.88612999246555635,1.0000108183658012,4.6515090607492015E-3,1,0,23817.394112896553,1.5707543406735118,1.7993956829983835,0.98154094425961746,1.0010852296771175,4.656713753111992E-2,1.0002483978534089,6.5499012060509149E-2,16.16851080400652,-90.685355179278076,89.314644820721924,null,1000000000,75857132.160000011,null,15.262451948491355,-36.427541333247817,null,42.175784005937302,-54.257813846030267,null,0,{"$f":"IF(AD154>0,S154,0)","v":0}]
[8760.3250000000007,8.7603249999999999,1.5867736300250153,0.88897316901118328,1.0000109447451058,4.6785992100024966E-3,1,0,23956.107407910455,1.5707545837861823,1.8066452507215249,0.98422096312591201,1.0010979003630622,4.6837950757275384E-2,1.0002513205159487,6.5880838954512452E-2,16.122523650917387,-90.730558728288045,89.269441271711955,null,1000000000,76743294.105625018,null,15.246826033146254,-36.289517947260983,null,42.145422768193264,-54.441040781027027,null,0,0]
[8811.0499999999993,8.8110499999999998,1.5923187791156435,0.89179656588427103,1.0000110718582946,4.7056893523887188E-3,1,0,24094.820702925754,1.5707548240996654,1.8139076908989877,0.98687954068780204,1.0011106444674687,4.7108757108405015E-2,1.0002542606370937,6.626267207788844E-2,16.076784824210595,-90.775857284809661,89.224142715190339,null,1000000000,77634602.102499992,null,15.231412483952917,-36.152722503233605,null,42.115097490679815,-54.62313478157607,null,0,0]
[8861.7749999999996,8.8617749999999997,1.5978765333283513,0.89460034422974033,1.0000111997053673,4.7327794878681082E-3,1,0,24233.533997942435,1.5707550616620287,1.821182849534003,0.98951689609509752,1.0011234619875329,4.7379556545052395E-2,1.0002572182252882,6.6644511466253387E-2,16.031291335983312,-90.821247527944038,89.178752472055962,null,1000000000,78531056.15062499,null,15.216207601276688,-36.017142445299847,null,42.084808885128751,-54.804105082644178,null,0,0]
[8912.5,8.9124999999999996,1.6034467615901848,0.89738466419470919,1.0000113282863232,4.7598696164009077E-3,1,0,24372.247292960466,1.570755296520246,{"$f":"SQRT(1+(A158/Zero2)^2)","v":1.8284705748131467},{"$f":"ATAN(A158/Zero2)","v":0.99213324619382826},1.0011363529204351,4.7650349027767137E-2,1.0002601932890249,6.7026357155215641E-2,15.986040255669877,-90.866726211556283,89.133273788443717,null,1000000000,79432656.25,null,15.201207761943241,-35.882765349528455,null,42.054557644148773,-54.983960862027821,null,0,0]
[8964.4,8.9643999999999995,1.6091587949982298,0.90021350675348133,1.0000114606053236,4.7875872566975055E-3,1,0,24514.173759426816,1.5707555340677954,1.8359399644090622,0.99478868471207971,1.0011496184408488,4.7927406941554528E-2,1.0002632553638431,6.7417054521977257E-2,15.939988871609714,-90.913346597269921,89.086653402730079,null,1000000000,80360467.359999999,null,15.186068986660079,-35.746507789133204,null,42.023645035371764,-55.166838808136688,null,0,0]
[9016.2999999999993,9.0162999999999993,1.6148836143033525,0.90302231496377627,1.0000115936926004,4.8153048896377544E-3,1,0,24656.10022589453,1.5707557688805829,1.8434221949030236,0.99742258546204632,1.0011629608085562,4.8204457491979061E-2,1.0002663357513346,6.7807758560004955E-2,15.894185226584476,-90.960052926670372,89.039947073329628,null,1000000000,81293665.689999983,null,15.17113742757523,-35.611483673382288,null,41.992772949431377,-55.348569253288076,null,0,0]
[9068.2000000000007,9.0682000000000009,1.6206210840075985,0.90581125705263954,1.0000117275481528,4.8430225151790676E-3,1,0,24798.026692363594,1.5707560010055637,1.8509171105691682,1.0000351733145323,1.0011763800204847,4.8481500636804849E-2,1.0002694344607534,6.8198469307413537E-2,15.848626358662832,-91.006841956766053,88.993158043233947,null,1000000000,82232251.24000001,null,15.156409440703374,-35.477680118398077,null,41.961942068381582,-55.529161838367969,null,0,0]
[9120.1,9.1201000000000008,1.6263710702277228,0.908580500112114,1.0000118621719811,4.8707401332788568E-3,1,0,24939.953158833974,1.5707562304886244,1.8584245579318677,1.002626670679734,1.0011898760735447,4.8758536333802754E-2,1.0002725515014077,6.8589186802308952E-2,15.803309362599183,-91.053710520455496,88.946289479544504,null,1000000000,83176224.010000005,null,15.141881458132531,-35.345084381224524,null,41.931153054888782,-55.708626139230979,null,0,0]
[9173.2000000000007,9.1732000000000014,1.6322668201108941,0.91139355747969364,1.0000120007036248,4.8990986134152875E-3,1,0,25085.161162102708,1.570756462590166,1.8661183998241306,1.005256488867069,1.0012037636975146,4.9041969728282793E-2,1.0002757595940301,6.8988945250761838E-2,15.757191927835784,-91.101741838591181,88.898258161408819,null,1000000000,84147598.24000001,null,15.127220919586321,-35.210659733765411,null,41.899696158671595,-55.891082104825784,null,0,0]
[9226.2999999999993,9.2262999999999984,1.6381753935652272,0.91418634453585823,1.0000121400394815,4.9274570856719128E-3,1,0,25230.369165372769,1.5707566920200859,1.8738250416516919,1.0078646932091948,1.0012177317504423,4.9325395237136124E-2,1.0002789868952573,6.9388710843001924E-2,15.711321701990371,-91.149849940417567,88.850150059582433,null,1000000000,85124611.689999983,null,15.112762421079804,-35.077472863531469,null,41.868284431332697,-56.072377076886106,null,0,0]
[9279.4,9.279399999999999,1.6440966523342364,0.91695903649163202,1.0000122801795506,4.9558155500031252E-3,1,0,25375.577168644144,1.5707569188242478,1.8815443261322951,1.010451514022092,1.0012317802289614,4.9608812815158602E-2,1.000282233415231,6.9788483619810937E-2,15.665695748574421,-91.198031671030193,88.801968328969807,null,1000000000,86107264.359999999,null,15.09850237694716,-34.945510574426827,null,41.836918522049388,-56.252521096603388,null,0,0]
[9332.5,9.3324999999999996,1.6500304598513007,0.91971180728167279,1.0000124211238317,4.9841740063633171E-3,1,0,25520.785171916814,1.570757143047472,1.8892760982982806,1.0130171790055085,1.001245909129687,4.98922224171537E-2,1.0002854991641514,7.018826362196065E-2,15.620311187112733,-91.246283952233512,88.753716047766488,null,1000000000,87095556.25,null,15.084437277121721,-34.814759820195363,null,41.805599060413144,-56.43152413203812,null,0,0]
[9386.85,9.3868500000000008,1.6561168066500458,0.9225089297189456,1.0000125662188424,5.013200026369429E-3,1,0,25669.4114426878,1.5707573699219475,1.8972026529108887,1.0156215672088509,1.0012604539123569,5.0182295312908111E-2,1.0002888617143704,7.0597462166128555E-2,15.574105284326263,-91.295742043211035,88.704257956788965,null,1000000000,88112952.922499999,null,15.07023937384044,-34.682172319406476,null,41.773591060907961,-56.613569723804531,null,0,0]
[9441.2000000000007,9.4412000000000003,1.6622160157837298,0.92528554665061513,1.0000127121563731,5.0422260379281323E-3,1,0,25818.037713460089,1.5707575941843339,1.9051419688099467,1.01820426622633,1.0012750829409174,5.0472359756907059E-2,1.0002922444313198,7.1006668366218675E-2,15.528146339462324,-91.34526775929622,88.65473224070378,null,1000000000,89136257.440000013,null,15.056238494724605,-34.550826883518447,null,41.741632995159854,-56.794440875777767,null,0,0]
[9495.5499999999993,9.4955499999999997,1.6683279461828446,0.92804184039400583,1.0000128589364237,5.0712520409905201E-3,1,0,25966.663984233659,1.5707578158794839,1.9130938871179204,1.0207655118455359,1.0012897962116758,5.076241570071155E-2,1.0002956473261275,7.1415882265917899E-2,15.482431436914883,-91.39485803916898,88.60514196083102,null,1000000000,90165469.80249998,null,15.042431110186154,-34.420710002692019,null,41.709725477150855,-56.974148036476961,null,0,0]
[9549.9,9.5498999999999992,1.6744524585454619,0.93077799184256482,1.0000130065589936,5.1002780355076886E-3,1,0,26115.290255008495,1.5707580350512291,1.9210582513377503,1.0233055370790998,1.0013045937209188,5.1052463095891149E-2,1.0002990704099846,7.1825103908902024E-2,15.436957716501079,-91.444509898861767,88.555490101138233,null,1000000000,91200590.00999999,null,15.028813765810177,-34.291808326023322,null,41.677869101113032,-57.152701572838424,null,0,0]
[9605.5249999999996,9.6055250000000001,1.6807335308508147,0.93355766149494768,1.0000131585170486,5.1299849437200238E-3,1,0,26267.403158631678,1.5707582567963436,1.9292221785028847,1.0258834162575374,1.001319825587843,5.1349305828469735E-2,1.0003025947129522,7.2243933571089727E-2,15.390664032544088,-91.495387273753238,88.504612726246762,null,1000000000,92266110.52562499,null,15.015070223089943,-34.16112726966994,null,41.645318959876278,-57.334260004083319,null,0,0]
[9661.15,9.6611499999999992,1.6870274926919464,0.93631661155030677,1.0000133113576153,5.1596918428778553E-3,1,0,26419.516062256138,1.5707584759880202,1.9373988181412443,1.0284395528300303,1.0013351456839839,5.1646139504012312E-2,1.0003061401872382,7.2662771436659293E-2,15.344617088835763,-91.546323068045197,88.453676931954803,null,1000000000,93337819.32249999,null,15.001518653083272,-34.031691307643072,null,41.612823586174621,-57.514631760402118,null,0,0]
[9716.7749999999996,9.7167750000000002,1.6933342003413354,0.93905503127857115,1.0000134650806933,5.1893987329287537E-3,1,0,26571.628965881853,1.5707586926701118,1.9455880099743312,1.0309741877330465,1.0013505540052912,5.194296407062763E-2,1.0003097068450486,7.3081617552396352E-2,15.298813990367426,-91.597314323686021,88.402685676313979,null,1000000000,94415716.40062499,null,14.98815558525412,-33.90348663483941,null,41.580383555535434,-57.693827688846596,null,0,0]
[9772.4,9.7723999999999993,1.6996535119157987,0.94177310837502526,1.0000136196862821,5.2191056138202914E-3,1,0,26723.741869508802,1.5707589068854724,1.9537895961668394,1.0334875589718471,1.0013660505476927,5.2239779476434024E-2,1.0003132946986597,7.3500471965074005E-2,15.253251896938689,-91.648358160291991,88.351641839708009,null,1000000000,95499801.75999999,null,14.974977623713336,-33.776499614044695,null,41.547999423647482,-57.871858546247296,null,0,0]
[9829.2999999999993,9.8292999999999999,1.7061305652051932,0.94453263409618105,1.0000137787487244,5.2494934069447401E-3,1,0,26879.341405984182,1.5707591235024079,1.9621918354991223,1.0360367848201439,1.001381993564959,5.254338875928042E-2,1.0003169867337089,7.3928935718773611E-2,15.206891908426968,-91.700623469729493,88.299376530270507,null,1000000000,96615138.48999998,null,14.96168566071063,-33.647847673528887,null,41.514931398138472,-58.052775796200621,null,0,0]
[9886.2000000000007,9.8862000000000005,1.7126205123195468,0.94727126618638791,1.0000139387345972,5.2798811903741515E-3,1,0,27034.940942460817,1.5707593376258668,1.9706067174513588,1.0385642555756698,1.001398028885268,5.2846988346760791E-2,1.0003207009735784,7.4357408253092408E-2,15.160778257570247,-91.752937942572345,88.247062057427655,null,1000000000,97736950.440000013,null,14.948580430111122,-33.520441509643973,null,41.481922977881254,-58.232496432928393,null,0,0]
[9943.1,9.9431000000000012,1.7191232072305147,0.94998920042655799,1.0000140996439,5.3102689640524064E-3,1,0,27190.54047893867,1.5707595492986568,1.9790340807537381,1.0410702166602699,1.0014141565041856,5.3150578183375027E-2,1.0003244374316362,7.4785889618053006E-2,15.114908073353167,-91.80529873674665,88.19470126325335,null,1000000000,98865237.610000014,null,14.935658527682827,-33.394267060026742,null,41.448974696092471,-58.411031676719936,null,0,0]
[10000,10,1.7256385058261727,0.95268663087273431,1.0000142614766321,5.3406567279233883E-3,1,0,27346.140015417728,1.5707597585626101,1.9874737666345528,1.043554910417003,1.0014303764172527,5.3454158213633786E-2,1.0003281961213275,7.5214379863664124E-2,15.069278538838791,-91.857703087696208,88.142296912303792,null,1000000000,100000000,null,14.922916623086506,-33.269310438660263,null,41.416087066174413,-58.588392649035981,null,0,0]
[10058.25,10.058249999999999,1.7323212926255189,0.95542702163546889,1.0000144281055336,5.371765456642202E-3,1,0,27505.431280795139,1.5707599703389656,1.9961262925110528,1.0460767752388975,1.0014470767613752,5.376493071750392E-2,1.0003320670322746,7.5653045649453854E-2,15.022812801660928,-91.911393087914661,88.088606912085339,null,1000000000,101168393.0625,null,14.910055459135892,-33.142636314470288,null,41.382482492947176,-58.768756773444338,null,0,0]
[10116.5,10.1165,1.7390169886677451,0.9581463301651052,1.0000145957022017,5.4028741749638336E-3,1,0,27664.722546173776,1.5707601796765387,2.004791403728019,1.0485768558337194,1.0014638738215738,5.4075692826518265E-2,1.0003359612710603,7.6091720848312741E-2,14.976593462157711,-91.965123114036601,88.034876885963399,null,1000000000,102343572.25,null,14.89737610158757,-33.017209599239656,null,41.348942510992273,-58.94791351479693,null,0,0]
[10174.75,10.17475,1.7457254454134061,0.96084475905646993,1.0000147642666362,5.4339828828280793E-3,1,0,27824.01381155361,1.5707603866172146,2.0134689377996517,1.0510554023987353,1.0014807675929818,5.438644448117886E-2,1.0003398788523603,7.6530405513847946E-2,14.930617665296143,-92.018890440708986,87.981109559291014,null,1000000000,103525537.5625,null,14.884875206137053,-32.893015956711778,null,41.315467609581226,-59.125874483997208,null,0,0]
[10233,10.233000000000001,1.7524465163165912,0.96352250902153547,1.000014933798836,5.4650915801747321E-3,1,0,27983.305076934619,1.5707605912019256,2.0221587347982388,1.0535126618980817,1.0014977580707054,5.4697185621999808E-2,1.0003438197909342,7.6969099699650947E-2,14.884882609564805,-92.072692419888966,87.927307580111034,null,1000000000,104714289,null,14.872549501780203,-32.770041235820898,null,41.282058258206732,-59.302651184068075,null,0,0]
[10292.5,10.2925,1.7593246889823175,0.96623657885165948,1.0000151079682054,5.4968678352128094E-3,1,0,28146.014609814272,1.570760797786116,2.0310475049406849,1.0560009285688956,1.0015152129872835,5.5014584111115539E-2,1.0003478694289367,7.741721780839024E-2,14.838411802095051,-92.127682049285113,87.872317950714887,null,1000000000,105935556.25,null,14.860136841441484,-32.645671487390466,null,41.248000111075697,-59.482010561894654,null,0,0]
[10352,10.352,1.7662157201499307,0.96892949007076445,1.0000152831473199,5.5286440791500694E-3,1,0,28308.724142695111,1.5707610019955462,2.0399487406208765,1.0584674954940996,1.0015327687947848,5.5331971504886557E-2,1.0003519434688277,7.7865345963358326E-2,14.792186434962421,-92.182702487871893,87.817297512128107,null,1000000000,107163904,null,14.847900298745341,-32.522544271021253,null,41.214011286639206,-59.66015821685064,null,0,0]
[10411.5,10.4115,1.7731194599000337,0.97160145054009717,1.0000154593361792,5.5604203119223481E-3,1,0,28471.433675577118,1.57076120387093,2.0488622793700833,1.0609126156769904,1.0015504254879044,5.5649347739954141E-2,1.0003560419266104,7.8313484221619961E-2,14.746203686603172,-92.237751151176099,87.762248848823901,null,1000000000,108399332.25,null,14.835836612605268,-32.400645089394665,null,41.180092224420036,-59.837106061781448,null,0,0]
[10471,10.471,1.780035760364683,0.97425266609586247,1.0000156365347828,5.5921965334654791E-3,1,0,28634.143208460275,1.5707614034520565,2.0577879613119516,1.0633365387661189,1.0015681830613063,5.5966712752972998E-2,1.0003601648183804,7.8761632640222262E-2,14.700460787959461,-92.292825530857826,87.707174469142174,null,1000000000,109641841,null,14.823942593936401,-32.279959637352697,null,41.146243344445203,-60.012865893505136,null,0,0]
[10532,10.532,1.7871393083699483,0.97694939639733014,1.0000158192488262,5.6247738244994665E-3,1,0,28800.954662341654,1.5707616057236014,2.0669511020075952,1.0657998216156401,1.0015864930261489,5.6292066848362202E-2,1.0003644170312713,7.9221089525602653E-2,14.653810857961417,-92.349312489592236,87.650687510407764,null,1000000000,110923024,null,14.811921598838069,-32.15747693200715,null,41.111614409545481,-60.191835557585094,null,0,0]
[10593,10.593,1.794255750121351,0.97962475428902973,1.0000160030241658,5.6573511035944131E-3,1,0,28967.766116224197,1.570761805665577,2.0761266737191795,1.0682413459055866,1.0016049090103345,5.6617409013959293E-2,1.0003686949602011,7.9680557211441377E-2,14.607407292653063,-92.405821375584338,87.594178624415662,null,1000000000,112211649,null,14.800072369662363,-32.03624008329372,null,41.077060073412838,-60.36958129229064,null,0,0]
[10654,10.654,1.8013849328071498,0.98227895499609863,1.0000161878608009,5.6899283706811797E-3,1,0,29134.577570107886,1.5707620033179974,2.0853145123539401,1.0706613699373919,1.0016234310080157,5.6942739181550885E-2,1.0003729986228149,8.014003575915174E-2,14.561247271401186,-92.462349722651183,87.537650277348817,null,1000000000,113507716,null,14.788391693810111,-31.916234290014696,null,41.042580728013213,-60.546115432636505,null,0,0]
[10715,10.715,1.808526705753686,0.98491221154552411,1.0000163737587315,5.7225056256906236E-3,1,0,29301.389023992699,1.5707621987199656,2.0945144564808982,1.073060148490673,1.0016420590133108,5.7268057282938774E-2,1.0003773280368584,8.0599525230127186E-2,14.515328025845518,-92.518895140397845,87.481104859602155,null,1000000000,114811225,null,14.776876430378611,-31.797444952706272,null,41.008176745889038,-60.721450187691545,null,0,0]
[10777.5,10.7775,1.81585699918832,0.98758871774420587,1.0000165653286841,5.7558839481425374E-3,1,0,29472.302398875829,1.5707623966327173,2.1039530183506594,1.0754961406188992,1.0016612550279065,5.7601362423555909E-2,1.0003817906396302,8.1070325016172534E-2,14.468526506814413,-92.576846302759762,87.423153697240238,null,1000000000,116154506.25,null,14.765246357515604,-31.676981202106933,null,40.973005299720946,-60.899865100652818,null,0,0]
[10840,10.84,1.8232001961963449,0.99024368281928488,1.000016758012767,5.7892622577689111E-3,1,0,29643.215773760101,1.5707625922632649,2.1134039536389211,1.0779103599307618,1.0016805623150995,5.7934654752355215E-2,1.0003862803139105,8.1541136399718273E-2,14.421972029169822,-92.63481054053797,87.36518945946203,null,1000000000,117505600,null,14.753783479345707,-31.557764077171008,null,40.937913700246256,-61.077046463366962,null,0,0]
[10902.5,10.9025,1.8305561414913829,0.99287732879949553,1.0000169518109798,5.8226405544953772E-3,1,0,29814.12914864549,1.570762785650857,2.1228670970875188,1.0803030692659763,1.0016999808684557,5.8267934196032926E-2,1.000390797079119,8.2011959446733673E-2,14.375661777365917,-92.692785517268291,87.307214482731709,null,1000000000,118864506.25,null,14.742484639772293,-31.439778516340883,null,40.902902288015753,-61.253007000927404,null,0,0]
[10965,10.965,1.8379246820056303,0.99548987534520483,1.0000171467233219,5.8560188382475696E-3,1,0,29985.042523531985,1.5707629768338485,2.1323422861603043,1.0826745277867049,1.001719510681504,5.8601200681302389E-2,1.0003953409547865,8.248279422316572E-2,14.329592987770459,-92.750768971445851,87.249231028554149,null,1000000000,120231225,null,14.731346753834668,-31.323009668716995,null,40.867971384357922,-61.427759302728859,null,0,0]
[11028.75,11.02875,1.8454534124603179,0.99813316153443055,1.0000173466816857,5.8900646742315859E-3,1,0,30159.374165917321,1.5707631696081896,2.1420192226392829,1.0850717878776075,1.0017395457037996,5.8941119070539762E-2,1.0004000036575338,8.2963057847139463E-2,14.28284876339244,-92.809918558831228,87.190081441168772,null,1000000000,121633326.5625,null,14.72014879750558,-31.205143717216785,null,40.832425116308997,-61.604774841614464,null,0,0]
[11092.5,11.092499999999999,1.8529949321976136,1.000754950052424,1.0000175477991882,5.924110496560879E-3,1,0,30333.70580830377,1.5707633601667339,2.1517083582300311,1.0874474718105476,1.0017596964669639,5.9281023823884185E-2,1.0004046946074046,8.3443333812921322E-2,14.236350107531612,-92.86907244285598,87.13092755714402,null,1000000000,123043556.25,null,14.709112032126701,-31.08851308027241,null,40.796963225827049,-61.780559362583553,null,0,0]
[11156.25,11.15625,1.860549085697907,1.0033554664886153,1.0000177500758287,5.9581563051565303E-3,1,0,30508.037450691307,1.570763548547466,2.1614095288745472,1.089801843112141,1.0017799629640127,5.962091486361893E-2,1.0004094138254849,8.3923622190422001E-2,14.190094245891762,-92.928228451613023,87.071771548386977,null,1000000000,124461914.0625,null,14.698233400886009,-30.973102656644517,null,40.761585995427879,-61.955125794968524,null,0,0]
[11220,11.22,1.8681157196986671,1.0059349339375425,1.0000179535116063,5.992202099939622E-3,1,0,30682.369093079917,1.5707637347875081,2.1711225732450807,1.0921351615470916,1.0018003451879218,5.9960792112046232E-2,1.000414161332982,8.4403923049527485E-2,14.144078454831227,-92.987384485740634,87.012615514259366,null,1000000000,125888400,null,14.687509916232283,-30.858897560587071,null,40.726293689021077,-62.128486925153531,null,0,0]
[11285.5,11.285500000000001,1.8759029055862786,1.0085635185261514,1.0000181637391978,6.0271824706982753E-3,1,0,30861.486309966556,1.5707639239485096,2.1811144505893205,1.0945108732897597,1.0018214074521228,6.030998487812806E-2,1.0004190686515664,8.4897421711784202E-2,14.097046720944444,-93.048162305428349,86.951837694571651,null,1000000000,127362510.25,null,14.676650586046607,-30.742797414119881,null,40.690121285319975,-62.30536489130845,null,0,0]
[11351,11.351000000000001,1.8837029457273897,1.0111703521081017,1.0000183751904375,6.0621628267067173E-3,1,0,31040.603526854295,1.5707641109264356,2.1911185258434367,1.096864904458335,1.0018425918688609,6.0659162919106266E-2,1.0004240058798117,8.5390933699811072E-2,14.050262748284643,-93.108935885215516,86.891064114784484,null,1000000000,128845201,null,14.665948859866976,-30.627938504279744,null,40.654039038839798,-62.480997380935769,null,0,0]
[11416.5,11.416499999999999,1.8915156811008151,1.0137556685548883,1.000018587865324,6.097143167879353E-3,1,0,31219.720743743103,1.5707642957588608,2.2011346326902914,1.0991975247518841,1.0018638984303874,6.1008326150770391E-2,1.0004289730411191,8.5884459089326098E-2,14.003723741363975,-93.169703174004681,86.830296825995319,null,1000000000,130336472.25,null,14.655401713900694,-30.514305375776342,null,40.618047177885408,-62.655397798228329,null,0,0]
[11482,11.481999999999999,1.8993409550451297,1.0163196990437526,1.0000188017638576,6.1321234941305843E-3,1,0,31398.837960632965,1.570764478482503,2.2111626076280513,1.1015089999177863,1.0018853271289097,6.1357474488931515E-2,1.0004339701590241,8.6377997956019081E-2,13.957426955592364,-93.230462192694532,86.769537807305468,null,1000000000,131836324,null,14.645006193709868,-30.401882799686547,null,40.582145912304632,-62.828579393007999,null,0,0]
[11548.75,11.54875,1.90732830627654,1.0189109988181739,1.0000190210033204,6.1677713684200114E-3,1,0,31581.373445021793,1.5707646625608536,2.2213939997104126,1.1038431040209382,1.001907290419471,6.1713270553618672E-2,1.0004390934858722,8.6880969447139425E-2,13.910493052419293,-93.292370249935786,86.707629750064214,null,1000000000,133373626.5625,null,14.63456529089199,-30.288544645288791,null,40.545652911949432,-63.003825604646991,null,0,0]
[11615.5,11.615500000000001,1.9153283580325375,1.0214806687529121,1.000019241513578,6.2034192270335967E-3,1,0,31763.908929411678,1.5707648445235431,2.2316373830318512,1.1061557932010195,1.0019293805367475,6.2069050974458966E-2,1.0004442479733895,8.7383955093364649E-2,13.863805104418145,-93.354265787743245,86.645734212256755,null,1000000000,134919840.25,null,14.624275873207672,-30.176432458058134,null,40.509254381632608,-63.177833329685107,null,0,0]
[11682.25,11.68225,{"$f":"SQRT(1+(A205/pole1)^2)","v":1.9233409518313149},{"$f":"ATAN(A205/pole1)","v":1.0240289450271767},{"$f":"SQRT(1+(A205/Zero1)^2)","v":1.0000194632946293},{"$f":"ATAN(A205/Zero1)","v":6.2390670698807523E-3},{"$f":"IF(VIN_nom>Vout, 1, SQRT(1+(A205/z_RHP)^2))","v":1},{"$f":"IF(VIN_nom>Vout, 0, -ATAN(A205/z_RHP))","v":0},{"$f":"SQRT(1+(A205/Pole2)^2)","v":31946.444413802608},{"$f":"ATAN(A205/Pole2)","v":1.5707650244068372},2.2418925932256348,1.108447336426591,{"$f":"SQRT(1+(A205/pole4)^2)","v":1.0019515974723507},{"$f":"ATAN(A205/pole4)","v":6.2424815662420904E-2},{"$f":"SQRT((1-(V205/pterm2))^2+(A205/pterm1)^2)","v":1.000449433646917},{"$f":"IF((ATAN((A205/pterm1)/(1-A205^2/pterm2))>0),ATAN((A205/pterm1)/(1-A205^2/pterm2)),PI()+ATAN((A205/pterm1)/(1-A205^2/pterm2)))","v":8.7886954974709539E-2},{"$f":"20*LOG10(((E205*K205*G205)/(C205*I205*O205*M205))*Adc)","v":13.817360361791906},{"$f":"((F205+L205+H205)-(D205+J205+P205+N205))*radconv","v":-93.416146928991921},{"$f":"IF(R205>0,R205,R205+180)","v":86.583853071008079},null,1000000000,136474965.0625,null,{"$f":"20*LOG10((K205/(I205*M205))*AEA)","v":14.614135024485222},{"$f":"(L205-(J205+N205))*radconv","v":-30.065530824207933},null,{"$f":"20*LOG10((E205*G205/(C205*O205))*Acs*Am)","v":40.472950487728816},{"$f":"(F205+H205-(D205+P205))*radconv","v":-63.350616104783974},null,0,0]
[11749,{"$f":"A206/1000","v":11.749000000000001},1.9313659315746077,1.0265560610154234,1.0000196863464732,6.2747148968708864E-3,1,0,32128.979898194553,1.5707652022461767,2.2521594687307456,1.1107179986584736,1.0019739412178448,6.2780564528496854E-2,1.0004546505319418,8.8389969171157698E-2,13.771156124257136,-93.478011865435136,86.521988134564864,null,{"$f":"IF(Q206<0,A206,1000000000)","v":1000000000},{"$f":"A206^2","v":138039001},null,14.604139895701426,-29.955824559532239,null,40.436741378977842,-63.522187305902882,null,{"$f":"SUM((Q207<0)*(Q206>0))*A206","v":0},0]
[11817.5,11.817500000000001,1.93961402009983,1.0291276730963568,1.0000199165673223,6.3112972945044126E-3,1,0,32316.300957084713,1.5707653826592578,2.2627074747904112,1.113026755742786,1.0019970025858995,6.3145623601016151E-2,1.0004600366657583,8.8906185972541532E-2,13.72398780448564,-93.541480055518562,86.458519944481438,null,1000000000,139653306.25,null,14.594031303978131,-29.844469203589405,null,40.399681650929644,-63.697010851929164,null,0,0]
[11886,11.885999999999999,1.9478748269796442,1.0316774898510821,1.000020148126469,6.3478796752452597E-3,1,0,32503.62201597591,1.5707655609928679,2.2732674299295841,1.1153140752963888,1.0020201974820606,6.3510665821310597E-2,1.0004654557239383,8.9422418020044359E-2,13.677067158559449,-93.604927535229848,86.395072464770152,null,1000000000,141276996,null,14.584070303102056,-29.734341042974528,null,40.362722005879526,-63.870586492255313,null,0,0]
[11954.5,11.954499999999999,1.9561481910853578,1.0342057544572489,1.0000203810239128,6.3844620389955252E-3,1,0,32690.94307486813,1.5707657372827535,2.2838391683987567,1.1175802309170024,1.0020435258970555,6.3875691093265893E-2,1.0004709077345035,8.9938665400003309E-2,13.630391422697279,-93.668352563120891,86.331647436879109,null,1000000000,142910070.25,null,14.574254022965071,-29.625424398234134,null,40.325862550154341,-64.04292816488676,null,0,0]
[12023,12.023,1.9644339537598199,1.0367127071011855,1.0000206152596525,6.4210443856573081E-3,1,0,32878.264133761353,1.5707659115638466,2.2944225273199801,1.1198254920322581,1.0020669878215589,6.4240699320794625E-2,1.0004763927256373,9.0454928198720169E-2,13.583957882670781,-93.731753465234775,86.268246534765225,null,1000000000,144552529,null,14.564579660250498,-29.517703828798098,null,40.289103372842419,-64.214049636436684,null,0,0]
[12093,12.093,1.9729138027256632,1.0392527862652787,1.0000208560072166,6.4584277878478938E-3,1,0,33069.687113653257,1.5707660876215801,2.3052494770069973,1.1220986096996939,1.002091101427941,6.4613682720888937E-2,1.0004820319273415,9.098251204090739E-2,13.536754985072186,-93.796516110705937,86.203483889294063,null,1000000000,146240649,null,14.554837213932629,-29.408844242011938,null,40.25164292156169,-64.387671868693999,null,0,0]
[12163,12.163,1.9814062719329442,1.0417711075880356,1.0000210981523276,6.4958111719866894E-3,1,0,33261.11009354618,1.5707662616528331,2.3160882266662517,1.1243504635970227,1.0021153544351264,6.4986648119118764E-2,1.0004877056298542,9.1510112166625204E-2,13.489799428647874,-93.861250234453067,86.138749765546933,null,1000000000,147938569,null,14.545237255156318,-29.301201831971191,null,40.214287323913695,-64.560048402481897,null,0,0]
[12233,12.233000000000001,1.9899111998010748,1.0442679179022492,1.0000213416949852,6.5331945379692204E-3,1,0,33452.5330734401,1.5707664336923937,2.3269386114069217,1.1265813281811858,1.0021397468329942,6.5359595413033544E-2,1.0004934138637724,9.2037728667854007E-2,13.44308846930887,-93.925954255128374,86.074045744871626,null,1000000000,149646289,null,14.535776997034105,-29.194760869574679,null,40.177036622696896,-64.731193385553695,null,0,0]
[12303,12.303000000000001,1.9984284272650528,1.0467434609148087,1.0000215866351878,6.5705778856910112E-3,1,0,33643.956053334994,1.5707666037742578,2.3378004692240273,1.1287914736523026,1.002164278611366,6.5732524500212774E-2,1.0004991566598689,9.2565361636534546E-2,13.396619411747636,-93.99062665613495,86.00937334386505,null,1000000000,151363809,null,14.526453717935821,-29.08950586957549,null,40.139890844233946,-64.901120786559446,null,0,0]
[12374.5,12.374499999999999,2.0071407017066476,1.0492503456635358,1.0000218382668951,6.6087622861891876E-3,1,0,33839.480954228624,1.5707667755142047,{"$f":"SQRT(1+(A215/Zero2)^2)","v":2.3489067601361282},{"$f":"ATAN(A215/Zero2)","v":1.1310278661063413},1.002189479952653,6.6113426022382571E-2,1.0005050582291013,9.3104318122069693E-2,13.349401568668373,-94.056650739662018,85.943349260337982,null,1000000000,153128250.25,null,14.517069304205377,-28.983203910107271,null,40.102057414885131,-65.073446829554712,null,0,0]
[12446,12.446,2.0158654808899179,1.0517355460416562,1.0000220913566822,6.6469466674153018E-3,1,0,34035.005855123243,1.5707669452809225,2.3600246883849132,1.1332431985443694,1.0022148266902475,6.6494308333260921E-2,1.0005109959230782,9.3643291982141358E-2,13.30243057169419,-94.122638833113925,85.877361166886075,null,1000000000,154902916,null,14.507822263672512,-28.878107386890701,null,40.064333458443812,-65.244531446223235,null,0,0]
[12517.5,12.5175,2.0246026031518713,1.0541993118863051,1.0000223459045474,6.6851310292580192E-3,1,0,34230.530756018838,1.5707671131082241,2.3711540902740582,1.1354377456138673,1.0022403188131184,6.6875171323799415E-2,1.0005169697751608,9.4182283314599213E-2,13.255703698323419,-94.18858951626477,85.81141048373523,null,1000000000,156687806.25,null,14.498709895521287,-28.774200559473584,null,40.026718953224275,-65.414388956791171,null,0,0]
[12589,12.589,2.0333519093813628,1.056641889784532,1.0000226019104901,6.7233153716060061E-3,1,0,34426.055656915385,1.5707672790291547,2.3822948049988422,1.1376117776335857,1.0022659563101721,6.7256014884983076E-2,1.0005229798189015,9.4721292217248912E-2,13.20921827402071,-94.254501430645632,85.745498569354368,null,1000000000,158482921,null,14.489729562528609,-28.671467935379642,null,39.989213861914237,-65.583033495265994,null,0,{"$f":"IF(AD218>0,S218,0)","v":0}]
[12662.25,12.66225,2.0423278306902244,1.0591225333081513,1.0000228656943562,6.7624342754270313E-3,1,0,34626.366132310373,1.5707674470679187,2.3937197609766372,1.1398180239938362,1.0022923720416395,6.7646159529643146E-2,1.0005291745281069,9.5273511968208602E-2,13.161842733390618,-94.321985012550385,85.678014987449615,null,1000000000,160332575.0625,null,14.480663661235933,-28.567422599702923,null,39.950904222576817,-65.754562412847477,null,0,0]
[12735.5,12.7355,2.0513162096227222,1.0615814526748359,1.0000231310085452,6.8015531585507976E-3,1,0,34826.676607706315,1.5707676131736861,2.4051562577139181,1.1420032995429996,1.0023189403268242,6.8036283550696713E-2,1.0005354072941779,9.582575036763849E-2,13.114715072039173,-94.389425208183866,85.610574791816134,null,1000000000,162192960.25,null,14.471730931074976,-28.464577510597675,null,39.912709291386328,-65.924847697586202,null,0,0]
[12808.75,12.80875,2.0603168831352421,1.0640189026657205,1.0000233978530557,6.8406720208575985E-3,1,0,35026.987083103217,1.5707677773796196,2.4166041313619369,1.1441678812876257,1.0023456611535955,6.84263868310373E-2,1.0005416781538152,9.637800752055746E-2,13.067832563106093,-94.456820745337978,85.543179254662022,null,1000000000,164064076.5625,null,14.462928732821807,-28.362916791948059,null,39.874628980706419,-66.093903953389898,null,0,0]
[12882,12.882,2.0693296907997527,1.0664351346527525,1.0000236662278865,6.8797908622277235E-3,1,0,35227.29755850105,1.5707679397181282,2.4280632210005444,1.1463120417884907,1.0023725345097538,6.8816469253596066E-2,1.0005479871439305,9.6930283531934849E-2,13.021192527489408,-94.524170411152653,85.475829588847347,null,1000000000,165945924,null,14.454254489910669,-28.262424822321261,null,39.83666318800087,-66.261745588831417,null,0,0]
[12957.25,12.95725,2.0786010517251206,1.0688955045165438,1.0000239435239227,6.9199777729020504E-3,1,0,35433.077261897051,1.5707681045777648,2.4398467002734678,1.1484937624883231,1.0024003004297135,6.9217180547987311E-2,1.0005545081385201,9.7497658499911419E-2,12.973528772198197,-94.593309994717728,85.406690005282272,null,1000000000,167890327.5625,null,14.445474008114751,-28.160389945761178,null,39.797779914505583,-66.432920048956547,null,0,0]
[13032.5,13.032500000000001,2.0878848835034156,1.0713340088415786,1.0000242224349842,6.9601646612246744E-3,1,0,35638.856965294006,1.5707682675335937,2.4516416813165489,1.1506545006376552,1.0024282272956981,6.9617869579707864E-2,1.0005610694538802,9.8065053594640461E-2,12.926115329626617,-94.662398756603665,85.337601243396335,null,1000000000,169846056.25,null,14.436823247503714,-28.059555896152332,null,39.759017232545034,-66.602842860451361,null,0,0]
[13107.75,13.107749999999999,2.0971810205161785,1.0737509092028037,1.0000245029610699,7.0003515270658104E-3,1,0,35844.636668691892,1.5707684286184032,2.4634479989184777,1.1527945375971893,1.0024563150942569,7.0018536221961095E-2,1.000567671130723,9.8632468929760714E-2,12.878949444901849,-94.731435564302458,85.268564435697542,null,1000000000,171813110.0625,null,14.4282996099465,-27.959906547327673,null,39.720374985377475,-66.771529016974782,null,0,0]
[13183,13.183,2.1064892998509155,1.0761464635704885,1.0000247851021786,7.0405383702956768E-3,1,0,36050.416372090702,1.5707685878642332,2.4752654908627045,1.1549141501207116,1.0024845638118622,7.0419180347993326E-2,1.0005743132099951,9.9199904618854362E-2,12.832028411246291,-94.800419342686311,85.199580657313689,null,1000000000,173791489,null,14.419900559659794,-27.861426037036562,null,39.68185300200863,-66.93899330564976,null,0,0]
[13259.75,13.25975,2.1159954679123367,1.0785680451601822,1.0000250745309947,7.0815262567415728E-3,1,0,36260.297996488422,1.5707687484225339,2.4873298929540804,1.1570552571300103,1.0025135413752726,7.0827787410345788E-2,1.0005811293507245,9.9778672402688534E-2,12.784421537537085,-94.870722530376312,85.129277469623688,null,1000000000,175820970.0625,null,14.411459857356894,-27.762170301269474,null,39.642686830602322,-67.108552229106863,null,0,0]
[13336.5,13.336499999999999,2.1255139332602462,1.080967952090331,1.0000253656398586,7.1225141193930605E-3,1,0,36470.179620887073,1.5707689071328461,2.4994055876989312,1.1591756845790815,1.0025426863083824,7.1236370783668138E-2,1.0005879876074499,0.10035746159852277,12.737063833769987,-94.940968468092379,85.059031531907621,null,1000000000,177862232.25,null,14.403143621094557,-27.664097953863585,null,39.603645363097563,-67.27687051422879,null,0,0]
[13413.25,13.41325,2.1350445314231936,1.083346446789748,1.000025658428769,7.163501958112441E-3,1,0,36680.061245286619,1.5707690640268921,2.5114924122061035,1.1612757118292532,1.0025719985965953,7.164493033361416E-2,1.0005948880243687,0.10093627232668376,12.689952575114283,-95.01115618669499,84.98884381330501,null,1000000000,179915275.5625,null,14.394949349799946,-27.567192982713895,null,39.564728375736465,-67.443963203981099,null,0,0]
[13490,13.49,2.1445871006455928,1.0857037879944325,1.0000259528977247,7.2044897727620147E-3,1,0,36889.942869687067,1.5707692191356721,2.5235902065564328,1.1633556136121066,1.0026014782252326,7.205346592588513E-2,1.0006018306459326,0.10151510470743541,12.6430850838277,-95.081284770684746,84.918715229315254,null,1000000000,181980100,null,14.386874602622676,-27.471439640941707,null,39.525935631627156,-67.609845129743036,null,0,0]
[13568.5,13.5685,2.1543594706759808,1.0880932630356215,1.000026255818897,7.2464121379470937E-3,1,0,37104.610068586153,1.5707693759659223,2.5359750306259503,1.1654624024328153,1.0026318031197212,7.2471291738718857E-2,1.0006089752740097,0.10210715774471531,12.59539837780199,-95.152950305176802,84.847049694823198,null,1000000000,184104192.25,null,14.378736901030049,-27.374678174437619,null,39.486386627194072,-67.778272130739197,null,0,0]
[13647,13.647,2.1641440300890626,1.0904611448363077,1.0000265604975991,7.2883344776608263E-3,1,0,37319.277267486133,1.5707695309919407,2.5483710013348646,1.1675487044494048,1.0026623030414701,7.2889092204853428E-2,1.000616164148191,0.10269923368754556,12.547961161810971,-95.224552203750747,84.775447796249253,null,1000000000,186240609,null,14.370719256880955,-27.279088959712865,null,39.446967055352147,-67.945463244037896,null,0,0]
[13725.5,13.7255,2.173940614297452,1.0928076985846999,1.0000268669338295,7.330256791755879E-3,1,0,37533.944466387009,1.5707696842446841,2.5607779568104005,1.1696147991423689,1.0026929779745071,7.3306867180748331E-2,1.0006233973168615,0.10329133266439965,12.500770716207448,-95.2960896484378,84.7039103515622,null,1000000000,188389350.25,null,14.362819243216256,-27.184655977264093,null,39.407676623413323,-68.1114336711737,null,0,0]
[13804,13.804,2.1837490614667363,1.0951331856528663,1.0000271751275864,7.3721790800849209E-3,1,0,37748.611665288758,1.5707698357544053,2.5731957381596646,1.1716609612945716,1.0027238279027708,7.3724616522916134E-2,1.0006306748286831,0.1038834548036809,12.453824368007808,-95.3675618717335,84.6324381282665,null,1000000000,190550416,null,14.355034491865297,-27.091363476705027,null,39.368515026564644,-68.276198395028459,null,0,0]
[13884.25,13.88425,2.1937882651844278,1.0974890066625171,1.0000274920086372,7.415035914933219E-3,1,0,37968.064438689187,1.570769988870778,2.5859013771911128,1.1737324158235656,1.0027555464419311,7.415165210186507E-2,1.0006381604659775,0.10448880119440543,12.406081029826762,-95.440559257863043,84.559440742136957,null,1000000000,192772398.0625,null,14.347192934047612,-26.997153983930389,null,39.328613246201279,-68.443405273932655,null,0,0]
[13964.5,13.964499999999999,2.2038395332274527,1.0998233516794207,1.0000278107264455,7.4578927225425187E-3,1,0,38187.517212090512,1.5707701402273184,2.598618003596608,1.1757836052958932,1.0027874478313894,7.4578660588358089E-2,1.0006456925492768,0.10509417206293734,12.358587288810012,-95.51348701338722,84.48651298661278,null,1000000000,195007260.25,null,14.339467010791747,-26.904103940261312,null,39.288845428440396,-68.609383073125898,null,0,0]
[14044.75,14.044750000000001,2.2139027012772572,1.1021364879423159,1.0000281312810098,7.5007495027554164E-3,1,0,38406.969985492695,1.5707702898541931,2.6113454568585222,1.1778148086341234,1.0028195320536955,7.5005641829270026E-2,1.0006532711314688,0.10569956754622996,12.311340433154392,-95.586344469682743,84.413655530317257,null,1000000000,197255002.5625,null,14.331854371899741,-26.812197357566752,null,39.249211211676787,-68.774147112115969,null,0,0]
[14125,14.125,2.2239776077965625,1.1044286787638797,1.0000284536723283,7.5436062554145086E-3,1,0,38626.422758895729,1.5707704377808827,2.6240835794380795,1.1798263000115115,1.0028517990913011,7.5432595671534888E-2,1.0006608962657448,0.10630498778115804,12.264337797242552,-95.659131005254679,84.340868994745321,null,1000000000,199515625,null,14.324352724404809,-26.721418519795396,null,39.209710223259876,-68.937712485459286,null,0,0]
[14207.25,14.20725,2.2343156171172858,1.1067565323205109,1.0000287860043076,7.5875310603796481E-3,1,0,38851.344760297216,1.5707705876600924,2.637150072732469,1.1818677490050711,1.0028850599796646,7.587016151650286E-2,1.0006687597972992,0.1069255221985986,12.216414439745439,-95.733657338880548,84.266342661119452,null,1000000000,201845952.5625,null,14.316776954412765,-26.629531371890099,null,39.169362635754808,-69.104125966990438,null,0,0]
[14289.5,14.2895,2.244665622413005,1.1090629311207125,1.0000291202657297,7.6314558360656565E-3,1,0,39076.26676169956,1.5707707358139003,2.6502274479879442,1.1838890595583516,1.0029185128715241,7.630769825474569E-2,1.0006766723443237,0.10754608290766741,12.168742100568839,-95.80810799467254,84.19189200532746,null,1000000000,204189810.25,null,14.309313077044406,-26.538796305069337,null,39.129154173946567,-69.2693116896032,null,0,0]
[14371.75,14.37175,2.2550274585082586,1.1113481462100487,1.0000294564565924,7.6753805823030659E-3,1,0,39301.188763102757,1.5707708822719297,2.6633155449071437,1.1858905119254286,1.002952157747667,7.6745205721661672E-2,1.0006846339650759,0.1081666700554702,12.121318053614882,-95.882482445726438,84.117517554273562,null,1000000000,206547198.0625,null,14.30195880024343,-26.449197254223687,null,39.089084403793578,-69.433285191502733,null,0,0]
[14454,14.454000000000001,2.265400963062512,1.1136124445630269,1.0000297945768941,7.7193052989224104E-3,1,0,39526.110764506782,1.5707710270631303,2.6764142061980807,1.1878723815171472,1.0029859945887731,7.7182683752715919E-2,1.0006926447181479,0.10878728378902403,12.074139619001862,-95.956780209340266,84.043219790659734,null,1000000000,208918116,null,14.29471188819565,-26.360718431705585,null,39.049152881228345,-69.596061777634702,null,0,0]
[14622.5,14.6225,2.2866882271143778,1.1181869449793016,1.0000304932862103,7.8092907953880618E-3,1,0,39986.89322331272,1.5707713186004735,2.7032808884533179,1.1918724865646202,1.0030559132107559,7.8078822727905339E-2,1.0007092094822831,0.11005877671914199,11.978244291861484,-96.108747714324622,83.891252285675378,null,1000000000,213817506.25,null,14.280191771828667,-26.182890979668073,null,38.96777767045495,-69.92585673465652,null,0,0]
[14706.75,14.70675,2.2973495538923854,1.120442381091344,1.0000308456774789,7.8542834962849022E-3,1,0,40217.284452716936,1.5707714618639668,2.7167302094327446,1.1938428545302864,1.0030911745597839,7.8526845187819022E-2,1.0007175694428676,0.11069456565146076,11.930672123023545,-96.184609051158631,83.815390948841369,null,1000000000,216288495.5625,null,14.273091596125953,-26.095675215521613,null,38.92730567731973,-70.088933835637022,null,0,0]
[14791,14.791,2.308022459268245,1.1226769690188751,1.0000312000931517,7.8992761653815802E-3,1,0,40447.675682121968,1.5707716034953934,2.7301899737706288,1.1957938022842427,1.0031266372392309,7.8974836060539066E-2,1.0007259812082447,0.11133038310546832,11.883346681501489,-96.260388303848771,83.739611696151229,null,1000000000,218773681,null,14.266095090829298,-26.009570244221241,null,38.886976741094323,-70.250818059627534,null,0,0]
[14877.25,14.87725,2.3189605546185148,1.1249432845327776,1.0000315650193108,7.9453368765774138E-3,1,0,40683.536139525582,1.5707717468272981,2.7439799154518383,1.1977712291248583,1.0031631502965901,7.9433428826324731E-2,1.0007346463911713,0.11198132385867769,11.835150608116722,-96.337881121492813,83.662118878507187,null,1000000000,221332567.5625,null,14.259037673172973,-25.92255567416661,null,38.845838085365884,-70.415325447326211,null,0,0]
[14963.5,14.9635,2.3299104487139237,1.1271883094542412,1.0000319320671245,7.9913975540590824E-3,1,0,40919.396596930019,1.5707718885068653,2.7577804793617289,1.1997288725647435,1.0031998743111243,7.9891988113244841E-2,1.0007433660054872,0.11263229483775929,11.787207552554174,-96.415287304289876,83.584712695710124,null,1000000000,223906332.25,null,14.252084464080728,-25.83667259660988,null,38.80484823889558,-70.578614707680018,null,0,0]
[15049.75,15.04975,2.3408719759815484,1.1294123200831603,1.0000323012365901,8.0374581976311761E-3,1,0,41155.25705433527,1.5707720285625038,2.771591506826764,1.2016670132320844,1.0032368092596673,8.0350513732137974E-2,1.0007521401215147,0.11328329621148854,11.739514771561003,-96.492606604717977,83.507393395282023,null,1000000000,226494975.0625,null,14.245233299506348,-25.751904923529885,null,38.764006622476792,-70.740701681188085,null,0,0]
[15136,15.135999999999999,2.3518449737610125,1.1316155884026595,1.000032672527706,8.0835188070982958E-3,1,0,41391.117511741315,1.5707721670219741,2.7854128422013162,1.2035859267775399,1.0032739551189227,8.0809005493927125E-2,1.0007609688099794,0.11393432814852854,11.692069567923419,-96.569838813074995,83.430161186925005,null,1000000000,229098496,null,14.238482069191443,-25.668236852064521,null,38.72331264915411,-70.901601961010485,null,0,0]
[15224,15.224,2.3630522682473774,1.1338424606373332,1.0000330535389206,8.1305139443033254E-3,1,0,41631.763543646266,1.5707723066738406,2.79952507580373,1.205524239481828,1.0033120720111193,8.1276764896508286E-2,1.0007700329496303,0.11459860110389694,11.643914119472194,-96.648548111220137,83.351451888779863,null,1000000000,231770176,null,14.231694718530131,-25.583988355693968,null,38.681944551364197,-71.064559755526162,null,0,0]
[15312,15.311999999999999,2.3742711703537585,1.1360482988989165,1.0000334367587496,8.1775090455944114E-3,1,0,41872.409575552025,1.5707724447205131,2.8136477218474476,1.2074431012459685,1.0033504084101448,8.1744488656757375E-2,1.0007791540487438,0.11526290622976434,11.596010866162418,-96.727166419424194,83.272833580575806,null,1000000000,234457344,null,14.225007124891334,-25.500852181976658,null,38.640728891693215,-71.226314237447525,null,0,0]
[15400,15.4,2.3855015163098789,1.1382333786369074,1.0000338221871901,8.2245041107640166E-3,1,0,42113.055607458562,1.5707725811895097,2.8277806243254391,1.2093427894728244,1.0033889642908391,8.2212176574127868E-2,1.0007883321837368,0.11592724370490391,11.548357084502252,-96.805693626108663,83.194306373891337,null,1000000000,237160000,null,14.218417210152062,-25.418812426985522,null,38.599665024772321,-71.386881199123152,null,0,0]
[15488,15.488,2.3967431452494545,1.1403979709337775,1.0000342098242399,8.271499139604602E-3,1,0,42353.701639365878,1.5707727161077221,2.8419236302217903,1.211223576602787,1.0034277396279025,8.2679828448166695E-2,1.0007975674314624,0.11659161370796407,11.500950096336148,-96.884129653773826,83.115870346226174,null,1000000000,239878144,null,14.211922947972727,-25.337853471091581,null,38.558752298785549,-71.546276182682249,null,0,0]
[15578.25,15.578250000000001,2.4082837560864907,1.1425969074859033,1.0000346096664976,8.3196957079355351E-3,1,0,42600.500552771613,1.5707728528923106,2.8564385840659257,1.213133100132427,1.0034677342979357,8.3159399683010032E-2,1.0008070982104518,0.11727300441713719,11.452584578147496,-96.964476395384906,83.035523604615094,null,1000000000,242681873.0625,null,14.205359921974239,-25.255931076780701,null,38.516949806595385,-71.708545318604209,null,0,0]
[15668.5,15.6685,2.4198359006458539,1.1447748593156379,1.0000350118317431,8.3678922376138123E-3,1,0,42847.299466178141,1.5707729881011505,2.8709638479475985,1.2150233085301567,1.0035079597356504,8.3638932581078143E-2,1.0008166892251911,0.11795442971905494,11.404473070922936,-97.04472717392153,82.95527282607847,null,1000000000,245501892.25,null,14.1988933459706,-25.175113071191124,null,38.475304875374469,-71.869614102730409,null,0,0]
[15758.75,15.758749999999999,2.4313994145293507,1.146932105016724,1.0000354163199738,8.4160887284155696E-3,1,0,43094.098379585448,1.5707731217613146,2.8854992661682632,1.216894480080283,1.0035484159132972,8.411842692645545E-2,1.0008263405600126,0.1186358898060087,11.356612827474898,-97.124882007323507,82.875117992676493,null,1000000000,248338201.5625,null,14.192521194129258,-25.095383498986621,null,38.433816783767774,-72.029498508336872,null,0,0]
[15849,15.849,2.4429741362911459,1.1490689186817244,1.0000358231311866,8.4642851801169389E-3,1,0,43340.897292993504,1.5707732538992589,2.9000446860431421,1.218746888023174,1.0035891028029713,8.4597882503331945E-2,1.000836052299731,0.11931738487014867,11.309001146224688,-97.204940944590973,82.795059055409027,null,1000000000,251190801,null,14.186241491475641,-25.016726693798141,null,38.392484805171179,-72.188214250792868,null,0,0]
[15941.25,15.94125,2.4548167797145677,1.1512322500591847,1.0000362413583737,8.5135496565871827E-3,1,0,43593.165434400304,1.5707733874191911,2.9149226227859066,1.2206212339297642,1.0036309297497328,8.5087922843246663E-2,1.0008460417745142,0.12001401866633564,11.260588478111055,-97.286675015708752,82.713324984291248,null,1000000000,254123451.5625,null,14.179916166912687,-24.937419477309138,null,38.350397461620503,-72.349255538399589,null,0,0]
[16033.5,16.0335,2.4666708013413223,1.1533747988426162,1.0000366620126357,8.5628140917318879E-3,1,0,43845.433575807867,1.5707735194026888,2.9298106961277295,1.2224765370143815,1.0036729976878371,8.5577922221731412E-2,1.0008560945418223,0.12071068941263711,11.212429944290665,-97.368309089735348,82.631690910264652,null,1000000000,257073122.25,null,14.173683417934964,-24.859200899202182,null,38.308471676777835,-72.509108190533169,null,0,0]
[16125.75,16.12575,2.4785360379168164,1.1554968436899828,1.000037085093969,8.6120784853119751E-3,1,0,44097.701717216187,1.5707736498761198,2.944708752320544,1.2243130734347543,1.003715306586983,8.6067880408654332E-2,1.0008662106937991,0.12140739731380003,11.164522800502226,-97.449843309993838,82.550156690006162,null,1000000000,260039813.0625,null,14.167541290536947,-24.782055125130103,null,38.266706660387413,-72.667788184863738,null,0,0]
[16218,16.218,2.490412329144684,1.1575986586899871,1.0000375106023711,8.6613428370883733E-3,1,0,44349.969858625256,1.5707737788652527,2.9596166406099549,1.2261311142964622,1.0037578564167007,8.6557797174001333E-2,1.0008763903231148,0.12210414257441363,11.116864347789672,-97.53127784743792,82.46872215256208,null,1000000000,263023524,null,14.161487879963095,-24.705966610184969,null,38.225101618248715,-72.825311237252933,null,0,0]
[16312.5,16.3125,2.5025895838759658,1.159731043280505,1.0000379490056088,8.7118087148248587E-3,1,0,44608.390881532854,1.5707739094877415,2.9748981761517435,1.2279745980825112,1.003801693831883,8.7059619939114957E-2,1.0008868841520573,0.12281792057293615,11.068298582578821,-97.614595439969932,82.385404560030068,null,1000000000,266097656.25,null,14.155376873373037,-24.629102580177651,null,38.182646859627923,-72.985492859792274,null,0,0]
[16407,16.407,2.5147781078075648,1.1618427670865163,1.0000383899557459,8.7622745481857056E-3,1,0,44866.811904441209,1.5707740386055282,2.9901897183287942,1.2297992332197305,1.0038457840084036,8.7561398749199229E-2,1.0008974447911143,0.12353173820965235,11.019988195384528,-97.697808873768665,82.302191126231335,null,1000000000,269189649,null,14.149355069871142,-24.553315893548273,null,38.140358275935519,-73.144492980220377,null,0,0]
[16501.5,16.5015,2.5269777378732492,1.1639341103723282,1.0000388334527788,8.8127403369139233E-3,1,0,45125.232927350298,1.5707741662444636,3.0054911144037919,1.2316052953487573,1.0038901269129594,8.8063133357384582E-2,1.0009080723416235,0.12424559570396808,10.971930426027388,-97.780918413673149,82.219081586326851,null,1000000000,272299502.25,null,14.143420573297686,-24.478590744588221,null,38.098235003151835,-73.302327669084917,null,0,0]
[16596,16.596,2.5391883139934506,1.1660053487317401,1.0000392794967043,8.8632060807525195E-3,1,0,45383.653950260123,1.5707742924298105,3.0208022146366531,1.233393055011905,1.0039347225120618,8.8564823516933955E-2,1.0009187669055015,0.12495949327511127,10.924122559756007,-97.863924348998253,82.136075651001747,null,1000000000,275427216,null,14.137571535569922,-24.404911619675158,null,38.056276174608215,-73.459012729323064,null,0,0]
[16692.5,16.692499999999999,2.5516684476947917,1.1680999567658283,1.0000397376090258,8.9147398360699508E-3,1,0,45647.544201168763,1.5707744198113429,3.0364472211583475,1.235200039213737,1.0039805226715601,8.9077085331697045E-2,1.0009297570716649,0.12568854137528793,10.875558004334851,-97.948580431706446,82.051419568293554,null,1000000000,278639556.25,null,14.131685027757609,-24.330736789594454,null,38.013598126999376,-73.617843642112007,null,0,0]
[16789,16.789000000000001,2.5641596675371701,1.1701741661976777,1.0000401983771783,8.9662735440359242E-3,1,0,45911.434452078145,1.5707745457285454,3.0521020406003001,1.2369884924651293,1.0040265862636868,8.9589300276888259E-2,1.0009408173344092,0.12641763172809459,10.82724846054,-98.033129160130727,81.966870839869273,null,1000000000,281870521,null,14.12588388650134,-24.257620935436918,null,37.971089724460796,-73.775508224693766,null,0,0]
[16885.5,16.8855,2.5766618122893927,1.1722282559748649,1.0000406618011584,9.0178072043767855E-3,1,0,46175.324702988255,1.5707746702065237,3.0677665227364521,1.2387586871022715,1.0040729132521853,9.0101468090203196E-2,1.0009519478041313,0.12714676456639382,10.779191177571603,-98.117570912842794,81.882429087157206,null,1000000000,285120110.25,null,14.120166289995908,-24.185548439897822,null,37.92875003799783,-73.932022472944965,null,0,0]
[16982,16.981999999999999,{"$f":"SQRT(1+(A269/pole1)^2)","v":2.5891747236946996},{"$f":"ATAN(A269/pole1)","v":1.1742625003388085},{"$f":"SQRT(1+(A269/Zero1)^2)","v":1.0000411278809618},{"$f":"ATAN(A269/Zero1)","v":9.0693408168188872E-3},{"$f":"IF(VIN_nom>Vout, 1, SQRT(1+(A269/z_RHP)^2))","v":1},{"$f":"IF(VIN_nom>Vout, 0, -ATAN(A269/z_RHP))","v":0},{"$f":"SQRT(1+(A269/Pole2)^2)","v":46439.214953899056},{"$f":"ATAN(A269/Pole2)","v":1.5707747932698128},3.083440520301667,1.2405108903867663,{"$f":"SQRT(1+(A269/pole4)^2)","v":1.0041195036005988},{"$f":"ATAN(A269/pole4)","v":9.0613588509484616E-2},{"$f":"SQRT((1-(V269/pterm2))^2+(A269/pterm1)^2)","v":1.0009631485918593},{"$f":"IF((ATAN((A269/pterm1)/(1-A269^2/pterm2))>0),ATAN((A269/pterm1)/(1-A269^2/pterm2)),PI()+ATAN((A269/pterm1)/(1-A269^2/pterm2)))","v":0.12787594012285006},{"$f":"20*LOG10(((E269*K269*G269)/(C269*I269*O269*M269))*Adc)","v":10.731383449640941},{"$f":"((F269+L269+H269)-(D269+J269+P269+N269))*radconv","v":-98.201906089488304},{"$f":"IF(R269>0,R269,R269+180)","v":81.798093910511696},null,1000000000,288388324,null,{"$f":"20*LOG10((K269/(I269*M269))*AEA)","v":14.114530462751231},{"$f":"(L269-(J269+N269))*radconv","v":-24.114503976400499},null,{"$f":"20*LOG10((E269*G269/(C269*O269))*Acs*Am)","v":37.886578137311844},{"$f":"(F269+H269-(D269+P269))*radconv","v":-74.087402113087791},null,0,0]
[17081,{"$f":"A270/1000","v":17.081},2.6020228296378498,1.1763291046479607,1.0000416087952884,9.1222094468778152E-3,1,0,46709.941739808281,1.5707749180762636,3.0995303170630533,1.2422900659029279,1.0041675745969196,9.1138926770836917E-2,1.0009747127466435,0.12862405087394974,10.682593726324894,-98.288315801686423,81.711684198313577,null,{"$f":"IF(Q270<0,A270,1000000000)","v":1000000000},{"$f":"A270^2","v":291760561},null,14.108831790263888,-24.042671544304465,null,37.843487086483137,-74.245644257381954,null,{"$f":"SUM((Q271<0)*(Q270>0))*A270","v":0},0]
[17180,17.18,2.6148819392063789,1.1783753918957278,1.0000420925048203,9.175078025940548E-3,1,0,46980.668525718218,1.5707750414443162,3.115629823925739,1.2440508597487299,1.0042159226971208,9.1664214592195176E-2,1.0009863511488195,0.12937220708070371,10.634061027461147,-98.374614259073041,81.625385740926959,null,1000000000,295152400,null,14.103215536584576,-23.971889331928711,null,37.800570641298705,-74.402724927144305,null,0,0]
[17279,17.279,2.6277518908589852,1.1804016433393283,1.0000425790095542,9.2279465537116155E-3,1,0,47251.395311628861,1.5707751633986946,3.1317388911379287,1.2457935445762855,1.0042645478611811,9.2189451690982832E-2,1.000998063920336,0.130120408993674,10.585782572493486,-98.460801954283554,81.539198045716446,null,1000000000,298563841,null,14.097679927648077,-23.902141702684002,null,37.757827795267538,-74.558660251599562,null,0,0]
[17378,17.378,2.6406325260687722,1.1824081354132872,1.0000430683094854,9.2808150298955491E-3,1,0,47522.122097540196,1.5707752839635596,3.1478573719252085,1.2475183878982465,1.0043134500488571,9.2714637784789958E-2,1.0010098511838394,0.1308686568631981,10.537755626325078,-98.546879398067304,81.453120601932696,null,1000000000,301994884,null,14.092223234810648,-23.833413314427812,null,37.715257541936566,-74.713466083639489,null,0,0]
[17479.25,17.47925,2.6538167913912627,1.1844400746323853,1.0000435716210758,9.334885008689349E-3,1,0,47799.001764950233,1.5707754058558989,3.1643517688242357,1.2492642513898211,1.0043637501468645,9.3251706875076071E-2,1.0010219835189713,0.13163395816190487,10.488894502653734,-98.63479965896147,81.36520034103853,null,1000000000,305524180.5625,null,14.086722397632084,-23.764161480772398,null,37.671897255443781,-74.870638178189054,null,0,0]
[17580.5,17.580500000000001,2.6670119053740731,1.1864519159404256,1.0000440778563531,9.3889549328993772E-3,1,0,48075.881432360969,1.5707755263442282,3.1808557107454369,1.250992003197656,1.004414339917709,9.3788722018665963E-2,1.0010341940322833,0.13239930805875497,10.44029080436715,-98.722605733647057,81.277394266352943,null,1000000000,309073980.25,null,14.081300586701687,-23.695944198794475,null,37.628715368087597,-75.026661534852579,null,0,0]
[17681.75,17.681750000000001,2.6802177077884592,1.1884439400057738,1.000044587015313,9.4430248022095639E-3,1,0,48352.76109977239,1.5707756454526667,3.1973690498824578,1.2527019135483322,1.0044652193176224,9.4325682913999662E-2,1.0010464828572383,0.13316470682080736,10.39194174653267,-98.810298219817597,81.189701780182403,null,1000000000,312644283.0625,null,14.075956091504661,-23.628745969755222,null,37.585710805450141,-75.181552250062353,null,0,0]
[17783,17.783000000000001,2.693434041419533,1.1904164226237912,1.0000450990979508,9.4970946163038406E-3,1,0,48629.640767184494,1.5707757632047838,3.2138916413834249,1.2543942475335756,1.0045163883025956,9.4862589259703298E-2,1.0010588501280617,0.13393015471486919,10.343844589585728,-98.897877730134184,81.102122269865816,null,1000000000,316235089,null,14.070687245488509,-23.562551589100533,null,37.542882494519354,-75.335326141033647,null,0,0]
[17886.5,17.886500000000002,2.7069547955979338,1.1924128227026978,1.0000456255820542,9.5523659244232603E-3,1,0,48912.67331609533,1.5707758821957309,3.2307908168383768,1.2561062931251155,1.0045689936394433,9.5411370162507933E-2,1.0010715734477837,0.13471266362155129,10.294936160601287,-98.987287334636122,81.012712665363878,null,1000000000,319926882.25,null,14.065377812863913,-23.495908249582325,null,37.499283498159507,-75.491379085053751,null,0,0]
[17990,17.989999999999998,2.7204862313854421,1.1943893707918227,1.0000461551212114,9.6076371741775912E-3,1,0,49195.70586500685,1.5707759998175215,{"$f":"SQRT(1+(A279/Zero2)^2)","v":3.2476993634979667},{"$f":"ATAN(A279/Zero2)","v":1.2578005167415278},1.0046219014810338,9.596009342808301E-2,1.0010843790246635,0.1354952244311293,10.246285304211714,-99.076580224209891,80.923419775790109,null,1000000000,323640100,null,14.060144042281228,-23.43028265320579,null,37.45586641235262,-75.646297571004112,null,0,0]
[18093.5,18.093499999999999,2.7340281901836518,1.1963463463194135,1.0000466877154173,9.6629083652292214E-3,1,0,49478.738413919047,1.5707761160936515,3.2646171357523648,1.2594771856493907,1.0046751117795762,9.6508758735122505E-2,1.0010972670045448,0.13627783742777069,10.197889234562362,-99.165757094905601,80.834242905094399,null,1000000000,327374742.25,null,14.054984287564867,-23.365659469660713,null,37.41263009741963,-75.800097625244902,null,0,0]
[18197,18.196999999999999,2.7475805163987546,1.1982840238067529,1.0000472233646671,9.7181794972405512E-3,1,0,49761.770962831906,1.5707762310470823,3.2815439909158339,1.2611365620001516,1.0047286244870157,9.7057365762527784E-2,1.0011102375341026,0.13706050289536176,10.149745211014604,-99.254818654665456,80.745181345334544,null,1000000000,331130809,null,14.049896944983502,-23.302023661693543,null,37.369573416453235,-75.952794992971903,null,0,0]
[18303,18.303000000000001,2.7614707800725489,1.2002487840092702,1.0000477751189247,9.7747856192003258E-3,1,0,50051.640046743327,1.5707763474296024,3.2988889758755948,1.2628183644216413,1.0047837431754039,9.7619163423903144E-2,1.0011236070802947,0.13786212800964245,10.100696722932712,-99.345912688484219,80.654087311515781,null,1000000000,334999809,null,14.044760144187824,-23.237858784058322,null,37.325661729167024,-76.108053904425887,null,0,{"$f":"IF(AD282>0,S282,0)","v":0}]
[18409,18.408999999999999,2.7753715970766693,1.2021938701333439,1.0000483300775849,9.8313916785164029E-3,1,0,50341.509130655424,1.5707764624718492,3.3162431939878338,1.2644825694431527,1.0048391789553839,9.8180899275140524E-2,1.0011370635263162,0.13866380876212839,10.05190692644905,-99.436887310562923,80.563112689437077,null,1000000000,338891281,null,14.039696021969641,-23.174698544921362,null,37.281936054901543,-76.26218876564154,null,0,0]
[18515,18.515000000000001,2.7892828096287192,1.2041195617163585,1.0000488882406424,9.8879976748261263E-3,1,0,50631.378214568176,1.570776576196842,3.3336065010536431,1.2661294427453305,1.0048949317744782,9.8742572971990461E-2,1.0011506070324414,0.1394655454568495,10.003373018425881,-99.527743313869493,80.472256686130507,null,1000000000,342805225,null,14.034702985719997,-23.112527703497886,null,37.23839518312802,-76.415215610371604,null,0,0]
[18621,18.620999999999999,2.8032042629615179,1.2060261333242774,1.0000494496080916,9.9446036077668418E-3,1,0,50921.247298481583,1.5707766886270764,3.3509787557880735,1.2677592448798138,1.0049510015799203,9.9304184170436585E-2,1.0011642377598595,0.14026733839751901,9.9550922411554605,-99.61848150036613,80.38151849963387,null,1000000000,346741641,null,14.029779484095402,-23.051331312856817,null,37.195037907482195,-76.567150187509284,null,0,0]
[18729.5,18.729500000000002,2.8174644999262557,1.2079581510159834,1.0000500275339796,1.000254452028879E-2,1,0,51217.952917393595,1.5707768023909894,3.3687698557250041,1.2694100725979109,1.0050087220197035,9.9878975830363842E-2,1.001178280467117,0.14108810011715839,9.9059320907020822,-99.711238566379123,80.288761433620877,null,1000000000,350794170.25,null,14.024810298778153,-22.989685506241425,null,37.150846942346064,-76.72155306013768,null,0,0]
[18838,18.838000000000001,2.8317351476747894,1.2098707028188602,1.000050608817181,1.0060485365648507E-2,1,0,51514.65853630627,1.5707769148444251,3.3865700398672907,1.2710435508650522,1.005066774461546,0.10045370128046721,1.0011924149030769,0.14190892141003977,9.8570314466136999,-99.80387391794936,80.19612608205064,null,1000000000,354870244,null,14.019910804668021,-22.929029881315518,null,37.106845792367807,-76.874844036633846,null,0,0]
[18946.5,18.9465,2.8460160496001765,1.2117640676662056,1.0000511934576899,1.0118426143457076E-2,1,0,51811.364155219584,1.5707770260098977,3.4043791657215294,1.272659943172586,1.0051251588479224,0.1010283601525775,1.0012066412435792,0.14272980260083221,9.8083874927788059,-99.896388438655322,80.103611561344678,null,1000000000,358969862.25,null,14.015079464309522,-22.869349321332294,null,37.063033178891416,-77.027039117323028,null,0,0]
[19055,19.055,2.8603070521116796,1.2136385194730364,1.0000517814555006,1.0176366853325586E-2,1,0,52108.069774133539,1.570777135909408,3.4221970936896211,1.274259507885585,1.0051838751209909,0.1016029520787867,1.0012209596654675,0.14355074401384879,9.7599974586490461,-99.988783018228148,80.011216981771852,null,1000000000,363093025,null,14.010314780251729,-22.8106290032445,null,37.019407828819446,-77.178154014983662,null,0,0]
[19165.75,19.165749999999999,2.8749046723440865,1.2155326163029561,1.0000523851092638,1.0235509028180328E-2,1,0,52410.928274546342,1.5707772468046544,3.4403934536465588,1.2758751517167586,1.0052441512339496,0.10218939008127553,1.0012356701633127,0.14438877200240374,9.710862986699933,-100.08297084612261,79.917029153877394,null,1000000000,367325973.0625,null,14.005518518872556,-22.751666206772811,null,36.975069618249506,-77.331304639349824,null,0,0]
[19276.5,19.276499999999999,2.8895125023596782,1.2174075687215471,1.0000529922610029,1.0294651131429192E-2,1,0,52713.786774959786,1.5707773564256395,3.4585986995700417,1.2774737909499831,1.0053047730184268,0.10277575755875394,1.0012504769767059,0.14522686341844715,9.6619873824917839,-100.17703559617618,79.822964403823818,null,1000000000,371583452.25,null,14.000788676424747,-22.693673588201786,null,36.930923856489173,-77.483362007974421,null,0,0]
[19387.25,19.387250000000002,2.9041303880922591,1.2192636525349621,1.0000536029107114,1.0353793162658579E-2,1,0,53016.645275373856,1.570777464794201,3.4768126918742897,1.2790556845954941,1.0053657404118923,0.10336205412079842,1.0012653802969529,0.14606501860572743,9.6133678399447557,-100.27097822932467,79.729021770675331,null,1000000000,375865462.5625,null,13.996123781540382,-22.636636286219652,null,36.886969208826507,-77.634341943105056,null,0,0]
[19498,19.498000000000001,2.9187581784570433,1.221101138546127,1.000054217058383,1.0412935121454888E-2,1,0,53319.503775788544,1.5707775719316805,3.4950352938168998,1.2806210866008965,1.0054270533514746,0.10394827937727494,1.0012803803164476,0.14690323790759721,9.5650015981938843,-100.364799709873,79.635200290127003,null,1000000000,380172004,null,13.991522401188139,-22.58053972957017,null,36.843204347427879,-77.784259980302807,null,0,0]
[19611.75,19.611750000000001,2.9337923620272606,1.2229693174249701,1.0000548514834779,1.0473679043929925E-2,1,0,53630.566118201546,1.5707776807116565,3.513760332181576,1.2822119860109644,1.0054903867849179,0.10455030968616297,1.0012958875240658,0.14776423002764547,9.5155860425461185,-100.46103752604502,79.538962473954982,null,1000000000,384620738.0625,null,13.986861031077403,-22.523887936150448,null,36.798450161890848,-77.937149589894588,null,0,0]
[19725.5,19.7255,2.9488366803769672,1.224818440624418,1.0000554895985947,1.0534422889110169E-2,1,0,53941.628460615182,1.5707777882370408,3.5324941694413217,1.2837860153712168,1.005554084602809,0.10515226394079008,1.0013114971556087,0.14862529051573453,9.4664319348256445,-100.55714960702436,79.442850392975643,null,1000000000,389095350.25,null,13.982263717872051,-22.468198295915453,null,36.753893367375724,-78.0889513111089,null,0,0]
[19839.25,19.83925,2.9638909791777688,1.2266487857668775,1.0000561314037264,1.0595166656547498E-2,1,0,54252.690803029429,1.5707778945294135,3.5512366663457162,1.2853434339269021,1.0056181467359058,0.10575414171941525,1.0013272094231138,0.14948641974256188,9.4175364261234389,-100.6531370040821,79.346862995917903,null,1000000000,393595840.5625,null,13.977729027559169,-22.41345593227906,null,36.709532548986402,-78.23968107180302,null,0,0]
[19953,19.952999999999999,2.9789551071195413,1.2284606253680528,1.0000567768988655,1.0655910345793799E-2,1,0,54563.75314544428,1.5707779996098625,3.5699876865049123,1.2868844958027352,1.0056825731145873,0.1063559426006262,1.0013430245398269,0.15034761807837388,9.3688967135429309,-100.74900076924662,79.250999230753379,null,1000000000,398122209,null,13.973255563763882,-22.359646262030701,null,36.665366300201178,-78.389354507215913,null,0,0]
[20069,20.068999999999999,2.9943271757341519,1.230289522627853,1.0000574389622463,1.0717855477572836E-2,1,0,54880.968369358066,1.5707781055420695,3.5891182452899284,1.2884394532658581,1.0057486489127601,0.1069695676049869,1.0013592586262452,0.1512259226628786,9.3195554737101229,-100.8466345071772,79.1533654928228,null,1000000000,402764761,null,13.968755259411861,-22.30571795443171,null,36.6205253647204,-78.540916552745486,null,0,0]
[20185,20.184999999999999,3.0097091576406383,1.232099731683068,1.0000581048630417,1.0779800527095736E-2,1,0,55198.183593272457,1.5707782102567254,3.6082573901450554,1.2899779186104721,1.0058151033613105,0.10758311175563684,1.0013756001226275,0.15210429989363808,9.2704745038779119,-100.94414188334378,79.055858116656225,null,1000000000,407434225,null,13.964315809223102,-22.252729873282661,null,36.575883845076945,-78.691412010061143,null,0,0]
[20301,20.300999999999998,3.0251009016181873,1.2338915258361056,1.0000587746012441,1.0841745493887275E-2,1,0,55515.398817187452,1.5707783137747011,3.6274049851631882,1.2915001456612003,1.005881936385191,0.10819657460672631,1.0013920492590089,0.15298275016183979,9.2216509729107692,-101.04152401183245,78.95847598816755,null,1000000000,412130601,null,13.959935845890213,-22.200667451154395,null,36.531440277442691,-78.840856560678048,null,0,0]
[20417,20.417000000000002,3.0405022594130409,1.2356651733300863,1.0000594481768459,1.0903690377472231E-2,1,0,55832.614041103036,1.570778416116394,3.6465608972323609,1.2930063832137144,1.0059491479089462,0.10880995571276848,1.0014086062667311,0.15386127385817169,9.1730820951950918,-101.13878200495601,78.861217995043987,null,1000000000,416853889,null,13.955614037998568,-22.149516408749122,null,36.487193207618652,-78.989265596206891,null,0,0]
[20536,20.536000000000001,3.0563117658405292,1.2374661102465532,1.0000601431600453,1.0967237196948204E-2,1,0,56158.033107017021,1.5707785199034383,3.6662207266588371,1.2945352156392922,1.0060184908918901,0.10943911471322493,1.0014257038088517,0.15476259470506137,9.1235188704203072,-101.23842746186928,78.761572538130721,null,1000000000,421727296,null,13.951239531382587,-22.097974865050308,null,36.442004489459855,-79.140452596818974,null,0,0]
[20655,20.655000000000001,3.0721310829866058,1.2392485057742919,1.0000608421816806,1.1030783927844991E-2,1,0,56483.452172931618,1.5707786224945823,3.6858890338236487,1.2960477355345672,1.0060882320432618,0.1100681867371681,1.0014429153714535,0.1556639936585211,9.0742178447561255,-101.33794464294637,78.662055357053632,null,1000000000,426629025,null,13.946923499731998,-22.047362908584905,null,36.397019495446266,-79.290581734361467,null,0,0]
[20774,20.774000000000001,3.0879600600732204,1.2410126336315217,1.0000615452417425,1.1094330569649554E-2,1,0,56808.871238846805,1.5707787239103779,3.705565683733028,1.2975441957833287,1.0061583712802651,0.11069717130484877,1.001460241208578,0.15656547113868277,9.0251761536938631,-101.43733473970326,78.56266526029674,null,1000000000,431559076,null,13.942664616211362,-21.997666023869016,null,36.352236687904636,-79.439668715834259,null,0,0]
[20893,20.893000000000001,3.1037985493069811,1.2427587624093375,1.0000622523402232,1.1157877121848856E-2,1,0,57134.290304762559,1.5707788241709082,3.7252505441886758,1.2990248442153631,1.0062289085196543,0.11132606793692792,1.0014776815757123,0.15746702756511144,8.9763909788625487,-101.53659893943068,78.463401060569325,null,1000000000,436517449,null,13.938461589022168,-21.948869984988388,null,36.307654540262519,-79.587728954442255,null,0,0]
[21014.75,21.014749999999999,3.1200127473846102,1.2445268899552975,1.00006297995869,1.122289209353877E-2,1,0,57467.229559176965,1.5707789255732314,3.7453986692175909,1.3005235984647607,1.0063014876389711,0.11196940638779675,1.0014956437751488,0.15838950041960342,8.9267410001523064,-101.63802799830628,78.361972001693715,null,1000000000,441619717.5625,null,13.934217928878494,-21.89986407987303,null,36.262248221695941,-79.738163918433273,null,0,0]
[21136.5,21.136500000000002,3.136236598606827,1.2462767297651298,1.0000637118043634,1.1287906970347709E-2,1,0,57800.168813591947,1.5707790258073635,3.7655551173593622,1.3020063108045505,1.0063744831905626,0.11261265177808251,1.0015137264048357,0.15931205679798008,8.8773537055725207,-101.73932777289198,78.260672227108017,null,1000000000,446751632.25,null,13.930030108504944,-21.85177190956351,null,36.217048747489706,-79.887555863328473,null,0,0]
[21258.25,21.25825,3.1524699539369889,1.2480085535525904,1.000064447877234,1.1352921751726253E-2,1,0,58133.10806800751,1.5707791248933765,3.7857197556688154,1.3034732310045607,1.0064478950838198,0.11325580359578748,1.0015319297430787,0.16023469714770794,8.8282262202663944,-101.84049951796631,78.159500482033692,null,1000000000,451913193.0625,null,13.925896851349737,-21.804579135117532,null,36.172054519338786,-80.035920382848786,null,0,0]
[21380,21.38,3.1687126673061017,1.2497226278974323,1.0000651881772928,1.1417936437124993E-2,1,0,58466.047322423627,1.5707792228508839,3.8058924539648422,1.3049246038142104,1.0065217232276435,0.11389886132937251,1.0015502540697647,0.16115742191561758,8.7793557156480269,-101.94154448176303,78.058455518236968,null,1000000000,457104400,null,13.921816914675887,-21.758271705241061,null,36.127263951394269,-80.183272776521946,null,0,0]
[21504.5,21.5045,3.1853317875381646,1.251457335659778,1.0000659495701856,1.1484419526882771E-2,1,0,58806.506765338432,1.570779321873927,3.8265290007297379,1.3063929309335012,1.006597649311874,0.11455634615268848,1.0015691177047283,0.16210107628084031,8.7296442130316692,-102.04474195953856,77.955258040461445,null,1000000000,462443520.25,null,13.917698703489751,-21.711819537380364,null,36.081670659964054,-80.332922422158191,null,0,0]
[21629,21.629000000000001,3.2019603935875782,1.2531740309738968,1.0000667153833642,1.1550902515113941E-2,1,0,59146.966208253805,1.5707794197569849,3.8471737089150055,1.3078455024790618,1.0066740104687226,0.11521373151325569,1.0015881084524765,0.16304481986385685,8.680195592550934,-102.14780948143841,77.852190518561585,null,1000000000,467813641,null,13.913633724067807,-21.666264333287184,null,36.036287018905263,-80.481545148151241,null,0,0]
[21753.5,21.753499999999999,3.2185983384314145,1.2548729829782685,1.000067485616819,1.1617385401231034E-2,1,0,59487.425651169731,1.5707795165196308,3.8678264478347337,1.3092825646580841,1.0067508065991893,0.1158710168655861,1.0016072266174214,0.16398865314037747,8.6310069732220907,-102.25074835848579,77.749251641514206,null,1000000000,473214762.25,null,13.909620750502436,-21.621591956195811,null,35.991111373141784,-80.629156402289979,null,0,0]
[21878,21.878,3.235245477989408,1.2565544556863035,1.0000682602705391,1.1683868184646578E-2,1,0,59827.885094086218,1.5707796121809925,3.888487089529137,1.3107043587043798,1.0068280376037411,0.11652820166470335,1.001626472505702,0.16493257658540073,8.5820755203851036,-102.3535598929757,77.646440107024304,null,1000000000,478646884,null,13.905658589441643,-21.577788554298046,null,35.946142081365593,-80.775771338677657,null,0,0]
[22005.25,22.00525,3.2522696800705795,1.2582552762552777,1.0000690566028723,1.1751819356537224E-2,1,0,60175.864725501415,1.5707797088367732,3.9096121268968416,1.3121420261534789,1.0069074237984956,0.11719979811782229,1.0016462758107498,0.16589744341679927,8.5323260987213985,-102.45851211836714,77.541487881632861,null,1000000000,484231027.5625,null,13.901660209958724,-21.533901457339159,null,35.900391039184811,-80.92461066102797,null,0,0]
[22132.5,22.1325,3.2693031922894242,1.2599383786401028,1.0000698575528786,1.1819770419898245E-2,1,0,60523.844356917172,1.5707798043811163,3.9307451581273938,1.3135642377313814,1.006987264078856,0.11787128837699436,1.0016662131960532,0.16686240544513595,8.482839485599893,-102.5633340352297,77.436665964770299,null,1000000000,489847556.25,null,13.897712491370092,-21.490893768423877,null,35.854852144651936,-81.072440266805842,null,0,0]
[22259.75,22.25975,3.2863458698793711,1.261604028884489,1.0000706631205472,1.1887721374102395E-2,1,0,60871.823988333468,1.5707798988330823,3.9518860549773058,1.314971235684951,1.0070675583368227,0.11854267186200029,1.0016862849940793,0.16782746317525207,8.43361279791662,-102.66802700383151,77.331972996168489,null,1000000000,495496470.0625,null,13.89381425842304,-21.448751575677282,null,35.809523689915714,-81.219275428154234,null,0,0]
[22387,22.387,3.3033975709842336,1.2632524879308153,1.0000714733058667,1.1955672218522435E-2,1,0,61219.803619750302,1.5707799922112993,3.973034691885446,1.3163632573469175,1.0071483064638163,0.11921394799319029,1.0017064915391778,0.16879261711119317,8.3846431988680106,-102.77259237367723,77.227407626322773,null,1000000000,501177769,null,13.889964367136997,-21.407461248791432,null,35.764403982153148,-81.365131124885806,null,0,0]
[22517.5,22.517499999999998,3.320894003779562,1.2649254617450059,1.0000723089795915,1.2025358431515974E-2,1,0,61576.670746665564,1.5707800868782542,3.9947313811370333,1.3177755202495069,1.0072315882108058,0.11990225659323865,1.0017273544704401,0.16978252179414388,8.3346870007026048,-102.87969724506821,77.120302754931785,null,1000000000,507037806.25,null,13.886065191616947,-21.365987146665066,null,35.718346959507784,-81.513710098403124,null,0,0]
[22648,22.648,3.3383996337894613,1.2665808949425192,1.0000731495098276,1.2095044527709752E-2,1,0,61933.537873581365,1.5707801804542485,4.0164359517374333,1.3191725223512167,1.0073153470735865,0.12059045105275815,1.0017483598379728,0.1707725287311154,8.2849952928897785,-102.98667075577369,77.013329244226313,null,1000000000,512931904,null,13.882214518264796,-21.325380821744091,null,35.672505925047119,-81.661289934029625,null,0,0]
[22778.5,22.778500000000001,3.3559143170862114,1.2682190530144215,1.0000739948965629,1.2164730506427251E-2,1,0,62290.405000497711,1.5707802729580331,4.038148276602687,1.3205545043177347,1.0073995829331512,0.1212785307484269,1.0017695080085678,0.17176263846312961,8.2355651608906353,-103.09351432458082,76.906485675419177,null,1000000000,518860062.25,null,13.87841120933345,-21.285628450260912,null,35.62687910197932,-81.807885874319922,null,0,0]
[22909,22.908999999999999,3.3734379126574794,1.2698401963104822,1.0000748451397847,1.2234416366991959E-2,1,0,62647.272127414581,1.570780364407931,4.0598682313225165,1.3219217018968457,1.0074842956698549,0.1219664950575655,1.001790799351097,0.17275285153030714,8.1863937370786282,-103.20022935743778,76.799770642562223,null,1000000000,524822281,null,13.874654157507955,-21.246716490235336,null,35.581464729992803,-81.953512867202406,null,0,0]
[23042.25,23.042249999999999,3.3913398318102028,1.271478210531233,1.0000757183110713,1.2305570580928901E-2,1,0,63011.659442830234,1.5707804567161068,4.0820536324083463,1.3233026951116875,1.0075712854725933,0.12266883699312546,1.001812687476495,0.17376403834110069,8.1364501452709241,-103.30906199440302,76.690938005596976,null,1000000000,530945285.0625,null,13.870864543812429,-21.207837924995797,null,35.535310751880623,-82.101224069407223,null,0,0]
[23175.5,23.1755,3.4092507546605004,1.2730990180399084,1.0000765965456544,1.2376724670255477E-2,1,0,63376.046758246412,1.5707805479628112,4.1042467343787035,1.3246687558787735,1.007658772208365,0.12337105731786509,1.0018347256553621,0.17477533402328629,8.0867703826068258,-103.41776354202749,76.582236457972513,null,1000000000,537103800.25,null,13.867120916928855,-21.169807897386846,null,35.4893746161001,-82.247955644640626,null,0,0]
[23308.75,23.30875,3.4271705400442305,1.2747028801616158,1.000077479843521,1.2447878634251527E-2,1,0,63740.434073663113,1.5707806381662486,4.1264474129815403,1.3260201200720299,1.0077467557477471,0.12407315537099911,1.001856914287091,0.17578673914891085,8.0373515412419536,-103.52633545455639,76.473664545443611,null,1000000000,543297826.5625,null,13.863422190173484,-21.132612856010848,null,35.443654501490599,-82.393722598545509,null,0,0]
[23442,23.442,3.4450990496652003,1.2762900531344221,1.0000783682046572,1.2519032472196894E-2,1,0,64104.821389080331,1.5707807273442098,4.1486555465824777,1.3273570187320669,1.0078352359606273,0.12477513049245459,1.0018792537733305,0.1767982542890176,7.9881907600491164,-103.63477917165717,76.365220828342828,null,1000000000,549527364,null,13.859767305952715,-21.096239526415864,null,35.398148604518539,-82.5385396452413,null,0,0]
[23578.5,23.578499999999998,3.4634737443989514,1.2778988955756725,1.000079283483142,1.2591921638151779E-2,1,0,64478.096199996049,1.5707808176521183,4.171412947473625,1.3287117621674083,1.0079263890829597,0.12549409880336182,1.0019022949657588,0.17783455519808522,7.9380955708634415,-103.74573642329534,76.254263576704659,null,1000000000,555945662.25,null,13.8560676618924,-21.059817469286777,null,35.351753059393175,-82.685918954008585,null,0,0]
[23715,23.715,3.4818573092656999,1.2794907533179312,1.0000802040748684,1.2664810670302347E-2,1,0,64851.371010912291,1.570780906920429,4.1941779211937513,1.3300518016067722,1.0080180631236113,0.12621293671287648,1.0019254953216932,0.17887097276348099,7.8882652516004894,-103.85656216084404,76.143437839155965,null,1000000000,562401225,null,13.852411868058986,-21.024230358056119,null,35.30557853396364,-82.832331802787891,null,0,0]
[23851.5,23.851500000000001,3.5002496045057025,1.2810658859711459,1.0000811299798222,1.2737699567874475E-2,1,0,65224.645821829035,1.5707809951669907,4.2169503450983585,1.3313773704122118,1.0081102579404713,0.1269316435137878,1.0019488552802567,0.17990750759574448,7.8386968726133706,-103.96725788372495,76.032742116275045,null,1000000000,568894052.25,null,13.848798876622508,-20.989464782565612,null,35.259623146412999,-82.977793101159307,null,0,0]
[23988,23.988,3.5186504932156781,1.2826245480505576,1.0000820611979888,1.2810588330094054E-2,1,0,65597.920632746289,1.5707810824092454,4.2397300991382343,1.3326886971363185,1.0082029733906723,0.12765021849968478,1.0019723752830532,0.18094416030428379,7.7893875513940758,-104.07782507497417,75.922174925025828,null,1000000000,575424144,null,13.845227667914388,-20.955507608241348,null,35.213885033901818,-83.122317466732838,null,0,0]
[24127.75,24.127749999999999,3.5374982611074741,1.2842035181994447,1.0000830200924771,1.2885212397999876E-2,1,0,65980.082939162079,1.5707811707060362,4.2630596995752414,1.3340167248956063,1.0082984355765772,0.12838576511695721,1.0019966215551157,0.18200561797488404,7.739169620449303,-104.19089319128271,75.809106808717289,null,1000000000,582148320.0625,null,13.841613681121261,-20.92156599835744,null,35.167281089750176,-83.269327192925275,null,0,0]
[24267.5,24.267499999999998,3.5563547550065491,1.2857657481869456,1.0000839845561684,1.2959836322388943E-2,1,0,66362.245245578379,1.5707812579858722,4.2863967367399205,1.3353302942111671,1.0083944431775431,0.12912117207163987,1.0020210365280453,0.18306720049083089,7.68921726250076,-104.30382967578937,75.696170324210627,null,1000000000,588911556.25,null,13.838041413970162,-20.888444735934204,null,35.120900998952735,-83.415384939855187,null,0,0]
[24407.25,24.407250000000001,3.5752198368442758,1.2873114953211771,1.0000849545890467,1.3034460102430546E-2,1,0,66744.407551995202,1.5707813442662217,4.3097410898237225,1.3366296354616871,1.008490996037801,0.12985643860828361,1.0020456206838237,0.18412890850237526,7.6395275312125772,-104.41663606645794,75.58336393354206,null,1000000000,595713852.5625,null,13.834509858227282,-20.856130578962006,null,35.074742823407433,-83.560505487495931,null,0,0]
[24547,24.547000000000001,{"$f":"SQRT(1+(A333/pole1)^2)","v":3.5940933713886385},{"$f":"ATAN(A333/pole1)","v":1.2888410118242521},{"$f":"SQRT(1+(A333/Zero1)^2)","v":1.000085930191096},{"$f":"ATAN(A333/Zero1)","v":1.3109083737293989E-2},{"$f":"IF(VIN_nom>Vout, 1, SQRT(1+(A333/z_RHP)^2))","v":1},{"$f":"IF(VIN_nom>Vout, 0, -ATAN(A333/z_RHP))","v":0},{"$f":"SQRT(1+(A333/Pole2)^2)","v":67126.569858412491},{"$f":"ATAN(A333/Pole2)","v":1.5707814295641556},4.3330926405840371,1.3379149742542118,{"$f":"SQRT(1+(A333/pole4)^2)","v":1.0085880940007566},{"$f":"ATAN(A333/pole4)","v":0.13059156397233512},{"$f":"SQRT((1-(V333/pterm2))^2+(A333/pterm1)^2)","v":1.0020703745071542},{"$f":"IF((ATAN((A333/pterm1)/(1-A333^2/pterm2))>0),ATAN((A333/pterm1)/(1-A333^2/pterm2)),PI()+ATAN((A333/pterm1)/(1-A333^2/pterm2)))","v":0.18519074265849453},{"$f":"20*LOG10(((E333*K333*G333)/(C333*I333*O333*M333))*Adc)","v":7.5900975277073481},{"$f":"((F333+L333+H333)-(D333+J333+P333+N333))*radconv","v":-104.52931388319602},{"$f":"IF(R333>0,R333,R333+180)","v":75.470686116803975},null,1000000000,602555209,null,{"$f":"20*LOG10((K333/(I333*M333))*AEA)","v":13.831018032846341},{"$f":"(L333-(J333+N333))*radconv","v":-20.824610558854662},null,{"$f":"20*LOG10((E333*G333/(C333*O333))*Acs*Am)","v":35.028804645283145},{"$f":"(F333+H333-(D333+P333))*radconv","v":-83.704703324341381},null,0,0]
[24690,{"$f":"A334/1000","v":24.69},3.6134144370257197,1.2903895551770843,1.0000869342464982,1.3185442654378026E-2,1,0,67517.619660328361,1.5707815158462128,4.3569945806427262,1.3392159404128261,1.0086880141569665,0.13134363835350302,1.0020958801413509,0.18627740188693187,7.5397838721973027,-104.64448058705987,75.355519412940126,null,{"$f":"IF(Q334<0,A334,1000000000)","v":1000000000},{"$f":"A334^2","v":609596100},null,13.827485133481517,-20.79316632015934,null,34.98202388913792,-83.85131426690053,null,{"$f":"SUM((Q335<0)*(Q334>0))*A334","v":0},0]
[24833,24.832999999999998,3.6327440753995965,1.2919216227373429,1.0000879441330797,1.326180141769316E-2,1,0,67908.669462244725,1.5707816011345654,4.3809038144967953,1.3405027084158958,1.0087885047299203,0.1320955633239641,1.002121564461921,0.18736419456607045,7.4897361719608959,-104.75951582936879,75.240484170631206,null,1000000000,616677889,null,13.823991839075189,-20.762526958316524,null,34.935469483307841,-83.996988871052267,null,0,0]
[24976,24.975999999999999,3.6520821503896475,1.293437468977146,1.0000889598508229,1.3338160026349407E-2,1,0,68299.719264161584,1.5707816854462819,4.4048202233747293,1.3417755052380576,1.0088895655491685,0.13284733807822871,1.0021474279970202,0.18845112138703579,7.4399514688610511,-104.87442118008883,75.125578819911169,null,1000000000,623800576,null,13.820537181399663,-20.732679423464255,null,34.889139437883522,-84.141741756624555,null,0,0]
[25119,25.119,3.6714285286843453,1.2949373433066151,1.0000899813997099,1.3414518479456806E-2,1,0,68690.769066078909,1.5707817687980417,4.4287436910353444,1.3430345531328869,1.0089911964433631,0.13359896181180819,1.0021734712777832,0.18953818303952352,7.3904268524404992,-104.98919818960489,75.010801810395108,null,1000000000,630964161,null,13.81712021840759,-20.703610936272511,null,34.843031784455043,-84.28558725333238,null,0,0]
[25265.25,25.265250000000002,3.6912230498457803,1.2964550399103527,1.0000910321970378,1.3492612190133689E-2,1,0,69090.706363494843,1.5707818530682165,4.4532180565537365,1.3443082213681192,1.0090957266076404,0.1343675108574762,1.0022002929277312,0.19065009081881534,7.3400427126557233,-105.10645261325951,74.893547386740494,null,1000000000,638332857.5625,null,13.813663631404086,-20.674674566851696,null,34.796104231673766,-84.431778046407814,null,0,0]
[25411.5,25.4115,3.7110259826671301,1.2979565423491575,1.0000920890935352,1.3570705736228095E-2,1,0,69490.643660911286,1.5707819363683968,4.4776995672407178,1.3455679642435365,1.0092008526884266,0.135135900241033,1.0022273037197049,0.19176214108256356,7.2899246065905938,-105.22357601360234,74.77642398639766,null,1000000000,645744332.25,null,13.810244559112091,-20.646526858235674,null,34.749405197900636,-84.577049155366694,null,0,0]
[25557.75,25.557749999999999,3.7308371932034983,1.2994421017773796,1.0000931520891836,1.3648799116788025E-2,1,0,69890.580958328195,1.5707820187152337,4.5021881065366189,1.3468140049585338,1.0093065744995164,0.13590412910516225,1.0022545042315418,0.19287433456386838,7.2400695689578809,-105.34056998622593,74.65943001377407,null,1000000000,653198585.0625,null,13.806862073424028,-20.619154973874529,null,34.702932645955983,-84.721415012351386,null,0,0]
[25704,25.704000000000001,3.7506565502846079,1.3009119643255473,1.000094221183963,1.3726892330861494E-2,1,0,70290.51825574557,1.5707821001250009,4.526683560370933,1.3480465620535502,1.009412891853726,0.13667219659366373,1.0022818950443326,0.19398667199422753,7.1904746822777854,-105.45743610576788,74.542563894232117,null,1000000000,660695616,null,13.803515271383088,-20.592546344199199,null,34.656684561316837,-84.864889761568662,null,0,0]
[25853.75,25.853750000000002,3.7709585239242238,1.3024009901389746,1.0000953221837172,1.3806854268860915E-2,1,0,70700.026702161427,1.5707821825286681,4.5517722783327237,1.3492948682174075,1.0095223704504772,0.13745847707656333,1.0023101391608555,0.1951257793856519,7.1399594756083049,-105.57696816480841,74.423031835191594,null,1000000000,668416389.0625,null,13.80012443223645,-20.566078944005767,null,34.609560193793989,-85.010889220802625,null,0,0]
[26003.5,26.003499999999999,3.7912687689696107,1.3038740654383061,1.0000964295779782,1.3886816030289895E-2,1,0,71109.535148577794,1.5707822639832365,{"$f":"SQRT(1+(A343/Zero2)^2)","v":4.5768680114092835},{"$f":"ATAN(A343/Zero2)","v":1.3505294869444826},1.0096324730357302,0.13824458655423286,1.0023385840392405,0.1962650392454649,7.0897109789520618,-105.69636945272462,74.303630547275375,null,1000000000,676182012.25,null,13.796769166433187,-20.540385923915881,null,34.562666962941009,-85.155983528808719,null,0,0]
[26153.25,26.15325,3.8115871531968928,1.3053314388605921,1.000097543366725,1.3966777614126494E-2,1,0,71519.043594994597,1.5707823445050089,4.6019706448349211,1.3517506384247819,1.0097431994053656,0.13903052411119002,1.0023672303138962,0.19740445235366375,7.0397262094850923,-105.81564159264195,74.184358407358047,null,1000000000,683992485.5625,null,13.793448581437975,-20.515454616452274,null,34.51600277846925,-85.300186976189693,null,0,0]
[26303,26.303000000000001,3.8319135471341861,1.3067733540372797,1.000098663549936,1.4046739019348779E-2,1,0,71928.55204141188,1.5707824241099175,4.6270800663032183,1.3529585382313976,1.0098545493541973,0.13981628883320255,1.0023960786227999,0.19854401948844155,6.9900022325466127,-105.93478618536273,74.065213814637275,null,1000000000,691847809,null,13.790161808982997,-20.49127261871779,null,34.469565573985747,-85.443513566644938,null,0,0]
[26456,26.456,3.8526892219743849,1.3082308460805112,1.0000998146484168,1.4128435628465831E-2,1,0,72346.947983327816,1.5707825045117472,4.6527413297766786,1.3541791862465817,1.0099689597245864,0.14061892742784429,1.0024257623481774,0.19970847834890787,6.9394654445151449,-106.05638646656283,73.943613533437173,null,1000000000,699919936,null,13.786837746822885,-20.467327049782131,null,34.422352848114393,-85.5890594167807,null,0,{"$f":"IF(AD346>0,S346,0)","v":0}]
[26609,26.609000000000002,3.873472993213722,1.3096727003216229,1.0001009724218843,1.421013204897492E-2,1,0,72765.343925244219,1.5707825839889662,4.6784094496929454,1.3553864418596608,1.0100840205983388,0.14142138367872775,1.0024556583301756,0.20087309963062935,6.8891948477370821,-106.17785691217343,73.822143087826575,null,1000000000,708038881,null,13.783547222555697,-20.444138308461454,null,34.375372775603516,-85.733718603712006,null,0,0]
[26762,26.762,3.8942647312202521,1.3110991611908533,1.0001021368703154,1.4291828279786166E-2,1,0,73183.739867161086,1.5707826625574328,4.7040843138142403,1.3565805208094068,1.010199731753179,0.14222365661487577,1.0024857672607486,0.20203788415766818,6.8391874614420214,-106.29919915864798,73.70080084135202,null,1000000000,716204644,null,13.780289383687396,-20.421693979110344,null,34.32862322817676,-85.877505179537621,null,0,0]
[26915,26.914999999999999,3.9150643090666088,1.3125104681776742,1.0001033079936867,1.4373524319809709E-2,1,0,73602.135809078391,1.5707827402326449,4.7297658123106778,1.3577616343011061,1.0103160929656776,0.14302574526669853,1.0025160898357321,0.2032028327520729,6.7894403529628944,-106.42041481904774,73.579585180952265,null,1000000000,724417225,null,13.777063400930105,-20.399981905891813,null,34.282102102454921,-86.020432913155915,null,0,0]
[27071.75,27.071750000000002,3.9363816809765719,1.3139408957854359,1.0001045147433851,1.4457222514756658E-2,1,0,74030.786553494123,1.5707828189011326,4.7560835272130051,1.3589584668063983,1.0104359800859546,0.14384730082699185,1.0025473779058414,0.20439650501399165,6.7387408609371056,-106.54447183569501,73.455528164304994,null,1000000000,732879648.0625,null,13.773790543401514,-20.378484628142573,null,34.234675467957722,-86.165987207552433,null,0,0]
[27228.5,27.2285,3.9577070204327498,1.3153559110970812,1.0001057284991866,1.4540920507133084E-2,1,0,74459.437297910321,1.5707828966638573,4.7824079797815831,1.3601421252188421,1.0105565490414863,0.1446686609028556,1.0025788917125762,0.20559035122464867,6.6883084803348769,-106.66839933854702,73.331600661452981,null,1000000000,741391212.25,null,13.77054943197346,-20.357730917984139,null,34.187484198783551,-86.310668420562848,null,0,0]
[27385.25,27.385249999999999,3.979040199330913,1.31675575629401,1.0001069492610657,1.4624618295767057E-2,1,0,74888.088042326941,1.5707829735363721,4.8087390593645098,1.3613128226052342,1.0106777995882539,0.14548982445621783,1.0026106320168606,0.20678437226137575,6.6381402079189975,-106.79219898749616,73.207801012503836,null,1000000000,749951917.5625,null,13.767339245869847,-20.337708509002272,null,34.140526112471278,-86.454490478493881,null,0,0]
[27542,27.542000000000002,4.0003810922528489,1.3181406686304211,1.0001081770289966,1.4708315879486667E-2,1,0,75316.738786744012,1.5707830495338768,4.8350766576927002,1.3624707675337748,1.0107997314809762,0.14631079045056339,1.0026425995838852,0.20797856899923223,6.588233089026593,-106.9158724178164,73.084127582183598,null,1000000000,758561764,null,13.76415918674441,-20.318405392602305,null,34.09379905270432,-86.597467025214087,null,0,0]
[27702.5,27.702500000000001,4.0222403976610677,1.3195434825865866,1.0001094414288092,1.4794015584194667E-2,1,0,75755.644333659555,1.5707831264583563,4.8620509859993382,1.3636434139946414,1.0109252861382678,0.14715119099378351,1.0026755682120483,0.20920151800505105,6.5373995836988126,-107.04237544090556,72.957624559094441,null,1000000000,767428506.25,null,13.760933455345478,-20.299373511186975,null,34.046191278775467,-86.743001929718588,null,0,0]
[27863,27.863,4.0441075328067395,1.320931128770839,1.0001107131738465,1.487971507157986E-2,1,0,76194.549880575534,1.5707832024966155,4.8890319263302242,1.3648031191443672,1.0110515546072443,0.14799138221796254,1.0027087767442056,0.21042465306875846,6.486833758755167,-107.1687495260982,72.831250473901804,null,1000000000,776346769,null,13.757737684594114,-20.281071068407915,null,33.998821224583182,-86.887678457690285,null,0,0]
[28023.5,28.023499999999999,4.0659823713632521,1.3223038466018207,1.0001119922640804,1.4965414340384259E-2,1,0,76633.455427491936,1.5707832776638813,4.9160193698176275,1.3659500929691073,1.0111785366204988,0.1488313630155205,1.002742226015678,0.21164797512223624,6.4365325939184226,-107.29499635062939,72.70500364937061,null,1000000000,785316552.25,null,13.754571085933556,-20.263485970357419,null,33.951686658407006,-87.031510380271939,null,0,0]
[28184,28.184000000000001,4.0878647896639437,1.3236618705994838,1.0001132786994824,1.5051113389349891E-2,1,0,77072.360974408773,1.570783351975034,4.9430132099454038,1.3670845410037249,1.011306231909249,0.14967113228061996,1.0027759168664661,0.21287148509480744,6.3864931178444522,-107.42111756603347,72.578882433966527,null,1000000000,794337856,null,13.751432892428115,-20.24660637824806,null,33.904785375838472,-87.174511187785413,null,0,0]
[28348,28.347999999999999,4.110232098179428,1.3250345698720229,1.0001146007751409,1.5138681036537604E-2,1,0,77520.837670324225,1.5707834270374885,4.9706021997587078,1.3682309986048391,1.0114374483259017,0.15052899462034136,1.0028105928264619,0.21412187104509581,6.3356297076694883,-107.54986103244252,72.450138967557479,null,1000000000,803609104,null,13.748254829768648,-20.230075388525734,null,33.857100028322975,-87.319785643916802,null,0,0]
[28512,28.512,4.1326070677731304,1.3263924074048521,1.0001159305197507,1.5226248451538573E-2,1,0,77969.314366240127,1.5707835012364297,4.9981976506291534,1.3693647983134152,1.0115694088940586,0.15138663377253125,1.0028455228049467,0.21537245515320419,6.2850334033423847,-107.67847675744068,72.321523242559323,null,1000000000,812934144,null,13.745104871746804,-20.214256805444926,null,33.809653682017718,-87.46421995199573,null,0,0]
[28676,28.675999999999998,4.1549895746783934,1.327735618326201,1.000117267933281,1.5313815633010786E-2,1,0,78417.791062156437,1.5707835745866734,5.0257994561284303,1.3704861457424864,1.011702113322531,0.15224404856310725,1.0028807077132005,0.21662323840220912,6.2347011864339503,-107.80696642210596,72.193033577894042,null,1000000000,822312976,null,13.741982265666518,-20.199138781825511,null,33.762444071189563,-87.607827640280433,null,0,0]
[28840,28.84,4.1773794977398913,1.3290644329370094,1.0001186130157014,1.5401382579612245E-2,1,0,78866.267758073183,1.5707836471026979,5.0534075121292368,1.3715952421386399,1.0118355613186425,0.15310123781992058,1.0029161484675908,0.21787422177233015,6.1846300874034474,-107.93533168103987,72.06466831896013,null,1000000000,831745600,null,13.738886279496892,-20.184709720757759,null,33.715468958328685,-87.750621960282118,null,0,0]
[29008,29.007999999999999,4.2003230822005593,1.3304109661602803,1.000119998856718,1.5491085060462883E-2,1,0,79325.682909988303,1.5707837205372088,5.0816953098968245,1.3727188926745033,1.0119730348289284,0.15397909905647791,1.0029527198763233,0.21915592545572413,6.133605436899713,-108.06670050792566,71.93329949207434,null,1000000000,841464064,null,13.735741639024635,-20.170631238729509,null,33.667588948297208,-87.896069269196133,null,0,0]
[29176,29.175999999999998,4.2232741997279994,1.3317428664767541,1.0001213927452128,1.5580787291995154E-2,1,0,79785.098061903846,1.5707837931260247,5.1099894527237835,1.3738301012367042,1.0121112879942618,0.15485672113966795,1.0029895617267242,0.22043784121434842,6.082848641487355,-108.19794221795661,71.802057782043391,null,1000000000,851238976,null,13.732623441364577,-20.157251878348355,null,33.619950350544912,-88.040690339608261,null,0,0]
[29344,29.344000000000001,4.2462327281723109,1.3330603664738185,1.0001227946811522,1.5670489272766524E-2,1,0,80244.513213819824,1.5707838648836709,5.1382898357923521,1.3749290706397266,1.0122503204951867,0.15573410281583458,1.003026675020448,0.22171997009246977,6.0323566617787368,-108.32905850591231,71.670941494087685,null,1000000000,861070336,null,13.729530962774227,-20.144559948203405,null,33.572550849426641,-88.184498557708892,null,0,0]
[29512,29.512,4.2691985479721239,1.3343636939365202,1.0001242046645025,1.5760191001334488E-2,1,0,80703.928365736196,1.5707839358243421,5.1665963565584869,1.376015999373098,1.0123901320106226,0.15661124283348887,1.0030640607647365,0.22300231313113189,5.982126507724475,-108.46005103914062,71.539948960859377,null,1000000000,870958144,null,13.726463499458418,-20.132544004790667,null,33.525388158688187,-88.327507034349949,null,0,0]
[29684,29.684000000000001,4.2927186046328494,1.3356836032323911,1.0001256565559486,1.585202822255612E-2,1,0,81174.281973650999,1.5707840076221771,5.1955830959913225,1.3771165360985094,1.0125340790919493,0.1575090154750638,1.0031026199616102,0.22431541110041225,5.9309685768419023,-108.59403594530824,71.405964054691765,null,1000000000,881139856,null,13.723348202424617,-20.120930592249653,null,33.477345524839421,-88.473105353058571,null,0,0]
[29856,29.856000000000002,4.3162460583863052,1.3369891253777204,1.0001271168825054,1.5943865176361736E-2,1,0,81644.63558156621,1.5707840785927594,5.2245760583849803,1.3782048596192875,1.012678842039014,0.158406532165765,1.0031414668919578,0.22562873574772216,5.8800788989478576,-108.72789458426355,71.272105415736448,null,1000000000,891380736,null,13.720257694370463,-20.110002232486327,null,33.429546354999523,-88.617892351777229,null,0,0]
[30028,30.027999999999999,4.3397807889258937,1.3382804899512433,1.0001285856441355,1.60357018612034E-2,1,0,82114.989189481828,1.5707841487503045,5.2535751407112974,1.3792811695818499,1.0128244205019818,0.1593037915696886,1.0031806026548744,0.22694228817962259,5.8294544191613626,-108.86162865876481,71.138371341235185,null,1000000000,901680784,null,13.717191280865634,-20.099747410876383,null,33.381988288717864,-88.761881247888454,null,0,0]
[30200,30.2,4.3633226785038248,1.3395579217681977,1.0001300628408021,1.6127538275533204E-2,1,0,82585.34279739784,1.5707842181087042,5.2825802421829167,1.3803456613605434,1.0129708141292488,0.16020079235335355,1.003220028355577,0.22825606949904681,5.7790921322745934,-108.99523984332617,71.004760156673825,null,1000000000,912040000,null,13.71414828668383,-20.090154857687409,null,33.334668996012894,-88.905084985638723,null,0,0]
[30375.75,30.37575,4.3873851109847957,1.3408490419035977,1.0001315809566487,1.6221376656235128E-2,1,0,83065.951207812439,1.5707842881679324,5.3122238371603689,1.3814213529725849,1.0131212411271242,0.16111708131576899,1.0032606142732372,0.22959873187761096,5.7278995843264351,-109.13163883754829,70.868361162451706,null,1000000000,922686188.0625,null,13.711062455832245,-20.081025772708291,null,33.286562278916321,-89.050613064839965,null,0,0]
[30551.5,30.551500000000001,4.4114547774050772,1.3421260749953452,1.0001331078792688,1.6315214751233605E-2,1,0,83546.559618227446,1.5707843574211175,5.3418735107528326,1.3824851047107758,1.0132725184738942,0.16203309745085198,1.0033015052617007,0.23094163554958935,5.6769745970345165,-109.267912971429,70.732087028571001,null,1000000000,933394152.25,null,13.707999709954269,-20.072565114071953,null,33.238700037502376,-89.195347857357035,null,0,0]
[30727.25,30.727250000000002,4.4355315599985099,1.3433892462442247,1.0001346436086223,1.6409052558877341E-2,1,0,84027.168028642816,1.5707844258820909,5.3715291623024068,1.3835371119039406,1.013424645788755,0.16294883934389404,1.003342702519842,0.23228478167975916,5.6263141181611847,-109.40406394307266,70.595936056927343,null,1000000000,944163892.5625,null,13.704959386857194,-20.064761609996754,null,33.191079881726118,-89.339302333075906,null,0,0]
[30903,30.902999999999999,4.4596153435076982,1.3446387761654159,1.0001361881446682,1.6502890077515084E-2,1,0,84507.776439058609,1.5707844935643684,5.4011906933417979,1.3845775656954671,1.0135776226889934,0.16386430558287338,1.0033842072531907,0.23362817142884654,5.5759151450868121,-109.54009342182984,70.459906578170163,null,1000000000,954995409,null,13.701940842689051,-20.057604228644813,null,33.143699452819895,-89.482489193185032,null,0,0]
[31083,31.082999999999998,4.4842886619606315,1.3459046078061938,1.0001377791594748,1.6598996480937486E-2,1,0,85000.00695897275,1.5707845620899772,5.4315754956297795,1.3856313994090408,1.0137351791373679,0.16480162249065755,1.0034270356420549,0.23500430086758503,5.5245654015951793,-109.67928815519679,70.320711844803213,null,1000000000,966152889,null,13.698871225017928,-20.050932233651274,null,33.095419326999384,-89.628355921545534,null,0,0]
[31263,31.263000000000002,4.5089690870792047,1.3471565840485824,1.0001393794119653,1.6695102577701404E-2,1,0,85492.237478887284,1.5707846298264991,5.4619662629210968,1.3866735070583334,1.0138936259386884,0.16573864726200058,1.0034701891377369,0.23638068830152387,5.473483743906713,-109.81835890291595,70.181641097084054,null,1000000000,977375169,null,13.695823141680483,-20.044915309255622,null,33.04738575264836,-89.773443593660318,null,0,0]
[31443,31.443000000000001,4.5336565028011204,1.3483949272785012,1.0001409889020951,1.6791208366032977E-2,1,0,85984.467998802211,1.5707846967874861,5.4923628961976991,1.3877040810491876,1.0140529626755992,0.16667537838878529,1.0035136690570279,0.23775733496427257,5.4226671011967014,-109.95730736786908,70.042692632130922,null,1000000000,988662249,null,13.692795956980643,-20.039542345782824,null,32.999596294638188,-89.917765022086272,null,0,0]
[31623,31.623000000000001,4.5583507955458735,1.3496198552321812,1.0001426076298201,1.6887313844158359E-2,1,0,86476.698518717531,1.5707847629861811,5.5227652986025619,1.3887233096499572,1.0142131889286636,0.16761181436590078,1.0035574767240192,0.23913424208487438,5.3721124526641981,-110.09613522348415,69.903864776515846,null,1000000000,1000014129,null,13.689789052899076,-20.034802470773052,null,32.95204855018725,-90.061332752711095,null,0,0]
[31807,31.806999999999999,4.5836008425724337,1.3508583600138071,1.0001442718770215,1.698555467710549E-2,1,0,86979.867494631326,1.5707848298815439,5.5538491741572269,1.3897536532188339,1.0143778947125488,0.16856875340651339,1.0036025980345991,0.24054201762049607,5.3207020653771187,-110.23792519528455,69.762074804715454,null,1000000000,1011685249,null,13.686735664772403,-20.030600533923518,null,32.903691551026853,-90.207324661361028,null,0,0]
[31991,31.991,4.6088578433137073,1.3520832923977257,1.0001459457768442,1.7083795182158124E-2,1,0,87483.036470545529,1.5707848960073936,5.5849388800878712,1.3907725266224138,1.014543529092965,0.1695253808631601,1.0036480646425392,0.24195006790086718,5.2695592179117599,-110.37959258200564,69.620407417994358,null,1000000000,1023424081,null,13.683702216773812,-20.027037892600482,null,32.855582151560078,-90.352554689405153,null,0,0]
[32175,32.174999999999997,4.6341216840717889,1.3532948706555592,1.00014762932924,1.718203535742165E-2,1,0,87986.205446460095,1.570784961376932,5.616034319565669,1.3917801182551368,1.0147100916151783,0.17048169513796546,1.0036938779857918,0.24335839422382527,5.2186808387203651,-110.52113907915789,69.478860920842109,null,1000000000,1035230625,null,13.68068810236926,-20.024103661802531,null,32.807717886773233,-90.497035417355363,null,0,0]
[32359,32.359000000000002,4.6593922535842554,1.3544933084824315,1.0001493225341598,1.7280275201001467E-2,1,0,88489.37442237504,1.5707850260030609,5.6471353978768466,1.3927766124539662,1.0148775818222071,0.1714376946363913,1.0037400395102525,0.24476699788210002,5.1680639062992455,-110.66256635239542,69.337433647604584,null,1000000000,1047104881,null,13.677692731928131,-20.021787189178546,null,32.760096324793253,-90.640779163216905,null,0,0]
[32547.5,32.547499999999999,4.6852877171150418,1.3557076482305037,1.0001510671584433,1.738091730352017E-2,1,0,89004.849161288279,1.5707850914519974,5.679002850912104,1.3937861581336768,1.0150501297711849,0.17241674647584798,1.0037876925632687,0.2462103400246704,5.1164770685497905,-110.80733052206752,69.192669477932483,null,1000000000,1059339756.25,null,13.674642943108164,-20.020043770776688,null,32.711559275863763,-90.787286751290836,null,0,0]
[32736,32.735999999999997,4.7111900137115983,1.3569086367638696,1.0001528219130542,1.7481559053907834E-2,1,0,89520.323900201911,1.5707851561471995,5.7108760272891868,1.3947844359976909,1.0152236503575798,0.17339546457687741,1.0038357141339593,0.24765397596383357,5.0651583587191871,-110.95197301026043,69.048026989739569,null,1000000000,1071645696,null,13.67161162553418,-20.01892678567015,null,32.663271883607138,-90.933046224590299,null,0,0]
[32924.5,32.924500000000002,4.7370990312850125,1.3580964896580536,1.0001545867979393,1.758220045012757E-2,1,0,90035.798639115892,1.570785220101613,5.7427548317118013,1.3957716316870563,1.0153981430827519,0.1743738472360524,1.0038841058028107,0.24909790707262364,5.0141046845491557,-111.0964955140217,68.903504485978303,null,1000000000,1084022700.25,null,13.668598196900831,-20.018425500552919,null,32.615231638070462,-91.078070013468775,null,0,0]
[33113,33.113,4.7630146601564878,1.359271417946889,1.0001563618130451,1.7682841490142525E-2,1,0,90551.273378030266,1.5707852833278892,5.7746391709713381,1.3967479268302869,1.0155736074456114,0.17535189275368188,1.0039328691590297,0.25054213471831038,4.9633130042800637,-111.24089969994721,68.759100300052793,null,1000000000,1096470769,null,13.665602091205146,-20.018529412217447,null,32.567436063497055,-91.22237028772976,null,0,0]
[33305.75,33.305750000000003,4.789521318417572,1.36045968689485,1.0001581873237249,1.7785751254760056E-2,1,0,91078.370226443047,1.5707853472396243,5.8072480163553166,1.3977351471008654,1.0157540321219904,0.17635163929932515,1.0039831179713168,0.25201923258521336,4.9116439572452277,-111.38843903884538,68.611560961154623,null,1000000000,1109272983.0625,null,13.66255577408384,-20.019250776785182,null,32.518813333583523,-91.369188262060177,null,0,0]
[33498.5,33.4985,4.8160346649544277,1.3616348741150266,1.0001600234264607,1.7888660642622102E-2,1,0,91605.467074856206,1.5707854104158643,5.8398624582960101,1.3987113414658872,1.0159354716763784,0.17735102974692357,1.0040337588090373,0.25349664338432126,4.8602425756324825,-111.5358580940316,68.464141905968404,null,1000000000,1122149502.25,null,13.659526422780573,-20.020583434151504,null,32.470441303274043,-91.51527465988012,null,0,0]
[33691.25,33.691249999999997,4.8425545899106313,1.3627971912580636,1.0001618701211945,1.7991569651551052E-2,1,0,92132.563923269729,1.570785472869233,5.8724824035473819,1.3996766917863124,1.0161179255651207,0.17835006229142544,1.0040847933995614,0.2549743685585607,4.8091057640453911,-111.68315855242895,68.316841447571051,null,1000000000,1135100326.5625,null,13.656513481624264,-20.022516861752354,null,32.422317432843258,-91.660641690676599,null,0,0]
[33884,33.884,4.8690809857961765,1.363946845503198,1.0001637274078674,1.8094478279369341E-2,1,0,92659.660771683615,1.5707855346120665,5.9051077609082032,1.4006313759858853,1.0163013932419154,0.17934873513192934,1.0041362234797564,0.25645240954440213,4.7582304776600477,-111.83034207020488,68.169657929795122,null,1000000000,1148125456,null,13.65351641054631,-20.025040762830884,null,32.374439217535873,-91.805301307373981,null,0,0]
[34081.5,34.081499999999998,4.8962676822574744,1.3651119083025021,1.0001656414508753,1.819992251987974E-2,1,0,93199.747036595742,1.5707855971520401,5.9385426359296272,1.4015987051802359,1.0164904331678919,0.18037164359852875,1.0041893330233014,0.25796720344464508,4.7063695949938609,-111.98103308001055,68.018966919989452,null,1000000000,1161548642.25,null,13.650461394301058,-20.02822880383933,null,32.325633351114938,-91.952804276171236,null,0,0]
[34279,34.279000000000003,4.9234609513696581,1.3662641028971558,1.0001675666141701,1.8305366355635771E-2,1,0,93739.833301508217,1.57078565897136,5.971983005574045,1.4025552020603749,1.0166805362940521,0.18139417059940766,1.0042428615115726,0.25948233194607073,4.6547769718826011,-112.13160473864649,67.868395261353513,null,1000000000,1175049841,null,13.64742193999561,-20.032015593068909,null,32.277080182309128,-92.099589145577582,null,0,0]
[34476.5,34.476500000000001,4.9506606848248396,1.3674036383024988,1.0001695028976878,1.8410809784295042E-2,1,0,94279.919566421042,1.5707857200824109,6.0054287780533944,1.4035010458451536,1.0168717020241034,0.18241631421088247,1.0042968108439996,0.26099779657263605,4.6034494909372068,-112.28205873126686,67.717941268733142,null,1000000000,1188629052.25,null,13.644397514339925,-20.036390752526486,null,32.228777127019413,-92.245667978740371,null,0,0]
[34674,34.673999999999999,4.9778667766569038,1.3685307190975939,1.0001714503013632,1.851625280351521E-2,1,0,94820.005831334231,1.5707857804972958,6.0388798635983854,1.4044364118596553,1.0170639297588697,0.18343807251391636,1.0043511829304368,0.26251359884100739,4.5523840858253219,-112.43239671177473,67.567603288225271,null,1000000000,1202286276,null,13.641387599096259,-20.041344127565434,null,32.180721637151194,-92.391052584209305,null,0,0]
[34875.75,34.875749999999996,5.0056647733096078,1.3696694022481755,1.0001734510928011,1.8623964424545517E-2,1,0,95371.714205745899,1.5707858415057483,6.0730561771238394,1.4053812659625833,1.0172613899442324,0.18448141819535499,1.0044071635438419,0.2640623698272872,4.5004872643187337,-112.58585171763075,67.414148282369254,null,1000000000,1216317938.0625,null,13.638327371966652,-20.046990774864966,null,32.131885042774215,-92.53886094276578,null,0,0]
[35077.5,35.077500000000001,5.0334691886114316,1.3707955068859732,1.000175463487998,1.8731675613384818E-2,1,0,95923.422580157916,1.5707859018124146,6.1072378516827674,1.4063155443607527,1.0174599570595235,0.18552435777381057,1.0044635893634739,0.26561149631903425,4.4488576091143628,-112.73918905656883,67.260810943431167,null,1000000000,1230431006.25,null,13.635281239204208,-20.053220057216855,null,32.083301520332284,-92.685968999351985,null,0,0]
[35279.25,35.279249999999998,5.0612799167787852,1.3719092374804338,1.0001774874868841,1.8839386367536466E-2,1,0,96475.130954570268,1.5707859614293342,6.1414247977605507,1.4072394220219999,1.0176596304567858,0.18656688921880937,1.0045204624587845,0.26716097990909421,4.3974920095731331,-112.89241039466538,67.107589605334624,null,1000000000,1244625480.5625,null,13.632248693912324,-20.060021834054723,null,32.034968466082944,-92.832388560610624,null,0,0]
[35481,35.481000000000002,{"$f":"SQRT(1+(A397/pole1)^2)","v":5.0890968543166535},{"$f":"ATAN(A397/pole1)","v":1.3730107941548129},{"$f":"SQRT(1+(A397/Zero1)^2)","v":1.0001795230893886},{"$f":"ATAN(A397/Zero1)","v":1.8947096684503867E-2},{"$f":"IF(VIN_nom>Vout, 1, SQRT(1+(A397/z_RHP)^2))","v":1},{"$f":"IF(VIN_nom>Vout, 0, -ATAN(A397/z_RHP))","v":0},{"$f":"SQRT(1+(A397/Pole2)^2)","v":97026.839328982969},{"$f":"ATAN(A397/Pole2)","v":1.5707860203682735},6.1756169278110553,1.40815307011115,{"$f":"SQRT(1+(A397/pole4)^2)","v":1.0178604094849621},{"$f":"ATAN(A397/pole4)","v":0.18760901050501527},{"$f":"SQRT((1-(V397/pterm2))^2+(A397/pterm1)^2)","v":1.0045777849105288},{"$f":"IF((ATAN((A397/pterm1)/(1-A397^2/pterm2))>0),ATAN((A397/pterm1)/(1-A397^2/pterm2)),PI()+ATAN((A397/pterm1)/(1-A397^2/pterm2)))","v":0.26871082218217984},{"$f":"20*LOG10(((E397*K397*G397)/(C397*I397*O397*M397))*Adc)","v":4.3463874059712033},{"$f":"((F397+L397+H397)-(D397+J397+P397+N397))*radconv","v":-113.04551736668752},{"$f":"IF(R397>0,R397,R397+180)","v":66.95448263331248},null,1000000000,1258901361,null,{"$f":"20*LOG10((K397/(I397*M397))*AEA)","v":13.629229243537699},{"$f":"(L397-(J397+N397))*radconv","v":-20.067386182987462},null,{"$f":"20*LOG10((E397*G397/(C397*O397))*Acs*Am)","v":31.986883312855632},{"$f":"(F397+H397-(D397+P397))*radconv","v":-92.978131183700086},null,0,0]
[35687.75,{"$f":"A398/1000","v":35.687750000000001},5.1176095193115891,1.3741272255345103,1.0001816211789996,1.9057475945957397E-2,1,0,97592.220773393841,1.5707860800765405,6.210661735177549,1.4090789234327608,1.0180673108370855,0.18867653119125566,1.0046369963806447,0.27029944820105811,4.2942838997759996,-113.20230183643837,66.797698163561634,null,{"$f":"IF(Q398<0,A398,1000000000)","v":1000000000},{"$f":"A398^2","v":1273615500.0625},null,13.626148046781939,-20.075506546116468,null,31.937861003416192,-93.126795290321908,null,{"$f":"SUM((Q399<0)*(Q398>0))*A398","v":0},0]
[35894.5,35.894500000000001,5.1461284923042294,1.3752312841302021,1.0001837314543536,1.916785474298004E-2,1,0,98157.602217805077,1.570786139096976,6.2457118066038415,1.4099943860100337,1.0182753719068947,0.1897436168467079,1.0046966842169682,0.271888454245164,4.2424481394865214,-113.35896957929489,66.641030420705107,null,1000000000,1288415130.25,null,13.623079598873439,-20.08419729020471,null,31.889093691035217,-93.274772289090208,null,0,0]
[36101.25,36.10125,5.1746536689991229,1.3763231718420061,1.0001858539153734,1.9278233072885148E-2,1,0,98722.983662216648,1.5707861974413972,6.2807670539610427,1.4108996302791137,1.0184845919836512,0.19081026530860984,1.0047568506956919,0.27347784199306718,4.1908769914702235,-113.51552225650724,66.484477743492761,null,1000000000,1303300251.5625,null,13.620023413586503,-20.093448412148792,null,31.840578728305854,-93.422073844358479,null,0,0]
[36308,36.308,5.2031849473654743,1.3774030862591564,1.0001879885619813,1.938861093298614E-2,1,0,99288.365106628538,1.5707862551213532,6.3158273910639915,1.4117948249150856,1.0186949703532431,0.19187647441995043,1.0048174981054185,0.27506761311414751,4.139567373515721,-113.6719614976106,66.328038502389404,null,1000000000,1318270864,null,13.616979018536908,-20.103250124652295,null,31.792313505400948,-93.568711372958276,null,0,0]
[36519.5,36.519500000000001,5.2323779301255549,1.3784956238231554,1.000190184859918,1.9501524192126383E-2,1,0,99866.735967538756,1.5707863134507103,6.3516984042465481,1.4127003597126229,1.0189113798506171,0.19296672241629081,1.0048800388964916,0.27669430701898712,4.0873463882392365,-113.83187916001489,66.168120839985107,null,1000000000,1333673880.25,null,13.613876400875851,-20.113836753402154,null,31.743195137785523,-93.718042406612724,null,0,0]
[36731,36.731000000000002,5.2615770891431914,1.3795760365751035,1.0001923939096271,1.9614436953940148E-2,1,0,100445.10682844931,1.5707863711083372,6.3875745672790032,1.4135957232657443,1.0191289999523245,0.19405650609448491,1.0049430878554861,0.2783214056194464,4.0353927231082078,-113.99168146512685,66.008318534873155,null,1000000000,1349166361,null,13.610785163804323,-20.124979509572636,null,31.694332709726019,-93.86670195555422,null,0,0]
[36942.5,36.942500000000003,5.29078232216043,1.3806445227592534,1.0001946157110244,1.972734921555162E-2,1,0,101023.4776893602,1.5707864281057713,6.4234557938728267,1.4144810845754812,1.019347829883011,0.19514582316423004,1.0050066474726169,0.27994891067241184,3.983703238395532,-114.15137005872295,65.848629941277053,null,1000000000,1364748306.25,null,13.607704843688653,-20.136668579554264,null,31.645723545129009,-94.014701479168664,null,0,0]
[37154,37.154000000000003,5.3199935291437424,1.3817012763760439,1.0001968502640253,1.9840260974085071E-2,1,0,101601.84855027137,1.5707864844542869,6.4593419996447521,1.4153566089507059,1.0195678688636796,0.19623467134161393,1.0050707202516245,0.28157682392445971,3.9322748459322043,-114.31094655473247,65.689053445267533,null,1000000000,1380419716,null,13.604634990155516,-20.148894361633761,null,31.597365006198821,-94.162052193098702,null,0,0]
[37370.25,37.370249999999999,5.3498668545705002,1.382769830215983,1.0001991481863279,1.9955708052747195E-2,1,0,102193.20882768091,1.5707865414088471,6.4960392226054786,1.4162417940374568,1.0197940988881831,0.19734748637705696,1.0051367652183045,0.28324172173794598,3.8799582319899457,-114.47399266640545,65.526007333594549,null,1000000000,1396535585.0625,null,13.601506558028882,-20.16193986025544,null,31.548176824383198,-94.312052806149978,null,0,0]
[37586.5,37.586500000000001,5.3797462206700217,1.3838265156537233,1.0002014594392512,2.0071154599400683E-2,1,0,102784.56910509079,1.5707865977080433,{"$f":"SQRT(1+(A407/Zero2)^2)","v":6.5327414783672451},{"$f":"ATAN(A407/Zero2)","v":1.4171170335078322},1.0200215912210622,0.19845980641389027,1.0052033519924317,0.28490704995116228,3.8279082003105556,-114.63692490225475,65.363075097745252,null,1000000000,1412744982.25,null,13.598388156231527,-20.175526801839897,null,31.499245194501157,-94.46139810041484,null,0,0]
[37802.75,37.802750000000003,5.4096315273477966,1.3848715270093725,1.0002037840227032,2.0186600610971907E-2,1,0,103375.92938250097,1.5707866533631221,6.5694486825781544,1.4179824927247793,1.0202503450179201,0.19957162903170927,1.0052704832940029,0.28657281039718357,3.776121609926145,-114.7997448885725,65.200255111427495,null,1000000000,1429047907.5625,null,13.595279343583734,-20.189645573753609,null,31.450567416764542,-94.61009931481891,null,0,0]
[38019,38.018999999999998,5.439522676689351,1.3859050544350118,1.0002061219365905,2.0302046084387335E-2,1,0,103967.28965991148,1.5707867083850748,6.6061607527498731,1.4188383334347454,1.0204803594304364,0.20068295181719262,1.005338161857722,0.28823900489754123,3.7245953714566289,-114.96245421978045,65.037545780219546,null,1000000000,1445444361,null,13.592179691583164,-20.204286770964391,null,31.4021408302956,-94.758167448816067,null,0,0]
[38240.5,38.240499999999997,5.4701454641662268,1.3869519622242343,1.0002085304287909,2.0420293719154707E-2,1,0,104573.00666082013,1.5707867640976774,6.6437690589052316,1.4197051455113483,1.0207172640111639,0.20182073399711042,1.0054080537109433,0.28994610224297362,3.6720849409725407,-115.12900063592542,64.870999364074578,null,1000000000,1462335840.25,null,13.589013849920402,-20.2198154063733,null,31.352796241474273,-94.909185229552136,null,0,{"$f":"IF(AD410>0,S410,0)","v":0}]
[38462,38.462000000000003,5.5007741802534404,1.3879872126181303,1.0002109529063428,2.0538540782791808E-2,1,0,105178.72366172911,1.5707868191685896,6.6813823007449997,1.4205621986848764,1.0209554893454555,0.20295798667834863,1.0054785255761889,0.29165365880511407,3.6198412571913585,-115.2954342455737,64.704565754426298,null,1000000000,1479325444,null,13.585856748050135,-20.23587281093592,null,31.30370965956336,-95.059561434637743,null,0,0]
[38683.5,38.683500000000002,5.5314087264666476,1.3890109970651316,1.0002133893691443,2.065678727199606E-2,1,0,105784.44066263839,1.5707868736088348,6.7190003953786839,1.4214096555989311,1.0211950345089917,0.2040947072907896,1.0055495804400663,0.29336167650328121,3.5678611612803435,-115.4617566626532,64.538243337346799,null,1000000000,1496413172.25,null,13.582707964191895,-20.252449519235036,null,31.254878347510584,-95.209307143418158,null,0,0]
[38905,38.905000000000001,5.5620490064726837,1.3900235028924086,1.0002158398170935,2.0775033183464964E-2,1,0,106390.15766354797,1.5707869274291848,6.7566232617512103,1.4222476753303628,1.0214358985732011,0.20523089327222008,1.0056212213052811,0.29507015724377733,3.5161415463861534,-115.62796946901354,64.372030530986464,null,1000000000,1513599025,null,13.579567088770263,-20.269536270651624,null,31.206299608038023,-95.358433198361908,null,0,0]
[39131.5,39.131500000000003,5.5933867718789481,1.391047391965812,1.0002183600420362,2.0895947701982272E-2,1,0,107009.54773445586,1.5707869818343656,6.795100254704848,1.4230950149612209,1.0216835626722944,0.2063921712616319,1.0056950884838016,0.29681768495232735,3.4635206293602745,-115.79782252265198,64.202177477348016,null,1000000000,1531274292.25,null,13.57636307708882,-20.287526730831821,null,31.15688270269359,-95.510295791820184,null,0,0]
[39358,39.357999999999997,5.6247303357624769,1.3920598709366165,1.0002208948904183,2.1016861609402811E-2,1,0,107628.93780536404,1.5707870356133575,6.8335820714921507,1.4239328119738592,1.0219326039107803,0.20755288481731035,1.0057695748201909,0.29856570083367467,3.4111656767158167,-115.96756420702262,64.032435792977381,null,1000000000,1549052164,null,13.573166506047887,-20.306031567213378,null,31.10772432109006,-95.661532639809252,null,0,0]
[39584.5,39.584499999999998,5.6560796017252599,1.3930611274357378,1.0002234443621287,2.113777490219567E-2,1,0,108248.32787627255,1.5707870887769093,6.8720686310764307,1.4247612255105622,1.0221830212820939,0.20871303122539686,1.0058446835771908,0.30031420688341254,3.3590735277456192,-116.13719611406835,63.862803885931655,null,1000000000,1566932640.25,null,13.569976974738168,-20.325041506738284,null,31.058821703429587,-95.812154607330086,null,0,0]
[39811,39.811,5.6874344754773318,1.3940513450475862,1.0002260084570558,2.1258687576830058E-2,1,0,108867.71794718134,1.5707871413355257,6.9105598542163822,1.4255804112201536,1.0224348137750974,0.209872607780791,1.005920418035041,0.3020632050825548,3.3072410737621203,-116.30671980369742,63.693280196302581,null,1000000000,1584915721,null,13.566794093921313,-20.344547476996855,null,31.010172130262941,-95.962172326700582,null,0,0]
[40042.75,40.042749999999998,5.7195218258987923,1.3950532764209658,1.000228647120097,2.1382402219628734E-2,1,0,109501.46474158834,1.5707871944969647,6.9499480041573589,1.4264091923187558,1.0226938647601191,0.21105846930763905,1.0059985589905038,0.30385325441869615,3.2544728100701974,-116.48006243554792,63.519937564452079,null,1000000000,1603421827.5625,null,13.563543927077177,-20.365009724431534,null,30.960654033415157,-96.115052711116434,null,0,0]
[40274.5,40.274500000000003,5.7516148538897767,1.3960440275680124,1.0002313010918698,2.1506116207802396E-2,1,0,110135.21153599564,1.570787247046594,6.9893408740588354,1.4272286317303451,1.0229543531967635,0.21224372855727061,1.0060773619926837,0.30564382313230737,3.201969997259078,-116.65329497950241,63.346705020497595,null,1000000000,1622035350.25,null,13.56029993394991,-20.385972668109446,null,30.9113952137313,-96.267322311392945,null,0,0]
[40506.25,40.506250000000001,5.783713464938133,1.3970237826723162,1.000233970372252,2.162982953756935E-2,1,0,110768.95833040323,1.5707872989949148,7.02873838456114,1.4280388854312658,1.0232162779871998,0.21342838266074432,1.0061568306119455,0.30743491329740269,3.1497294672064329,-116.82641900698924,63.173580993010759,null,1000000000,1640756289.0625,null,13.557061733088545,-20.407427207467776,null,30.862392884540021,-96.418991799521464,null,0,0]
[40738,40.738,5.8158175666019742,1.3979927219361015,1.0002366549611215,2.1753542205148017E-2,1,0,111402.70512481111,1.5707873503521892,7.0681404580647449,1.428840105968699,1.0234796380286704,0.21461242875884171,1.0062369684377102,0.30922652697162828,3.0977481039688231,-116.99943605740368,63.000563942596315,null,1000000000,1659584644,null,13.553828954228388,-20.429364438963702,null,30.813644300162572,-96.570071618439997,null,0,0]
[40975.25,40.975250000000003,5.8486891711257396,1.3989736366806778,1.0002394191195481,2.1880190190044051E-2,1,0,112051.49229621714,1.5707874023265158,7.108482287610097,1.4296511399398171,1.0237507338463006,0.21582394240003791,1.0063197051174997,0.31106120448807645,3.0447983606933704,-117.1764499887598,62.823550011240201,null,1000000000,1678971112.5625,null,13.550524694860604,-20.452313211775749,null,30.763998816254905,-96.724136776984054,null,0,0]
[41212.5,41.212499999999999,5.8815663403143494,1.399943585985407,1.0002421993214383,2.2006837472928049E-2,1,0,112700.27946762343,1.5707874537024364,7.1488287401711839,1.4304530198306873,1.0240233314928524,0.21703481280162201,1.0064031508185107,0.31289643496798442,2.9921137854949698,-117.35335497034926,62.646645029650742,null,1000000000,1698470156.25,null,13.547225366943309,-20.475749585550751,null,30.714613568973796,-96.877605384798485,null,0,0]
[41449.75,41.449750000000002,5.914448981369425,1.4009027509039496,1.0002449955666584,2.2133484049743149E-2,1,0,113349.06663903003,1.570787504490226,7.1891797379134141,1.4312458987397154,1.0242974297692744,0.21824503692780228,1.0064873094536904,0.31473222056504668,2.9396911978509537,-117.53015255417084,62.46984744582916,null,1000000000,1718081775.0625,null,13.543930607294497,-20.499664615046868,null,30.665485740978585,-97.030487939123972,null,0,0]
[41687,41.686999999999998,5.94733700352963,1.4018513085655278,1.0002478078550734,2.2260129916432635E-2,1,0,113997.85381043692,1.5707875546999266,7.229535204731234,1.4320299263927574,1.0245730274712015,0.21945461175359912,1.0065721849567753,0.31656856341454326,2.8875274696837385,-117.70684426015359,62.293155739846412,null,1000000000,1737805969,null,13.540640063476069,-20.524049548861242,null,30.616612556629804,-97.182794711292331,null,0,0]
[41929.75,41.929749999999999,5.9809929226741803,1.4028110577607329,1.0002507019440363,2.2389710985996028E-2,1,0,114661.68135884195,1.5707876054854917,7.2708307520369511,1.4328231209134483,1.0248565648678054,0.22069155210537184,1.006659774182312,0.31844805589716396,2.8344191880380141,-117.88752405022235,62.112475949777647,null,1000000000,1758103935.0625,null,13.537277244146688,-20.549477221986347,null,30.566867094313462,-97.338046828236017,null,0,0]
[42172.5,42.172499999999999,6.0146542893639445,1.4037600652362483,1.000253612828365,2.2519291303535496E-2,1,0,115325.50890724726,1.5707876556864013,7.3121308221697303,1.4336073557469717,1.0251416694481261,0.22192780633093745,1.0067481222967318,0.32032813623165224,2.7815754446160956,-118.06809611623321,61.931903883766793,null,1000000000,1778519756.25,null,13.53391812482349,-20.57537890173829,null,30.517382470214738,-97.492717214494917,null,0,0]
[42415.25,42.41525,6.0483210126455074,1.4046985086429213,1.0002565405079131,2.2648870864706037E-2,1,0,115989.33645565287,1.5707877053126935,7.3534353389231173,1.4343827809011391,1.0254283399049693,0.22316337122538352,1.0068372335810793,0.32220880664467344,2.7289930517952374,-118.24856198678995,61.751438013210048,null,1000000000,1799053432.5625,null,13.530562360649238,-20.601745810249721,null,30.468155841568134,-97.646816176540241,null,0,0]
[42658,42.658000000000001,6.0819930035650192,1.4056265617728276,1.0002594849825328,2.2778449665162806E-2,1,0,116653.16400405875,1.5707877543741779,7.3947442277851998,1.4351495430747574,1.0257165749254267,0.22439824359578939,1.0069271123390195,0.32409006934222173,2.6766688745451339,-118.42892315848691,61.57107684151309,null,1000000000,1819704964,null,13.527209617062663,-20.628569359919336,null,30.419184407904606,-97.800353798567599,null,0,0]
[42906.5,42.906500000000001,6.1164679457159288,1.4065660127550845,1.0002625165990531,2.2911096995898998E-2,1,0,117332.7155829627,1.5707878040227521,7.4370360496406187,1.4359256440454395,1.0260132565613944,0.22566164564540256,1.0070199195221872,0.32601650913607721,2.6233695422410488,-118.61344961232832,61.386550387671676,null,1000000000,1840967742.25,null,13.523780247238818,-20.656492499779919,null,30.369314445424358,-97.956957112548395,null,0,0]
[43155,43.155000000000001,6.1509482255520149,1.4074949320164767,1.0002655658154,2.3043743520243087E-2,1,0,118012.26716186694,1.5707878530995423,7.4793323004052192,1.4366929676419404,1.0263115749556977,0.22692431524234183,1.0071135401669085,0.32794357421690579,2.5703343185151679,-118.79786942280849,61.202130577191511,null,1000000000,1862354025,null,13.520353364898828,-20.684876546929107,null,30.319706104038474,-98.112992875879399,null,0,0]
[43403.5,43.403500000000001,6.1854337538095914,1.4084134940922315,1.0002686326314123,2.317638923353461E-2,1,0,118691.81874077146,1.5707879016143693,7.5216329053640054,1.4374516610411254,1.0266115286814821,0.22818624900065393,1.0072079789633477,0.32987126688307755,2.5175600040569455,-118.98218409596193,61.017815904038073,null,1000000000,1883863812.25,null,13.516928642495285,-20.713712875315515,null,30.270356511983792,-98.268471220646433,null,0,0]
[43652,43.652000000000001,6.2199244431911707,1.4093218697170486,1.0002717170469284,2.3309034131113279E-2,1,0,119371.37031967624,1.5707879495768307,7.5639377914657251,1.4382018681674875,1.0269131163057428,0.22944744354770547,1.0073032406263174,0.33179958940971377,2.4650434523933269,-119.16639510583448,60.833604894165518,null,1000000000,1905497104,null,13.513505762366243,-20.742993045985365,null,30.221262840449214,-98.42340205984911,null,0,0]
[43906,43.905999999999999,6.2551837528443368,1.4102399969822541,1.0002748879171206,2.3444613983408892E-2,1,0,120065.96227557921,1.5707879980397601,7.6071833529784705,1.438960055910856,1.0272230659521242,0.23073578442667264,1.0074014660170889,0.33377124437663058,2.4116277244078259,-119.35457759222521,60.645422407774788,null,1000000000,1927736836,null,13.510008707512791,-20.773371359906832,null,30.171344167317166,-98.58120623231838,null,0,0]
[44160,44.16,6.2904482762391165,1.411147830883773,1.0002780771741455,2.358019297363911E-2,1,0,120760.55423148244,1.5707880459451906,7.6504332380306428,1.4397096716168305,1.027534719575915,0.23202334592823207,1.0075005611413956,0.3357435621252996,2.3584748120960546,-119.54265479089551,60.457345209104489,null,1000000000,1950105600,null,13.506512936494286,-20.804196128414866,null,30.121687026023899,-98.738458662480639,null,0,0]
[44414,44.414000000000001,6.3257179261790304,1.4120455420874714,1.0002812848178269,2.3715771096827876E-2,1,0,121455.14618738595,1.5707880933026865,7.6936873737082108,1.4404508590125082,1.0278480756271273,0.2333101244942011,1.0076005311135936,0.33771654500906523,2.3055815191033746,-119.73062817712403,60.269371822875968,null,1000000000,1972603396,null,13.503018140031593,-20.835458913232522,null,30.072288529493918,-98.895169263891532,null,0,0]
[44668,44.667999999999999,6.3609926173889662,1.4129332975396152,1.0002845108479881,2.3851348347999301E-2,1,0,122149.73814328974,1.5707881401215953,7.736945688720593,1.4411837586481131,1.0281631325492007,0.23459611658109406,1.0077013810747188,0.33969019535528511,2.2529447018328104,-119.9184991944343,60.081500805565696,null,1000000000,1995230224,null,13.499524018279432,-20.867151458933968,null,30.023145833975512,-99.051347735500372,null,0,0]
[44928.25,44.928249999999998,6.3971404298645735,1.4138327419122136,1.0002878353293074,2.3990260743909309E-2,1,0,122861.42143669144,1.5707881875434675,7.781272692743447,1.4419262397910204,1.0284877043855454,0.23591293273839431,1.0078056307194907,0.34171310463891358,2.1992754739939309,-120.11088832081732,59.889111679182676,null,1000000000,2018547648.0625,null,13.495944314983422,-20.900061148395995,null,29.973056309432643,-99.210827172421347,null,0,0]
[45188.5,45.188499999999998,6.4332933594670152,1.4147220778521314,1.0002911791127065,2.4129172213784324E-2,1,0,123573.1047300934,1.5707882344191146,7.8256039378151376,1.4426603091754833,1.0288140584974337,0.23722891575165483,1.0079108152052685,0.34373671949910295,2.1458689822207413,-120.30317294761065,59.696827052389352,null,1000000000,2042000532.25,null,13.49236471173394,-20.933405029182101,null,29.923229420908935,-99.369767918428565,null,0,0]
[45448.75,45.448749999999997,6.4694513204088953,1.415601473429676,1.0002945421979912,2.4268082752272681E-2,1,0,124284.78802349564,1.5707882807579205,7.8699393522663827,1.4433861081669024,1.0291421931893188,0.23854406185758559,1.0080169401487764,0.34576104235337196,2.0927220099347585,-120.49535452863,59.504645471369997,null,1000000000,2065588876.5625,null,13.488784914822565,-20.967174786568421,null,29.87366224553433,-99.528179742061553,null,0,0]
[45709,45.709000000000003,6.5056142287982244,1.4164710930404112,1.0002979245849672,2.4406992354022924E-2,1,0,124996.47131689813,1.5707883265690545,7.9142788660271828,1.4441037749979995,1.0294721067585704,0.23985836730926166,1.0081240111958794,0.34778607558991403,2.039831393740708,-120.68743448587817,59.312565514121829,null,1000000000,2089312681,null,13.485204639630794,-21.001362286245797,null,29.824351904532044,-99.686072199632363,null,0,0]
[45975.25,45.975250000000003,6.5426158984884841,1.4173508125616163,1.0003014049261567,2.4549103507652936E-2,1,0,125724.56229429865,1.5707883728996372,7.9596447871400953,1.4448297128670995,1.0298114654889523,0.24120209991180461,1.0082345357310609,0.34985853306874792,1.9859834426625678,-120.88383908463423,59.116160915365768,null,1000000000,2113723612.5625,null,13.481541039541579,-21.036761971664788,null,29.774167553543123,-99.847077112969416,null,0,0]
[46241.5,46.241500000000002,6.579622574599485,1.4182206368947146,1.0003049054688724,2.469121366952387E-2,1,0,126452.65327169943,1.5707884186966943,8.005014855328028,1.4455474223064855,1.0301526824376837,0.24254494476994429,1.0083460625448002,0.35193173902488545,1.9323972716022482,-121.08014023200658,58.919859767993415,null,1000000000,2138276322.25,null,13.477876364062173,-21.072582216802537,null,29.724246057962208,-100.00755801520407,null,0,0]
[46507.75,46.507750000000001,6.6166341731288538,1.4190807307650644,1.0003084262129025,2.4833322833906255E-2,1,0,127180.74424910048,1.5707884639693885,8.0503890004752101,1.4462570417033316,1.0304957557588887,0.24388689792502052,1.0084585977767659,0.3540056959191123,1.879069658554779,-121.27633935209347,58.723660647906527,null,1000000000,2162970810.0625,null,13.474210336052098,-21.10881486636848,null,29.67458447292482,-100.16752448572498,null,0,0]
[46774,46.774000000000001,6.6536506119322567,1.4199312552906596,1.0003119671580332,2.4975430995070855E-2,1,0,127908.83522650177,1.5707885087266744,8.0957671540315452,1.4469587063750886,1.030840683599114,0.24522795543647538,1.0085721475982437,0.35608040617932418,1.8259974347948305,-121.47243783732921,58.52756216267079,null,1000000000,2187807076,null,13.47054268707562,-21.145451941979491,null,29.625179898141344,-100.32698589534969,null,0,0]
[47046.25,47.046250000000001,6.6915061454356684,1.4207912155004749,1.0003156087879714,2.5120740550317454E-2,1,0,128653.33388790111,1.5707885539687305,8.1421719889653268,1.4476680954208876,1.0311953002001084,0.24659830372959493,1.0086893118944906,0.35820265199151896,1.7719900576025702,-121.67285279949979,58.327147200500207,null,1000000000,2213349639.0625,null,13.466790439838473,-21.183324709503253,null,29.574924768186229,-100.48952808999655,null,0,0]
[47318.5,47.3185,6.7293665718412425,1.4216414998027802,1.0003192715392863,2.5266049044506418E-2,1,0,129397.83254930071,1.5707885986901802,8.1885808748658953,1.4483694438734844,1.0315518519022839,0.24796770728214909,1.0088075501748315,0.36032569053505331,1.7182431744103108,-121.87316538654075,58.126834613459252,null,1000000000,2239040442.25,null,13.463035956721193,-21.221604009607059,null,29.524932368111251,-100.65156137693371,null,0,0]
[47590.75,47.59075,6.767231809026466,1.4224822693788124,1.0003229554117463,2.5411356471513186E-2,1,0,130142.33121070059,1.5707886428999587,8.2349937432447309,1.449062886988657,1.0319103366997577,0.24933616194011485,1.0089268691392621,0.36244952429774818,1.6647535626718142,-122.07337698926798,57.926623010732015,null,1000000000,2264879485.5625,null,13.459278977132108,-21.260281855209637,null,29.475199735961837,-100.81309513405834,null,0,0]
[47863,47.863,6.805101776686306,1.4233136818764476,1.0003266604051175,2.5556662825213471E-2,1,0,130886.82987210069,1.5707886866067968,8.2814105271428655,1.4497485570205864,1.0322707525785662,0.25070366356943957,1.0090472755219866,0.36457415573061763,1.6115180531052142,-122.27348896705315,57.726511032946846,null,1000000000,2290866769,null,13.455519248798907,-21.299350432341058,null,29.42572395472844,-100.9741385347121,null,0,0]
[48141.75,48.141750000000002,6.843880713395575,1.4241554106229475,1.0003304757387133,2.5705437266341294E-2,1,0,131649.10352449867,1.5707887308449566,8.3289395055790614,1.4504426788820137,1.0326417721050423,0.25210282273002133,1.0091716903611541,0.36675034196784673,1.5572715592086266,-122.47827680750879,57.521723192491208,null,1000000000,2317628093.0625,null,13.451666653544718,-21.339748628687918,null,29.375330056086039,-101.13852817882085,null,0,0]
[48420.5,48.420499999999997,6.8826644444015068,1.4249876536909347,1.0003343132132889,2.5854210569307347E-2,1,0,132411.3771768969,1.5707887745737708,8.3764724514006357,1.4511289233737468,1.0330148117244884,0.25350097410461908,1.0092972595601666,0.36892736949996713,1.5032848876509066,-122.68296299544843,57.317037004551565,null,1000000000,2344544820.25,null,13.447810667039128,-21.380540394005482,null,29.325199371033914,-101.30242260144291,null,0,0]
[48699.25,48.699249999999999,6.9214528891108875,1.4258105693935268,1.0003381728285894,2.600298272753903E-2,1,0,133173.65082929539,1.5707888178019855,8.4240092974490004,1.4518074232003488,1.0333898692492263,0.25489811332130574,1.0094239904580249,0.37110524083643198,1.4495548026583203,-122.88754889229998,57.112451107700025,null,1000000000,2371616950.5625,null,13.443951043856988,-21.421717874890504,null,29.275328909223468,-101.46583101740944,null,0,0]
[48978,48.978000000000002,6.960245968717353,1.4266243125655718,1.0003420545843589,2.6151753734464028E-2,1,0,133935.92448169412,1.5707888605381484,8.4715499780675234,1.4524783081164259,1.0337669424829277,0.25629423603028795,1.0095518904309038,0.37328395844529588,1.3960781219804996,-123.09203582810598,56.907964171894022,null,1000000000,2398844484,null,13.440087546565922,-21.463273388216606,null,29.225715725836707,-101.6287624398894,null,0,0]
[49263.25,49.263249999999999,6.99994835819437,1.4274476930455087,1.0003460497770456,2.6303992642355924E-2,1,0,134715.97312509074,1.5707889037701668,8.5202031333803827,1.4531570860161414,1.034154892916874,0.25772185721311913,1.0096839908433801,0.37551435886584078,1.3416135230072037,-123.30118997525184,56.698810024748155,null,1000000000,2426867800.5625,null,13.43612970848328,-21.50618142491707,null,29.175208964946059,-101.79500855033474,null,0,0]
[49548.5,49.548499999999997,7.0396554397931599,1.428261785539195,1.0003500681542519,2.6456230330697609E-2,1,0,135496.02176848758,1.5707889465044131,8.5688601697075129,1.45382815553736,1.0345449494809518,0.25914840478380313,1.0098173312356808,0.37774565058182513,1.2874077081991726,-123.51024321291692,56.489756787083081,null,1000000000,2455053852.25,null,13.432167334951167,-21.549469577207635,null,29.124965523670138,-101.96077363570926,null,0,0]
[49833.75,49.833750000000002,7.0793671345615534,1.4290667452611925,1.0003541097156989,2.6608466792447206E-2,1,0,136276.07041188472,1.5707889887494351,8.617521021308896,1.4544916466519888,1.0349371097938287,0.26057387415337613,1.0099519196322926,0.37997783610180708,1.2334574339095805,-123.71919686909358,56.280803130906421,null,1000000000,2483402639.0625,null,13.428200195845994,-21.593130135808028,null,29.074982388485719,-102.12606673328555,null,0,0]
[50119,50.119,7.1190833652999554,1.4298627240103408,1.0003581744611052,2.6760702020563173E-2,1,0,137056.11905528206,1.5707890305135856,8.666185623915954,1.4551476864395616,1.0353313714649457,0.26199826075733507,1.0100877640979775,0.38221091788789108,1.1797595101512608,-123.92805224051723,56.071947759482768,null,1000000000,2511914161,null,13.424228068706093,-21.637155558549139,null,29.025256591867304,-102.29089668196808,null,0,0]
[50410.75,50.41075,7.1597092244479539,1.4306677052079706,1.0003623558121073,2.6916404953765977E-2,1,0,137853.94268967735,1.5707890727404932,8.715962962933494,1.4558110969793807,1.0357367884162612,0.2634539801119094,1.0102280118317013,0.38449581462414778,1.1250957418598369,-124.14156645523327,55.858433544766726,null,1000000000,2541243715.5625,null,13.4201600446609,-21.682553929181086,null,28.974660847621067,-102.45901252605215,null,0,0]
[50702.5,50.702500000000001,7.2003396706944605,1.4314636021380638,1.0003665614150941,2.707210658157394E-2,1,0,138651.76632407284,1.5707891144814403,8.7657440943968776,1.4564669727169672,1.0361443984966281,0.26490855721254453,1.0103695907245307,0.38678165399835274,1.0706893724392232,-124.35498050192305,55.645019498076948,null,1000000000,2570743506.25,null,13.416086355390604,-21.728318538007514,null,28.924328167470751,-102.62666196391554,null,0,0]
[50994.25,50.994250000000001,7.2409746268223039,1.4322505667211964,1.0003707912697604,2.7227806896454224E-2,1,0,139449.5899584686,1.570789155744768,8.815528954058486,1.4571154407394398,1.0365541991187968,0.26636198725523685,1.0105125095351175,0.38906843849224398,1.01653715538724,-124.56829567129246,55.431704328707539,null,1000000000,2600413533.0625,null,13.412006786136818,-21.774441828701654,null,28.874255519672559,-102.79385384259079,null,0,0]
[51286,51.286000000000001,{"$f":"SQRT(1+(A461/pole1)^2)","v":7.281614017329475},{"$f":"ATAN(A461/pole1)","v":1.4330287475312329},{"$f":"SQRT(1+(A461/Zero1)^2)","v":1.000375045375798},{"$f":"ATAN(A461/Zero1)","v":2.738350589087438E-2},{"$f":"IF(VIN_nom>Vout, 1, SQRT(1+(A461/z_RHP)^2))","v":1},{"$f":"IF(VIN_nom>Vout, 0, -ATAN(A461/z_RHP))","v":0},{"$f":"SQRT(1+(A461/Pole2)^2)","v":140247.41359286456},{"$f":"ATAN(A461/Pole2)","v":1.5707891965386274},8.8653174791091196,1.4577566253042213,{"$f":"SQRT(1+(A461/pole4)^2)","v":1.0369661876857144},{"$f":"ATAN(A461/pole4)","v":0.26781426546294118},{"$f":"SQRT((1-(V461/pterm2))^2+(A461/pterm1)^2)","v":1.0106567770656176},{"$f":"IF((ATAN((A461/pterm1)/(1-A461^2/pterm2))>0),ATAN((A461/pterm1)/(1-A461^2/pterm2)),PI()+ATAN((A461/pterm1)/(1-A461^2/pterm2)))","v":0.39135617053555305},{"$f":"20*LOG10(((E461*K461*G461)/(C461*I461*O461*M461))*Adc)","v":0.96263589788200754},{"$f":"((F461+L461+H461)-(D461+J461+P461+N461))*radconv","v":-124.78151322297829},{"$f":"IF(R461>0,R461,R461+180)","v":55.21848677702171},null,1000000000,2630253796,null,{"$f":"20*LOG10((K461/(I461*M461))*AEA)","v":13.407921129470777},{"$f":"(L461-(J461+N461))*radconv","v":-21.820916408600105},null,{"$f":"20*LOG10((E461*G461/(C461*O461))*Acs*Am)","v":28.824439918833367},{"$f":"(F461+H461-(D461+P461))*radconv","v":-102.96059681437822},null,0,0]
[51584.75,{"$f":"A462/1000","v":51.58475},7.3232329927518673,1.4338166486936579,1.0003794266820467,2.7542939217584394E-2,1,0,141064.37952525829,1.570789237833081,8.9163043216729232,1.4584057731232067,1.0373903257489951,0.2693001898096935,1.0108059129160283,0.39369977687232288,0.90769816348796084,-124.99974665914547,55.000253340854528,null,{"$f":"IF(Q462<0,A462,1000000000)","v":1000000000},{"$f":"A462^2","v":2660986432.5625},null,13.403730927578222,-21.868862538089452,null,28.773692386331874,-103.13088412105603,null,{"$f":"SUM((Q463<0)*(Q462>0))*A462","v":0},0]
[51883.5,51.883499999999998,7.3648564629684561,1.4345956444777699,1.0003838334167026,2.7702371143725382E-2,1,0,141881.34545765223,1.5707892786519799,8.9672948787764195,1.4590475387364528,1.0378167524650526,0.27078489633466735,1.0109564818026411,0.3960443817615753,0.85301696704815644,-125.21788031374673,54.782119686253267,null,1000000000,2691897572.25,null,13.399533924952729,-21.917161833516193,null,28.723208192517561,-103.30071848023057,null,0,0]
[52182.25,52.182250000000003,7.4064843521987775,1.4353658840871781,1.0003882655794296,2.7861801661210862E-2,1,0,142698.31139004644,1.5707893190034921,9.0182890874121728,1.4596820468395517,1.0382454650139104,0.2722683799968203,1.0111084933173455,0.39838998764070177,0.79858904767384864,-125.43591544274119,54.564084557258809,null,1000000000,2722987215.0625,null,13.395329921217245,-21.965806861986671,null,28.672984276878736,-103.47010858075454,null,0,0]
[52481,52.481000000000002,7.4481165863485801,1.4361275134316103,1.0003927231698901,2.8021230761954764E-2,1,0,143515.27732244084,1.5707893588955992,9.069286885985365,1.4603094193470547,1.0386764605651435,0.2737506357849398,1.0112619570991963,0.40073659688861191,0.74441119842528558,-125.65385327105196,54.346146728948042,null,1000000000,2754255361,null,13.391118723039366,-22.014790351647644,null,28.623017625808057,-103.6390629194043,null,0,0]
[52786.5,52.786499999999997,7.4906938829190297,1.4368975955343368,1.0003973077714294,2.8184260552938181E-2,1,0,144350.70189933313,1.5707893992220698,9.1214405858566341,1.4609437117411186,1.0391195520900232,0.27526510687955941,1.0114204002130009,0.4031372658070202,0.68926457012631404,-125.87661583904179,54.12338416095821,null,1000000000,2786414582.25,null,13.386804742040821,-22.065223187000992,null,28.572184978507629,-103.81139265204079,null,0,0]
[53092,53.091999999999999,7.533275571454034,1.437658972337166,1.0004019189619973,2.8347288845335827E-2,1,0,145186.12647622562,1.5707894390844501,9.1735979138003625,1.4615707917305294,1.039565024928206,0.27677828348461953,1.0115803824978196,0.40553898878982336,0.63437282465219391,-126.09927915435978,53.900720845640222,null,1000000000,2818760464,null,13.382482850476876,-22.115995067322697,null,28.521615124597453,-103.98328408703706,null,0,0]
[53397.5,53.397500000000001,7.5758615778957745,1.4384117897545101,1.0004065567412261,2.8510315630502481E-2,1,0,146021.55105311834,1.5707894784907059,9.22575880828321,1.4621907811510659,1.0400128760197003,0.27829016033855863,1.0117419144128061,0.40794176818898725,0.57973270007437194,-126.32184443085416,53.678155569145844,null,1000000000,2851293006.25,null,13.378152862983978,-22.167098710927956,null,28.471304987512525,-104.15474571992618,null,0,0]
[53703,53.703000000000003,7.6184518298348909,1.4391561904772034,1.0004112211087461,2.8673340899793405E-2,1,0,146856.97563001129,1.5707895174486213,9.2779232091514583,1.462803799120546,1.0404631022934592,0.27980073221261742,1.0119050064679089,0.41034560629109074,0.52534098838275001,-126.54431285152604,53.455687148473956,null,1000000000,2884012209,null,13.373814600932302,-22.218526993728702,null,28.421251537872578,-104.32578585779734,null,0,0]
[54015.75,54.015749999999997,7.6620571399713651,1.439909684020716,1.0004160237109758,2.8840233438248181E-2,1,0,147712.22615840193,1.570789556874586,9.3313291248610284,1.4634242649924232,1.0409264703349201,0.28134579512943897,1.0120735960990352,0.41280759029401681,0.46991250667788276,-126.77196167359745,53.228038326402555,null,1000000000,2917701248.0625,null,13.369364633928702,-22.271504761156194,null,28.370273023171315,-104.50045691244127,null,0,0]
[54328.5,54.328499999999998,7.7056667510248298,1.4406546493090671,1.0004208541776443,2.9007124369691942E-2,1,0,148567.4766867928,1.5707895958466278,{"$f":"SQRT(1+(A471/Zero2)^2)","v":9.3847385920390973},{"$f":"ATAN(A471/Zero2)","v":1.464037668834028},1.0413923210814715,0.28288947940863973,1.0122438432511516,0.41527068848370374,0.41473773227821631,-126.99951140131975,53.000488598680249,null,1000000000,2951585912.25,null,13.364905636781042,-22.324808136988445,null,28.319557245919306,-104.67470326433127,null,0,0]
[54641.25,54.641249999999999,7.7492805903841644,1.4413912295023183,1.0004257125083482,2.9174013684851341E-2,1,0,149422.7272151839,1.5707896343725414,9.4381515503935489,1.4646441300774007,1.0418606512028115,0.28443177954739718,1.0124157593644516,0.41773490309809858,0.35981339120342509,-127.22696320812265,52.773036791877345,null,1000000000,2985666201.5625,null,13.360437438345855,-22.378429963431703,null,28.269101103279702,-104.84853324469096,null,0,0]
[54954,54.954000000000001,7.7928985870567917,1.4421195645922427,1.0004305987026814,2.9340901374453575E-2,1,0,150277.9777435752,1.5707896724599433,9.4915679409855223,1.4652437654867274,1.0423314573569156,0.28597269007909187,1.0125893559340076,0.42020023630173969,0.30513626359715529,-127.45431823662132,52.545681763378681,null,1000000000,3019942116,null,13.355959873944688,-22.43236323761305,null,28.218901540074597,-105.02195499900826,null,0,0]
[55274,55.274000000000001,7.8375319429414168,1.4428563923145972,1.0004356270056776,2.9511656071305608E-2,1,0,151153.05422346422,1.5707897109841533,9.5462260936341217,1.4658503553685323,1.04281573677968,0.28754787719470254,1.0127687281126381,0.42272387948155343,0.24944421374976239,-127.68684467616458,52.313155323835417,null,1000000000,3055215076,null,13.351368653720515,-22.487861978496245,null,28.167800710451377,-105.19898269766834,null,0,{"$f":"IF(AD474>0,S474,0)","v":0}]
[55594,55.594000000000001,7.8821695057492942,1.4435848749614815,1.0004406844782479,2.9682409046722681E-2,1,0,152028.13070335347,1.5707897490648715,9.6008877188340591,1.4664500383599475,1.0433026012460944,0.28912159806782195,1.012949884083673,0.42524869806037652,0.19400432024471198,-127.9192721228892,52.080727877110803,null,1000000000,3090692836,null,13.346767299279175,-22.543672420131951,null,28.116962171387669,-105.37559970275723,null,0,0]
[55914,55.914000000000001,7.9268112044101828,1.4443051527448536,1.0004457711199504,2.9853160290773839E-2,1,0,152903.20718324292,1.5707897867097118,9.6555527576093318,1.4670429313363043,1.04379204713887,0.2906938469607116,1.0131328363371099,0.42777469411556002,0.13881330227268596,-128.15160170516586,51.848398294834141,null,1000000000,3126375396,null,13.342155653874146,-22.599787537745051,null,28.066382798820676,-105.55181416742082,null,0,0]
[56234,56.234000000000002,7.9714569694393553,1.4450173627700216,1.0004508869303399,3.002390979352872E-2,1,0,153778.28366313258,1.5707898239261158,9.7102211523083497,1.4676291485602515,1.0442840708283376,0.29226461817547034,1.0133175974220259,0.43030186964224831,8.3867933233018083E-2,-128.38383452062558,51.616165479374416,null,1000000000,3162262756,null,13.337533566952132,-22.656200458528637,null,28.01605951670302,-105.72763406209694,null,0,0]
[56561.5,56.561500000000002,8.017153259139123,1.4457380515124914,1.0004561528442288,3.0198659424400542E-2,1,0,154673.86974801988,1.570789861578751,9.766174253525973,1.4682223095392992,1.0447902916528946,0.29387066840294285,1.0135085749218293,0.43288949910181934,2.7885823209679347E-2,-128.62141121122588,51.378588788774124,null,1000000000,3199203282.25,null,13.332792187578136,-22.714236894980967,null,27.964818786053677,-105.90717431624491,null,56561.5,51.378588788774124]
[56889,56.889000000000003,8.0628536656854717,1.4464505708667985,1.0004614493091588,3.0373407210351883E-2,1,0,155569.45583290738,1.570789898797867,9.8221307517243606,1.4688087122683413,1.0452992047924732,0.29547515892624038,1.0137014738205354,0.43547836793142092,-2.7845657847460813E-2,-128.85888877663817,51.141111223361833,null,56889,3236358321,null,13.328039571419033,-22.772571161330504,null,27.913839921155635,-106.08631761530768,null,0,0]
[57216.5,57.216500000000003,8.1085581194698833,1.4471550582452672,1.0004667763246446,3.0548153140739658E-2,1,0,156465.04191779511,1.5707899355909078,9.8780905891748052,1.4693884711980125,1.0458108063166647,0.29707808376719841,1.0138963077608174,0.43806847799946219,-8.3329800162513026E-2,-129.09626829803506,50.903731701964944,null,57216.5,3273727872.25,null,13.32327557592728,-22.831196357941845,null,27.86311977433234,-106.26507194009322,null,0,0]
[57544,57.543999999999997,8.1542665524383651,1.4478516480114851,1.0004721338901983,3.0722897204921457E-2,1,0,157360.62800268305,1.5707899719651486,9.934053709445962,1.4699616982180301,1.046325092282006,0.29867943699149596,1.0140930904489189,0.44065983108223833,-0.13856983961570546,-129.33355082586371,50.666449174136289,null,57544,3311311936,null,13.318500064493611,-22.890105734411684,null,27.812655246312815,-106.44344509145205,null,0,0]
[57879,57.878999999999998,8.2010257909683482,1.4485561562069855,1.0004776457550897,3.0901641099669676E-2,1,0,158276.72369256863,1.5707900087465021,9.9913017668333417,1.4705414086093092,1.0468539290225829,0.30031583027083458,1.0142964101665619,0.4433118159231248,-0.19482568379211831,-129.57616801749401,50.423831982505988,null,57879,3349978641,null,13.313603139258099,-22.950651311666697,null,27.761296327371916,-106.62551670582731,null,0,0]
[58214,58.213999999999999,8.2477890537740102,1.4492526759126081,1.0004831895842687,3.1080383019234444E-2,1,0,159192.81938245444,1.5707900451045296,10.048553143679472,1.4711145134208414,1.0473855661756186,0.30195056670673837,1.0145017981227165,0.44596510482522067,-0.25083279700099681,-129.81868585019245,50.181314149807548,null,58214,3388869796,null,13.308693893630139,-23.011480406371835,null,27.710198459791002,-106.80720544382064,null,0,0]
[58549,58.548999999999999,8.2945562727908548,1.4499413415713256,1.0004887653772041,3.1259122952227561E-2,1,0,160108.91507234043,1.5707900810464974,10.105807783568203,1.4716811245450199,1.0479199994789463,0.30358364009033928,1.0147092691913231,0.44861969938738672,-0.30659447385363503,-130.06110535294707,49.938894647052933,null,58549,3427985401,null,13.303772199430373,-23.072586252239617,null,27.659358477138124,-106.98851910070748,null,0,0]
[58884,58.884,8.3413273814751587,1.4506222846409242,1.0004943731333613,3.1437860887261568E-2,1,0,161025.01076222665,1.5707901165795066,10.163065631351509,1.4722413513695636,1.0484572246566954,0.30521504426087753,1.0149188383144652,0.45127560110553278,-0.36211395459869172,-130.30342752406261,49.696572475937387,null,58884,3467325456,null,13.298837934160732,-23.133962229236726,null,27.608773261662712,-107.1694652948259,null,0,0]
[59227,59.226999999999997,8.3892193743239378,1.4513116218550994,1.0005001479228093,3.1620865108904217E-2,1,0,161962.98336411035,1.570790152544588,10.221694098143541,1.4728084536151445,1.049010167290602,0.30688367147180018,1.0151356015563631,0.45399628314807028,-0.4187116609697436,-130.55143665847052,49.448563341529479,null,59227,3507837529,null,13.29377268856838,-23.19707702149859,null,27.55724080088401,-107.35435963697195,null,0,0]
[59570,59.57,8.4371153083526895,1.4519931329118105,1.0005059562191652,3.1803867211865185E-2,1,0,162900.95596599425,1.5707901880955006,10.28032581478711,1.4733690873380783,1.0495660276188634,0.30855053587746811,1.0153545961746995,0.45671833836429182,-0.47506217092867842,-130.79934577955001,49.200654220449991,null,59570,3548584900,null,13.288694021870127,-23.260461407776809,null,27.505968957623331,-107.53888437177324,null,0,0]
[59913,59.912999999999997,8.4850151168202803,1.4526669497137989,1.0005117980218452,3.1986867183924114E-2,1,0,163838.92856787835,1.5707902232393574,10.338960725992997,1.4739233622368846,1.050124801008228,0.31021563102201066,1.0155758384273441,0.45944176802095871,-0.53116879311642895,-131.04715586330298,48.952844136697024,null,59913,3589567569,null,13.283601819888784,-23.324108733322568,null,27.454954537416924,-107.7230471299804,null,0,0]
[60256,60.256,8.5329187344788622,1.4533332012301183,1.000517673330263,3.216986501286144E-2,1,0,164776.90116976266,1.5707902579831099,10.39759877771616,1.4744713855513014,1.0506864828110467,0.31187895050249725,1.0157993446453502,0.46216657326938765,-0.587034781586939,-131.29486785493054,48.705132145069456,null,60256,3630785536,null,13.278495973902416,-23.388012487288897,null,27.40419439493278,-107.90685536764163,null,0,0]
[60607,60.606999999999999,8.5819435146236458,1.4540072916830047,1.0005237203585604,3.2357128781305748E-2,1,0,165736.7506836445,1.5707902931300886,10.457607676918791,1.4750258281271256,1.0512642711568241,0.31357921971239744,1.016030424737923,0.46495635599782192,-0.64395798800467696,-131.54825678965048,48.45174321034952,null,60607,3673208449,null,13.273256808175702,-23.453665531323697,null,27.352510354241755,-108.09459125832679,null,0,0]
[60958,60.957999999999998,8.6309721500844159,1.4546737240320267,1.0005298024725178,3.2544390279603867E-2,1,0,166696.60019752654,1.5707903278723101,10.51761975417441,1.4755739437252116,1.0518450952747063,0.31527761606573135,1.0162639104702824,0.46774758130060273,-0.70063592975353228,-131.80154490998504,48.19845509001496,null,60958,3715877764,null,13.26800314093019,-23.5195737545125,null,27.301086079738411,-108.28197115547255,null,0,0]
[61309,61.308999999999997,8.6800045755314095,1.4553326274595937,1.0005359196714951,3.2731649494663985E-2,1,0,167656.44971140876,1.5707903622167267,10.577634955391085,1.4761158397070713,1.0524289501384643,0.31697413287324538,1.0164998195781281,0.47054025003230693,-0.75707192422643022,-132.05473313302559,47.945266866974407,null,61309,3758793481,null,13.262734872243403,-23.585730622626119,null,27.2499183539523,-108.46900251039948,null,0,0]
[61660,61.66,8.7290407270977397,1.4559841282718282,1.000542071954849,3.2918906413395205E-2,1,0,168616.29922529118,1.5707903961701315,10.6376532276948,1.4766516210260578,1.0530158307068185,0.31866876350375978,1.0167381698754203,0.47333436291841324,-0.81326923412642815,-132.30782234496323,47.692177655036772,null,61660,3801955600,null,13.257451907418281,-23.652129742730967,null,27.199004008877424,-108.65569260223228,null,0,0]
[62019,62.018999999999998,8.7791983011458843,1.4566429492046014,1.0005484007534657,3.3110428907010138E-2,1,0,169598.0256511711,1.5707904304998415,10.699042560837862,1.4771933955254262,1.053619212133702,0.32040006019178108,1.0169844965902095,0.4761936538116015,-0.87050383236156192,-132.56657844217008,47.433421557829917,null,62019,3846356361,null,13.25203323734234,-23.720286310803328,null,27.14718808071823,-108.84629213136675,null,0,0]
[62378,62.378,8.8293596424664624,1.4572942846329358,1.0005547662525986,3.3301948970729495E-2,1,0,170579.75207705121,1.5707904644344006,10.760434998526833,1.4777289881149713,1.0542257480458286,0.32212936989743651,1.0172334149854811,0.47905445655889461,-0.92749547593948645,-132.82523274264534,47.174767257354659,null,62378,3891014884,null,13.246599009194604,-23.788683207874147,null,27.095630665288045,-109.0365495347712,null,0,0]
[62737,62.737000000000002,8.8795246872143547,1.4579382608679539,1.0005611684515474,3.3493466590549921E-2,1,0,171561.47850293151,1.570790497980592,10.821830487925283,1.4782585037002525,1.0548354330016612,0.32385668571420806,1.0174849443718708,0.48191677151338491,-0.98424748606558898,-133.08378609854478,46.916213901455222,null,62737,3935931169,null,13.241149137510034,-23.857314027971942,null,27.04432852684651,-109.22647207057285,null,0,0]
[63096,63.095999999999997,8.9296933729744481,1.4585750014069518,1.0005676073496077,3.3684981752469097E-2,1,0,172543.20492881205,1.5707905311450452,10.883228977386445,1.4787820448333107,1.0554482615440177,0.32558200079908678,1.0177391041433328,0.4847805988841925,-1.0407631292658417,-133.34223933103146,46.657760668968535,null,63096,3981105216,null,13.235683541817,-23.926172503601904,null,26.993278479339292,-109.41606682742955,null,0,0]
[63463.25,63.463250000000002,8.9810186641495502,1.4592190134331096,1.0005742321898827,3.3880895470959016E-2,1,0,173547.49192018999,1.5707905646833908,10.946041486551955,1.4793115397583887,1.0560784202657507,0.32734488719439109,1.0180018466928187,0.48771180346005072,-1.0983363030207465,-133.60652917159291,46.393470828407089,null,63463.25,4027584100.5625,null,13.230075994972427,-23.996842551019714,null,26.941312852428961,-109.60968662057323,null,0,0]
[63830.5,63.830500000000001,9.0323476378820864,1.4598557061450899,1.000580895433874,3.4076806587642276E-2,1,0,174551.77891156817,1.5707905978358092,11.008857029582654,1.4798349923284777,1.0567118571142986,0.32910566556211113,1.018267383233505,0.49064459074169819,-1.1556688666989159,-133.87071587602097,46.129284123979033,null,63830.5,4074332730.25,null,13.224451838054129,-24.067737996681291,null,26.889604445669089,-109.80297787933969,null,0,0]
[64197.75,64.197749999999999,9.0836802317451948,1.4604852031083313,1.0005875970808138,3.4272715087532414E-2,1,0,175556.06590294652,1.5707906306089241,11.071675554840311,1.4803525051036805,1.0573485661980764,0.330864328782698,1.0185357347940436,0.49357896048098904,-1.2127641474482751,-134.13480022693307,45.865199773066934,null,64197.75,4121351105.0625,null,13.218811000073236,-24.138852556785,null,26.838150002900623,-109.99594767014807,null,0,0]
[64565,64.564999999999998,9.1350163847108412,1.4611076251337709,1.0005943371299306,3.4468620955644173E-2,1,0,176560.35289432504,1.5707906630092074,11.134497011849612,1.4808641783423928,1.0579885416092831,0.33262086980603228,1.0188069224916227,0.4965149122692164,-1.2696254177052799,-134.3987829757732,45.601217024226798,null,64565,4168639225,null,13.213153414814411,-24.210180083376635,null,26.786946317902441,-110.18860289239653,null,0,0]
[64941,64.941000000000003,9.1875792840981472,1.4617376703687621,1.0006012775503565,3.466919168219719E-2,1,0,177588.56775820086,1.5707906958017948,11.198818221883196,1.4813820950242413,1.0586471427054573,0.33441705577151087,1.0190875318800372,0.499522453699279,-1.3276023702728914,-134.66895079738723,45.331049202612775,null,64941,4217333481,null,13.207343618591898,-24.283421397370397,null,26.734779161557345,-110.38552940001685,null,0,0]
[65317,65.316999999999993,9.240145789065485,1.4623605472873222,1.000608258223028,3.4869759618283737E-2,1,0,178616.78262207689,1.5707907282168385,11.263142401551761,1.4818940961634421,1.0593091550445575,0.33621100247581326,1.0193711592411345,0.50253165207755846,-1.3853408002583767,-134.93901361452612,45.060986385473882,null,65317,4266310489,null,13.201516141731958,-24.356873325145365,null,26.682868208431803,-110.58214028938075,null,0,0]
[65693,65.692999999999998,9.2927158384253392,1.4629763770581536,1.0006152791471026,3.507032474782569E-2,1,0,179644.99748595306,1.5707907602608211,11.327469500265186,1.4824002822698372,1.0599745722350582,0.33800270257869519,1.019657827521546,0.50554250643771292,-1.4428440492342698,-135.20897213621555,44.79102786378445,null,65693,4315570249,null,13.195670927702473,-24.430529687718174,null,26.631210173485393,-110.77844244849737,null,0,0]
[66069,66.069000000000003,9.3452893723629042,1.4635852781449954,1.0006223403217331,3.5270887054746285E-2,1,0,180673.21234982947,1.5707907919400779,11.391799468573778,1.4829007515950106,1.0606433878686414,0.3397921488159813,1.019947559762014,0.50855501563389272,-1.5001154038474986,-135.47882703995194,44.521172960048062,null,66069,4365112761,null,13.189807924547219,-24.504384439844141,null,26.579801822027417,-110.97444260010778,null,0,0]
[66453.75,66.453749999999999,9.3990899057083119,1.4642012975411849,1.0006296074845,3.5476113763901272E-2,1,0,181725.35508620317,1.5707908239854536,11.457629397485862,1.4834070497894618,1.061331278985735,0.34162089710192739,1.0202472303188477,0.51163934142965184,-1.5584828564354098,-135.7548552231537,44.245144776846303,null,66453.75,4416100889.0625,null,13.183790017356101,-24.580157084854857,null,26.527452276630626,-111.17469813829885,null,0,0]
[66838.5,66.838499999999996,9.4528939652185713,1.4648103046377756,1.0006369167911735,3.5681337483479479E-2,1,0,182777.49782257702,1.5707908556618966,11.52346222986513,1.4839075632099807,1.0620227149295827,0.34344727025524258,1.0205501582104084,0.5147253969715474,-1.6166142881033445,-136.03077624654497,43.969223753455026,null,66838.5,4467385082.25,null,13.177753387400934,-24.656125066783716,null,26.475357474917853,-111.37465117976126,null,0,0]
[67223.25,67.223249999999993,9.5067014910237067,1.4654124180470911,1.0006442682408305,3.5886558196259875E-2,1,0,183829.6405589511,1.5707908869757414,11.58929791623228,1.4844023901888723,1.0627176887810732,0.3452712607396079,1.0208563684243221,0.51781318044324021,-1.6745130496027048,-136.30659073756703,43.693409262432965,null,67223.25,4518965340.5625,null,13.17169799291011,-24.732282320168363,null,26.42351410790932,-111.57430841739867,null,0,0]
[67608,67.608000000000004,9.56051242459775,1.4660077537312908,1.0006516618325416,3.6091775885022971E-2,1,0,184881.78329532535,1.5707909179331787,11.655136408223846,1.4848916268478551,1.0634161936038258,0.3470928611017704,1.021165886047698,0.52090268982831323,-1.7321824366618341,-136.58229929176255,43.417700708237447,null,67608,4570841664,null,13.165623796485743,-24.808622910954711,null,26.371918917274556,-111.77367638080786,null,0,0]
[68001.75,68.001750000000001,9.6155855620352941,1.4666101162968304,1.0006592720050445,3.6301790838641976E-2,1,0,185958.53755769681,1.5707909492520684,11.722517837408502,1.4853866176798525,1.0641346862962202,0.34895458966876802,1.0214860944933357,0.52406625306787968,-1.7909667122278317,-136.8643480745568,43.135651925443199,null,68001.75,4624238003.0625,null,13.15938801221337,-24.886933009401172,null,26.319370425980935,-111.97741506515563,null,0,0]
[68395.5,68.395499999999998,9.6706621486595861,1.4672056178969832,1.0006669263122336,3.6511802588628517E-2,1,0,187035.29182006849,1.5707909802103548,11.789902105965954,1.4858759504673975,1.0648568623301149,0.35081379945853775,1.0218098203693615,0.52723161899140158,-1.8495175697928175,-137.14628706882962,42.853712931170378,null,68395.5,4677944420.25,null,13.153132470244351,-24.965422953949513,null,26.267075110384965,-112.18086411488012,null,0,0]
[68789.25,68.789249999999996,9.725742125872701,1.4677943746732649,1.0006746247530964,3.6721811116531229E-2,1,0,188112.0460824403,1.5707910108142307,11.857289165488247,1.4863597214411162,1.0655827142165903,0.35267048275201102,1.0221370908821781,0.53039878478160896,-1.9078383707061848,-137.42811681311522,42.571883186884776,null,68789.25,4731960915.5625,null,13.146857143777574,-25.044086789075788,null,26.215029635938375,-112.38403002403943,null,0,0]
[69183,69.183000000000007,9.7808254363931066,1.4683765001698104,1.0006823673266141,3.6931816403900433E-2,1,0,189188.80034481231,1.570791041069747,11.924678968659665,1.4868380246668751,1.0663122344490521,0.35452463192075939,1.0224679333429942,0.53356774739834623,-1.9659324211659395,-137.70983781357509,42.290162186424908,null,69183,4786287489,null,13.140562010190708,-25.122918688472744,null,26.163230719065481,-112.58691912510237,null,0,0]
[69586,69.585999999999999,9.8372061607910002,1.4689655500587702,1.0006903374880749,3.714675177394354E-2,1,0,190290.84978668147,1.5707910716814684,11.993654690187649,1.4873219982531429,1.0670626833886112,0.35641970689159275,1.0228102753896307,0.53681301271754944,-2.0251598112907825,-137.99806491080659,42.00193508919341,null,69586,4842211396,null,13.134098461002866,-25.203770596288251,null,26.110466878128484,-112.79429431451835,null,0,0]
[69989,69.989000000000004,9.8935902595967935,1.4695478860943767,1.0006983538779028,3.73616837103092E-2,1,0,191392.89922855084,1.570791101940662,12.062633188866519,1.4878004368784472,1.0678169590857409,0.35831211139593921,1.0231564174028966,0.54006015311440403,-2.0841565085198441,-138.28617906659306,41.713820933406936,null,69989,4898460121,null,13.127614127993146,-25.284786607349531,null,26.057954513909145,-113.0013924592435,null,0,0]
[70392,70.391999999999996,9.9499776754446465,1.4701236220223035,1.0007064164949875,3.7576612193222295E-2,1,0,192494.94867042039,1.5707911318533829,12.131614417324919,1.488273434738419,1.0685750534368545,0.3602018375490631,1.0235063889980334,0.54330916459877421,-2.1429258859986331,-138.5741807221693,41.425819277830698,null,70392,4955033664,null,13.121108999595819,-25.365960873229341,null,26.005690264827681,-113.20821984893996,null,0,0]
[70795,70.795000000000002,10.006368352258439,1.4706928690419077,1.000714525338211,3.7791537202909613E-2,1,0,193596.99811229005,1.5707911614255481,12.200598329260965,1.4887410839081725,1.0693369583203778,0.3620888775650476,1.0238602199002533,0.54656004293240978,-2.2014712615646426,-138.86207028581174,41.13792971418826,null,70795,5011932025,null,13.114583068234808,-25.447287672651051,null,25.953670820622683,-113.41478261316067,null,0,0]
[71207.25,71.207250000000002,10.064056672968137,1.4712685812207491,1.0007228681312026,3.8011391740543778E-2,1,0,194724.34273365693,1.5707911913301367,12.271168348218152,1.4892140265472962,1.0701202853390868,0.36401644319353432,1.0242261965339445,0.54988746513590714,-2.2611320499253158,-139.15645214749517,40.843547852504827,null,71207.25,5070472452.5625,null,13.10788581959255,-25.530633144226218,null,25.900707280904271,-113.62581900326899,null,0,0]
[71619.5,71.619500000000002,10.121748291330562,1.4718377307345825,1.0007312592943447,3.8231242601830057E-2,1,0,195851.68735502401,1.5707912208904569,12.341741080536433,1.4896815605143583,1.0709075825743681,0.3659411817946307,1.0245962749436615,0.55321683110086317,-2.3205652869216351,-139.45071747375715,40.549282526242848,null,71619.5,5129352780.25,null,13.101166798212745,-25.614126513420278,null,25.847993065287753,-113.83659096033688,null,0,0]
[72031.75,72.031750000000002,10.179443151277745,1.4724004287987611,1.0007396988264206,3.8451089765608487E-2,1,0,196979.03197639124,1.5707912501124195,12.412316479933722,1.4901437778629796,1.0716988412763557,0.36786308535366757,1.0249704872974006,0.55654813547908144,-2.3797743523753105,-139.7448665983992,40.255133401600801,null,72031.75,5188573008.0625,null,13.094426008069647,-25.697762047081223,null,25.795524789977176,-114.04710455131796,null,0,0]
[72444,72.444000000000003,10.237141198002552,1.4729567841378872,1.0007481867262062,3.8670933210721216E-2,1,0,198106.37659775864,1.5707912790018008,12.482894501172868,1.4906007685741094,1.072494052677043,0.3697821459633428,1.0253488658777223,0.55988137264709026,-2.4387625707498088,-140.03889982164054,39.961100178359459,null,72444,5248133136,null,13.087663456933338,-25.781534136956346,null,25.743299122738982,-114.25736568468419,null,0,0]
[72865.75,72.865750000000006,10.296172095964229,1.473519507461365,1.0007569202746069,3.8895838917122193E-2,1,0,199259.70005212311,1.570791308218638,12.555101608395177,1.4910629733285072,1.0733116703604337,0.3717424798144448,1.0257403090423911,0.56329341578881897,-2.498884999821553,-140.33958916563378,39.660410834366218,null,72865.75,5309417523.0625,null,13.080722560722215,-25.867372285462789,null,25.690117589878369,-114.47221688017099,null,0,0]
[73287.5,73.287499999999994,10.355206217113793,1.4740758148868449,1.0007657044429865,3.912074068670307E-2,1,0,200413.02350648778,1.5707913370992046,12.627311367128875,1.4915198919087713,1.0741334063942052,0.37369982177955408,1.0261361813756777,0.5667074690335594,-2.5587831529312899,-140.64015773549249,39.359842264507506,null,73287.5,5371057656.25,null,13.073758917084263,-25.953341867729964,null,25.637183080406579,-114.68681586776255,null,0,0]
[73709.25,73.709249999999997,10.414243506638416,1.4746258151802596,1.0007745392300118,3.9345638496816396E-2,1,0,201566.34696085262,1.5707913656492734,12.69952373214432,1.4919716142976152,1.0749592513337285,0.37565416373932842,1.0265365178059958,0.57012352546020029,-2.6184604177173343,-140.94060574728979,39.059394252710206,null,73709.25,5433053535.5625,null,13.066772545830716,-26.039437263254861,null,25.58449218687408,-114.90116848403493,null,0,0]
[74131,74.131,{"$f":"SQRT(1+(A525/pole1)^2)","v":10.473283910958255},{"$f":"ATAN(A525/pole1)","v":1.4751696146704449},{"$f":"SQRT(1+(A525/Zero1)^2)","v":1.0007834246343421},{"$f":"ATAN(A525/Zero1)","v":3.9570532324817109E-2},{"$f":"IF(VIN_nom>Vout, 1, SQRT(1+(A525/z_RHP)^2))","v":1},{"$f":"IF(VIN_nom>Vout, 0, -ATAN(A525/z_RHP))","v":0},{"$f":"SQRT(1+(A525/Pole2)^2)","v":202719.67041521761},{"$f":"ATAN(A525/Pole2)","v":1.5707913938744851},12.771738659233169,1.4924182284511978,{"$f":"SQRT(1+(A525/pole4)^2)","v":1.0757891957162236},{"$f":"ATAN(A525/pole4)","v":0.37760549769096147},{"$f":"SQRT((1-(V525/pterm2))^2+(A525/pterm1)^2)","v":1.0269413533804461},{"$f":"IF((ATAN((A525/pterm1)/(1-A525^2/pterm2))>0),ATAN((A525/pterm1)/(1-A525^2/pterm2)),PI()+ATAN((A525/pterm1)/(1-A525^2/pterm2)))","v":0.57354157784253412},{"$f":"20*LOG10(((E525*K525*G525)/(C525*I525*O525*M525))*Adc)","v":-2.6779201263758159},{"$f":"((F525+L525+H525)-(D525+J525+P525+N525))*radconv","v":-141.24093338276492},{"$f":"IF(R525>0,R525,R525+180)","v":38.759066617235078},null,74131,5495405161,null,{"$f":"20*LOG10((K525/(I525*M525))*AEA)","v":13.059763470379455},{"$f":"(L525-(J525+N525))*radconv","v":-26.125652974316953},null,{"$f":"20*LOG10((E525*G525/(C525*O525))*Acs*Am)","v":25.532041553666861},{"$f":"(F525+H525-(D525+P525))*radconv","v":-115.11528040844796},null,0,0]
[74562.75,{"$f":"A526/1000","v":74.562749999999994},10.533727378082512,1.4757199934812395,1.0007925731484737,3.9800754400951065E-2,1,0,203900.34000957958,1.57079142243819,12.845668463699502,1.4928702305614603,1.076643055183564,0.37959997512340338,1.0273604850405127,0.57704273437838105,-2.738567735164346,-141.54825746825713,38.451742531742866,null,{"$f":"IF(Q526<0,A526,1000000000)","v":74562.75},{"$f":"A526^2","v":5559603687.5625},null,13.052564714662566,-26.214031936961639,null,25.478592700595222,-115.33422553129556,null,{"$f":"SUM((Q527<0)*(Q526>0))*A526","v":0},0]
[74994.5,74.994500000000002,10.594173999639814,1.4762640919204022,1.0008017747058462,4.0030972255877845E-2,1,0,205081.0096039417,1.5707914506730074,12.919600862575754,1.4933170595991858,1.0775011906749024,0.38159128361287242,1.027784406431987,0.58054596633468181,-2.7989942428944294,-141.8554556789729,38.144544321027098,null,74994.5,5624175030.25,null,13.045342226020487,-26.302525708928208,null,25.425388681507215,-115.55292997004467,null,0,0]
[75426.25,75.426249999999996,10.654623721942258,1.4768020165593359,1.0008110293049968,4.0261185865310994E-2,1,0,206261.67919830402,1.5707914785845849,12.993535811575843,1.493758803690824,1.0783635919819721,0.38357941495126147,1.0282131555294003,0.58405126496007564,-2.8592030517838261,-142.16252810173907,37.837471898260929,null,75426.25,5689119189.0625,null,13.038096040509359,-26.391128770976724,null,25.372426058128944,-115.77139933076241,null,0,0]
[75858,75.858000000000004,10.715076492510743,1.4773338715788844,1.0008203369444539,4.0491395204966786E-2,1,0,207442.34879266642,1.5707915061784419,13.067473267414442,1.494195548976343,1.0792302488784697,0.38556436105709957,1.0286467704297053,0.58755862116469182,-2.9191975083637214,-142.46947478808411,37.530525211915887,null,75858,5754436164,null,13.030826197613838,-26.47983572493261,null,25.319701444444572,-115.9896390631515,null,0,0]
[76299.75,76.299750000000003,10.776932544541932,1.4778718692888959,1.0008299150590183,4.0726932105583591E-2,1,0,208650.36452702587,1.5707915340881968,13.143125779946111,1.4946373239620636,1.0801213727891052,0.38759197654919803,1.0290955045427941,0.59114933296134875,-2.9803631060645634,-142.78340071479306,37.216599285206939,null,76299.75,5821651850.0625,null,13.023363532882801,-26.570699292143939,null,25.265998511474766,-116.2127014226491,null,0,0]
[76741.5,76.741500000000002,10.838791680261446,1.4784037262319307,1.0008395486961914,4.0962464484919685E-2,1,0,209858.38026138544,1.5707915616766357,13.218780828196985,1.4950740422106581,1.0810169299894918,0.38961624083822849,1.0295494135398009,0.59474217841404731,-3.0413112215641132,-143.09719501150079,36.902804988499213,null,76741.5,5889257822.25,null,13.015876196287532,-26.661660560848674,null,25.212537732570489,-116.4355344506521,null,0,0]
[77183.25,77.183250000000001,10.900653847171252,1.4789295466526775,1.0008492378543701,4.119799231697345E-2,1,0,211066.3959957452,1.5707915889492756,13.294438368876792,1.4955057898865118,1.0819169094706564,0.39163714567728219,1.0300085386110243,0.59833714668132998,-3.1020452662213334,-143.41085762225552,36.58914237774448,null,77183.25,5957254080.5625,null,13.008364240480322,-26.752714121994231,null,25.159315643720479,-116.65814350026126,null,0,0]
[77625,77.625,10.962518993955774,1.4794494324562002,1.0008589825319416,4.1433515575746302E-2,1,0,212274.41173010512,1.5707916159115083,13.370098359673715,1.4959326512111388,1.0828213002059548,0.39365468295656142,1.0304729210717194,0.60193422654760009,-3.1625685955639726,-143.72438845478496,36.275611545215042,null,77625,6025640625,null,13.000827721356982,-26.843854685695028,null,25.106328833501177,-116.88053376908992,null,0,0]
[78077,78.076999999999998,11.025822640279728,1.4799753423994342,1.0008690107819016,4.1674498959746793E-2,1,0,213510.45725796188,1.5707916431835511,13.447516394955189,1.4963644452051568,1.0837512301270904,0.39571553950554861,1.0309535636877964,0.60561694363577845,-3.2242815948218535,-144.04505766229539,35.954942337704608,null,78077,6096017929,null,12.993090967838599,-26.937194657337177,null,25.052352587761678,-117.10786300495826,null,0,0]
[78529,78.528999999999996,11.089129301321906,1.4804952477571154,1.0008790971541524,4.1915477500714948E-2,1,0,214746.50278581886,1.5707916701416471,{"$f":"SQRT(1+(A535/Zero2)^2)","v":13.524936908769426},{"$f":"ATAN(A535/Zero2)","v":1.4967912958593219},1.0846857549766269,0.39777285366520093,1.0314397984036283,0.60930184649234309,-3.2857809206398647,-144.36558859574887,35.634411404251125,null,78529,6166803841,null,12.985328626177566,-27.030614879543567,null,24.998615603604701,-117.33497371620531,null,0,0]
[78981,78.980999999999995,11.152438925743297,1.4810092505053809,1.0008892416469366,4.2156451170810065E-2,1,0,215982.54831367597,1.5707916967911866,13.602359858795253,1.4972132874273825,1.0856248628883804,0.39982661719077534,1.0319316698681991,0.61298892188212761,-3.3470699939404991,-144.68598104175913,35.314018958240865,null,78981,6237998361,null,12.977540766039004,-27.124110052849883,null,24.945114390442633,-117.56187098890932,null,0,0]
[79433,79.433000000000007,11.215751463361681,1.4815174503303981,1.0008994442584871,4.2397419942194793E-2,1,0,217218.59384153321,1.5707917231374366,13.679785203668276,1.4976305022626497,1.0865685419790974,0.4018768219857724,1.0324292228567842,0.61667815615716592,-3.4081521796360388,-145.0062347494565,34.993765250543504,null,79433,6309601489,null,12.969727460147114,-27.217674995165488,null,24.891845510638984,-117.788559754291,null,0,0]
[79895.5,79.895499999999998,11.280537721158616,1.4820315506399395,1.0009099440353568,4.2643981339700703E-2,1,0,218483.35281638731,1.5707917497871424,13.759011582923725,1.498052548535296,1.0875388621012063,0.40397096123362469,1.0329442619118228,0.62045531169501311,-3.4704426100182735,-145.33378406857744,34.666215931422556,null,79895.5,6383290920.25,null,12.961706390138147,-27.313480392623397,null,24.837576150265711,-118.02030367595408,null,0,{"$f":"IF(AD538>0,S538,0)","v":0}]
[80358,80.358000000000004,11.345326926341045,1.4825397793873982,1.0009205046587883,4.2890537549300271E-2,1,0,219748.11179124159,1.5707917761300838,13.838240384913618,1.4984697621543197,1.088513943022025,0.40606135781318836,1.0334653447629087,0.62423469734874004,-3.5325233827123261,-145.6611874794277,34.338812520572304,null,80358,6457408164,null,12.953658841803982,-27.409348224064455,null,24.783542925905824,-118.25183925536331,null,0,0]
[80820.5,80.820499999999996,11.410119028701226,1.4830422363325617,1.0009311261268556,4.3137088541181895E-2,1,0,221012.87076609602,1.5707918021715273,13.917471568261831,1.4988822255090875,1.0894937719590185,0.40814800352889063,1.0339925197712017,0.62801629715152718,-3.5943979283612375,-145.98844459486583,34.011555405134175,null,80820.5,6531953220.25,null,12.945584902269831,-27.505273299655663,null,24.729742319791065,-118.48317129521017,null,0,0]
[81283,81.283000000000001,11.474913979163174,1.4835390189937872,1.0009418084376218,4.3383634285537778E-2,1,0,222277.62974095056,1.5707918279166191,13.996705092527879,1.4992900191299336,1.0904783361134636,0.41023089034519483,1.0345258354239413,0.63180009468201526,-3.6560696213825796,-146.31555498895949,33.684445011040509,null,81283,6606926089,null,12.93748466153475,-27.601250545241257,null,24.676170867504801,-118.71430444371826,null,0,0]
[81756.25,81.756249999999994,11.541217872549678,1.4840415742862252,1.0009528020183101,4.3635905089612653E-2,1,0,223571.78581630188,1.5707918539585932,14.077782642805742,1.4997025395020798,1.0914906729539284,0.41235829102304705,1.0350779541666768,0.63567409727643165,-3.718968247042044,-146.65011612866766,33.349883871332338,null,81756.25,6684084414.0625,null,12.92916901642238,-27.699507441335804,null,24.621587886957709,-118.95060868733185,null,0,0]
[82229.5,82.229500000000002,11.607524647506423,1.4845383881134715,1.0009638592987919,4.3888170336255521E-2,1,0,224865.94189165338,1.570791879700812,14.158862561306272,1.5001103353942187,1.0925079405317712,0.41448173952064427,1.0356366054336945,0.63955036470486815,-3.7816614538270841,-146.98452262284155,33.015477377158447,null,82229.5,6761690670.25,null,12.920826032645493,-27.797808569772005,null,24.567237663949555,-119.18671405306957,null,0,0]
[82702.75,82.702749999999995,11.673834254931895,1.4850295580660169,1.0009749802769567,4.4140429993543888E-2,1,0,226160.09796700499,1.5707919051484214,14.239944807576649,1.5005134873731154,1.093530125086386,0.41660122774503261,1.0362018415613472,0.64342887789423076,-3.8441526819728589,-147.31877389249286,32.681226107507143,null,82702.75,6839744857.5625,null,12.912455815261962,-27.896148851016992,null,24.513116653187311,-119.4226250414759,null,0,0]
[83176,83.176000000000002,11.740146646831839,1.4855151795404873,1.0009861649506813,4.4392684029559544E-2,1,0,227454.25404235674,1.5707919303064501,14.321029342079045,1.5009120741870021,1.0945572128421805,0.41871674777573942,1.0367737150099117,0.64730961727207847,-3.9064453152345449,-147.6528693183933,32.3471306816067,null,83176,6918246976,null,12.904058472016128,-27.994523319607882,null,24.459221363171459,-119.65834599878538,null,0,0]
[83660.5,83.660499999999999,11.808038238606313,1.4860066945838613,1.0009976814866937,4.4650928739124428E-2,1,0,228779.17452520516,1.5707919557676733,14.404043731295596,1.5013154872536627,1.0956137813378481,0.42087843860476348,1.0373661136848706,0.65128489401171952,-3.9700164986104269,-147.99474465779053,32.005255342209466,null,83660.5,6999079260.25,null,12.895433523321138,-28.09526667353876,null,24.404275128490568,-119.89947798425172,null,0,0]
[84145,84.144999999999996,11.875932650433448,1.486492589784929,1.0010092647780331,4.490916748929559E-2,1,0,230104.09500805367,1.5707919809356889,14.48706043779125,1.5017142769450471,1.0966754596562129,0.42303595408566336,1.0379655806507195,0.65526246091944906,-4.0333865341801927,-148.33645521562121,31.663544784378786,null,84145,7080381025,null,12.886780380483804,-28.196035680735037,null,24.349558235758138,-120.14041953488619,null,0,0]
[84629.5,84.629499999999993,11.943829834221683,1.4869729607537638,1.0010209148223821,4.5167400245838027E-2,1,0,231429.01549090238,1.5707920058155334,14.570079421956153,1.5021085221639292,1.0977422329714235,0.42518928627624569,1.038572172577924,0.65924229536698631,-4.0965588766318657,-148.678000199834,31.321999800165997,null,84629.5,7162152270.25,null,12.878099167180242,-28.296825365635151,null,24.295067106610023,-120.38117483419887,null,0,0]
[85114,85.114000000000004,12.011729742964873,1.4874479009489103,1.0010326316174103,4.5425626974521544E-2,1,0,232753.93597375118,1.5707920304121272,14.653100645077046,1.5024983000306253,1.0988140864441902,0.42733842742026235,1.0391859462565403,0.66322437417779179,-4.1595369237596316,-149.01937877646549,30.980621223534513,null,85114,7244392996,null,12.86939000958731,-28.397630865452125,null,24.240798217075191,-120.62174791101337,null,0,0]
[85609.5,85.609499999999997,12.081174009479613,1.4879281021829351,1.0010446834671076,4.5689710165587961E-2,1,0,234108.93721059672,1.5707920552792001,14.738009043319263,1.5028923852554572,1.0999155140809327,0.42953201952939657,1.0398211424275321,0.66729915803028983,-4.2237473333880393,-149.3683349202322,30.631665079767799,null,85609.5,7328986490.25,null,12.860454351713173,-28.50073644002353,null,24.185523465320919,-120.86759848020864,null,0,0]
[86105,86.105000000000004,12.150621029987155,1.4884028143335379,1.0010568051279092,4.5953786979575771E-2,1,0,235463.93844744243,1.5707920798600725,14.8229197041987,1.5032819556352492,1.101022223738132,0.43172121230835814,1.0404639706673855,0.67137623852833084,-4.2877615364169639,-149.71711511827777,30.282884881722225,null,86105,7414071025,null,12.851489740763075,-28.603848616711229,null,24.130473873242092,-121.11326650156657,null,0,0]
[86600.5,86.600499999999997,12.220070757534433,1.4888721307724337,1.001068996597279,4.621785737988568E-2,1,0,236818.93968428823,1.5707921041596575,14.907832589053401,1.5036670881984704,1.1021341995039424,0.43390599805789898,1.0411144920828139,0.67545558910385917,-4.3515829904849426,-150.06571834600794,29.934281653992059,null,86600.5,7499646600.25,null,12.842496319155714,-28.7069625412561,null,24.075645840781476,-121.35875580475185,null,0,0]
[87096,87.096000000000004,12.289523146227923,1.4893361427702638,1.0010812578726664,4.6481921329923744E-2,1,0,238173.94092113417,1.5707921281827557,14.992747660096262,1.5040478582338466,1.1032514254551078,0.4360863692780248,1.0417727678923376,0.67953718259113027,-4.4152150961093213,-150.41414353529024,29.585856464709764,null,87096,7585713216,null,12.833474231609669,-28.810073470488955,null,24.021035822703144,-121.60407006480125,null,0,0]
[87603.25,87.603250000000003,12.360625198357742,1.4898057566130869,1.0010938822108124,4.6752240419801486E-2,1,0,239561.07387247664,1.5707921524940227,15.079678583957422,1.5044332155278834,1.1044005664310363,0.4383138641401883,1.0424547500990891,0.68371785895632764,-4.4801634913488559,-150.77064549602548,29.22935450397452,null,87603.25,7674329410.5625,null,12.824208659256771,-28.915621571478702,null,23.965352999816506,-121.85502392454677,null,0,0]
[88110.5,88.110500000000002,12.431729945282489,1.4902699985337,1.0011065796994532,4.7022552672272025E-2,1,0,240948.20682381923,1.5707921765253712,15.166611721483802,1.5048141552375107,1.1055551757407049,0.44053671735216715,1.0431449889987816,0.68790082633953475,-4.5449204851342202,-151.12695847164591,28.873041528354094,null,88110.5,7763460210.25,null,12.814913359188374,-29.02115681840705,null,23.909891306099539,-122.10580165323891,null,0,0]
[88617.75,88.617750000000001,12.502837341025554,1.4907289599854794,1.0011193503358056,4.7292858048093543E-2,1,0,242335.33977516193,1.5707922002816075,15.253547034826985,1.5051907527832999,1.1067152362691721,0.44275492150939055,1.0438435506009884,0.69208605365564968,-4.6094895473909521,-151.48308117799164,28.516918822008364,null,88617.75,7853105615.0625,null,12.805588493508777,-29.126674466018269,null,23.854647109522404,-122.35640671197341,null,0,0]
[89125,89.125,12.573947340648642,1.4911827303620155,1.0011321941170701,4.7563156508030231E-2,1,0,243722.47272650478,1.5707922237674292,15.340484486995576,1.5055630818811225,1.1078807308925442,0.44496846942122947,1.044550501016168,0.69627350916757436,-4.6738740904107736,-151.8390122854525,28.160987714547502,null,89125,7943265625,null,12.796234226424616,-29.232169878980489,null,23.799616833586747,-122.60684240647198,null,0,0]
[89644,89.644000000000005,12.646707190095592,1.491641730230032,1.0011454111163347,4.7839708995040281E-2,1,0,245141.73739234416,1.5707922475221843,15.429437944767622,1.5059396928977364,1.1090788296715994,0.44722846566497415,1.0452825789121074,0.70056023583302696,-4.7395625644893933,-152.20298848239901,27.797011517600993,null,89644,8036046736,null,12.786633018464556,-29.340081264862896,null,23.743529567468183,-122.86290721753608,null,0,0]
[90163,90.162999999999997,12.719469673478763,1.4920954787206022,1.0011587046824548,4.8116254158972652E-2,1,0,246561.00205818366,1.570792271003463,15.518393565898119,1.5063119862946235,1.1102825809204895,0.44948357289996899,1.0460235790809447,0.70484922581619325,-4.8050649193957549,-152.56676114186649,27.433238858133507,null,90163,8129366569,null,12.777001385316451,-29.44795989689672,null,23.687658845709926,-123.11880124496982,null,0,0]
[90682,90.682000000000002,12.792234745852516,1.4925440652582744,1.0011720748123805,4.8392791957821063E-2,1,0,247980.26672402327,1.5707922942159611,15.607351313396254,1.5066800357955392,1.1114919662742566,0.45173378411126619,1.0467735726254479,0.70914044301390178,-4.8703846304386289,-152.93032869563399,27.069671304366011,null,90682,8223225124,null,12.767339509071082,-29.555801149364118,null,23.632001010912418,-123.37452754626985,null,0,0]
[91201,91.200999999999993,12.865002363286482,1.4929875772527867,1.0011855215030441,4.8669322349586007E-2,1,0,249399.53138986306,1.5707923171642673,15.696311151108905,1.5070439134575611,1.1127069673620162,0.45397909251266927,1.0475326307338151,0.71343385061589715,-4.9355251148353991,-153.29368952812044,26.706310471879561,null,91201,8317622401,null,12.757647573711896,-29.663600505141112,null,23.57655246187484,-123.63008902297933,null,0,0]
[91732,91.731999999999999,12.939455058212186,1.4934361810723573,1.0011993583331216,4.8952238797882811E-2,1,0,250851.61142369924,1.5707923403744215,15.787329990097039,1.5074119602850558,1.1139558537962129,0.45627123456002361,1.0483186950102692,0.71782875558573178,-5.0019897513147011,-153.66523608709335,26.334763912906652,null,91732,8414759824,null,12.747700631466836,-29.773844370590201,null,23.520034767640595,-123.89139171650314,null,0,0]
[92263,92.263000000000005,13.013910327348148,1.4938796518700945,1.0012132752986955,4.9235147403689214E-2,1,0,252303.69145753555,1.5707923633174135,15.878350943095336,1.5077757875830078,1.1152105797337275,0.45855823081221775,1.0491143988724976,0.72222587320971532,-5.0682738331166801,-154.03656268424672,25.963437315753282,null,92263,8512461169,null,12.737722619314908,-29.88403514962139,null,23.463728697990543,-124.15252753462535,null,0,0]
[92794,92.793999999999997,13.088368126762948,1.494318077073078,1.0012272723964248,4.9518048122046736E-2,1,0,253755.771491372,1.5707923859978297,15.969373973955999,1.5081354674063163,1.1164711254866986,0.46084007473508309,1.0499198187969301,0.72662516178248593,-5.1343808388539109,-154.40766743925897,25.592332560741028,null,92794,8610726436,null,12.727713739841121,-29.994168339675532,null,23.4076305717271,-124.41349909958346,null,0,0]
[93325,93.325000000000003,13.162828413517722,1.4947515421379951,1.0012413496229482,4.9800940908004417E-2,1,0,255207.85152520859,1.5707924084201521,16.0603990473499,1.5084910701806953,1.1177374713649653,0.46311676003847496,1.0507350313248627,0.73102657883518474,-5.2003141885204238,-154.7785484224886,25.221451577511402,null,93325,8709555625,null,12.717674197304877,-30.104239545514503,null,23.351736764596829,-124.6743088769741,null,0,0]
[93868.5,93.868499999999997,13.239044063937339,1.4951901617060654,1.0012558412111521,5.0090484867055265E-2,1,0,256694.11423404148,1.5707924311075998,16.15356897472541,1.5088508937184335,1.1190396136321086,0.46544169111449413,1.0515796554032588,0.73553376650490587,-5.2676233146094926,-155.15792632522351,24.842073674776486,null,93868.5,8811295292.25,null,12.707366779576642,-30.216833213771014,null,23.294735056236,-124.94109311145252,null,0,0]
[94412,94.412000000000006,13.315262232220348,1.4956237599340549,1.0012704167379105,5.0380020420576856E-2,1,0,258180.37694287446,1.5707924535338385,16.246740969563835,1.5092065902615546,1.1203477905695598,0.46776120528052823,1.0524347009959309,0.74004309157837944,-5.3347575795895974,-155.53706555050684,24.462934449493162,null,94412,8913625744,null,12.697027676141559,-30.329352960354743,null,23.237939894690975,-125.20771259015211,null,0,0]
[94955.5,94.955500000000001,13.391482875375184,1.4960524223977829,1.0012850761995582,5.0669547520393321E-2,1,0,259666.63965170758,1.5707924757033536,16.339914996498464,1.5095582303185477,1.1216619810628921,0.47007529657463015,1.0533002503405675,0.74455450605413065,-5.4017204675158546,-155.91596387277386,24.084036127226142,null,94955.5,9016546980.25,null,12.686657110883367,-30.441794404089428,null,23.181347572022915,-125.47416946868451,null,0,0]
[95499,95.498999999999995,13.46770595138215,1.4964762327430869,1.0012998195924081,5.0959066118337261E-2,1,0,261152.90236054084,1.5707924976205281,16.433091020963936,1.5099058828028278,1.1229821639996838,0.47238395929501209,1.0541763857132145,0.7490679611088199,-5.4685154031112893,-156.29461901508159,23.705380984918406,null,95499,9120059001,null,12.676255309134541,-30.554153270089991,null,23.124954438176299,-125.74046574499162,null,0,0]
[96611.5,96.611500000000007,13.623735761891728,1.4973289489613972,1.0013302598255358,5.1551660268711795E-2,1,0,264195.16043519991,1.5707925417142072,16.623820801894762,1.510605345855963,1.1257030683961471,0.47709265179836791,1.0560031207676763,0.75831278767801069,-5.6047295245694926,-157.0689269103413,22.931073089658696,null,96611.5,9333781932.25,null,12.654867219880273,-30.783867723331412,null,23.010128405972363,-126.28505918700991,null,0,0]
[97724,97.724000000000004,13.779775254218441,1.4981623537894142,1.0013610516721843,5.2144218182629487E-2,1,0,267237.41850985948,1.5707925848039526,16.814558531492231,1.5112889403704663,1.1284488109561779,0.48177853338805759,1.0578752609270712,0.76756551880971213,-5.7402821241091884,-157.8421854923958,22.157814507604201,null,97724,9549980176,null,12.63335116512649,-31.01318435026193,null,22.896091861186456,-126.82900114213388,null,0,0]
[98862,98.861999999999995,13.939401060367215,1.4989955558829056,1.0013929130707291,5.2750320400706437E-2,1,0,270349.40924151172,1.570792627877992,17.00967617229799,1.5119723413776525,1.131282999752933,0.48654817995393129,1.0598380274446404,0.77703804379577479,-5.8782856553017169,-158.63206015324872,21.367939846751284,null,98862,9773695044,null,12.611211598523235,-31.247311443056979,null,22.780227896597182,-127.38474871019172,null,0,0]
[100000,100,14.099036324479721,1.499809890796721,1.0014251423173857,5.335638382857797E-2,1,0,273461.39997316449,1.5707926699716663,17.204801577061378,1.5126402413324542,1.1341427957360795,0.49129388024121184,1.0618497989522315,0.78651787145508079,-6.0156535028896672,-159.42079050721503,20.579209492784969,null,100000,10000000000,null,12.588942341278457,-31.480954603861932,null,22.665129306254009,-127.93983590335311,null,0,0]
[101165,101.16500000000001,14.262468534145947,1.5006246628661608,1.0014585172356432,5.3976785974684083E-2,1,0,276647.22528280952,1.5707927120830592,17.404564264760442,1.5133084744080851,1.1370967667579188,0.49612733733126912,1.0639608525065116,0.79622964588735701,-6.1556503280708084,-160.22702294051831,19.77297705948169,null,101165,10234357225,null,12.566012631793619,-31.719606773692878,null,22.548062190557708,-128.50741616682544,null,0,0]
[102330,102.33,14.425909997466906,1.5014209731819936,1.0014922775883275,5.4597146531980729E-2,1,0,279833.05059245502,1.5707927532355981,17.604334547834554,1.5139615418332597,1.1400771649607346,0.50093563494833848,1.0661248642872438,0.80594797169807009,-6.2950374179975155,-161.03200268366322,18.967997316336778,null,102330,10471428900,null,12.54295158306947,-31.957686284732638,null,22.431736149355146,-129.07431639893062,null,0,0]
[103520,103.52,14.592868018675212,1.5022159554143275,1.001527160301428,5.523077611841315E-2,1,0,283087.2412520934,1.5707927943149602,17.80839932268114,1.5146134963931741,1.1431485891933757,0.50582111417857212,1.068390828907791,0.81588100476962899,-6.4368142894517195,-161.8529338327368,18.147066167263205,null,103520,10716390400,null,12.51926249180533,-32.200251734757686,null,22.313648369165087,-129.65268209797912,null,0,0]
[104710,104.71,14.759835053878735,1.5029929520431737,1.0015624450860126,5.5864361313995345E-2,1,0,286341.43191173219,1.5707928344606112,18.012471495384517,1.5152506785893669,1.1462471513912846,0.51068029578319374,1.0707137504143249,0.8258196311780226,-6.5780110420001456,-162.67249709827749,17.327502901722511,null,104710,10964184100,null,12.495441295738377,-32.442156782420163,null,22.19627281268361,-130.23034031585735,null,0,0]
[105930,105.93,14.931020383227439,1.5037714960578608,1.0015990367621299,5.6513872634424096E-2,1,0,289677.66099136235,1.5707928746819633,18.221695764467874,1.5158891075744532,1.1494517716546651,0.51563466077321474,1.073155258256,0.83601393481791997,-6.7221932055100933,-163.51126792392216,16.488732076077838,null,105930,11221164900,null,12.470885043448058,-32.689444004947767,null,22.076646901463981,-130.82182391897439,null,0,0]
[107150,107.15,15.10221455755506,1.5045323898422218,1.0016360509468041,5.7163336225094619E-2,1,0,293013.89007099305,1.5707929139874022,18.430927291939145,1.5165130416651516,1.1526844487727219,0.52056135732407627,1.0756584507139393,0.84621271129958631,-6.8658216591032701,-164.34853163453488,15.651468365465121,null,107150,11481122500,null,12.446195274303079,-32.935976386479908,null,21.957708217015785,-131.41255524805496,null,0,0]
[108400,108.4,15.277627287672619,1.5052943070750286,1.0016744134879947,5.7828720159859077E-2,1,0,296432.15757061506,1.5707929533417322,18.645311129762952,1.517137794239442,1.1560254720331218,0.52558049851827904,1.0782881335010839,0.85666614522943807,-7.0124356886657306,-165.20478240797127,14.795217592028735,null,108400,11750560000,null,12.420762724711953,-33.187758563065934,null,21.836526737044451,-132.01702384490531,null,0,0]
[109650,109.65,15.453048685374345,1.5060389263219649,1.0017132194722065,5.849405283573661E-2,1,0,299850.42507023754,1.5707929917987906,18.85970207969191,1.5177483430800265,1.1593954493610799,0.53057058686435632,1.080984514386794,0.86712268903949463,-7.1585243372800376,-166.0593723567541,13.940627643245904,null,109650,12023122500,null,12.395195756467057,-33.438689896655333,null,21.716005056675041,-132.62068246009872,null,0,0]
[110925,110.925,15.631987137757115,1.5067812206651918,1.0017532583576554,5.9172638753564447E-2,1,0,303337.0579198529,1.5707930301320792,19.078387926858433,1.518356966334488,1.1628623936469793,0.53563055212019228,1.0838045472081583,0.8777907076974939,-7.3070211887658267,-166.92930033269678,13.070699667303217,null,110925,12304355625,null,12.368981982349123,-33.693735203130501,null,21.593721979307183,-133.23556512956628,null,0,0]
[112200,112.2,15.810934008417306,1.5075067129461353,1.001793758492294,5.9851170116597151E-2,1,0,306823.69076946867,1.5707930675941566,19.297080680906998,1.5189517948174052,1.1663589335465878,0.54066030773382434,1.0866960174399971,0.88846020135555404,-7.4550264307862761,-167.79741270569249,12.202587294307506,null,112200,12588840000,null,12.342634455987687,-33.947839956877814,null,21.472064263648175,-133.84957274881467,null,0,0]
[113510,113.51,15.994801617219407,1.5082352124130827,1.0018358507521252,6.0548270359329213E-2,1,0,310406.03510907438,1.5707931052080495,19.521783715363497,1.5195490707920387,1.1699820033879538,0.54579668857950492,1.0897423422886445,0.89942315688668273,-7.6066100091562028,-168.68741653965586,11.312583460344143,null,113510,12884520100,null,12.315427577820454,-34.207913664170555,null,21.347687563445476,-134.47950287548528,null,0,0]
[114820,114.82,16.178677521700426,1.50894715298646,1.0018784298117884,6.1245311688319683E-2,1,0,313988.3794486805,1.5707931419636563,19.74649355549608,1.5201327532877711,1.1736357491233149,0.55090122238761829,1.0928662616399252,0.91038569132476821,-7.7577294532545,-169.57540496650773,10.424595033492267,null,114820,13183632400,null,12.288086055870398,-34.466941470413303,null,21.22390964129724,-135.1084634960944,null,0,0]
[116155,116.155,16.366070753493691,1.5096562214126763,1.0019223222082529,6.1955594028356584E-2,1,0,317639.08913827955,1.5707931785677602,19.975498515294305,1.5207140642454575,1.1773904867439102,0.55607043936229916,1.0961307589334559,0.92155593538292346,-7.9112823787547102,-170.47821300490119,9.5217869950988074,null,116155,13491984025,null,12.260087643438604,-34.72981121955079,null,21.098355128228818,-135.74840178535044,null,0,0]
[117490,117.49,16.5534720274843,1.5103492355034054,1.0019667200310995,6.2665813780492255E-2,1,0,321289.79882787901,1.5707932143400236,20.20451007224267,1.5212821974498594,1.1811764846804669,0.56120665530569913,1.0994781218689169,0.93272356568374371,-8.0644068741486166,-171.37881918855823,8.6211808114417749,null,117490,13803900100,null,12.231956301563077,-34.991545130860757,null,20.973361974710443,-136.38727405769751,null,0,0]
[118860,118.86,16.745794521553698,1.5110442918818054,1.0020128072477463,6.3394587712755565E-2,1,0,325036.22000746836,1.5707932502146928,20.439532303794664,1.5218519891860558,1.1850939271630661,0.56644326736119477,1.1030005871862596,0.94418008355465832,-8.2211270153510227,-172.30068860150831,7.6993113984916874,null,118860,14127699600,null,12.202952854262829,-35.258936294675159,null,20.845645280808284,-137.0417523068331,null,0,0]
[120230,120.23,{"$f":"SQRT(1+(A589/pole1)^2)","v":16.938124921857312},{"$f":"ATAN(A589/pole1)","v":1.5117235640166407},{"$f":"SQRT(1+(A589/Zero1)^2)","v":1.0020594265957452},{"$f":"ATAN(A589/Zero1)","v":6.412329422173256E-2},{"$f":"IF(VIN_nom>Vout, 1, SQRT(1+(A589/z_RHP)^2))","v":1},{"$f":"IF(VIN_nom>Vout, 0, -ATAN(A589/z_RHP))","v":0},{"$f":"SQRT(1+(A589/Pole2)^2)","v":328782.64118705812},{"$f":"ATAN(A589/Pole2)","v":1.5707932852717907},20.674561020426541,1.5224088262977931,{"$f":"SQRT(1+(A589/pole4)^2)","v":1.1890436527635251},{"$f":"ATAN(A589/pole4)","v":0.57164523167270065},{"$f":"SQRT((1-(V589/pterm2))^2+(A589/pterm1)^2)","v":1.1066127307146238},{"$f":"IF((ATAN((A589/pterm1)/(1-A589^2/pterm2))>0),ATAN((A589/pterm1)/(1-A589^2/pterm2)),PI()+ATAN((A589/pterm1)/(1-A589^2/pterm2)))","v":0.95563143216299429},{"$f":"20*LOG10(((E589*K589*G589)/(C589*I589*O589*M589))*Adc)","v":-8.3774488407328178},{"$f":"((F589+L589+H589)-(D589+J589+P589+N589))*radconv","v":-173.22011835902029},{"$f":"IF(R589>0,R589,R589+180)","v":6.7798816409797098},null,120230,14455252900,null,{"$f":"20*LOG10((K589/(I589*M589))*AEA)","v":12.173816763518886},{"$f":"(L589-(J589+N589))*radconv","v":-35.525084487451203},null,{"$f":"20*LOG10((E589*G589/(C589*O589))*Acs*Am)","v":20.718459546170433},{"$f":"(F589+H589-(D589+P589))*radconv","v":-137.69503387156905},null,0,0]
[126030,{"$f":"A590/1000","v":126.03},17.752452084974159,1.5144362475661808,1.0022626866035345,6.7207564548071946E-2,1,0,344643.40238532564,1.5707934252450828,21.669640092136323,1.524632418743044,1.2061154143039166,0.59328589853008107,1.1229258833289393,1.0040253180534182,-9.0353912471405167,-177.08411785934638,2.9158821406536219,null,{"$f":"IF(Q590<0,A590,1000000000)","v":126030},{"$f":"A590^2","v":15883560900},null,12.049081627326355,-36.637608922907816,null,20.185252275955257,-140.44650893643859,null,{"$f":"SUM((Q591<0)*(Q590>0))*A590","v":0},0]
[131830,131.83000000000001,18.566898422694088,1.5169109615618204,1.0024754769398962,7.0290554827341173E-2,1,0,360504.16358359932,1.5707935529018295,22.664816898126016,1.5266607515347597,1.2237361104854125,0.61431296888079057,1.1409555943451566,1.052206559473496,-9.6882947213351418,-180.89840277734618,-0.89840277734617757,null,131830,17379148900,null,11.922307489157241,-37.72616371655149,null,19.659122939929752,-143.17223906079468,null,0,0]
[144540,144.54,20.352006101228834,1.521641328959624,1.0029750765350647,7.7041797899637582E-2,1,0,395261.10751983413,1.5707937968217194,24.845911138734483,1.5305373813309504,1.2641560560797267,0.65828661459855287,1.1868619825223026,1.1565567899830669,-11.107633826183648,-189.0588466979726,-9.0588466979725979,null,144540,20891811600,null,11.638627498545215,-40.023567478131802,null,18.52346382569327,-149.03527921984079,null,0,0]
[158490,158.49,22.311706861169252,1.5259617873549667,1.0035759834546447,8.4443584603633659E-2,1,0,433408.97281572421,1.5707940195053325,27.240152681376561,1.5340775624646541,1.3111478659889213,0.70333343574701146,1.2480752873137106,1.2681185011180982,-12.655957945408877,-197.65248285715268,-17.652482857152677,null,158490,25119080100,null,11.320423736811641,-42.40173553429473,null,17.293343468201613,-155.2507473228579,null,0,0]
[173780,173.78,24.460049341185609,1.5299019375147476,1.0042976886287389,9.2545697820948306E-2,1,0,475221.22087124002,1.5707942225117626,29.86470497758831,1.537305724361117,1.3654854795653575,0.74904387454928933,1.3290514839915701,1.3853841952938863,-14.347917955932399,-206.56691610981827,-26.566916109818266,null,173780,30199488400,null,10.966730738775468,-44.835802339297004,null,15.955076455714266,-161.73111377052123,null,0,0]
[190550,190.55,26.816704555854376,1.5334974893195932,1.0051649413066677,0.10141802928168685,1,0,521080.69764634047,1.5707944077063476,32.743599295217514,1.5402512572647407,1.4280974337646557,0.79507344485547293,1.4352977490111871,1.5064674408633443,-16.197620612028636,-215.67068197581224,-35.670681975812244,null,190550,36309302500,null,10.576496245706542,-47.304346460536294,null,14.495608292686953,-168.36633551527601,null,0,0]
[208930,208.93,29.399941215383613,1.5367760913532023,1.0062061695199525,0.11112372810489139,1,0,571342.90296098765,1.5707945765324975,35.899152659886035,1.5429369124232557,1.499887207114414,0.84100140680418989,1.5731392888840006,1.6288617149641074,-18.210648966950547,-224.79272315672523,-44.792723156725231,null,208930,43651744900,null,10.149799598051125,-49.781957811881711,null,12.909276585420461,-175.01076534484355,null,0,0]
[229090,229.09,32.233652214036887,1.5397678701919286,1.00745699071298,0.12174518269224215,1,0,626472.72119513201,1.5707947305562,39.360551388035475,1.5453874446853093,1.5819167494335271,0.88647857628630111,1.7500730931161566,1.7500650837015734,-20.387966977699268,-233.76526998321091,-53.765269983210914,null,229090,52482228100,null,9.6867320850287371,-52.247211358956577,null,11.195026087694126,-181.51805862425439,null,0,0]
[251190,251.19,35.340327447884938,1.5424962637519171,1.008958418175516,0.13335702271834615,1,0,686907.69058872713,1.5707948709952111,43.155266979692485,1.547622109996136,1.6752084795693112,0.93111397506191595,1.9744639767370404,1.8675727402092817,-22.720289873902271,-242.41836990377854,-62.41836990377854,null,251190,63096416100,null,9.1885557269443634,-54.676602484086636,null,9.3608795495755022,-187.74176741969185,null,0,0]
[275420,275.42,38.746675835810869,1.5449847951924616,1.0107603949632566,0.14604646043061897,1,0,753167.38780171773,1.5707949990687946,{"$f":"SQRT(1+(A599/Zero2)^2)","v":47.315923625947335},{"$f":"ATAN(A599/Zero2)","v":1.5496602190517925},1.7809013774494526,0.97458269718030766,2.2560151682641378,1.9794123893287416,-25.193736941450219,-250.61564752254588,-70.615647522545885,null,275420,75856176400,null,8.6567433110799534,-57.050409096009219,null,7.4192448978919634,-193.56523842653664,null,0,0]
[302000,302,42.483626018438905,1.5472556721920907,1.0129236199214038,0.15991219146600119,1,0,825853.42791404051,1.5707951159262774,51.880298780077702,1.5515199934717505,1.9002597263972383,1.0166190925646299,2.606129309776561,2.0842496668508801,-27.791777101055175,-258.26000238041769,-78.260002380417689,null,302000,91204000000,null,8.0929549732426445,-59.352366610435048,null,5.384993076124319,-198.90763576998262,null,0,0]
[331130,331.13,46.579296530610705,1.5493259116446219,1.0155170148799471,0.17503707133619897,1,0,905512.73372563731,1.5707952224481958,56.882736884679296,1.5532153950133345,2.0344471519332474,1.0569459370422083,3.0376028359596727,2.1812113261573032,-30.492634911736705,-265.28094518227977,-85.280945182279766,null,331130,109647076900,null,7.5000145870250741,-61.565791352953589,null,3.2770756516603545,-203.71515382932623,null,0,0]
[363080,363.08,51.071649274808678,1.5512147404651058,1.0186271380471992,0.19153338503998391,1,0,992883.6510164307,1.5707953196275422,62.369604483044618,1.554762188715862,2.1849357570188328,1.0954129356682381,3.5663277349956899,2.2701313884637315,-33.279689553439681,-271.65411972948777,-91.654119729487775,null,363080,131827086400,null,6.8799435670299447,-63.681168844211946,null,1.110092029952509,-207.97295088527582,null,0,{"$f":"IF(AD602>0,S602,0)","v":0}]
[398110,398.11,55.997241818546847,1.5529373550554693,1.0223535588989809,0.20949915929841897,1,0,1088677.1794263455,1.5707954082489595,68.385552201256019,1.5561728338232048,2.3531457332540602,1.1318752551208611,4.2107395898485613,2.3511180143396508,-36.134840733702148,-277.37196518326368,-97.371965183263683,null,398110,158491572100,null,6.2355526860126451,-65.689486928991528,null,-1.1006682692926573,-211.68247825427213,null,0,0]
[436520,436.52,61.398257368598813,1.5545084994235383,1.0268158512611039,0.22904152187718127,1,0,1193713.7031552952,1.57079548907309,74.982101139647582,1.5574594153060144,2.5406799963941156,1.1662568877061996,4.9932248587707297,2.4245765753702342,-39.043433811778783,-282.44736713086462,-102.44736713086462,null,436520,190549710400,null,5.569373568619743,-67.585698312984519,null,-3.3430822299763956,-214.86166881788012,null,0,0]
[478630,478.63,67.319692654571071,1.5559412860153086,1.0321544224221229,0.25026318379262552,1,0,1308868.2986831879,1.5707955627760866,82.214208211885534,1.5586326791574672,2.7492345594568572,1.1985191066801102,5.9405451746814251,2.4910352031178622,-41.992383183251107,-286.9026171216276,-106.9026171216276,null,478630,229086676900,null,4.8840070985937567,-69.36696845587899,null,-5.6066651314227292,-217.53564866574857,null,0,0]
[524810,524.80999999999995,73.81357645029864,1.557248269101567,1.0385374606275988,0.27327358566818283,1,0,1435152.7731899172,1.5707956300049668,90.145418419521533,1.5597029120826567,2.9807514108381152,1.2286753762249163,7.0854054672610376,2.5511074901569759,-44.971871368213741,-290.76750233444983,-110.76750233444983,null,524810,275425536100,null,4.1816197240978177,-71.033479450781343,null,-7.8837659418894255,-219.73402288366847,null,0,0]
[575440,575.44000000000005,80.933344801889334,1.5584401657010076,1.046159198726784,0.29816397103013542,1,0,1573606.2799953739,1.5707956913119219,98.840995089161794,1.5606788946534338,3.2372241000423245,1.2567530990944797,8.466587125157389,2.6053754802956077,-47.972087466778383,-294.0718245981065,-114.0718245981065,null,575440,331131193600,null,3.4645896811425914,-72.586298301765581,null,-10.166951997498842,-221.48552629634091,null,0,0]
[630960,630.96,88.740872057549566,1.5595273236602758,1.0552505331587749,0.32502651409915478,1,0,1725432.0492594321,1.5707957472299114,108.37650712872414,1.561569103876308,3.5209520416542071,1.2828183058586013,10.131446373511213,2.6544220278256518,-50.985938533477075,-296.84758830455496,-116.84758830455496,null,630960,398110521600,null,2.7347679949915182,-74.02872261564427,null,-12.450981378046455,-222.81886568891071,null,0,0]
[691830,691.83,97.3008459455489,1.5605187429230674,1.0660769333587758,0.35392788412773207,1,0,1891888.0034219588,1.5707957982223817,118.83095914179694,1.5623809120703123,3.8343419427032126,1.3069445600332545,12.136338318125304,2.6987664306605903,-54.006138987738119,-299.12503532736008,-119.12503532736008,null,691830,478628748900,null,1.9940911807017305,-75.364544895200922,null,-14.730505018017713,-223.76049043215917,null,0,0]
[758580,758.58,106.68779885270682,1.5614230464951067,1.0789507329628187,0.3849255829278217,1,0,2074423.4879028024,1.5707958447332511,130.29537888758415,1.5631213821723959,4.1801666246010329,1.329228818926554,14.549962857113874,2.7388986597755438,-57.027431422839541,-300.9345889797147,-120.9345889797147,null,758580,575443616400,null,1.2439843715036578,-76.598915733945844,null,-17.001690643921066,-224.33567324576885,null,0,0]
[831760,831.76,116.97907645776525,1.5622476853603466,1.0942258643750185,0.41803579504577781,1,0,2274542.5404018047,1.5707958871460519,142.86422974862842,1.5637966168759334,4.5613100331466487,1.3497657318773426,17.453852652582729,2.7752401740326316,-60.043744280582054,-302.30497005047391,-122.30497005047391,null,831760,691824697600,null,0.48602135920558021,-77.736908502934952,null,-19.260040489365501,-224.56806154753897,null,0,0]
[912010,912.01,128.2646817356075,1.5629998693653715,1.1123150842869289,0.45325656340467341,1,0,2493995.3138787826,1.5707959258318336,156.64743335031881,1.5644125210037181,4.9811323533507403,1.3686651588141059,20.947584553593902,2.8081849870476145,-63.05096377562009,-303.2652352930275,-123.2652352930275,null,912010,831762240100,null,-0.27878422347260784,-78.784479412249667,null,-21.502454401725348,-224.48075588077793,null,0,0]
[1000000,1000,140.63883719620219,1.56368585541691,1.1336805398963297,0.49053126416542941,1,0,2734613.9997135438,1.5707959611125737,171.76006442303569,1.5649742187695428,5.4431597544078238,1.3860300231915545,25.149602373665662,2.8380696414519706,-66.044103239198321,-303.8438734833577,-123.8438734833577,null,1000000,1000000000000,null,-1.0492739865116809,-79.747231964088456,null,-23.725104102264506,-224.09664151926927,null,0,0]
[]
[]
["Pole/Zero Locations for Chart"]
[{"$f":"Q4*1000","v":56561.5},null,{"$f":"SQRT(1+(A617/pole1)^2)","v":8.017153259139123},{"$f":"ATAN(A617/pole1)","v":1.4457380515124914},{"$f":"SQRT(1+(A617/Zero1)^2)","v":1.0004561528442288},{"$f":"ATAN(A617/Zero1)","v":3.0198659424400542E-2},{"$f":"IF(VIN_nom>Vout, 1, SQRT(1+(A617/z_RHP)^2))","v":1},{"$f":"IF(VIN_nom>Vout, 0, -ATAN(A617/z_RHP))","v":0},{"$f":"SQRT(1+(A617/Pole2)^2)","v":154673.86974801988},{"$f":"ATAN(A617/Pole2)","v":1.570789861578751},{"$f":"SQRT(1+(A617/Zero2)^2)","v":9.766174253525973},{"$f":"ATAN(A617/Zero2)","v":1.4682223095392992},{"$f":"SQRT(1+(A617/pole4)^2)","v":1.0447902916528946},{"$f":"ATAN(A617/pole4)","v":0.29387066840294285},{"$f":"SQRT((1-(A617^2/(pole3^2)))^2+(A617/(Q*pole3))^2)","v":1.0135085749218293},{"$f":"ATAN((A617/(Q*pole3))/(1-A617^2/pole3^2))","v":0.43288949910181934},{"$f":"20*LOG10(((E617*K617*G617)/(C617*I617*O617*M617))*Adc)","v":2.7885823209679347E-2},{"$f":"((F617+L617+H617)-(D617+J617+P617+N617))*radconv","v":-128.62141121122588},{"$f":"IF(R617>0,R617,R617+180)","v":51.378588788774124},"crossover",null,null,null,{"$f":"20*LOG10((K617/(I617*M617))*AEA)","v":13.332792187578136},{"$f":"(L617-(J617+N617))*radconv","v":-22.714236894980967},null,{"$f":"20*LOG10((E617*G617/(C617*O617))*Acs*Am)","v":27.964818786053677},{"$f":"(F617+H617-(D617+P617))*radconv","v":-105.90717431624491}]
[{"$f":"A617","v":56561.5},null,null,null,null,null,null,null,null,null,null,null,null,null,null,null,null,-180]
[{"$f":"A618","v":56561.5}]
[1000000,null,null,null,null,null,null,null,null,null,null,null,null,null,null,null,null,{"$f":"R617","v":-128.62141121122588}]
[]
[{"$f":"pole1","v":7110.5912127177653},null,1.4142135623730951,0.78539816339744828,1.0000072107003675,3.7975405301946727E-3,{"$f":"IF(VIN_nom>Vout, 1, SQRT(1+(A622/z_RHP)^2))","v":1},{"$f":"IF(VIN_nom>Vout, 0, -ATAN(A622/z_RHP))","v":0},19444.722302250724,1.5707448989583404,1.5784680060037011,0.88469480197311745,1.0007234611043268,3.8026969643042571E-2,1.0001651700618372,5.3465637039248587E-2,{"$f":"20*LOG10(((E622*K622*G622)/(C622*I622*O622*M622))*Adc)","v":17.766036392541519},{"$f":"((F622+L622+H622)-(D622+J622+P622+N622))*radconv","v":-89.332332368506812},90.667667631493188,"p1",null,null,null,15.88962353726169,-41.486560007417822,null,{"$f":"20*LOG10((E622*G622/(C622*O622))*Acs*Am)","v":43.146138005701964},{"$f":"(F622+H622-(D622+P622))*radconv","v":-47.845772361089011}]
[{"$f":"Zero1","v":1872411.0973383102},null,263.32896136466712,1.5669987862647019,1.4142135623730951,0.78539816339744828,1,0,5120321.6000000974,1.5707961314946639,321.6015547226101,1.5676868840799716,10.068144369900008,1.4713091236599123,87.783732588350816,-0.16102728811378247,-85.771215000076154,-120.0341829960207,59.965817003979296,"z1",null,null,null,-6.3913462800431038,-84.477949995658648,null,-38.110143569610912,-35.556233000362027]
[{"$f":"Pole2","v":0.36568232302797354},null,1.0000000013224111,5.1427836556197762E-5,1.0000000000000191,1.9530023270413079E-7,1,0,1.4142135623730951,0.78539816339744828,1.0000000019724573,6.2808554755057795E-5,1.000000000001914,1.9565879804732975E-6,1.0000000000004348,2.748766171739979E-6,99.585009160875416,-44.999606391353886,135.00039360864611,"p2",null,null,{"$f":"Pole2","v":0.36568232302797354},94.696924461106349,-44.996513490544757,null,46.1578098501912,-3.0929008091300598E-3]
[{"$f":"Zero2","v":5822.1738101315623},null,1.2924544260466282,0.68610152482177922,1.0000048343364742,3.1094427149251352E-3,1,0,15921.398041354527,1.5707335182401416,1.4142135623730951,0.78539816339744828,1.0004850939309795,3.1141545091743009E-2,1.0001105628826488,4.3773339810677145E-2,19.332549561144404,-88.421271909123604,91.578728090876396,"z2",null,null,{"$f":"Zero2","v":5822.1738101315623},16.673687906126226,-46.780680489623158,null,43.928586805440311,-41.640591419500424]
[{"$f":"pole3","v":200000},null,28.144827253262626,1.5352583391765799,1.0056884520872185,0.10641068489895747,1,0,546922.79994358635,1.5707944983832816,34.365983024267102,1.5416936768299798,1.4646226560039968,0.81924952813954333,1.5033628910344898,{"$error":"#DIV/0!"},-17.235129990798651,{"$error":"#DIV/0!"},{"$error":"#DIV/0!"},"p3",null,null,null,10.356764297969672,-48.606894641389005,null,13.67783086165381,{"$error":"#DIV/0!"}]
[{"$f":"Fp2_u","v":186897.97069030782},null,{"$f":"SQRT(1+(A627/pole1)^2)","v":26.303464579437307},{"$f":"ATAN(A627/pole1)","v":1.5327693571518541},{"$f":"SQRT(1+(A627/Zero1)^2)","v":1.0049693435518918},{"$f":"ATAN(A627/Zero1)","v":9.9487203134984284E-2},1,0,{"$f":"SQRT(1+(A627/Pole2)^2)","v":511093.80716871144},{"$f":"ATAN(A627/Pole2)","v":1.570794370206916},{"$f":"SQRT(1+(A627/Zero2)^2)","v":32.116635445717947},{"$f":"ATAN(A627/Zero2)","v":1.5396547817031536},{"$f":"SQRT(1+(A627/pole4)^2)","v":1.4142135623730951},{"$f":"ATAN(A627/pole4)","v":0.78539816339744828},{"$f":"SQRT((1-(A627^2/(pole3^2)))^2+(A627/(Q*pole3))^2)","v":1.4105816478505644},{"$f":"ATAN((A627/(Q*pole3))/(1-A627^2/pole3^2))","v":1.4808335672879949},-15.795569797774442,-213.75069908477585,{"$f":"IF(R627>0,R627,R627+180)","v":-33.750699084775846},"p4",null,null,null,null,null,null,14.812642441257111,-166.96653203427744]
[{"$f":"z_RHP","v":0},null,{"$f":"SQRT(1+(A628/pole1)^2)","v":1},{"$f":"ATAN(A628/pole1)","v":0},{"$f":"SQRT(1+(A628/Zero1)^2)","v":1},{"$f":"ATAN(A628/Zero1)","v":0},1,0,{"$f":"SQRT(1+(A628/Pole2)^2)","v":1},{"$f":"ATAN(A628/Pole2)","v":0},{"$f":"SQRT(1+(A628/Zero2)^2)","v":1},{"$f":"ATAN(A628/Zero2)","v":0},{"$f":"SQRT(1+(A628/pole4)^2)","v":1},{"$f":"ATAN(A628/pole4)","v":0},{"$f":"SQRT((1-(A628^2/(pole3^2)))^2+(A628/(Q*pole3))^2)","v":1},{"$f":"ATAN((A628/(Q*pole3))/(1-A628^2/pole3^2))","v":0},102.59530911188924,0,{"$f":"IF(R628>0,R628,R628+180)","v":180},"z_RHP",null,null,null,null,null,null,46.157809861681123,0]
[{"$f":"Fp2_u","v":186897.97069030782},null,null,null,null,null,null,null,null,null,null,null,null,null,null,null,-25]
[]
[null,null,null,"System","Plant"]
["p1","p-dom",{"$f":"pole1","v":7110.5912127177653},{"$f":"Q622","v":17.766036392541519},{"$f":"AA622","v":43.146138005701964}]
["z1","ESR zero",{"$f":"Zero1","v":1872411.0973383102},{"$f":"Q623","v":-85.771215000076154},{"$f":"AA623","v":-38.110143569610912}]
["p2","EA pole",{"$f":"Pole2","v":0.36568232302797354},{"$f":"Q624","v":99.585009160875416},{"$f":"AA624","v":46.1578098501912}]
["z2","EA zero",{"$f":"Zero2","v":5822.1738101315623},{"$f":"Q625","v":19.332549561144404},{"$f":"AA625","v":43.928586805440311}]
["p3","p_sampling",{"$f":"pole3","v":200000},{"$f":"Q626","v":-17.235129990798651},{"$f":"AA626","v":13.67783086165381}]
[]
[]
[{"$f":"Q4*1000","v":56561.5}]
[{"$f":"Q4*1000","v":56561.5}]
[]
[]
[]
[]
[]
[]
[]
[]
[]
[]
[]
[]
[]
[]
[]
[]
[]
[]
[]
[]
[]
[]
[]
[]
[]
[]
[]
[]
[]
[]
[]
[]
[]
[]
[]
[]
[]
[]
[]
[]
[]
[]
[]
[]
[]
[]
[null,null,null,null,null,null,null,null,null,null,null,null,null,null,null,null,null,null,null,null,null,null,null,null,null,null,null,null,null,"phase margin",{"$f":"SUM(AE689:AE1306)","v":0}]

{"sheet":"Bode Plot Management","index":5,"n_rows":6,"n_cols":14,"rows_kept":6,"cut":false,"hidden":true,"merged":[]}
[null,null,null,null,null,null,null,null,null,"Single or dual output (MODE)",null,null,null,"3.3V or 5V fixed (FB1/2)"]
[{"$f":"CHOOSE(BODE_PLOT_TYPE, \"BODE_PLOT_Ch1\", \"BODE_PLOT_Ch2\")","v":"BODE_PLOT_Ch1"},null,null,null,null,null,null,null,null,"With/without dither (DITH)",null,null,null,"With/without VOUT connected to VCCX"]
[null,null,null,null,null,null,null,null,null,"FPWM or DEM (DEMB)"]
[null,null,null,null,null,null,null,null,null,"Shunt or inductor DCR current sensing"]
[]
[null,null,null,null,null,{"$f":"INDIRECT(A2)","v":0}]

{"sheet":"Efficiency Calculations","index":6,"n_rows":109,"n_cols":57,"rows_kept":109,"cut":false,"hidden":true,"merged":[[6,51,6,56],[6,27,6,32],[6,33,6,36],[6,40,6,44],[6,45,6,49],[6,24,6,26],[0,0,3,3],[5,0,6,3],[6,6,6,13],[6,17,6,20],[6,21,6,23]]}
["BUCK CONTROLLER POWER DESIGN TOOL"]
[null,null,null,null,null,null,null,{"$f":"AV19","v":0.94978402359479031},"10% load"]
[null,null,null,null,null,null,null,{"$f":"AV59","v":0.96734823374282708},"50% load",null,null,null,null,null,null,null,null,null,null,null,null,null,null,null,null,null,null,null,null,null,null,null,null,null,null,null,null,null,null,null,null,{"$f":"IF(MODE=1, (Qg_Q1+Qg_Q2)*Fsw*Vin, (Qg_Q1+Qg_Q2+Qg_Q3+Qg_Q4)*Fsw*Vin)","v":9.1799999999999993E-2}]
[null,null,null,null,null,null,null,{"$f":"AV109","v":0.95425639203688795},"100% load",null,null,null,null,null,null,null,null,null,null,null,null,null,null,null,null,null,null,null,null,null,null,null,null,null,null,null,null,null,null,null,"I_VCC",{"$f":"(Qg_Q1+Qg_Q2)*Fsw*1000","v":6.8},"mA",{"$f":"AP4*5/1000","v":3.4000000000000002E-2}]
[]
["Enter the values of your design and MOSFET datasheet specifications below. Note that thermal resistance (θJA) will change when components are placed on the PCB"]
[null,null,null,null,null,null,"Operating Point Condtions",null,null,null,null,null,null,null,null,null,null,"Filter Inductor",null,null,null,"Cout",null,null,"Cin",null,null,"High-side BUCK \"Control\" MOSFET Losses ",null,null,null,null,null,"Low-side BUCK \"Sync\" MOSFET Losses ",null,null,null,"External Diode","Diode/FET","Sense Rs","Controller IC Losses",null,null,null,null,"RESULTS",null,null,null,null,null,"Consolidated Buck/Boost Efficiency & Losses"]
["Input Parameters",null,null,null,null,null,"Step","Vin","Mode","Iout","Iout/ phase","Iin","Duty Cycle BUCK Leg","Ripple Current pk-pk","Peak Inductor Current","Valley Inductor Current","SW node voltage at Q1 turn-on","Irms Lf","DCR    Loss","Core Loss","Total Inductor Loss","Irms Cout","Cout ESR Loss","Total Cout Loss","Irms Cin","Cin ESR Loss","Total Cin Loss","Irms","RDS(on) Loss","Transition Loss (not including capacitive loss)","MOSFET Output Capacitance Loss","Dead Time Loss ","Total Control MOSFET Loss","Irms","RDS(on) Loss","Deadtime Loss","Total Sync MOSFET Loss","Deadtime Loss","Reverse Recovery Loss","Isense Shunt Loss","IQ Loss","Switching Current Loss","Switching Current Diss","LDO Loss Saved from Gate Drive Current (ext VCC)","Total IC Loss","Total Loss","Pout","EFF, h",{"$f":"IF(Vin>Vout, \"Buck ''CONTROL'' MOSFET Temp Rise\", \"Boost ''CONTROL'' MOSFET Temp Rise\")","v":"Buck ''CONTROL'' MOSFET Temp Rise"},{"$f":"IF(Vin>Vout, \"Buck ''SYNC'' MOSFET Temp Rise\", \"Boost ''SYNC'' MOSFET Temp Rise\")","v":"Buck ''SYNC'' MOSFET Temp Rise"},null,"h","Inductor Cu & Core Loss","Total MOSFET Loss","Control MOSFET Loss","SYNC MOSFET Loss","Shunt Loss"]
["Design","Input Value","Units","Description",null,null,0,{"$f":"Vin","v":13.5},{"$f":"MODE","v":1},0,{"$f":"Iout*G9/100/Number_of_Phases","v":0},{"$f":"Vout*K9/(Vin*Efficiency)","v":0},{"$f":"(Vout+(Rdson2+Rs+Rdcr)*K9)/(Vin+(Rs+Rdson2-Rdson1)*K9)","v":0.37037037037037035},{"$f":"(Vin-(Rdson1+Rdcr)*K9-Vout)*M9/(Fsw*Lf)","v":5.2469135802469138},{"$f":"K9+N9/2","v":2.6234567901234569},{"$f":"K9-N9/2","v":-2.6234567901234569},{"$f":"IF(MIN(Vin, -P9/(Coss_Q1+Coss_Q2)*0.00000002)<0, 0, MIN(Vin, -P9/(Coss_Q1+Coss_Q2)*0.00000002))","v":13.5},{"$f":"SQRT(K9^2+(N9^2)/12)","v":1.5146534839851293},{"$f":"R9^2*Rdcr","v":9.1767007061931607E-3},{"$f":"Core_Loss_Ch1","v":0.25},{"$f":"(T9+S9*(1+Ltc*(Ta-25)))/(1-S9*Ltc*ThetaCa)","v":0.25936711145458102},{"$f":"N9/SQRT(12)","v":1.5146534839851296},{"$f":"RCoutEsr*V9^2","v":2.294175176548291E-3},{"$f":"W9","v":2.294175176548291E-3},{"$f":"SQRT(M9*(1-M9))*SQRT(K9^2+(N9^2)/12)","v":0.7314320470995872},{"$f":"RCinEsr*Y9^2","v":5.3499283952429283E-4},{"$f":"Z9","v":5.3499283952429283E-4},{"$f":"SQRT(M9)*SQRT(K9^2+(N9^2)/12)","v":0.92178875553605022},{"$f":"Rdson1*AB9^2","v":3.8236252942471503E-3},{"$f":"(Vin*K9/2)*Fsw*(Tr_buck+Tf_buck)","v":0},{"$f":"(0.5*Coss_Q1*(Vin-Q9)^2-0.5*Coss_Q2*(Vin-Q9)^2+(Qoss_Q2*(Vin-Q9)/Vin)*Vin)*Fsw","v":0},{"$f":"IF(K9>N9/2,0,ABS(K9-N9/2)*Vsd_Q1*Deadtime*Fsw)","v":1.1753086419753086E-2},{"$f":"(AF9+AE9+AD9+AC9*(1+RdsonTopTc*Ta-RdsonTopTc*25))/(1-AC9*RdsonTopTc*ThetaJA_Q1)","v":1.5588632732083659E-2},{"$f":"SQRT((1-M9))*SQRT(K9^2+(N9^2)/12)","v":1.2018654944358751},{"$f":"Rdson2*AH9^2","v":5.2723544335119051E-3},{"$f":"IF(K9<N9/2,Deadtime*Fsw*IF(VfdSky_Q2>0,0,Vsd_Q2)*(K9+N9/2),2*Deadtime*Fsw*IF(VfdSky_Q2>0,0,Vsd_Q2)*K9)","v":1.1753086419753088E-2},{"$f":"(AJ9+AI9*(1+RdsonBotTc*Ta-RdsonBotTc*25))/(1-AI9*RdsonBotTc*ThetaJA_Q2)","v":1.7043412635699393E-2},{"$f":"2*Deadtime*Fsw*IF(VfdSky_Q2>0,VfdSky_Q2,Vsd_Q2)*K9","v":0},{"$f":"IF(QrrSky_Q2>0,QrrSky_Q2,Qrr_Q2*K9/(Iout/Number_of_Phases))*Fsw*Vin","v":0},{"$f":"Rs*R9^2","v":6.8825255296448709E-3},{"$f":"Iq*Vin","v":4.7249999999999994E-4},{"$f":"IF(Ext_VCC=1,  (Qg_Q1+Qg_Q2)*Fsw*VCC, (Qg_Q1+Qg_Q2)*Fsw*Vin)","v":3.3999999999999996E-2},{"$f":"(Vin-VCC)*Fsw*(Qg_Q1+Qg_Q2)+(RdsonDRT+RdsonDRT2)*Fsw*Qg_Q1*VCC/(RdsonDRT+2*Rgate1+RdsonDRT2)+(RdsonDRB+RdsonDRB2)*Fsw*Qg_Q2*VCC/(RdsonDRB+2*Rgate2+RdsonDRB2)","v":9.1800000000000007E-2},{"$f":"(Qg_Q1+Qg_Q2)*Fsw*(Vin-VCC)","v":5.7799999999999997E-2},{"$f":"SUM(AO9:AP9)","v":3.4472499999999996E-2},{"$f":" SUM(U9,X9,AA9,AG9,AK9,AL9,AM9,AS9,AN9)","v":0.33618335036808156},{"$f":"Vout*K9","v":0},{"$f":"AU9/(AU9+AT9)","v":0},{"$f":"ThetaJA_Q1*BC9","v":0.77943163660418291},{"$f":"ThetaJA_Q2*BD9","v":0.85217063178496966},null,{"$f":"AV9*100","v":0},{"$f":"U9","v":0.25936711145458102},{"$f":"AG9+AK9+AM9","v":3.2632045367783052E-2},{"$f":"AG9+AM9*0.66","v":1.5588632732083659E-2},{"$f":"AK9+AM9*0.33","v":1.7043412635699393E-2},{"$f":"AN9","v":6.8825255296448709E-3}]
[null,null,null,null,null,null,1,13.5,1,{"$f":"Iout*G10/100","v":0.15},0.15,6.1728395061728392E-2,0.3704798533516514,5.2476773194600232,{"$f":"K10+N10/2","v":2.7738386597300115},{"$f":"K10-N10/2","v":-2.4738386597300117},13.5,{"$f":"SQRT(K10^2+(N10^2)/12)","v":1.5222822025163165},9.2693724163917107E-3,0.25,0.25946177624293681,{"$f":"N10/SQRT(12)","v":1.5148739565052691},2.2948431040979277E-3,{"$f":"W10","v":2.2948431040979277E-3},{"$f":"SQRT(M10*(1-M10))*SQRT(K10^2+(N10^2)/12)","v":0.73516070354581542},5.4046126003797835E-4,{"$f":"Z10","v":5.4046126003797835E-4},{"$f":"SQRT(M10)*SQRT(K10^2+(N10^2)/12)","v":0.92656836411117605},3.8633802001724737E-3,1.4299845114377078E-3,0,1.1082797195590454E-2,1.6388825159725871E-2,1.2078137980360495,5.3246717231508747E-3,1.2426797195590453E-2,1.7770393220799742E-2,1.3440000000000001E-3,7.0200000000000004E-4,6.952029312293783E-3,4.7249999999999994E-4,3.3999999999999996E-2,9.1800000000000007E-2,5.7799999999999997E-2,3.4472499999999996E-2,0.33992682829989218,0.75,{"$f":"AU10/(AU10+AT10)","v":0.68811958796342088},0.84260725798629355,0.90010266103998715,null,{"$f":"AV10*100","v":68.811958796342083},0.25946177624293681,3.4861218380525617E-2,1.685214515972587E-2,1.8002053220799744E-2,6.952029312293783E-3]
["Vin",{"$f":"Vin","v":13.5},"V","Vin",null,null,2,13.5,1,0.3,0.3,0.12345679012345678,0.37058933110232878,5.2484405192924735,2.9242202596462366,-2.3242202596462369,13.5,1.5445098436222153,9.5420426281836793E-3,0.25,0.25974031888378746,1.5150942733196244,2.2955106570459209E-3,2.2955106570459209E-3,0.74594049903829029,5.5642722810549366E-4,5.5642722810549366E-4,0.94023656530264998,3.9782015942945595E-3,2.8599690228754155E-3,0,1.0412506763215142E-2,1.7264413643961713E-2,1.2253431594103734,5.4803503828453545E-3,1.3100506763215142E-2,1.8601245414546299E-2,2.6880000000000003E-3,1.4040000000000001E-3,7.1565319711377603E-3,4.7249999999999994E-4,3.3999999999999996E-2,9.1800000000000007E-2,5.7799999999999997E-2,3.4472499999999996E-2,0.34417894779858466,1.5,0.81337009176390684,0.9095526821980856,0.95322827072731497,null,81.33700917639068,0.25974031888378746,3.7269659058508015E-2,1.8191053643961713E-2,1.9064565414546299E-2,7.1565319711377603E-3]
["Vout",{"$f":"Vout","v":5},"V","Vout",null,null,3,13.5,1,0.45,0.45,0.18518518518518517,0.37069880362277741,5.2492031797829179,3.0746015898914592,-2.1746015898914588,13.5,1.5807206695745641,9.9947113408810351E-3,0.25,0.26020276346175303,1.5153144344393537,2.2961778352202583E-3,2.2961778352202583E-3,0.76347532072184088,5.8289456535131777E-4,5.8289456535131777E-4,0.96242240422534897,4.1681559786970546E-3,4.2899535343131233E-3,0,9.7422151227137353E-3,1.8215509652816791E-2,1.2539621011280033,5.7393364713885526E-3,1.3774215122713738E-2,1.9535976302361559E-2,4.0320000000000009E-3,2.1059999999999998E-3,7.4960335056607754E-3,4.7249999999999994E-4,3.3999999999999996E-2,9.1800000000000007E-2,5.7799999999999997E-2,3.4472499999999996E-2,0.34893985532316368,2.25,0.86573761812592054,0.98027348264083958,1.0115478151180781,null,86.573761812592053,0.26020276346175303,3.9857485955178351E-2,1.9605469652816791E-2,2.0230956302361561E-2,7.4960335056607754E-3]
["Fsw",{"$f":"Fsw/1000","v":400},"kHz","Switching Frequency",null,null,4,13.5,1,0.6,0.6,0.24691358024691357,0.37080827091337198,5.2499653009700067,3.2249826504850034,-2.0249826504850033,13.5,1.6299830178407047,1.0627378553796364E-2,0.25,0.260849149966767,1.5155344398756141,2.2968446384490915E-3,2.2968446384490915E-3,0.78731638276108029,6.1986708656399194E-4,6.1986708656399194E-4,0.99256232372016329,4.4333098491094658E-3,5.719938045750831E-3,0,9.0719222741728143E-3,1.9242231523939897E-2,1.2929287188319087,6.1015760527281717E-3,1.4447922274172817E-2,2.0574605831347965E-2,5.3760000000000006E-3,2.8080000000000002E-3,7.9705339153472721E-3,4.7249999999999994E-4,3.3999999999999996E-2,9.1800000000000007E-2,5.7799999999999997E-2,3.4472499999999996E-2,0.3542097329624152,3,0.89439845413316488,1.0547755761969948,1.0750622915673982,null,89.43984541331649,0.260849149966767,4.262483735528786E-2,2.1095511523939896E-2,2.1501245831347965E-2,7.9705339153472721E-3]
["Iout",{"$f":"Iout","v":15},"A","Max Output Current",null,null,5,13.5,1,0.75,0.75,0.30864197530864196,0.37091773297448727,5.2507268828923825,3.3753634414461913,-1.8753634414461913,13.5,1.6911567244228816,1.1440044266242922E-2,0.25,0.26167953430272234,1.5157542896395608,2.2975110665607295E-3,2.2975110665607295E-3,0.8169140711835664,6.6734859969770903E-4,6.6734859969770903E-4,1.0299654465518013,4.7737296949079315E-3,7.1499225571885388E-3,0,8.4016282176789369E-3,2.0344704493770616E-2,1.3413359927587416,6.5670151959657886E-3,1.5121628217678939E-2,2.1717166806531088E-2,6.7200000000000003E-3,3.5100000000000005E-3,8.5800331996821917E-3,4.7249999999999994E-4,3.3999999999999996E-2,9.1800000000000007E-2,5.7799999999999997E-2,3.4472499999999996E-2,0.3599887984689647,3.75,0.91241124584011846,1.1330652246885307,1.1437733403265544,null,91.241124584011843,0.26167953430272234,4.55718713003017E-2,2.2661304493770615E-2,2.2875466806531089E-2,8.5800331996821917E-3]
["Ta",{"$f":"Ta","v":25},"°C","Ambient Temperature",null,null,6,13.5,1,0.9,0.9,0.37037037037037035,0.37102718980649813,5.251487925588691,3.5257439627943454,-1.7257439627943456,13.5,1.7630023027164914,1.2432708477534605E-2,0.25,0.26269398829956092,1.5159739837423503,2.2981771193836516E-3,2.2981771193836516E-3,0.85167065575485457,7.2534290587390401E-4,7.2534290587390401E-4,1.0738799849265153,5.1894819991159767E-3,8.5799070686262465E-3,0,7.7313329533186684E-3,2.1523060728303976E-2,1.3981984470588855,7.1355999753562587E-3,1.5795332953318669E-2,2.2963704891085915E-2,8.0640000000000017E-3,4.2119999999999996E-3,9.3245313581509538E-3,4.7249999999999994E-4,3.3999999999999996E-2,9.1800000000000007E-2,5.7799999999999997E-2,3.4472499999999996E-2,0.3662773053023593,4.5,0.92473151809428145,1.2151490364151987,1.2176832445542958,null,92.473151809428145,0.26269398829956092,4.8698765619389892E-2,2.4302980728303974E-2,2.4353664891085914E-2,9.3245313581509538E-3]
["Vcc",{"$f":"VCC","v":5},"V","Subregulated VCC Voltage",null,null,7,13.5,1,1.05,1.05,0.43209876543209874,0.37113664140977909,5.2522484290975671,3.6761242145487838,-1.5761242145487835,13.5,1.8442729724057902,1.3605371186985956E-2,0.25,0.26389259972881068,1.5161935221951348,2.2988427967464888E-3,2.2988427967464888E-3,0.89098473577432269,7.9385379938283962E-4,7.9385379938283962E-4,1.1235492609885143,5.6806332384052643E-3,1.0009891580063955E-2,0,7.0610364811785507E-3,2.2777439355465456E-2,1.4625251638445924,7.807276470307079E-3,1.6469036481178555E-2,2.431427861054335E-2,9.4080000000000014E-3,4.914E-3,1.0204028390239466E-2,4.7249999999999994E-4,3.3999999999999996E-2,9.1800000000000007E-2,5.7799999999999997E-2,3.4472499999999996E-2,0.37307554268118831,5.25,0.93365275997994179,1.301033967773273,1.2967949305271675,null,93.365275997994175,0.26389259972881068,5.2005717966008808E-2,2.6020679355465457E-2,2.5935898610543351E-2,1.0204028390239466E-2]
["Components","Input Value","Units","Description",null,null,8,13.5,1,1.2,1.2,0.49382716049382713,0.37124608778470486,5.2530083934576464,3.8265041967288234,-1.4265041967288232,13.5,1.9337807782884906,1.4958032393912161E-2,0.25,0.26527547232257703,1.516412905009068,2.2995080984780408E-3,2.2995080984780408E-3,0.93428318388227305,8.7288506768519729E-4,8.7288506768519729E-4,1.1782519899406889,6.2472498830963693E-3,1.1439876091501662E-2,0,6.3907388013451291E-3,2.4107986499110813E-2,1.5333722140037778,8.5819907653777918E-3,1.714273880134513E-2,2.5768959360976781E-2,1.0752000000000001E-2,5.6160000000000003E-3,1.121852429543412E-2,4.7249999999999994E-4,3.3999999999999996E-2,9.1800000000000007E-2,5.7799999999999997E-2,3.4472499999999996E-2,0.38038383564426204,6,0.9403822958864585,1.3907273249555407,1.3811119680488391,null,94.038229588645848,0.26527547232257703,5.5492945860087593E-2,2.7814546499110814E-2,2.762223936097678E-2,1.121852429543412E-2]
["L",{"$f":"Lf*1000000","v":1.5},"uH","Filter Inductance",null,null,9,13.5,1,1.35,1.35,0.55555555555555558,0.37135552893165008,5.2537678187075576,3.9768839093537789,-1.2768839093537787,13.5,2.0304366585558054,1.6490692097629059E-2,0.25,0.26684272579599655,1.5166321321953007,2.3001730244072644E-3,2.3001730244072644E-3,0.98104051466474285,9.6244049141366351E-4,9.6244049141366351E-4,1.2373267238652066,6.8893983971595229E-3,1.2869860602939372E-2,0,5.7204399139049282E-3,2.5514855314665547E-2,1.6098744059137839,9.4596889502793439E-3,1.7816439913904931E-2,2.7327831421170266E-2,1.2096000000000003E-2,6.3180000000000007E-3,1.2368019073221794E-2,4.7249999999999994E-4,3.3999999999999996E-2,9.1800000000000007E-2,5.7799999999999997E-2,3.4472499999999996E-2,0.3882025451208751,6.75,0.94561620482649089,1.4842367657332773,1.4706385710585133,null,94.56162048264909,0.26684272579599655,5.9160686735835813E-2,2.9684735314665547E-2,2.9412771421170266E-2,1.2368019073221794E-2]
["Rdcr",{"$f":"Rdcr*1000","v":4},"mW","Inductor DCR at 25°C",null,null,10,13.5,1,1.5,1.5,0.61728395061728392,0.37146496485098929,5.2545267048859312,4.1272633524429656,-1.1272633524429656,13.5,2.1332692221947243,1.8203350297453135E-2,0.25,0.26859449587316087,1.5168512037649848,2.3008375743632835E-3,2.3008375743632835E-3,1.0307879725600795,1.0625238443745192E-3,1.0625238443745192E-3,1.3001833407652241,7.607145238215385E-3,1.4299845114377078E-2,0,5.0501398189444855E-3,2.6998206026419794E-2,1.6912601381100028,1.044031711987351E-2,1.8490139818944488E-2,2.8990991968772736E-2,1.3440000000000001E-2,7.0200000000000011E-3,1.365251272308985E-2,4.7249999999999994E-4,3.3999999999999996E-2,9.1800000000000007E-2,5.7799999999999997E-2,3.4472499999999996E-2,0.39653206801018109,7.5,0.94978402359479031,1.5815703013209899,1.5653795984386369,null,94.978402359479034,0.26859449587316087,6.3009197995192529E-2,3.1631406026419798E-2,3.1307591968772738E-2,1.365251272308985E-2]
["LTc",{"$f":"Ltc*1000000","v":4000},"ppm","Inductor Series Resistance Temp Co",null,null,11,13.5,1,1.65,1.65,0.67901234567901236,0.37157439554309712,5.2552850520313896,4.2776425260156952,-0.9776425260156949,13.5,2.241428506148563,2.0096006992701514E-2,0.25,0.27053093431652286,1.5170701197292698,2.3015017481753807E-3,2.3015017481753807E-3,1.0831153648384937,1.1731388935492233E-3,1.1731388935492233E-3,1.3663053878199154,8.400556857535782E-3,1.5729829625814786E-2,0,4.3798385165503134E-3,2.8558205966495033E-2,1.7768543371333647,1.1523821374172218E-2,1.9163838516550315E-2,3.0758551100444505E-2,1.4784E-2,7.7220000000000006E-3,1.5072005244526137E-2,4.7249999999999994E-4,3.3999999999999996E-2,9.1800000000000007E-2,5.7799999999999997E-2,3.4472499999999996E-2,0.40537283726971318,8.25,0.95316517902912368,1.6827362983247516,1.6653405550222253,null,95.316517902912366,0.27053093431652286,6.7038757066939542E-2,3.3654725966495033E-2,3.3306811100444506E-2,1.5072005244526137E-2]
["ThetaCa",{"$f":"ThetaCa","v":20},"°C/W","Core to Ambient Thermal Resistance",null,null,12,13.5,1,1.8,1.8,0.7407407407407407,0.37168382100834801,5.2560428601825508,4.4280214300912757,-0.82802143009127538,13.5,2.3541804403386326,2.2168662182691992E-2,0.25,0.27265220895979553,1.5172888800993032,2.3021655456729974E-3,2.3021655456729974E-3,1.1376684047190577,1.2942893990960059E-3,1.2942893990960059E-3,1.435246761597655,9.2696997000445008E-3,1.7159814137252493E-2,0,3.7095360068089139E-3,3.0195029615499837E-2,1.8660740282733808,1.2710147818337014E-2,1.9837536006808917E-2,3.2630631856005045E-2,1.6128000000000003E-2,8.4239999999999992E-3,1.6626496637018994E-2,4.7249999999999994E-4,3.3999999999999996E-2,9.1800000000000007E-2,5.7799999999999997E-2,3.4472499999999996E-2,0.41472532201308843,9,0.9559492913677049,1.7877434807749921,1.7705275928002522,null,95.594929136770489,0.27265220895979553,7.1249661471504883E-2,3.575486961549984E-2,3.5410551856005043E-2,1.6626496637018994E-2]
["Cin",{"$f":"Cin*1000000","v":18},"μF","Input Capacitance",null,null,13,13.5,1,1.95,1.95,0.80246913580246915,0.37179324124711638,5.2568001293780311,4.5784000646890153,-0.67840006468901559,13.5,2.4708963893060631,2.4421315866742958E-2,0.25,0.27495850374435798,1.5175074848862329,2.3028289666857404E-3,2.3028289666857404E-3,1.1941436740825808,1.4259791143514452E-3,1.4259791143514452E-3,1.5066253832336687,1.0214640204317995E-2,1.8589798648690203E-2,0,3.0392322898067903E-3,3.1908858644892589E-2,1.9584200063525039,1.3999242562678356E-2,2.051123228980679E-2,3.4607370246592842E-2,1.7472000000000001E-2,9.1260000000000004E-3,1.8315986900057219E-2,4.7249999999999994E-4,3.3999999999999996E-2,9.1800000000000007E-2,5.7799999999999997E-2,3.4472499999999996E-2,0.42459002761693782,9.75,0.95826956894926762,1.8966009322446293,1.8809475123296422,null,95.826956894926766,0.27495850374435798,7.5642228891485419E-2,3.7932018644892589E-2,3.7618950246592842E-2,1.8315986900057219E-2]
["RCinEsr",{"$f":"RCinEsr*1000","v":1},"mW","Input Capacitor ESR",null,null,14,13.5,1,2.1,2.1,0.86419753086419748,0.37190265625977681,5.2575568596564439,4.7287784298282221,-0.52877842982822187,13.5,2.5910407196806804,2.6853968044173514E-2,0.25,0.27745001875918263,1.5177259341012057,2.3034920110433774E-3,2.3034920110433774E-3,1.252282630172624,1.5682117858320651E-3,1.5682117858320651E-3,1.5801156640214105,1.1235444802586203E-2,2.001978316012791E-2,0,2.3689273656304342E-3,3.3699881961070002E-2,2.0534669462539576,1.5391051722655072E-2,2.1184927365630438E-2,3.6688915286851122E-2,1.8816000000000003E-2,9.8279999999999999E-3,2.0140476033130135E-2,4.7249999999999994E-4,3.3999999999999996E-2,9.1800000000000007E-2,5.7799999999999997E-2,3.4472499999999996E-2,0.43496749583710931,10.5,0.96022233298793991,2.0093180980535004,1.9966077643425562,null,96.022233298793992,0.27745001875918263,8.0216797247921134E-2,4.0186361961070005E-2,3.9932155286851123E-2,2.0140476033130135E-2]
["Cout",{"$f":"Cout*1000000","v":85},"μF","Output Capcitance",null,null,15,13.5,1,2.25,2.25,0.92592592592592593,0.37201206604670362,5.2583130510563958,4.8791565255281979,-0.3791565255281979,12.874584907578878,2.7141581896742561,2.9466618714303342E-2,0.25,0.28012697028430017,1.5179442277553663,2.3041546785758358E-3,2.3041546785758358E-3,1.3118655240671244,1.720991153235911E-3,1.720991153235911E-3,1.6554408557328808,1.2332179920733256E-2,2.1449767671565617E-2,2.9964381982842247E-3,1.6986212343663265E-3,3.8572142745803319E-2,2.1508533775565044,1.6885521418873714E-2,2.185862123436633E-2,3.8875429031154735E-2,2.0160000000000001E-2,1.0529999999999999E-2,2.2099964035727507E-2,4.7249999999999994E-4,3.3999999999999996E-2,9.1800000000000007E-2,5.7799999999999997E-2,3.4472499999999996E-2,0.44886215192879747,11.25,0.96163198214496504,2.2760971372901659,2.1175164515577367,null,96.163198214496504,0.28012697028430017,8.7977571776958044E-2,4.5521942745803318E-2,4.2350329031154738E-2,2.2099964035727507E-2]
["RCoutEsr",{"$f":"Cout_ESR*1000","v":1},"mW","Output Capacitor ESR",null,null,16,13.5,1,2.4,2.4,0.98765432098765427,0.37212147060827117,5.2590687036164931,5.0295343518082465,-0.22953435180824666,7.7940357150508213,2.8398621391034466,3.2259267876452821E-2,0.25,0.28298959083781966,1.5181623658598593,2.3048169691132054E-3,2.3048169691132054E-3,1.3727057038725179,1.8843209494441449E-3,1.8843209494441449E-3,1.7323658824662145,1.3504911978298256E-2,2.2879752183003324E-2,2.6926304564176218E-2,1.0283138961009453E-3,6.4513532537243651E-2,2.2502722987185924,1.8482597777087939E-2,2.2532313896100945E-2,4.1167086613896724E-2,2.1504000000000002E-2,1.1232000000000001E-2,2.4194450907339612E-2,4.7249999999999994E-4,3.3999999999999996E-2,9.1800000000000007E-2,5.7799999999999997E-2,3.4472499999999996E-2,0.48426229881485705,12,0.96121017908596584,3.5963326268621825,2.2436823306948361,null,96.121017908596585,0.28298959083781966,0.11691261915114039,7.1926652537243646E-2,4.4873646613896721E-2,2.4194450907339612E-2]
["Top Driver","Input Value","Units","Description",null,null,17,13.5,1,2.5499999999999998,2.5499999999999998,1.0493827160493827,0.37223086994485394,5.2598238173753398,5.1799119086876697,-7.9911908687670064E-2,2.713477374793551,2.9678239305062792,3.523191552994296E-2,0.25,0.28603812922652311,1.5183803484258287,2.3054788824857409E-3,2.3054788824857409E-3,1.4346445206122045,2.0582049005226223E-3,2.0582049005226223E-3,1.8106909294199189,1.4753707388476063E-2,2.4309736694441031E-2,5.0123151802104873E-2,3.580053509207619E-4,8.9809606165952072E-2,2.3514627874159886,2.0182226928197922E-2,2.3206005350920763E-2,4.356407629385467E-2,2.2848E-2,1.1934E-2,2.6423936647457222E-2,4.7249999999999994E-4,3.3999999999999996E-2,9.1800000000000007E-2,5.7799999999999997E-2,3.4472499999999996E-2,0.51945393211679536,12.75,0.96085340551508813,4.8843023082976034,2.3751148146927337,null,96.085340551508807,0.28603812922652311,0.14530768245980674,9.768604616595207E-2,4.7502296293854669E-2,2.6423936647457222E-2]
["RdsonDRT",0.7,"W","Drain to Source Resistance of pullup Top FET Driver",null,null,18,13.5,1,2.7,2.7,1.1111111111111112,0.37234026405682596,5.2605783923715279,5.3302891961857641,6.9710803814236222E-2,0,3.0977637770694932,3.8384561674095409E-2,0.25,0.28927285060005536,1.5185981754644153,2.3061404185238514E-3,2.3061404185238514E-3,1.4975469026790043,2.2426467257234792E-3,2.2426467257234792E-3,1.890245872197464,1.6078632558117978E-2,2.5739721205878745E-2,6.2212049999999998E-2,0,0.10436601632962042,2.454202713950969,2.1984355008249704E-2,2.4192000000000005E-2,4.638028313019317E-2,2.4192000000000005E-2,1.2636000000000001E-2,2.8788421255571559E-2,4.7249999999999994E-4,3.3999999999999996E-2,9.1800000000000007E-2,5.7799999999999997E-2,3.4472499999999996E-2,0.54465685845968781,13.5,0.96121963932984111,5.6352888164810206,2.5275081565096587,null,96.121963932984116,0.28927285060005536,0.16338229945981361,0.11270577632962042,5.0550163130193171E-2,2.8788421255571559E-2]
["RdsonDRT2",{"$f":"RdsonDRT2","v":0.5},"W","Drain to Source Resistance of pulldown Top FET Driver",null,null,19,13.5,1,2.85,2.85,1.1728395061728394,0.37244965294456167,5.2613324286436542,5.4806662143218272,0.21933378567817297,0,3.2294429205449835,4.1717206308232446E-2,0.25,0.29269403650873038,1.5188158469867608,2.3068015770581116E-3,2.3068015770581116E-3,1.5612975813363441,2.4376501374867182E-3,2.4376501374867182E-3,1.9708855250443804,1.7479753887732583E-2,2.7169705717316448E-2,6.2212049999999998E-2,0,0.1072364027907667,2.5583025278939644,2.3888928158434568E-2,2.5536000000000003E-2,4.9662203520854424E-2,2.5536000000000003E-2,1.3338000000000003E-2,3.1287904731174335E-2,4.7249999999999994E-4,3.3999999999999996E-2,9.1800000000000007E-2,5.7799999999999997E-2,3.4472499999999996E-2,0.5589714992660707,14.25,0.96225453609024958,5.8019741395383351,2.7031871760427215,null,96.225453609024953,0.29269403650873038,0.17023660631162113,0.1160394827907667,5.4063743520854426E-2,3.1287904731174335E-2]
["Bottom Driver","Input Value","Units","Description",null,null,20,13.5,1,3,3,1.2345679012345678,0.37255903660843526,5.2620859262303084,5.6310429631151546,0.36895703688484582,0,3.3626570384027059,4.522984943167703E-2,0.25,0.29630198496497884,1.5190333630040049,2.3074623579192569E-3,2.3074623579192569E-3,1.6257979091639265,2.6432188414417948E-3,2.6432188414417948E-3,2.0524856351635066,1.895713777148644E-2,2.8599690228754155E-2,6.2212049999999998E-2,0,0.11018664267338799,2.6636000216561633,2.5895892525088504E-2,2.6880000000000001E-2,5.3050651318072253E-2,2.6880000000000001E-2,1.4040000000000002E-2,3.3922387073757776E-2,4.7249999999999994E-4,3.3999999999999996E-2,9.1800000000000007E-2,5.7799999999999997E-2,3.4472499999999996E-2,0.57380484722955782,15,0.96315577003447339,5.9726521336694001,2.8841925659036129,null,96.315577003447345,0.29630198496497884,0.17727729399146025,0.11945304267338799,5.7683851318072257E-2,3.3922387073757776E-2]
["RdsonDRB",0.7,"W","Drain to Source Resistance of pullup Bottom FET Driver",null,null,21,13.5,1,3.15,3.15,1.2962962962962963,0.37266841504882087,5.2628388851700754,5.7814194425850376,0.51858055741496223,0,3.4972307274382373,4.8922491043752729E-2,0.25,0.30009701050846133,1.5192507235272865,2.3081227609381837E-3,2.3081227609381837E-3,1.6909631978281481,2.8593565364091965E-3,2.8593565364091965E-3,2.1349395306141261,2.051085059720489E-2,3.0029674740191865E-2,6.2212049999999998E-2,0,0.11321701077601455,2.7699559493896859,2.8005194259691505E-2,2.8224000000000003E-2,5.6545910099074635E-2,2.8224000000000003E-2,1.4741999999999998E-2,3.6691868282814545E-2,4.7249999999999994E-4,3.3999999999999996E-2,9.1800000000000007E-2,5.7799999999999997E-2,3.4472499999999996E-2,0.58915777896371246,15.75,0.96394197381934577,6.1473365388007277,3.0705385049537317,null,96.394197381934575,0.30009701050846133,0.18450492087508918,0.12294673077601455,6.1410770099074634E-2,3.6691868282814545E-2]
["RdsonDRB2",0.5,"W","Drain to Source Resistance of pulldown Bottom FET Driver",null,null,22,13.5,1,3.3,3.3,1.3580246913580247,0.37277778826609276,5.2635913055015404,5.93179565275077,0.66820434724922961,0,3.6330129074840829,5.2795131143783799E-2,0.25,0.30407944427487349,1.5194679285677442,2.3087827859459512E-3,2.3087827859459512E-3,1.7567204997955796,3.0860669144020312E-3,3.0860669144020312E-3,2.2181553270115031,2.2140958746372785E-2,3.1459659251629572E-2,6.2212049999999998E-2,0,0.11632778975681483,2.8772503768696325,3.0216779518867011E-2,2.9568000000000001E-2,6.014827696355652E-2,2.9568000000000001E-2,1.5444000000000001E-2,3.9596348357837853E-2,4.7249999999999994E-4,3.3999999999999996E-2,9.1800000000000007E-2,5.7799999999999997E-2,3.4472499999999996E-2,0.60503120905343077,16.5,0.96462846506043232,6.3260414878407421,3.2622398481778259,null,96.462846506043235,0.30407944427487349,0.19192006672037137,0.12652082975681483,6.524479696355652E-2,3.9596348357837853E-2]
["Deadtime",0.5,"Units","Description",null,null,23,13.5,1,3.45,3.45,1.419753086419753,0.37288715626062491,5.2643431872632815,6.0821715936316405,0.81782840636835941,0,3.7698729995549956,5.6847769731095121E-2,0.25,0.30824963406847267,1.519684978136514,2.309442432773777E-3,2.309442432773777E-3,1.8230067637361098,3.3233536606276045E-3,3.3233536606276045E-3,2.3020536046531852,2.3847528594135251E-2,3.2889643763067279E-2,6.2212049999999998E-2,0,0.11951927019993114,2.9853796465570435,3.2530594464381266E-2,3.0912000000000005E-2,6.3858062612003705E-2,3.0912000000000005E-2,1.6146000000000001E-2,4.2635827298321341E-2,4.7249999999999994E-4,3.3999999999999996E-2,9.1800000000000007E-2,5.7799999999999997E-2,3.4472499999999996E-2,0.62142609027213025,17.25,0.96522795175196519,6.5087815099965569,3.4593121306001855,null,96.522795175196521,0.30824963406847267,0.19952333281193485,0.13017563019993114,6.9186242612003707E-2,4.2635827298321341E-2]
["Deadtime",{"$f":"Deadtime*1000000000","v":14},"ns","Total Deadtime",null,null,24,13.5,1,3.6,3.6,1.4814814814814814,0.37299651903279157,5.2650945304938759,6.2325472652469376,0.96745273475306215,0,3.9076977494751364,6.1080406805012186E-2,0.25,0.3126079444383541,1.5199018722447328,2.3101017012530441E-3,2.3101017012530441E-3,1.8897673014127971,3.5712204534890058E-3,3.5712204534890058E-3,2.3865654778036354,2.5630626509298423E-2,3.4319628274504986E-2,6.2212049999999998E-2,0,0.1227917506838435,3.0942538553597942,3.494658526314267E-2,3.2256000000000007E-2,6.7675591428359633E-2,3.2256000000000007E-2,1.6847999999999998E-2,4.5810305103759136E-2,4.7249999999999994E-4,3.3999999999999996E-2,9.1800000000000007E-2,5.7799999999999997E-2,3.4472499999999996E-2,0.63834341380905846,18,0.96575106490761875,6.6955715341921751,3.6617715714179813,null,96.575106490761868,0.3126079444383541,0.20731534211220312,0.13391143068384351,7.3235431428359629E-2,4.5810305103759136E-2]
["IQ","Input Value","Units","Description",null,null,25,13.5,1,3.75,3.75,1.5432098765432098,0.37310587658296668,5.2658453352318917,6.3829226676159454,1.1170773323840542,0,4.0463885862847242,6.5493042364861156E-2,0.25,0.31715475675850935,1.5201186109035341,2.3107605912152901E-3,2.3107605912152901E-3,1.9569545126514032,3.8296709645866912E-3,3.8296709645866912E-3,2.4716309889234527,2.7490318854330259E-2,3.5749612785942693E-2,6.2212049999999998E-2,0,0.12614553785179228,3.2037947571292027,3.7464698087201272E-2,3.3600000000000005E-2,7.1601201567079581E-2,3.3600000000000005E-2,1.7550000000000003E-2,4.9119781773645864E-2,4.7249999999999994E-4,3.3999999999999996E-2,9.1800000000000007E-2,5.7799999999999997E-2,3.4472499999999996E-2,0.65578420950682892,18.75,0.96620676585769905,6.8864268925896148,3.8696350783539795,null,96.6206765857699,0.31715475675850935,0.21529673941887187,0.13772853785179229,7.7392701567079586E-2,4.9119781773645864E-2]
["IQ ",{"$f":"Iq*1000","v":3.4999999999999996E-2},"mA","Quiescent Current Of Controller (Not Switching!)",null,null,26,13.5,1,3.9,3.9,1.6049382716049383,0.3732152289115242,5.266595601515899,6.5332978007579499,1.2667021992420504,0,4.1858594222085648,7.0085676409968878E-2,0.25,0.32189046931169951,1.5203351941240517,2.3114191024922182E-3,2.3114191024922182E-3,2.0245268234133302,4.0987088587200694E-3,4.0987088587200694E-3,2.557197771231507,2.9426671985361239E-2,3.7179597297380407E-2,6.2212049999999998E-2,0,0.1295809464842908,3.3139340158338748,4.0084879113748043E-2,3.4944000000000003E-2,7.5635245044618493E-2,3.4944000000000003E-2,1.8252000000000001E-2,5.2564257307476665E-2,4.7249999999999994E-4,3.3999999999999996E-2,9.1800000000000007E-2,5.7799999999999997E-2,3.4472499999999996E-2,0.67374954610929783,19.5,0.96660266131641159,7.0813633242145402,4.0829202522309247,null,96.660266131641166,0.32189046931169951,0.22346819152890929,0.1416272664842908,8.1658405044618493E-2,5.2564257307476665E-2]
["High-side FET","Input Value","Units","Description",null,null,27,13.5,1,4.05,4.05,1.6666666666666665,0.37332457601883817,5.2673453293844599,6.6836726646922298,1.4163273353077699,0,4.326034816655512,7.4858308939662763E-2,0.25,0.32681549737717719,1.520551621917418,2.3120772349156903E-3,2.3120772349156903E-3,2.0924477995613344,4.3783377938890703E-3,4.3783377938890703E-3,2.6432199325059389,3.1439752252185149E-2,3.8609581808818114E-2,6.2212049999999998E-2,0,0.13309829957376051,3.4246117478217859,4.28070745251143E-2,3.6288000000000001E-2,7.9778087835402536E-2,3.6288000000000001E-2,1.8954000000000002E-2,5.6143731704747075E-2,4.7249999999999994E-4,3.3999999999999996E-2,9.1800000000000007E-2,5.7799999999999997E-2,3.4472499999999996E-2,0.69224053151989207,20.25,0.96694524969866469,7.2803969786880254,4.3016453917701272,null,96.694524969866464,0.32681549737717719,0.23183038740916304,0.1456079395737605,8.6032907835402544E-2,5.6143731704747075E-2]
["RdsonTop",{"$f":"Rdson1*1000","v":4.5},"mW","Drain-Source Resistance of Top FET ",null,null,28,13.5,1,4.2,4.2,1.728395061728395,0.37343391790528269,5.2680945188761399,6.8340472594380701,1.5659527405619302,0,4.4668484402672242,7.9810939953270932E-2,0.25,0.3319302733222948,1.5207678942947658,2.3127349883177361E-3,2.3127349883177361E-3,2.1606854054433162,4.6685614212957482E-3,4.6685614212957482E-3,2.7296571212541161,3.3529625998259885E-2,4.0039566320255821E-2,6.2212049999999998E-2,0,0.13669792840132233,3.5357753023494616,4.5631230508771159E-2,3.7632000000000006E-2,8.4030109972336176E-2,3.7632000000000006E-2,1.9656E-2,5.9858204964953199E-2,4.7249999999999994E-4,3.3999999999999996E-2,9.1800000000000007E-2,5.7799999999999997E-2,3.4472499999999996E-2,0.71125831307052001,21,0.96724011557440082,7.4835444200661172,4.5258294986168091,null,96.724011557440079,0.3319302733222948,0.24038403837365852,0.14967088840132234,9.0516589972336178E-2,5.9858204964953199E-2]
["RdsonTopTc",{"$f":"RdsonTopTc*1000000","v":4000},"ppm","Drain to Source Resistance Temp Co",null,null,29,13.5,1,4.3499999999999996,4.3499999999999996,1.7901234567901234,0.37354325457123133,5.2688431700294922,6.9844215850147453,1.7155784149852535,0,4.6082417864659106,8.4943569450122117E-2,0.25,0.33723524669803601,1.5209840112672244,2.313392362530536E-3,2.313392362530536E-3,2.2292113819343911,4.9693833853458377E-3,4.9693833853458377E-3,2.8164737433223137,3.5696359560708026E-2,4.146955083169352E-2,6.2212049999999998E-2,0,0.14038017261577898,3.6473782386402589,4.8557293257328792E-2,3.8976000000000004E-2,8.8391705651899743E-2,3.8976000000000004E-2,2.0358000000000001E-2,6.3707677087591591E-2,4.7249999999999994E-4,3.3999999999999996E-2,9.1800000000000007E-2,5.7799999999999997E-2,3.4472499999999996E-2,0.73080407780118284,21.75,0.96749208456814861,7.6908226307889489,4.7554922825949868,null,96.749208456814856,0.33723524669803601,0.24912987826767874,0.15381645261577898,9.5109845651899741E-2,6.3707677087591591E-2]
["QgTop",{"$f":"Qg_Q1*1000000000","v":8},"nC","Gate Charge Of Top FET",null,null,30,13.5,1,4.5,4.5,1.8518518518518519,0.3736525860170582,5.2695912828830709,7.134795641441535,1.8652043585584646,0,4.7501630874514653,9.0256197429545756E-2,0.25,0.34273088433851051,1.5211999728459233,2.314049357386438E-3,2.314049357386438E-3,2.2980007231614086,5.2808073236503567E-3,5.2808073236503567E-3,2.9036383027856592,3.7940019270317919E-2,4.2899535343131234E-2,6.2212049999999998E-2,0,0.14414538031482349,3.759379465281798,5.1585208968535974E-2,4.0320000000000002E-2,9.2863283343895819E-2,4.0320000000000002E-2,2.1059999999999999E-2,6.7692148072159314E-2,4.7249999999999994E-4,3.3999999999999996E-2,9.1800000000000007E-2,5.7799999999999997E-2,3.4472499999999996E-2,0.75087905275042599,22.5,0.96770534778290018,7.9022490157411749,4.9906541671947915,null,96.770534778290013,0.34273088433851051,0.25806866365871933,0.1580449803148235,9.9813083343895825E-2,6.7692148072159314E-2]
["QgdTop",{"$f":"Qgd_Q1*1000000000","v":3.1},"nC","Gate to Drain Charge",null,null,31,13.5,1,4.6500000000000004,4.6500000000000004,1.9135802469135801,0.37376191224313698,5.2703388574754246,7.2851694287377127,2.014830571262288,0,4.8925663994184019,9.5748823890871776E-2,0.25,0.34841767046445332,1.5214157790419907,2.3147059727179477E-3,2.3147059727179477E-3,2.3670312349073832,5.6028368670271722E-3,5.6028368670271722E-3,2.9911228457087651,4.026067145154405E-2,4.4329519854568948E-2,6.2212049999999998E-2,0,0.1479939081285114,3.8717425139847621,5.471492384527922E-2,4.1664000000000007E-2,9.7445265905904133E-2,4.1664000000000007E-2,2.1762000000000004E-2,7.1811617918153839E-2,4.7249999999999994E-4,3.3999999999999996E-2,9.1800000000000007E-2,5.7799999999999997E-2,3.4472499999999996E-2,0.77148450525676771,23.25,0.96788356252137786,8.1178414064255708,5.2313362952952067,null,96.788356252137788,0.34841767046445332,0.26720117403441557,0.1623568281285114,0.10462672590590413,7.1811617918153839E-2]
["QgsTop",{"$f":"Qgs_Q1*1000000000","v":2.9},"nC",null,null,null,32,{"$f":"Vin","v":13.5},{"$f":"MODE","v":1},4.8,{"$f":"Iout*G41/100/Number_of_Phases","v":4.8},{"$f":"Vout*K41/(Vin*Efficiency)","v":1.9753086419753085},{"$f":"(Vout+(Rdson2+Rs+Rdcr)*K41)/(Vin+(Rs+Rdson2-Rdson1)*K41)","v":0.37387123324984162},{"$f":"(Vin-(Rdson1+Rdcr)*K41-Vout)*M41/(Fsw*Lf)","v":5.2710858938451004},7.43554294692255,2.1644570530774496,{"$f":"IF(MIN(Vin, -P41/(Coss_Q1+Coss_Q2)*0.00000002)<0, 0, MIN(Vin, -P41/(Coss_Q1+Coss_Q2)*0.00000002))","v":0},5.0354108281606704,{"$f":"R41^2*Rdcr","v":0.10142144883343092},{"$f":"Core_Loss_Ch1","v":0.25},{"$f":"(T41+S41*(1+Ltc*(Ta-25)))/(1-S41*Ltc*ThetaCa)","v":0.354296106790772},1.5216314298665541,2.3153622083577343E-3,2.3153622083577343E-3,2.436283160780492,5.9354756395025845E-3,5.9354756395025845E-3,3.0789024892541059,{"$f":"Rdson1*AB41^2","v":4.2658382422508079E-2},{"$f":"(Vin*K41/2)*Fsw*(Tr_buck+Tf_buck)","v":4.5759504366006648E-2},{"$f":"(0.5*Coss_Q1*(Vin-Q41)^2-0.5*Coss_Q2*(Vin-Q41)^2+(Qoss_Q2*(Vin-Q41)/Vin)*Vin)*Fsw","v":6.2212049999999998E-2},{"$f":"IF(K41>N41/2,0,ABS(K41-N41/2)*Vsd_Q1*Deadtime*Fsw)","v":0},{"$f":"(AF41+AE41+AD41+AC41*(1+RdsonTopTc*Ta-RdsonTopTc*25))/(1-AC41*RdsonTopTc*ThetaJA_Q1)","v":0.15192612130503441},{"$f":"SQRT((1-M41))*SQRT(K41^2+(N41^2)/12)","v":3.9844349248071049},{"$f":"Rdson2*AH41^2","v":5.794638409558249E-2},{"$f":"IF(K41<N41/2,Deadtime*Fsw*IF(VfdSky_Q2>0,0,Vsd_Q2)*(K41+N41/2),2*Deadtime*Fsw*IF(VfdSky_Q2>0,0,Vsd_Q2)*K41)","v":4.3008000000000005E-2},{"$f":"(AJ41+AI41*(1+RdsonBotTc*Ta-RdsonBotTc*25))/(1-AI41*RdsonBotTc*ThetaJA_Q2)","v":0.10213809070250991},{"$f":"2*Deadtime*Fsw*IF(VfdSky_Q2>0,VfdSky_Q2,Vsd_Q2)*K41","v":4.3008000000000005E-2},{"$f":"IF(QrrSky_Q2>0,QrrSky_Q2,Qrr_Q2*K41/(Iout/Number_of_Phases))*Fsw*Vin","v":2.2464000000000001E-2},{"$f":"Rs*R41^2","v":7.6066086625073193E-2},{"$f":"Iq*Vin","v":4.7249999999999994E-4},{"$f":"IF(Ext_VCC=1,  (Qg_Q1+Qg_Q2)*Fsw*VCC, (Qg_Q1+Qg_Q2)*Fsw*Vin)","v":3.3999999999999996E-2},9.1800000000000007E-2,{"$f":"(Qg_Q1+Qg_Q2)*Fsw*(Vin-VCC)","v":5.7799999999999997E-2},{"$f":"SUM(AO41:AP41)","v":3.4472499999999996E-2},{"$f":" SUM(U41,X41,AA41,AG41,AK41,AL41,AM41,AS41,AN41)","v":0.7926217432712499},{"$f":"Vout*K41","v":24},0.96802993441037066,{"$f":"ThetaJA_Q1*BC41","v":8.3376180652517196},{"$f":"ThetaJA_Q2*BD41","v":5.4775605351254955},null,96.80299344103706,{"$f":"U41","v":0.354296106790772},{"$f":"AG41+AK41+AM41","v":0.27652821200754429},{"$f":"AG41+AM41*0.66","v":0.1667523613050344},{"$f":"AK41+AM41*0.33","v":0.10955121070250991},{"$f":"AN41","v":7.6066086625073193E-2}]
["RGateTop",{"$f":"Rgate1","v":0},"W","Gate Resistance",null,null,33,13.5,1,{"$f":"Iout*G42/100","v":4.95},4.95,2.0370370370370368,0.3739805490375458,5.2718323920306407,7.5859161960153205,2.3140838039846798,0,5.178659871447306,0.10727407225655453,0.25,0.36036671263818698,1.5218469253307396,2.3160180641386258E-3,2.3160180641386258E-3,2.5057388647488614,6.2787272583129132E-3,6.2787272583129132E-3,3.1669550217835281,4.5133218494999579E-2,4.7189488877444362E-2,6.2212049999999998E-2,0,0.15594239379883515,4.0974277240896786,6.1279535932606342E-2,4.4352000000000009E-2,0.10694220972937102,4.4352000000000009E-2,2.3165999999999999E-2,8.0455554192415887E-2,4.7249999999999994E-4,3.3999999999999996E-2,9.1800000000000007E-2,5.7799999999999997E-2,3.4472499999999996E-2,0.81429211568126059,24.75,0.96814728481443968,8.5615976899417578,5.7293494864685508,null,96.814728481443964,0.36036671263818698,0.28605060352820622,0.17123195379883516,0.11458698972937102,8.0455554192415887E-2]
["GfsTop",{"$f":"Gfs_Q1","v":71},"S","Transconductance of Top FET",null,null,34,13.5,1,5.0999999999999996,5.0999999999999996,2.0987654320987654,0.37408985960662317,5.2725783520705827,7.7362891760352905,2.4637108239647083,0,5.3222808587948087,0.11330669415957442,0.25,0.36663002504901004,1.5220622654456721,2.316673539893612E-3,2.316673539893612E-3,2.5753825606899778,6.6325953339060675E-3,6.6325953339060675E-3,3.2552605621764665,4.7685245974476501E-2,4.8619473388882062E-2,6.2212049999999998E-2,0,0.16004310836110236,4.2106949797191628,6.4714325574647388E-2,4.5696000000000001E-2,0.11185808974219429,4.5696000000000001E-2,2.3868E-2,8.498002061968081E-2,4.7249999999999994E-4,3.3999999999999996E-2,9.1800000000000007E-2,5.7799999999999997E-2,3.4472499999999996E-2,0.83649701264578713,25.5,0.96823810652403275,8.789799418055118,5.9867264871097143,null,96.823810652403282,0.36663002504901004,0.29576919810329666,0.17579598836110236,0.11973452974219428,8.498002061968081E-2]
["VthTop",{"$f":"Vth_Q1","v":3.2},"V","Threshold Voltage of Top FET",null,null,35,13.5,1,5.25,5.25,2.1604938271604937,0.37419916495744759,5.2733237740034644,7.8866618870017327,2.6133381129982678,0,5.4662444727121242,0.11951931454182339,0.25,0.37308659890711288,1.5222774502224767,2.3173286354558451E-3,2.3173286354558451E-3,2.6452000812685479,6.9970834699431324E-3,6.9970834699431324E-3,3.343801268684969,5.0314531160066435E-2,5.0049457900319776E-2,6.2212049999999998E-2,0,0.16422865663269048,4.3242134210740151,6.8250699245137728E-2,4.7040000000000005E-2,0.11688621239069384,4.7040000000000005E-2,2.4570000000000002E-2,8.9639485906367541E-2,4.7249999999999994E-4,3.3999999999999996E-2,9.1800000000000007E-2,5.7799999999999997E-2,3.4472499999999996E-2,0.8592378659422637,26.25,0.96830461003030499,9.0222428316345251,6.2497156195346921,null,96.830461003030493,0.37308659890711288,0.30568486902338432,0.1804448566326905,0.12499431239069383,8.9639485906367541E-2]
["VspTop",{"$f":"Vsp_Q1","v":3.4112676056338032},"V",null,null,null,36,13.5,1,5.4,5.4,2.2222222222222223,0.37430846509039262,5.2740686578678142,8.0370343289339079,2.7629656710660933,0,5.610524338300177,0.12591193340263457,0.25,0.37973700706213243,1.5224924796722754,2.3179833506586341E-3,2.3179833506586341E-3,2.7151786798109523,7.3721952632999459E-3,7.3721952632999459E-3,3.4325610893509193,5.3021140344566856E-2,5.1479442411757489E-2,6.2212049999999998E-2,0,0.16849943923950408,4.4379621132376368,7.1888603172644255E-2,4.838400000000001E-2,0.1220270743576068,4.838400000000001E-2,2.5272000000000003E-2,9.4433950051975926E-2,4.7249999999999994E-4,3.3999999999999996E-2,9.1800000000000007E-2,5.7799999999999997E-2,3.4472499999999996E-2,0.88251614932517786,27,0.96834876219209021,9.2589479619752044,6.5183417178803413,null,96.834876219209022,0.37973700706213243,0.31579851359711092,0.18517895923950409,0.13036683435760682,9.4433950051975926E-2]
["VsdTop",{"$f":"Vsd_Q1","v":0.8},"V",null,null,null,37,13.5,1,5.55,5.55,2.2839506172839505,0.37441776000583182,5.2748130037021603,8.1874065018510791,2.9125934981489197,0,5.755096670372744,0.13248455074134177,0.25,0.38658184045796862,1.5227073538061904,2.3186376853354504E-3,2.3186376853354504E-3,2.7853068599471515,7.7579343040686619E-3,7.7579343040686619E-3,3.5215255473995981,5.5805139814446174E-2,5.2909426923195189E-2,6.2212049999999998E-2,0,0.17285586589039348,4.5519221768773033,7.5627983590868045E-2,4.9728000000000001E-2,0.12728118750284634,4.9728000000000001E-2,2.5974000000000001E-2,9.9363413056006322E-2,4.7249999999999994E-4,3.3999999999999996E-2,9.1800000000000007E-2,5.7799999999999997E-2,3.4472499999999996E-2,0.90633337889661902,27.75,0.96837231871527329,9.4999352945196733,6.7926303751423163,null,96.837231871527337,0.38658184045796862,0.32611105339323981,0.18999870589039347,0.13585260750284633,9.9363413056006322E-2]
["θJATop",{"$f":"ThetaJA_Q1","v":50},"°C/W","Junction to Ambient Resistance",null,null,38,13.5,1,5.7,5.7,2.3456790123456788,0.37452704970413891,5.2755568115450249,8.3377784057725126,3.0622215942274877,0,5.8999399691284937,0.13923716655727972,0.25,0.39362170826562703,1.5229220726353421,2.3192916393199262E-3,2.3192916393199262E-3,2.8555742286901542,8.1543041755593702E-3,8.1543041755593702E-3,3.6106815561560452,5.8666595849844475E-2,5.4339411434632896E-2,6.2212049999999998E-2,0,0.17729835547760672,4.6660765466668552,7.9468786738643868E-2,5.1072000000000006E-2,0.1326490790128742,5.1072000000000006E-2,2.6676000000000005E-2,0.1044278749179598,4.7249999999999994E-4,3.3999999999999996E-2,9.1800000000000007E-2,5.7799999999999997E-2,3.4472499999999996E-2,0.93069111348894717,28.5,0.96837685156967368,9.7452257738803372,7.0726079506437101,null,96.837685156967368,0.39362170826562703,0.33662343449048093,0.19490451547760673,0.1414521590128742,0.1044278749179598]
["Low-side FET","Input Value","Units","Description",null,null,39,13.5,1,5.85,5.85,2.4074074074074074,0.37463633418568737,5.2763000814349317,8.4881500407174659,3.2118499592825338,0,6.0450347569262046,0.14616978084978344,0.25,0.40085723802046347,1.5231366361708512,2.319945212445856E-3,2.319945212445856E-3,2.9259713693578093,8.5613084543016138E-3,8.5613084543016138E-3,3.7000172589559686,6.1605574724574175E-2,5.5769395946070596E-2,6.2212049999999998E-2,0,0.18182733617984431,4.7804097623398167,8.341095885993946E-2,5.2416000000000004E-2,0.13813129155537865,5.2416000000000004E-2,2.7378E-2,0.10962733563733756,4.7249999999999994E-4,3.3999999999999996E-2,9.1800000000000007E-2,5.7799999999999997E-2,3.4472499999999996E-2,0.95559095505977143,29.25,0.96836377224065862,9.9948408089922154,7.3583015777689331,null,96.836377224065856,0.40085723802046347,0.347336627735223,0.19989681617984431,0.14716603155537866,0.10962733563733756]
["RdsonBot",{"$f":"Rdson2*1000","v":3.65},"mW","Drain-Source Resistance of Low-side FET",null,null,40,13.5,1,6,6,2.4691358024691357,0.37474561345085067,5.2770428134103957,8.6385214067051983,3.3614785932948021,0,6.1903633499615509,0.15328239361818879,0.25,0.40828907576388851,1.5233510444238361,2.3205984045471923E-3,2.3205984045471923E-3,2.9964897313433312,8.9789507100460283E-3,8.9789507100460283E-3,3.7895218902805836,6.4622142706120766E-2,5.719938045750831E-2,6.2212049999999998E-2,0,0.18644324556796613,4.8949077874492657,8.7454446203854841E-2,5.3760000000000002E-2,0.14372838343934755,5.3760000000000002E-2,2.8080000000000004E-2,0.1149617952136416,4.7249999999999994E-4,3.3999999999999996E-2,9.1800000000000007E-2,5.7799999999999997E-2,3.4472499999999996E-2,0.98103454909943699,30,0.96833435153546366,10.248802278398305,7.6497391719673775,null,96.833435153546361,0.40828907576388851,0.35825162900731367,0.20497604556796611,0.15299478343934755,0.1149617952136416]
["RdsonBotTc",{"$f":"RdsonBotTc*1000000","v":4000},"ppm","Drain To Source Resitance Temp Co",null,null,41,13.5,1,6.15,6.15,2.5308641975308643,0.37485488750000234,5.2777850075099293,8.7888925037549654,3.5111074962450357,0,6.3359096596667204,0.16057500486183221,0.25,0.41591788618959352,1.5235652974054144,2.3212512154580488E-3,2.3212512154580488E-3,3.0671215342346434,9.4072345057658723E-3,9.4072345057658723E-3,3.8791856549665948,6.771636605564374E-2,5.8629364968946031E-2,6.2212049999999998E-2,0,0.19114653071340074,5.0095578517229882,9.1599195024621952E-2,5.5104000000000007E-2,0.14944092878062945,5.5104000000000007E-2,2.8782000000000002E-2,0.12043125364637416,4.7249999999999994E-4,3.3999999999999996E-2,9.1800000000000007E-2,5.7799999999999997E-2,3.4472499999999996E-2,1.0070235850512217,30.75,0.96828973652539496,10.507132535670037,7.9469494390314726,null,96.828973652539503,0.41591788618959352,0.36936945949403022,0.21014265071340074,0.15893898878062945,0.12043125364637416]
["QgBot",{"$f":"Qg_Q2*1000000000","v":9},"nC","Gate Charge Of Top FET",null,null,42,13.5,1,6.3,6.3,2.5925925925925926,0.37496415633351576,5.2785266637720412,8.9392633318860213,3.6607366681139792,0,6.4816590194959112,0.16804761458005077,0.25,0.42374435279435957,1.5237793951267027,2.3219036450127001E-3,2.3219036450127001E-3,3.1378596841889901,9.846163397658628E-3,9.846163397658628E-3,3.9689996228542457,7.0888311027977144E-2,6.0059349480383731E-2,6.2212049999999998E-2,0,0.19593764829930724,5.1243483135707661,9.5845151581603782E-2,5.6448000000000005E-2,0.15526951767307956,5.6448000000000005E-2,2.9483999999999996E-2,0.1260357109350381,4.7249999999999994E-4,3.3999999999999996E-2,9.1800000000000007E-2,5.7799999999999997E-2,3.4472499999999996E-2,1.0335597967444559,31.5,0.96823096509568307,10.769854414965362,8.2499618836539774,null,96.823096509568302,0.42374435279435957,0.38069116597238678,0.21539708829930723,0.16499923767307956,0.1260357109350381]
["RGateBot",{"$f":"Rgate2","v":0},"W","Gate Resistance",null,null,43,13.5,1,6.45,6.45,2.6543209876543208,0.37507341995176435,5.2792677822352365,9.089633891117618,3.8103661088823819,0,6.62759803345417,0.17570022277218231,0.25,0.43176917803351439,1.5239933375988164,2.3225556930455801E-3,2.3225556930455801E-3,3.2086977008044202,1.0295740935147572E-2,1.0295740935147572E-2,4.0589556366585633,7.4138043871630449E-2,6.1489333991821438E-2,6.2212049999999998E-2,0,0.20081706473454422,5.2392685398520333,0.1001922621392939,5.779200000000001E-2,0.16121475636539062,5.779200000000001E-2,3.0186000000000001E-2,0.13177516707913675,4.7249999999999994E-4,3.3999999999999996E-2,9.1800000000000007E-2,5.7799999999999997E-2,3.4472499999999996E-2,1.0606449628407792,32.25,0.96815897848798893,11.036991236727211,8.5588068182695309,null,96.815897848798897,0.43176917803351439,0.3922178210999348,0.22073982473454423,0.17117613636539061,0.13177516707913675]
["VsdBot",{"$f":"Vsd_Q2","v":0.8},"V","Diode Forward Voltage of Bottom FET Body Diode",null,null,44,13.5,1,6.6,6.6,2.7160493827160495,0.37518267835512153,5.280008362938017,9.2400041814690077,3.9599958185309911,0,6.7737144433014951,0.18353282943756513,0.25,0.43999308348110477,1.5242071248328697,2.3232073593912831E-3,2.3232073593912831E-3,3.2796296530070808,1.0755970660883345E-2,1.0755970660883345E-2,4.1490462311981835,7.7465630828789322E-2,6.2919318503259145E-2,6.2212049999999998E-2,0,0.20578525627050015,5.3543088004682211,0.10464047296731577,5.9136000000000001E-2,0.16727726744371382,5.9136000000000001E-2,3.0888000000000002E-2,0.13764962207817386,4.7249999999999994E-4,3.3999999999999996E-2,9.1800000000000007E-2,5.7799999999999997E-2,3.4472499999999996E-2,1.0882809072937674,33,0.96807463215134126,11.308566813525008,8.8735153721856914,null,96.807463215134121,0.43999308348110477,0.40395052371421403,0.22617133627050015,0.17747030744371384,0.13764962207817386]
["QrrBot",{"$f":"Qrr_Q2*1000000000","v":13},"nC","Reverse Recovery Charge of Body Diode",null,null,45,13.5,1,6.75,6.75,2.7777777777777777,0.37529193154396057,5.2807484059188834,9.3903742029594426,4.1096257970405583,0,6.9199970118407252,0.19154543457553824,0.25,0.4484168099948535,1.5244207568399772,2.3238586438845692E-3,2.3238586438845692E-3,3.3506501027032862,1.1226856110745543E-2,1.1226856110745543E-2,4.2392645624058742,8.0871138135316212E-2,6.4349303014696851E-2,6.2212049999999998E-2,0,0.21084270912084022,5.4694601757224905,0.10918973034042219,6.0480000000000006E-2,0.17345769002017736,6.0480000000000006E-2,3.159E-2,0.1436590759316537,4.7249999999999994E-4,3.3999999999999996E-2,9.1800000000000007E-2,5.7799999999999997E-2,3.4472499999999996E-2,1.1164694998221547,33.75,0.96797870516176443,11.584605456042011,9.1941195010088688,null,96.797870516176445,0.4484168099948535,0.41589039914101755,0.23169210912084021,0.18388239002017737,0.1436590759316537]
["TrrBot",{"$f":"Trr_Q2*1000000000","v":40},"ns","Reverse Recovery Time of Body Diode",null,null,46,13.5,1,6.9,6.9,2.8395061728395059,0.37540117951865487,5.2814879112163284,9.5407439556081641,4.2592560443918366,0,7.0664354200940913,0.19973803818544145,0.25,0.45704111788597146,1.5246342336312508,2.3245095463603517E-3,2.3245095463603517E-3,3.4217540551366752,1.1708400813844281E-2,1.1708400813844281E-2,4.3296043447859303,8.4354632020751413E-2,6.5779287526134558E-2,6.2212049999999998E-2,0,0.21598991958422986,5.5847144747042474,0.11383998053849466,6.1824000000000011E-2,0.17975667992741493,6.1824000000000011E-2,3.2292000000000001E-2,0.14980352863908108,4.7249999999999994E-4,3.3999999999999996E-2,9.1800000000000007E-2,5.7799999999999997E-2,3.4472499999999996E-2,1.1452126563969021,34.5,0.96787190842607074,11.865131979211494,9.5206519963707468,null,96.787190842607075,0.45704111788597146,0.4280385995116448,0.23730263958422987,0.19041303992741493,0.14980352863908108]
["θJABot",{"$f":"ThetaJA_Q2","v":50},"°C/W","Junction to Ambient Resistance",null,null,47,13.5,1,7.05,7.05,2.9012345679012346,0.37551042227957754,5.2822268788688422,9.6911134394344209,4.4088865605655787,0,7.2130201765039939,0.20811064026661485,0.25,0.46586678709389984,1.5248475552178016,2.3251600666537066E-3,2.3251600666537066E-3,3.4929369150503926,1.2200608292521753E-2,1.2200608292521753E-2,4.4200597961846002,8.7916178708313517E-2,6.7209272037572265E-2,6.2212049999999998E-2,0,0.22122739417009221,5.7000641632183626,0.11859116984654282,6.3168000000000002E-2,0.18617490991922189,6.3168000000000002E-2,3.2994000000000002E-2,0.15608298019996114,4.7249999999999994E-4,3.3999999999999996E-2,9.1800000000000007E-2,5.7799999999999997E-2,3.4472499999999996E-2,1.1745123397423507,35.25,0.9677548918490021,12.15017170850461,9.853146495961095,null,96.775489184900209,0.46586678709389984,0.44039630408931413,0.24300343417009221,0.19706292991922189,0.15608298019996114]
["Bottom Schottky","Input Value","Units","Std Units",null,null,48,13.5,1,7.2,7.2,2.9629629629629628,0.37561965982710194,5.2829653089149131,9.8414826544574563,4.5585173455425441,0,7.3597425365701392,0.21666324081839947,0.25,0.47489461736605898,1.5250607216107399,2.3258102045998707E-3,2.3258102045998707E-3,3.5641944478877488,1.2703482062353855E-2,1.2703482062353855E-2,4.5106255889079483,9.1555844414900292E-2,6.8639256549009972E-2,6.2212049999999998E-2,0,0.22655564972746312,5.8155022999985739,0.12344324455470378,6.4512000000000014E-2,0.19271306987745795,6.4512000000000014E-2,3.3695999999999997E-2,0.16249743061379959,4.7249999999999994E-4,3.3999999999999996E-2,9.1800000000000007E-2,5.7799999999999997E-2,3.4472499999999996E-2,1.2043705598517334,36,0.9676282506133459,12.439750486373155,10.191637493872898,null,96.762825061334595,0.47489461736605898,0.45296471960492107,0.2487950097274631,0.20383274987745795,0.16249743061379959]
["VfdSky",{"$f":"VfdSky_Q2","v":0},"V","Diode Forward Voltage",null,null,49,13.5,1,7.35,7.35,3.0246913580246915,0.37572889216160127,5.283703201393025,9.9918516006965117,4.7081483993034876,0,7.5065944315671027,0.22539583984013695,0.25,0.4841254284426813,1.5252737328211752,2.3264599600342417E-3,2.3264599600342417E-3,3.6355227453767509,1.3217025632151708E-2,1.3217025632151708E-2,4.6012968063625381,9.5273695351089413E-2,7.0069241060447679E-2,6.2212049999999998E-2,0,0.23197521357700501,5.9310224801287124,0.12839615095824133,6.5855999999999998E-2,0.19937186702532331,6.5855999999999998E-2,3.4397999999999998E-2,0.16904687988010272,4.7249999999999994E-4,3.3999999999999996E-2,9.1800000000000007E-2,5.7799999999999997E-2,3.4472499999999996E-2,1.2347893745172982,36.75,0.96749253069846752,12.73389467885025,10.536160351266165,null,96.749253069846759,0.4841254284426813,0.46574508060232828,0.25467789357700499,0.21072320702532329,0.16904687988010272]
["QrrSky",{"$f":"QrrSky_Q2*1000000000","v":0},"nC","Diode Reverse Recovery Charge",null,null,50,13.5,1,7.5,7.5,3.0864197530864197,0.37583811928344846,5.2844405563416537,10.142220278170827,4.8577797218291732,0,7.6535684051814927,0.23430843733116952,0.25,0.49356006024681015,1.5254865888602149,2.3271093327923748E-3,2.3271093327923748E-3,3.7069181949381149,1.3741242503963252E-2,1.3741242503963252E-2,4.6920689045129782,9.9069797721139288E-2,7.1499225571885386E-2,6.2212049999999998E-2,0,0.23748662364624665,6.0466187847502635,0.13344983535754584,6.720000000000001E-2,0.20615202614713785,6.720000000000001E-2,3.5100000000000006E-2,0.17573132799837712,4.7249999999999994E-4,3.3999999999999996E-2,9.1800000000000007E-2,5.7799999999999997E-2,3.4472499999999996E-2,1.2657708898753273,37.5,0.96734823374282708,13.032631182312333,10.886751307356892,null,96.734823374282712,0.49356006024681015,0.47873864979338454,0.26065262364624664,0.21773502614713786,0.17573132799837712]
["Ireverse",{"$f":"Ireverse","v":0},"mA","Reverse Leakage Current",null,null,51,13.5,1,7.65,7.65,3.1481481481481479,0.37594734119301693,5.2851773737992804,10.292588686899641,5.0074113131003601,0,7.800657557072352,0.24340103329084001,0.25,0.50319937307954921,1.525699289738967,2.3277583227099882E-3,2.3277583227099882E-3,3.7783774524357452,1.4276136173074832E-2,1.4276136173074832E-2,4.7829376775503851,0.10294421772298981,7.2929210083323107E-2,6.2212049999999998E-2,0,0.24309042860811467,6.1622857362653116,0.13860424405813304,6.8544000000000008E-2,0.21305428981475638,6.8544000000000008E-2,3.5802E-2,0.18255077496812999,4.7249999999999994E-4,3.3999999999999996E-2,9.1800000000000007E-2,5.7799999999999997E-2,3.4472499999999996E-2,1.2973172609663348,38.25,0.96719582133964865,13.335987430405732,11.24344749073782,null,96.719582133964863,0.50319937307954921,0.49194671842287108,0.26671974860811465,0.22486894981475639,0.18255077496812999]
["Controller","Input Value","Units","Std Units",null,null,52,13.5,1,7.8,7.8,3.2098765432098766,0.37605655789067954,5.2859136538043741,10.442956826902186,5.1570431730978132,0,7.9478554924975171,0.25267362771849178,0.25,0.51304424782064761,1.5259118354685368,2.3284069296229588E-3,2.3284069296229588E-3,3.8498974178557988,1.4821710128012746E-2,1.4821710128012746E-2,4.8738992272503703,0.10689702154826289,7.4359194594760814E-2,6.2212049999999998E-2,0,0.24878718802282523,6.2780182583543986,0.14385932337064386,6.9888000000000006E-2,0.22007941862076133,6.9888000000000006E-2,3.6504000000000002E-2,0.18950522078886883,4.7249999999999994E-4,3.3999999999999996E-2,9.1800000000000007E-2,5.7799999999999997E-2,3.4472499999999996E-2,1.3294306923107386,39,0.96703571884132233,13.643991401141262,11.606286931038067,null,96.703571884132231,0.51304424782064761,0.50537060664358657,0.27287982802282523,0.23212573862076133,0.18950522078886883]
["θJA",30,"°C/W","Junction to Ambient Resistance",null,null,53,13.5,1,7.95,7.95,3.2716049382716048,0.3761657693768094,5.2866493963954033,10.593324698197701,5.306675301802299,0,8.095156277266506,0.2621262206134693,0.25,0.52309558613451146,1.5261242260600294,2.3290551533673236E-3,2.3290551533673236E-3,3.9214752135573727,1.5377967850544842E-2,1.5377967850544842E-2,4.9649499355708748,0.11092827538226355,7.578917910619852E-2,6.2212049999999998E-2,0,0.25457747248320972,6.3938116402222924,0.1492150196108436,7.1232000000000004E-2,0.22722819141857548,7.1232000000000004E-2,3.7206000000000003E-2,0.19659466546010196,4.7249999999999994E-4,3.3999999999999996E-2,9.1800000000000007E-2,5.7799999999999997E-2,3.4472499999999996E-2,1.3621134385003106,39.75,0.96686831873681467,13.956671624160485,11.975308570928773,null,96.68683187368147,0.52309558613451146,0.51901166390178521,0.27913343248320971,0.23950617141857547,0.19659466546010196]
["Theta Ja",2,"°C/W","Junction to Ambient Resistance",null,null,54,13.5,1,8.1,8.1,3.333333333333333,0.37627497565177959,5.2873846016108361,10.743692300805417,5.456307699194582,0,8.2425543973806619,0.2717588119751172,0.25,0.53335431068173123,1.5263364615245494,2.3297029937792823E-3,2.3297029937792823E-3,3.9931081647861841,1.5944912815682086E-2,1.5944912815682086E-2,5.0560864401010228,0.11503804540398044,7.7219163617636227E-2,6.2212049999999998E-2,0,0.26046186376354385,6.5096615045642618,0.15467127909962136,7.2576000000000002E-2,0.23450140556964455,7.2576000000000002E-2,3.7908000000000004E-2,0.20381910898133787,4.7249999999999994E-4,3.3999999999999996E-2,9.1800000000000007E-2,5.7799999999999997E-2,3.4472499999999996E-2,1.395367804805719,40.5,0.96669398365693171,14.274057188177192,12.350552278482226,null,96.669398365693169,0.53335431068173123,0.5328712693331884,0.28548114376354383,0.24701104556964454,0.20381910898133787]
[null,null,null,null,null,null,55,13.5,1,8.25,8.25,3.3950617283950617,0.37638417671596297,5.2881192694891306,10.894059634744565,5.6059403652554352,0,8.3900447228066195,0.28157140180278084,0.25,0.54382136533622261,1.5265485418731983,2.3303504506951879E-3,2.3303504506951879E-3,4.0647937821838047,1.6522548491680118E-2,1.6522548491680118E-2,5.1473056120241019,0.11922639778608665,7.8649148129073934E-2,6.2212049999999998E-2,0,0.26644095497195897,6.6255637788131194,0.16022804816298941,7.3920000000000013E-2,0.24189987719784492,7.3920000000000013E-2,3.8609999999999998E-2,0.21117855135208563,4.7249999999999994E-4,3.3999999999999996E-2,9.1800000000000007E-2,5.7799999999999997E-2,3.4472499999999996E-2,1.4291961478004873,41.25,0.96651304905436597,14.596177748597949,12.732058859892245,null,96.651304905436604,0.54382136533622261,0.54695083216980389,0.29192355497195899,0.2546411771978449,0.21117855135208563]
[null,null,null,null,null,null,56,13.5,1,8.4,8.4,3.4567901234567899,0.37649337256973264,5.2888534000687475,11.044426700034375,5.7555732999656266,0,8.5376224749019887,0.29156399009580625,0.25,0.55449771540807724,1.5267604671170796,2.3309975239515631E-3,2.3309975239515631E-3,4.1365297460601962,1.7110878340040832E-2,1.7110878340040832E-2,5.2386045363020628,0.12349339869494047,8.0079132640511641E-2,6.2212049999999998E-2,0,0.27251535070651023,6.7415146692851602,0.16588527313208257,7.5264000000000011E-2,0.24942444145127493,7.5264000000000011E-2,3.9312E-2,0.21867299257185466,4.7249999999999994E-4,3.3999999999999996E-2,9.1800000000000007E-2,5.7799999999999997E-2,3.4472499999999996E-2,1.4636008760017094,42,0.9663258255988213,14.923063535325513,13.119870072563748,null,96.632582559882124,0.55449771540807724,0.5612517921577852,0.29846127070651024,0.26239740145127494,0.21867299257185466]
["Outputs",null,null,null,null,null,57,13.5,1,8.5500000000000007,8.5500000000000007,3.5185185185185186,0.37660256321346136,5.2895869933881388,11.19479349669407,5.9052065033059318,0,8.6852831970745257,0.30173657685354038,0.25,0.56538434787222325,1.5269722372672927,2.3316442133850816E-3,2.3316442133850816E-3,4.2083138922273804,1.7709905815513963E-2,1.7709905815513963E-2,5.3299804938268505,0.1278391142905862,8.1509117151949362E-2,6.2212049999999998E-2,0,0.27868566721498444,6.8575106378926147,0.17164290034315788,7.6608000000000009E-2,0.25707595277159745,7.6608000000000009E-2,4.0014000000000001E-2,0.22630243264015529,4.7249999999999994E-4,3.3999999999999996E-2,9.1800000000000007E-2,5.7799999999999997E-2,3.4472499999999996E-2,1.4985844505278594,42.75,0.96613260132189427,15.254745360749222,13.514028638579873,null,96.613260132189424,0.56538434787222325,0.57577561998658189,0.30509490721498445,0.27028057277159745,0.22630243264015529]
["Design","Value","Units",null,null,null,58,13.5,1,8.6999999999999993,8.6999999999999993,3.5802469135802468,0.37671174864752205,5.2903200494857554,11.345160024742878,6.0548399752571216,0,8.8330227283095208,0.31208916207533033,0.25,0.57648227160299936,1.5271838523349377,2.3322905188325809E-3,2.3322905188325809E-3,4.280144199217899,1.8319634366098628E-2,1.8319634366098628E-2,5.4214309453164118,0.1322636107267548,8.2939101663387041E-2,6.2212049999999998E-2,0,0.28495253255852665,6.9735483811326766,0.17750087613759333,7.7952000000000007E-2,0.26485528517110185,7.7952000000000007E-2,4.0716000000000002E-2,0.23406687155649775,4.7249999999999994E-4,3.3999999999999996E-2,9.1800000000000007E-2,5.7799999999999997E-2,3.4472499999999996E-2,1.5341493857740567,43.5,0.96593364354165678,15.591254627926332,13.914578258555094,null,96.593364354165672,0.57648227160299936,0.59052381772962848,0.31182509255852664,0.27829156517110187,0.23406687155649775]
["Dmax",{"$f":"D1_Vinmin","v":0.625},"index",null,null,null,59,13.5,1,8.85,8.85,3.6419753086419751,0.37682092887228757,5.2910525684000449,11.495526284200022,6.2044737157999776,0,8.9808371792462118,0.32262174576052421,0.25,0.58779251761475193,1.5273953123311135,2.3329364401310599E-3,2.3329364401310599E-3,4.3520187767339609,1.8940067433044962E-2,1.8940067433044962E-2,5.5129535167612227,0.13676695415086468,8.4369086174824762E-2,6.2212049999999998E-2,0,0.2913165867791721,7.0896248110997471,0.18345914686188811,7.9296000000000005E-2,0.27276333251766743,7.9296000000000005E-2,4.1417999999999996E-2,0.24196630932039317,4.7249999999999994E-4,3.3999999999999996E-2,9.1800000000000007E-2,5.7799999999999997E-2,3.4472499999999996E-2,1.5702982501051608,44.25,0.9657292005928495,15.932623338958605,14.321563625883371,null,96.572920059284954,0.58779251761475193,0.60549791929683949,0.31865246677917208,0.28643127251766742,0.24196630932039317]
["Dprime",{"$f":"1-B68","v":0.375},"index",null,null,null,60,13.5,1,9,9,3.7037037037037037,0.37693010388813075,5.2917845501694494,11.645892275084725,6.3541077249152753,0,9.1287229105235568,0.33333432790847073,0.25,0.5993161393085602,1.5276066172669172,2.3335819771176736E-3,2.3335819771176736E-3,4.4239358551922487,1.9571208450855571E-2,1.9571208450855571E-2,5.604545986251253,0.14134921070402262,8.5799070686262469E-2,6.2212049999999998E-2,0,0.29777848207137109,7.2057370382989028,0.18951765886766114,8.0640000000000003E-2,0.28080100882780579,8.0640000000000003E-2,4.2119999999999998E-2,0.25000074593135302,4.7249999999999994E-4,3.3999999999999996E-2,9.1800000000000007E-2,5.7799999999999997E-2,3.4472499999999996E-2,1.6070336665670633,45,0.96551950338517578,16.278884103568554,14.73503044139029,null,96.551950338517571,0.5993161393085602,0.62069949089917686,0.32557768207137111,0.2947006088278058,0.25000074593135302]
["Ipp",{"$f":"Iripple_Vinnom","v":5.339301095115049},"A",null,null,null,61,13.5,1,9.15,9.15,3.7654320987654319,0.37703927369542423,5.2925159948324065,11.796257997416204,6.5037420025837971,0,9.2766765131500488,0.344226908518519,0.25,0.61105421272520832,1.527817767153445,2.3342271296297383E-3,2.3342271296297383E-3,4.4958937762459694,2.0213060847287242E-2,2.0213060847287242E-2,5.6962062720341251,0.14601044652102407,8.7229055197700175E-2,6.2212049999999998E-2,0,0.30433888295759387,7.3218823560658794,0.19567635851165124,8.1984000000000015E-2,0.28896924856797729,8.1984000000000015E-2,4.2822000000000006E-2,0.25817018138888925,4.7249999999999994E-4,3.3999999999999996E-2,9.1800000000000007E-2,5.7799999999999997E-2,3.4472499999999996E-2,1.6443583136165856,45.75,0.96530476680925636,16.630070147879692,15.155025428398863,null,96.530476680925631,0.61105421272520832,0.63613013152557119,0.33260140295759388,0.30310050856797727,0.25817018138888925]
["Top FET","Value","Units",null,null,null,62,13.5,1,9.3000000000000007,9.3000000000000007,3.8271604938271602,0.37714843829454081,5.2932469024273558,11.946623451213679,6.6533765487863228,0,9.4246947906818033,0.35529948759001889,0.25,0.62300783680451566,1.5280287620017934,2.3348718975047334E-3,2.3348718975047334E-3,4.5678909841799413,2.0865628043352395E-2,2.0865628043352395E-2,5.7879324216732657,0.1507507277303545,8.8659039709137896E-2,6.2212049999999998E-2,0,0.3109984664681108,7.4380582264222808,0.20193519215571581,8.3328000000000013E-2,0.29726900696437375,8.3328000000000013E-2,4.3524000000000007E-2,0.26647461569251418,4.7249999999999994E-4,3.3999999999999996E-2,9.1800000000000007E-2,5.7799999999999997E-2,3.4472499999999996E-2,1.6822749258703715,46.5,0.96508519100730306,16.986215323405538,15.581596348218687,null,96.508519100730311,0.62300783680451566,0.65179147343248456,0.3397243064681108,0.31163192696437375,0.26647461569251418]
["Tr",{"$f":"(Qgd_Q1+Qgs_Q1/2)*(RdsonDRT+Rgate1)/(VCC-Vsp_Q1)*1000000000","v":2.8639184397163127},"ns","Turn on of MOSFET -> Rise time of current",null,null,63,13.5,1,9.4499999999999993,9.4499999999999993,3.8888888888888888,0.37725759768585315,5.2939772729927261,12.096988636496363,6.8030113635036358,0,9.5727747430188845,0.36655206512232108,0.25,0.63517813365115072,1.5282396018230557,2.3355162805802922E-3,2.3355162805802922E-3,4.6399260180870039,2.1528913453320718E-2,2.1528913453320718E-2,5.8797226021904141,0.15557012045418966,9.0089024220575575E-2,6.2212049999999998E-2,0,0.31775792232504113,7.5542622672152078,0.20829410616683078,8.4671999999999997E-2,0.30570126032137362,8.4671999999999997E-2,4.4225999999999994E-2,0.27491404884174081,4.7249999999999994E-4,3.3999999999999996E-2,9.1800000000000007E-2,5.7799999999999997E-2,3.4472499999999996E-2,1.7207862948732073,47.25,0.96486096252341857,17.347354116252056,16.014792016068682,null,96.486096252341852,0.63517813365115072,0.66768518264641474,0.34694708232504112,0.32029584032137365,0.27491404884174081]
["Tf",{"$f":"(Qgd_Q1+Qgs_Q1/2)*(RdsonDRT2+Rgate1)/(Vsp_Q1)*1000000000","v":0.66690751445086693},"ns","Turn off of MOSFET -> Fall time of current",null,null,64,{"$f":"Vin","v":13.5},{"$f":"MODE","v":1},9.6,{"$f":"Iout*G73/100/Number_of_Phases","v":9.6},{"$f":"Vout*K73/(Vin*Efficiency)","v":3.9506172839506171},{"$f":"(Vout+(Rdson2+Rs+Rdcr)*K73)/(Vin+(Rs+Rdson2-Rdson1)*K73)","v":0.37736675186973395},{"$f":"(Vin-(Rdson1+Rdcr)*K73-Vout)*M73/(Fsw*Lf)","v":5.2947071065669471},12.247353553283473,6.9526464467165265,{"$f":"IF(MIN(Vin, -P73/(Coss_Q1+Coss_Q2)*0.00000002)<0, 0, MIN(Vin, -P73/(Coss_Q1+Coss_Q2)*0.00000002))","v":0},9.7209135516521386,{"$f":"R73^2*Rdcr","v":0.37798464111477675},{"$f":"Core_Loss_Ch1","v":0.25},{"$f":"(T73+S73*(1+Ltc*(Ta-25)))/(1-S73*Ltc*ThetaCa)","v":0.64756624880704661},1.5284502866283258,2.3361602786942113E-3,2.3361602786942113E-3,4.7119975047447511,2.2202920484720761E-2,2.2202920484720761E-2,5.9715750910905072,{"$f":"Rdson1*AB73^2","v":0.16046869080839668},{"$f":"(Vin*K73/2)*Fsw*(Tr_buck+Tf_buck)","v":9.1519008732013296E-2},{"$f":"(0.5*Coss_Q1*(Vin-Q73)^2-0.5*Coss_Q2*(Vin-Q73)^2+(Qoss_Q2*(Vin-Q73)/Vin)*Vin)*Fsw","v":6.2212049999999998E-2},{"$f":"IF(K73>N73/2,0,ABS(K73-N73/2)*Vsd_Q1*Deadtime*Fsw)","v":0},{"$f":"(AF73+AE73+AD73+AC73*(1+RdsonTopTc*Ta-RdsonTopTc*25))/(1-AC73*RdsonTopTc*ThetaJA_Q1)","v":0.32461795313076919},{"$f":"SQRT((1-M73))*SQRT(K73^2+(N73^2)/12)","v":7.670492240408147},{"$f":"Rdson2*AH73^2","v":0.21475304691708982},{"$f":"IF(K73<N73/2,Deadtime*Fsw*IF(VfdSky_Q2>0,0,Vsd_Q2)*(K73+N73/2),2*Deadtime*Fsw*IF(VfdSky_Q2>0,0,Vsd_Q2)*K73)","v":8.6016000000000009E-2},{"$f":"(AJ73+AI73*(1+RdsonBotTc*Ta-RdsonBotTc*25))/(1-AI73*RdsonBotTc*ThetaJA_Q2)","v":0.31426700634887655},{"$f":"2*Deadtime*Fsw*IF(VfdSky_Q2>0,VfdSky_Q2,Vsd_Q2)*K73","v":8.6016000000000009E-2},{"$f":"IF(QrrSky_Q2>0,QrrSky_Q2,Qrr_Q2*K73/(Iout/Number_of_Phases))*Fsw*Vin","v":4.4928000000000003E-2},{"$f":"Rs*R73^2","v":0.28348848083608258},{"$f":"Iq*Vin","v":4.7249999999999994E-4},{"$f":"IF(Ext_VCC=1,  (Qg_Q1+Qg_Q2)*Fsw*VCC, (Qg_Q1+Qg_Q2)*Fsw*Vin)","v":3.3999999999999996E-2},{"$f":"(Vin-VCC)*Fsw*(Qg_Q1+Qg_Q2)+(RdsonDRT+RdsonDRT2)*Fsw*Qg_Q1*VCC/(RdsonDRT+2*Rgate1+RdsonDRT2)+(RdsonDRB+RdsonDRB2)*Fsw*Qg_Q2*VCC/(RdsonDRB+2*Rgate2+RdsonDRB2)","v":9.1800000000000007E-2},{"$f":"(Qg_Q1+Qg_Q2)*Fsw*(Vin-VCC)","v":5.7799999999999997E-2},3.4472499999999996E-2,{"$f":" SUM(U73,X73,AA73,AG73,AK73,AL73,AM73,AS73,AN73)","v":1.7598952698861901},{"$f":"Vout*K73","v":48},0.96463225534658137,{"$f":"ThetaJA_Q1*BC73","v":17.713521656538457},{"$f":"ThetaJA_Q2*BD73","v":16.454662317443827},null,96.463225534658136,{"$f":"U73","v":0.64756624880704661},0.68381295947964571,0.35427043313076917,0.32909324634887654,0.28348848083608258]
["Part Power","Value","Units",null,null,null,65,13.5,1,{"$f":"Iout*G74/100","v":9.75},9.75,4.0123456790123457,0.37747590084655586,5.295436403188444,{"$f":"K74+N74/2","v":12.397718201594222},{"$f":"K74-N74/2","v":7.1022817984057784},0,{"$f":"SQRT(K74^2+(N74^2)/12)","v":9.8691085662122724},0.38959721556673782,0.25,0.6601733515305509,{"$f":"N74/SQRT(12)","v":1.5286608164286959},{"$f":"RCoutEsr*V74^2","v":2.3368038916844469E-3},{"$f":"W74","v":2.3368038916844469E-3},{"$f":"SQRT(M74*(1-M74))*SQRT(K74^2+(N74^2)/12)","v":4.7841041521210004},{"$f":"RCinEsr*Y74^2","v":2.2887652538341397E-2},{"$f":"Z74","v":2.2887652538341397E-2},{"$f":"SQRT(M74)*SQRT(K74^2+(N74^2)/12)","v":6.0634882681787259},0.16544650490253468,9.2948993243451003E-2,6.2212049999999998E-2,0,0.33157927456082703,7.7867460414054479,0.22131196078370344,8.7360000000000007E-2,0.32296726449873631,8.7360000000000007E-2,4.5629999999999997E-2,0.29219791167505338,4.7249999999999994E-4,3.3999999999999996E-2,9.1800000000000007E-2,5.7799999999999997E-2,3.4472499999999996E-2,1.7996047586951933,48.75,{"$f":"AU74/(AU74+AT74)","v":0.96439923185777943},18.084753728041353,16.901258224936814,null,{"$f":"AV74*100","v":96.439923185777943},0.6601733515305509,{"$f":"AG74+AK74+AM74","v":0.70017653905956323},{"$f":"AG74+AM74*0.66","v":0.36169507456082706},{"$f":"AK74+AM74*0.33","v":0.33802516449873632},{"$f":"AN74","v":0.29219791167505338}]
["Power Dis",{"$f":"AS9","v":3.4472499999999996E-2},"W",null,null,null,66,13.5,1,9.9,9.9,4.0740740740740735,0.37758504461669135,5.2961651628956377,12.548082581447819,7.251917418552182,0,10.017357292189848,0.40138978847755646,0.25,0.67300063508243646,1.5288711912352573,2.3374471193891148E-3,2.3374471193891148E-3,4.856244743444619,2.3583113008233493E-2,2.3583113008233493E-2,6.1554606080898298,0.17050362883985526,9.4378977754888724E-2,6.2212049999999998E-2,0,0.33864261556135006,7.9030216893061551,0.22797079414899882,8.8704000000000019E-2,0.33180307631051675,8.8704000000000019E-2,4.6331999999999998E-2,0.30104234135816738,4.7249999999999994E-4,3.3999999999999996E-2,9.1800000000000007E-2,5.7799999999999997E-2,{"$f":"SUM(AO75:AP75)","v":3.4472499999999996E-2},1.8399177284400934,49.5,0.96416204369137781,18.461086778067504,17.354631815525838,null,96.416204369137787,0.67300063508243646,0.71677769187186691,0.36922173556135007,0.34709263631051673,0.30104234135816738]
["Temp rise",{"$f":"B75*B62","v":1.0341749999999998},"°C",null,null,null,67,13.5,1,10.050000000000001,10.050000000000001,4.1358024691358022,0.37769418318051312,5.2968933857269436,12.698446692863472,7.4015533071365294,0,10.16565737970971,0.41336235984658598,0.25,0.68604931701891203,1.5290814110590996,2.3380899616464871E-3,2.3380899616464871E-3,4.9284181317854374,2.428930528171146E-2,2.428930528171146E-2,6.2474906734589375,0.17564012871730383,9.5808962266326445E-2,6.2212049999999998E-2,0,0.34580871855121043,8.019317317994723,0.23472949340041879,9.0048000000000017E-2,0.34077550576680143,9.0048000000000017E-2,4.7034000000000006E-2,0.31002176988493946,4.7249999999999994E-4,3.3999999999999996E-2,9.1800000000000007E-2,5.7799999999999997E-2,3.4472499999999996E-2,1.8808372064652215,50.25,0.96392083251960581,18.84255792756052,17.814836288340071,null,96.392083251960585,0.68604931701891203,0.73361822431801182,0.37685115855121043,0.35629672576680144,0.31002176988493946]
["Current (switching)",{"$f":"(Qg_Q1+Qg_Q2)*Fsw+Iq","v":6.8349999999999999E-3},"A",null,null,null,68,13.5,1,10.199999999999999,10.199999999999999,4.1975308641975309,0.37780331653839355,5.2976210717207772,12.848810535860387,7.5511894641396111,0,10.314006613256314,0.42551492967317994,0.25,0.69932063949176737,1.5292914759113123,2.3387324182949998E-3,2.3387324182949998E-3,5.0006232350932782,2.5006232739354765E-2,2.5006232739354765E-2,6.3395771086707482,0.18085607062551973,9.7238946777764124E-2,6.2212049999999998E-2,0,0.35307833962893836,8.1356311679864657,0.24158800493052179,9.1392000000000001E-2,0.34988563965829944,9.1392000000000001E-2,4.7736000000000001E-2,0.31913619725488496,4.7249999999999994E-4,3.3999999999999996E-2,9.1800000000000007E-2,5.7799999999999997E-2,3.4472499999999996E-2,1.9223662811915396,51,0.96367573076801849,19.229204981446919,18.281925982914974,null,96.367573076801847,0.69932063949176737,0.75069997928723775,0.38458409962893836,0.36563851965829947,0.31913619725488496]
["Qrr Current",{"$f":"Qrr_Q2*Fsw","v":5.2000000000000006E-3},"A",null,null,null,69,13.5,1,10.35,10.35,4.2592592592592595,0.37791244469070517,5.2983482209155488,12.999174110457774,7.7008258895422248,0,10.462402902257839,0.43784749795669303,0.25,0.71281586955579967,1.5295013858029836,2.339374489173247E-3,2.339374489173247E-3,5.072859031651638,2.5733898755009595E-2,2.5733898755009595E-2,6.4317186341312071,0.18615152064883769,9.8668931289201844E-2,6.2212049999999998E-2,0,0.36045224878454685,8.2519615789545853,0.24854627513698066,9.2736000000000013E-2,0.35913458795899306,9.2736000000000013E-2,4.8438000000000002E-2,0.32838562346751976,4.7249999999999994E-4,3.3999999999999996E-2,9.1800000000000007E-2,5.7799999999999997E-2,3.4472499999999996E-2,1.9645081030110421,51.75,0.96342686226887519,19.621066439227342,18.755956397949653,null,96.342686226887523,0.71281586955579967,0.76802483674353983,0.39242132878454683,0.37511912795899305,0.32838562346751976]
["Diode Current",{"$f":"Deadtime*Fsw*(Iripple_Vinnom/2)*(Vsd_Q2)/Vin","v":8.8592847800427485E-4},null,null,null,null,70,13.5,1,10.5,10.5,4.3209876543209873,0.37802156763782041,5.2990748333496631,13.149537416674832,7.850462583325168,0,10.610844272446938,0.45036006469647999,0.25,0.72653629948366438,1.5297111407451998,2.3400161741199805E-3,2.3400161741199805E-3,5.145124555906329,2.6472306695790298E-2,2.6472306695790298E-2,6.523914041011607,0.19152654486528778,0.10009891580063955,6.2212049999999998E-2,0,0.36793123011637208,8.3683069828736318,0.25560425042258234,9.4080000000000011E-2,0.36852348421158654,9.4080000000000011E-2,4.9140000000000003E-2,0.33777004852235998,4.7249999999999994E-4,3.3999999999999996E-2,9.1800000000000007E-2,5.7799999999999997E-2,3.4472499999999996E-2,2.0072658852038932,52.5,0.96317434285859549,20.018181505818607,19.236984210579326,null,96.317434285859548,0.72653629948366438,0.78559471432795858,0.4003636301163721,0.38473968421158655,0.33777004852235998]
["Total",{"$f":"SUM(B77:B79)","v":1.2920928478004275E-2},"A",null,null,null,71,13.5,1,10.65,10.65,4.382716049382716,0.37813068538011185,5.2998009090615277,13.299900454530764,8.0000995454692365,0,10.759328857924835,0.46305262989189661,0.25,0.74048324708830726,1.5299207407490483,2.3406574729741164E-3,2.3406574729741164E-3,5.2174188946337337,2.7221459922081092E-2,2.7221459922081092E-2,6.6161621864205786,0.19698120934659685,0.10152890031207726,6.2212049999999998E-2,0,0.37551608205305542,8.4846658977211717,0.26276187719522709,9.5424000000000009E-2,0.37805348592351978,9.5424000000000009E-2,4.9842000000000004E-2,0.34728947241892244,4.7249999999999994E-4,3.3999999999999996E-2,9.1800000000000007E-2,5.7799999999999997E-2,3.4472499999999996E-2,2.0506429048788601,53.25,0.96291828092476039,20.420590102652771,19.72506729617599,null,96.291828092476038,0.74048324708830726,0.80341156797657531,0.40841180205305544,0.39450134592351976,0.34728947241892244]
[null,null,null,null,null,null,72,13.5,1,10.8,10.8,4.4444444444444446,0.37823979791795154,5.300526448089534,13.450263224044768,8.1497367759552333,0,10.907854893863171,0.4759251935422989,0.25,0.75465805605312608,1.5301301858256118,2.3412983855747214E-3,2.3412983855747214E-3,5.2897411834169636,2.79813617875375E-2,2.79813617875375E-2,6.7084619889640331,0.20251558015818868,0.10295888482351498,6.2212049999999998E-2,0,0.3832076175807857,8.6010369216856315,0.27001910186792799,9.6768000000000021E-2,0.38772577497382366,9.6768000000000021E-2,5.0544000000000006E-2,0.35694389515672414,4.7249999999999994E-4,3.3999999999999996E-2,9.1800000000000007E-2,5.7799999999999997E-2,3.4472499999999996E-2,2.0946425039375716,54,0.96265877790752408,20.828332879039284,20.220264748691182,null,96.265877790752413,0.75465805605312608,0.82147739255460939,0.4165666575807857,0.40440529497382366,0.35694389515672414]
[null,null,null,null,null,null,73,13.5,1,10.95,10.95,4.5061728395061724,0.378348905251712,5.3012514504720816,13.600625725236039,8.2993742747639594,0,11.056420709784927,0.4889777556470441,0.25,0.76906209627003042,1.5303394759859752,2.3419389117610291E-3,2.3419389117610291E-3,5.3620906034016258,2.8752015639088011E-2,2.8752015639088011E-2,6.8008124246574075,0.20812972335918553,0.10438886933495266,6.2212049999999998E-2,0,0.39100666447593296,8.7174187278337421,0.27737587085881055,9.8112000000000005E-2,0.39754155803109942,9.8112000000000005E-2,5.1246E-2,0.36673331673528309,4.7249999999999994E-4,3.3999999999999996E-2,9.1800000000000007E-2,5.7799999999999997E-2,3.4472499999999996E-2,2.1392680900631946,54.75,0.96239592875977142,21.241451223796648,20.722636901554971,null,96.239592875977138,0.76906209627003042,0.8397942225070324,0.42482902447593296,0.41445273803109944,0.36673331673528309]
[null,null,null,null,null,null,74,13.5,1,11.1,11.1,4.5679012345679011,0.37845800738176549,5.3019759162475619,13.75098795812378,8.4490120418762196,0,11.205024723371761,0.50221031620548962,0.25,0.78369676418555745,1.5305486112412214,2.3425790513724315E-3,2.3425790513724315E-3,5.434466378305749,2.9533424816935605E-2,2.9533424816935605E-2,6.893212523158124,0.21382370500240794,0.10581885384639038,6.2212049999999998E-2,0,0.39891406554320247,8.8338100591957716,0.28483213059111168,9.9456000000000003E-2,0.40750206698291691,9.9456000000000003E-2,5.1948000000000001E-2,0.37665773715411721,4.7249999999999994E-4,3.3999999999999996E-2,9.1800000000000007E-2,5.7799999999999997E-2,3.4472499999999996E-2,2.1845231377341019,55.5,0.96212982236989131,21.659987277160123,21.232245349145845,null,96.212982236989134,0.78369676418555745,0.85836413252611943,0.43319974554320245,0.4246449069829169,0.37665773715411721]
[null,null,null,null,null,null,75,13.5,1,11.25,11.25,4.6296296296296298,0.37856710430848434,5.302699845454363,13.901349922727182,8.5986500772728185,0,11.353665434750509,0.5156228752169939,0.25,0.79856348315521708,1.5307575916024319,2.3432188042484775E-3,2.3432188042484775E-3,5.5068677716610681,3.0325592654559339E-2,3.0325592654559339E-2,6.9856613642895748,0.21959759113437635,0.10724883835782809,6.2212049999999998E-2,0,0.40693067885944656,8.950209724231069,0.29238782749317943,0.10080000000000001,0.41760855937693514,0.10080000000000001,5.2649999999999995E-2,0.3867171564127454,4.7249999999999994E-4,3.3999999999999996E-2,9.1800000000000007E-2,5.7799999999999997E-2,3.4472499999999996E-2,2.230411189263152,56.25,0.9618605419506242,22.083983942972328,21.749152968846758,null,96.186054195062425,0.79856348315521708,0.87718923823638162,0.44167967885944653,0.43498305937693515,0.3867171564127454]
[null,null,null,null,null,null,76,13.5,1,11.4,11.4,4.6913580246913575,0.37867619603224073,5.3034232381308701,14.051711619065436,8.7482883809345644,0,11.502341421216329,0.52921543268091542,0.25,0.81366370380624153,1.5309664170806874,2.3438581702288773E-3,2.3438581702288773E-3,5.5792940842651291,3.1128522478715868E-2,3.1128522478715868E-2,7.0781580748307222,0.22545144779531109,0.10867882286926579,6.2212049999999998E-2,0,0.41505737802327131,9.0666165926401412,0.300042907998472,0.10214400000000001,0.42786231887406051,0.10214400000000001,5.3352000000000011E-2,0.39691157451068659,4.7249999999999994E-4,3.3999999999999996E-2,9.1800000000000007E-2,5.7799999999999997E-2,3.4472499999999996E-2,2.2769358558632047,57,0.96158816539708181,22.513484901163565,22.273423943703026,null,96.158816539708184,0.81366370380624153,0.89627169689733188,0.45026969802327133,0.44546847887406049,0.39691157451068659]
[null,null,null,null,null,null,77,13.5,1,11.55,11.55,4.7530864197530862,0.37878528255340682,5.3041460943154632,14.202073047157732,8.8979269528422691,0,11.651051332354241,0.54298798859661423,0.25,0.82899890440891788,1.5311750876870676,2.3444971491534991E-3,2.3444971491534991E-3,5.6517446518257595,3.1942217609441076E-2,3.1942217609441076E-2,7.1707018255480843,0.2313853410191338,0.11010880738070351,6.2212049999999998E-2,0,0.42329505241058435,9.1830295914929359,0.30779731854555747,0.10348800000000001,0.43826465571396772,0.10348800000000001,5.4053999999999998E-2,0.40724099144746062,4.7249999999999994E-4,3.3999999999999996E-2,9.1800000000000007E-2,5.7799999999999997E-2,3.4472499999999996E-2,2.3241008187395251,57.75,0.96131276561671741,22.94853462052922,22.805123785698385,null,96.13127656167174,0.82899890440891788,0.91561370812455212,0.45897069241058436,0.45610247571396773,0.40724099144746062]
[null,null,null,null,null,null,78,13.5,1,11.7,11.7,4.8148148148148149,0.37889436387235487,5.3048684140465188,14.352434207023258,9.0475657929767408,0,11.799793885524542,0.55694054296344953,0.25,0.84457059125668632,1.5313836034326505,2.3451357408623692E-3,2.3451357408623692E-3,5.7242188427812195,3.2766681360051564E-2,3.2766681360051564E-2,7.26329182844907,0.23739933683346762,0.11153879189214119,6.2212049999999998E-2,0,0.43164460743622945,9.2994477016459065,0.31565100557811276,0.10483200000000001,0.44881690719331868,0.10483200000000001,5.4755999999999999E-2,0.41770540722258714,4.7249999999999994E-4,3.3999999999999996E-2,9.1800000000000007E-2,5.7799999999999997E-2,3.4472499999999996E-2,2.3719098302097352,58.5,0.96103441083373731,23.389178371811472,23.344319359665931,null,96.103441083373724,0.84457059125668632,0.93521751462954816,0.46778356743622945,0.46688638719331865,0.41770540722258714]
[null,null,null,null,null,null,79,13.5,1,11.85,11.85,4.8765432098765427,0.37900343998945696,5.3055901973624096,14.502795098681204,9.1972049013187949,0,11.948567861680983,0.57107309578078269,0.25,0.86038029905520275,1.5315919643285134,2.3457739451956745E-3,2.3457739451956745E-3,5.7967160562810287,3.3601917037146281E-2,3.3601917037146281E-2,7.3559273342377649,0.24349350125963837,0.11296877640357891,6.2212049999999998E-2,0,0.44010696482186284,9.4158699544231883,0.32360391554492407,0.10617600000000001,0.45952043815703092,0.10617600000000001,5.5458000000000007E-2,0.42830482183558699,4.7249999999999994E-4,3.3999999999999996E-2,9.1800000000000007E-2,5.7799999999999997E-2,3.4472499999999996E-2,2.4203667148520256,59.25,0.96075316487020135,23.83546224109314,23.891078907851547,null,96.075316487020132,0.86038029905520275,0.95508540297889377,0.47670924482186283,0.47782157815703091,0.42830482183558699]
[null,null,null,null,null,null,80,13.5,1,12,12,4.9382716049382713,0.37911251090508508,5.3063114443015076,14.653155722150753,9.3468442778492467,0,12.097372101493519,0.58538564704797491,0.25,0.87642959132054854,1.5318001703857338,2.3464117619937629E-3,2.3464117619937629E-3,5.8692357203138545,3.4447927940608088E-2,3.4447927940608088E-2,7.4486076299560118,0.24966790031267511,0.11439876091501662,6.2212049999999998E-2,0,0.44868306287022558,9.5322954285394879,0.33165599489988512,0.10752,0.47037664150295067,0.10752,5.6160000000000009E-2,0.43903923528598116,4.7249999999999994E-4,3.3999999999999996E-2,9.1800000000000007E-2,5.7799999999999997E-2,3.4472499999999996E-2,2.469475370682308,60,0.96046908740582659,24.287433143511279,24.445472075147535,null,96.046908740582666,0.87642959132054854,0.97521970437317629,0.48574866287022556,0.48890944150295068,0.43903923528598116]
[null,null,null,null,null,null,81,13.5,1,12.15,12.15,5,0.37922157661961142,5.3070321549021786,14.803516077451089,9.4964839225489115,0,12.246205501750211,0.59987819676438858,0.25,0.89272006078680322,1.5320082216153863,2.3470491910971389E-3,2.3470491910971389E-3,5.9417772899701706,3.5304717363605263E-2,3.5304717363605263E-2,7.5413320367943113,0.25592260000131101,0.11582874542645434,6.2212049999999998E-2,0,0.45737385674597686,9.6487232472445239,0.33980719010199673,0.10886400000000002,0.48138693870030747,0.10886400000000002,5.686200000000001E-2,0.44990864757329146,4.7249999999999994E-4,3.3999999999999996E-2,9.1800000000000007E-2,5.7799999999999997E-2,3.4472499999999996E-2,2.5192397703610818,60.75,0.96018223421832172,24.745138837298843,25.007569935015372,null,96.018223421832175,0.89272006078680322,0.99562279544628429,0.49490277674597688,0.50015139870030745,0.44990864757329146]
[null,null,null,null,null,null,82,13.5,1,12.3,12.3,5.0617283950617287,0.37933063713340792,5.3077523292027831,14.953876164601393,9.6461238353986083,0,12.395067012015161,0.61455074492938577,0.25,0.90925332982317431,1.532216118028545,2.3476862323464644E-3,2.3476862323464644E-3,6.0143402458285555,3.617228859259309E-2,3.617228859259309E-2,7.6340999080584862,0.26225766632798364,0.11725872993789206,6.2212049999999998E-2,0,0.46618031876325294,9.7651525756706867,0.34805744761536667,0.11020800000000001,0.49255278032233557,0.11020800000000001,5.7564000000000004E-2,0.46091305869703936,4.7249999999999994E-4,3.3999999999999996E-2,9.1800000000000007E-2,5.7799999999999997E-2,3.4472499999999996E-2,2.569663962430742,61.5,0.95989265740588958,25.208627938162646,25.57744501611678,null,95.989265740588962,0.90925332982317431,1.0162970990855884,0.50417255876325295,0.51154890032233558,0.46091305869703936]
[null,null,null,null,null,null,83,13.5,1,12.45,12.45,5.1234567901234565,0.37943969244684661,5.3084719672416814,15.104235983620839,9.7957640163791595,0,12.543955631521603,0.62940329154233021,0.25,0.92603105086091098,1.5324238596362836,2.3483228855825642E-3,2.3483228855825642E-3,6.0869240924555212,3.7050644907315473E-2,3.7050644907315473E-2,7.7269106272794232,0.26867316528883656,0.11868871444932975,6.2212049999999998E-2,0,0.47510343868012639,9.8815826183673074,0.35640671390920897,0.11155200000000001,0.50387564659345951,0.11155200000000001,5.8266000000000005E-2,0.47205246865674766,4.7249999999999994E-4,3.3999999999999996E-2,9.1800000000000007E-2,5.7799999999999997E-2,3.4472499999999996E-2,2.6207520725841431,62.25,0.95960040559339022,25.677949934006321,26.155171329672978,null,95.960040559339021,0.92603105086091098,1.0372450852735859,0.51355899868012644,0.52310342659345954,0.47205246865674766]
[null,null,null,null,null,null,84,13.5,1,12.6,12.6,5.1851851851851851,0.37954874256029941,5.3091910690572277,15.254595534528613,9.9454044654713858,0,12.692870406281095,0.64443583660258563,0.25,0.94305490683020965,1.5326314464496738,2.3489591506464192E-3,2.3489591506464192E-3,6.159528357009683,3.7939789580806405E-2,3.7939789580806405E-2,7.8197636064542575,0.27516916287371923,0.12011869896076746,6.2212049999999998E-2,0,0.48414422400013962,9.9980126170064381,0.3648549354578427,0.11289600000000001,0.51535704795145743,0.11289600000000001,5.8967999999999993E-2,0.4833268774519392,4.7249999999999994E-4,3.3999999999999996E-2,9.1800000000000007E-2,5.7799999999999997E-2,3.4472499999999996E-2,2.672508304965199,63,0.95930552412350678,26.153155200006985,26.740824397572872,null,95.930552412350679,0.94305490683020965,1.0584692719515969,0.52306310400013967,0.53481648795145742,0.4833268774519392]
[null,null,null,null,null,null,85,13.5,1,12.75,12.75,5.2469135802469138,0.37965778747413814,5.3099096346877737,15.404954817343887,10.095045182656113,0,12.841810426391568,0.65964838010951676,0.25,0.96032661160734434,1.5328388784797868,2.3495950273791709E-3,2.3495950273791709E-3,6.2321525879419575,3.8839725879391634E-2,3.8839725879391634E-2,7.9126582844085727,0.28174572506618822,0.12154868347220517,6.2212049999999998E-2,0,0.49330370028109982,10.114441848246475,0.37340205874069243,0.11424000000000001,0.52699852562503169,0.11424000000000001,5.9670000000000001E-2,0.49473628508213757,4.7249999999999994E-4,3.3999999999999996E-2,9.1800000000000007E-2,5.7799999999999997E-2,3.4472499999999996E-2,2.7249369435023847,63.75,0.95900805523413535,26.634295014054992,27.334481281251584,null,95.900805523413538,0.96032661160734434,1.0799722259061317,0.53268590028109986,0.54668962562503165,0.49473628508213757]
[null,null,null,null,null,null,86,13.5,1,12.9,12.9,5.3086419753086416,0.37976682718873483,5.310627664171669,15.555313832085835,10.244686167914166,0,12.990774823528508,0.67504092206248856,0.25,0.97784791047225406,1.5330461557376933,2.3502305156221201E-3,2.3502305156221201E-3,6.3047963537841669,3.9750457062690127E-2,3.9750457062690127E-2,8.0055941252699867,0.28840291784350791,0.12297866798364288,6.2212049999999998E-2,0,0.50258291145131995,10.230869621741096,0.38204803024228651,0.11558400000000002,0.53880165222722676,0.11558400000000002,6.0372000000000002E-2,0.50628069154686639,4.7249999999999994E-4,3.3999999999999996E-2,9.1800000000000007E-2,5.7799999999999997E-2,3.4472499999999996E-2,2.7780423532759797,64.5,0.95870803822310224,27.121421572565996,27.936220611361339,null,95.870803822310222,0.97784791047225406,1.1017565636785469,0.54242843145131991,0.5587244122272268,0.50628069154686639]
[null,null,null,null,null,null,87,13.5,1,13.05,13.05,5.3703703703703702,0.3798758617044613,5.3113451575472563,15.70567257877363,10.394327421226372,0,13.139762768604946,0.69061346246086697,0.25,0.99562058057682368,1.5332532782344619,2.3508656152167241E-3,2.3508656152167241E-3,6.3774592420191683,4.0671986383615702E-2,4.0671986383615702E-2,8.0985706170444587,0.29514080717665137,0.12440865249508058,6.2212049999999998E-2,0,0.51198292013350422,10.347295278282187,0.39079279645225712,0.11692800000000002,0.55076803236515426,0.11692800000000002,6.1074000000000003E-2,0.51796009684565014,4.7249999999999994E-4,3.3999999999999996E-2,9.1800000000000007E-2,5.7799999999999997E-2,3.4472499999999996E-2,2.8318289819199651,65.25,0.95840550960121829,27.614588006675213,28.546122618257712,null,95.840550960121831,0.99562058057682368,1.1238249524986585,0.55229176013350423,0.57092245236515426,0.51796009684565014]
[null,null,null,null,null,null,88,13.5,1,13.2,13.2,5.4320987654320989,0.3799848910216892,5.3120621148528748,15.856031057426437,10.543968942573562,0,13.288773469587198,0.70636600130401839,0.25,1.0136464314241092,1.5334602459811602,2.3515003260046003E-3,2.3515003260046003E-3,6.4501408580261694,4.160431708837857E-2,4.160431708837857E-2,8.1915872702873305,0.30195945903030041,0.12583863700651829,6.2212049999999998E-2,0,0.52150480797647403,10.463718188066379,0.39963630386533966,0.118272,0.5628993032664994,0.118272,6.1776000000000005E-2,0.52977450097801382,4.7249999999999994E-4,3.3999999999999996E-2,9.1800000000000007E-2,5.7799999999999997E-2,3.4472499999999996E-2,2.8863013610594801,66,0.95810050323457974,28.113848398823706,29.164269163324967,null,95.810050323457972,1.0136464314241092,1.1461801112429735,0.56227696797647408,0.58328538326649937,0.52977450097801382]
[null,null,null,null,null,null,89,13.5,1,13.35,13.35,5.4938271604938267,0.38009391514079049,5.3127785361268645,16.006389268063433,10.693610731936568,0,13.437806169454429,0.7222985385913101,0.25,1.0319273053587581,1.5336670589888557,2.3521346478275261E-3,2.3521346478275261E-3,6.5228408240955007,4.2547452416486872E-2,4.2547452416486872E-2,8.2846436168618975,0.30885893936284758,0.12726862151795601,6.2212049999999998E-2,0,0.53114967599494756,10.580137749075714,0.40857849898137172,0.11961600000000001,0.57519713542329898,0.11961600000000001,6.2478000000000006E-2,0.54172390394348258,4.7249999999999994E-4,3.3999999999999996E-2,9.1800000000000007E-2,5.7799999999999997E-2,3.4472499999999996E-2,2.9414641077848018,66.75,0.95779305047694896,28.619257799747377,29.790743771164951,null,95.779305047694891,1.0319273053587581,1.1688248114182467,0.57238515599494755,0.59581487542329903,0.54172390394348258]
[null,null,null,null,null,null,90,13.5,1,13.5,13.5,5.5555555555555554,0.38020293406213673,5.3134944214075528,16.156747210703777,10.843252789296223,0,13.586860144291153,0.73841107432210962,0.25,1.050465078068886,1.5338737172686128,2.352768580527432E-3,2.352768580527432E-3,6.5955587785075691,4.3501395600748262E-2,4.3501395600748262E-2,8.3777392087788307,0.31583931412639565,0.1286986060293937,6.2212049999999998E-2,0,0.54091864491757891,10.69655338556384,0.41761932830529297,0.12096000000000001,0.58766323325350178,0.12096000000000001,6.318E-2,0.55380830574158224,4.7249999999999994E-4,3.3999999999999996E-2,9.1800000000000007E-2,5.7799999999999997E-2,3.4472499999999996E-2,2.997321926162825,67.5,0.95748318029297419,29.130872245878948,30.425631662675091,null,95.748318029297423,1.050465078068886,1.1917618781710808,0.58261744491757894,0.6085126332535018,0.55380830574158224]
[null,null,null,null,null,null,91,13.5,1,13.65,13.65,5.617283950617284,0.38031194778609978,5.3142097707332763,16.307104885366638,10.992895114633363,0,13.735934701502714,0.75470360849578588,0.25,1.0692616590996835,1.5340802208314983,2.3534021239464183E-3,2.3534021239464183E-3,6.6682943746711949,4.4466149867271508E-2,4.4466149867271508E-2,8.4708736171104331,0.32290064926675915,0.13012859054083142,6.2212049999999998E-2,0,0.55081285554348425,10.812964546639781,0.42675873834714434,0.12230400000000001,0.60029933578083605,0.12230400000000001,6.3881999999999994E-2,0.56602770637183941,4.7249999999999994E-4,3.3999999999999996E-2,9.1800000000000007E-2,5.7799999999999997E-2,3.4472499999999996E-2,3.0538796087870614,68.25,0.95717091937293808,29.648748777174212,31.069019789041803,null,95.717091937293802,1.0692616590996835,1.2149941913243203,0.59297497554348422,0.62138039578083604,0.56602770637183941]
[null,null,null,null,null,null,92,13.5,1,13.8,13.8,5.6790123456790118,0.38042095631305123,5.314924584142358,16.457462292071181,11.142537707928822,0,13.885029178144595,0.77117614111170718,0.25,1.0883189923790222,1.5342865696885752,2.354035277926735E-3,2.354035277926735E-3,6.7410472803169039,4.5441718435467925E-2,4.5441718435467925E-2,8.5640464309741464,0.33004301072346454,0.13155857505226912,6.2212049999999998E-2,0,0.56083346910747711,10.929370704942063,0.43599667562206701,0.12364800000000002,0.61310721733353002,0.12364800000000002,6.4584000000000003E-2,0.57838210583378036,4.7249999999999994E-4,3.3999999999999996E-2,9.1800000000000007E-2,5.7799999999999997E-2,3.4472499999999996E-2,3.1111420383672046,69,0.95685629223966662,30.172945455373856,31.720996866676497,null,95.685629223966657,1.0883189923790222,1.2385246864410071,0.60345890910747713,0.63441993733352997,0.57838210583378036]
[null,null,null,null,null,null,93,13.5,1,13.95,13.95,5.7407407407407405,0.38052995964336273,5.3156388616731194,16.60781943083656,11.29218056916344,0,14.034142939357244,0.78782867216924313,0.25,1.107639056755352,1.5344927638509058,2.3546680423107919E-3,2.3546680423107919E-3,6.8138171767411739,4.6428104518053064E-2,4.6428104518053064E-2,8.6572572565802588,0.33726646442975194,0.13298855956370684,6.2212049999999998E-2,0,0.57098166765424918,11.045771355396564,0.44533308665030225,0.12499200000000001,0.62608868826245379,0.12499200000000001,6.5285999999999997E-2,0.59087150412693235,4.7249999999999994E-4,3.3999999999999996E-2,9.1800000000000007E-2,5.7799999999999997E-2,3.4472499999999996E-2,3.1691141893593517,69.75,0.95653932134817676,30.703521382712456,32.381653413122692,null,95.65393213481768,1.107639056755352,1.2623563559167028,0.61407042765424913,0.64763306826245381,0.59087150412693235]
[null,null,null,null,null,null,94,13.5,1,14.1,14.1,5.8024691358024691,0.38063895777740581,5.3163526033638799,16.758176301681939,11.441823698318061,0,14.183275376898708,0.80466120166776478,0.25,1.1272238665481844,1.5346988033295519,2.3553004169411585E-3,2.3553004169411585E-3,6.8866037580979098,4.7425311321048255E-2,4.7425311321048255E-2,8.7505057163390987,0.34457107631257455,0.13441854407514453,6.2212049999999998E-2,0,0.58125865442173852,11.162166014052019,0.45476791795719151,0.126336,0.63924559567926431,0.126336,6.5988000000000005E-2,0.60349590125082364,4.7249999999999994E-4,3.3999999999999996E-2,9.1800000000000007E-2,5.7799999999999997E-2,3.4472499999999996E-2,3.2278011296380003,70.5,0.95622002717858834,31.240536721086926,33.051081783963213,null,95.622002717858834,1.1272238665481844,1.2864922501010028,0.62481073442173851,0.66102163567926431,0.60349590125082364]
[null,null,null,null,null,null,95,13.5,1,14.25,14.25,5.8641975308641969,0.38074795071555206,5.317065809252953,16.908532904626476,11.591467095373524,0,14.332425907768041,0.8216737296066422,0.25,1.1470754721114516,1.5349046881355739,2.3559324016605631E-3,2.3559324016605631E-3,6.9594067307337424,4.8433342043782121E-2,4.8433342043782121E-2,8.8437914480234898,0.35195691229260034,0.13584852858658225,6.2212049999999998E-2,0,0.59166565423393391,11.278554216987528,0.46430111607317409,0.12768000000000002,0.65257982421516103,0.12768000000000002,6.6690000000000013E-2,0.61625529720498162,4.7249999999999994E-4,3.3999999999999996E-2,9.1800000000000007E-2,5.7799999999999997E-2,3.4472499999999996E-2,3.287208022210971,71.25,0.9558984283227856,31.784052711696699,33.729376210758048,null,95.589842832278563,1.1470754721114516,1.3109354784490947,0.63568105423393395,0.67458752421516099,0.61625529720498162]
[null,null,null,null,null,null,96,13.5,1,14.4,14.4,{"$f":"Vout*K105/(Vin*Efficiency)","v":5.9259259259259256},0.38085693845817298,{"$f":"(Vin-(Rdson1+Rdcr)*K105-Vout)*M105/(Fsw*Lf)","v":5.3177784793786502},17.058889239689325,11.741110760310676,{"$f":"IF(MIN(Vin, -P105/(Coss_Q1+Coss_Q2)*0.00000002)<0, 0, MIN(Vin, -P105/(Coss_Q1+Coss_Q2)*0.00000002))","v":0},14.481593972913062,{"$f":"R105^2*Rdcr","v":0.83886625598524767},0.25,{"$f":"(T105+S105*(1+Ltc*(Ta-25)))/(1-S105*Ltc*ThetaCa)","v":1.1671959604100717},1.5351104182800313,2.3565639963118927E-3,2.3565639963118927E-3,7.0322258125640476,4.9452199878892079E-2,4.9452199878892079E-2,8.9371141039824966,{"$f":"Rdson1*AB105^2","v":0.35942403828421282},0.13727851309801994,6.2212049999999998E-2,0,{"$f":"(AF105+AE105+AD105+AC105*(1+RdsonTopTc*Ta-RdsonTopTc*25))/(1-AC105*RdsonTopTc*ThetaJA_Q1)","v":0.60220391390337469},11.394935519287024,{"$f":"Rdson2*AH105^2","v":0.47393262753378795},0.12902400000000003,{"$f":"(AJ105+AI105*(1+RdsonBotTc*Ta-RdsonBotTc*25))/(1-AI105*RdsonBotTc*ThetaJA_Q2)","v":0.66609329680088536},0.12902400000000003,6.7391999999999994E-2,0.62914969198893578,4.7249999999999994E-4,3.3999999999999996E-2,9.1800000000000007E-2,5.7799999999999997E-2,3.4472499999999996E-2,{"$f":" SUM(U105,X105,AA105,AG105,AK105,AL105,AM105,AS105,AN105)","v":3.3473401269784713},72,0.95557454156527111,32.334131695168736,34.416632840044272,null,95.557454156527115,1.1671959604100717,1.3356892107042599,0.64668263390337466,0.6883326568008854,0.62914969198893578]
[null,null,null,null,null,null,97,13.5,1,14.55,14.55,5.9876543209876543,0.38096592100564008,5.3184906137792805,17.209245306889642,11.89075469311036,0,14.630779036016442,0.85623878080295279,0.25,1.1875874556100254,1.5353159937739829,2.3571952007381929E-3,2.3571952007381929E-3,7.1050607324868169,5.0481888012326101E-2,5.0481888012326101E-2,9.0304733504028363,0.36697252019551119,0.13870849760945766,6.2212049999999998E-2,0,0.61287470264360877,11.511309494075919,0.48366239887966866,0.13036800000000001,0.67978797546860881,0.13036800000000001,6.8094000000000016E-2,0.64217908560221459,4.7249999999999994E-4,3.3999999999999996E-2,9.1800000000000007E-2,5.7799999999999997E-2,3.4472499999999996E-2,3.4082028025375219,72.75,0.95524838195861472,32.890837132180437,35.112949773430444,null,95.524838195861477,1.1875874556100254,1.3607566781122176,0.65781674264360879,0.70225899546860882,0.64217908560221459]
[null,null,null,null,null,null,98,13.5,1,14.7,14.7,6.0493827160493829,0.38107489835832481,5.3192022124931473,17.359601106246572,12.040398893753427,0,14.779980582354723,0.87379130405913064,0.25,1.2082521196822817,1.5355214146284859,2.3578260147826663E-3,2.3578260147826663E-3,7.1779112298316994,5.152240962334402E-2,5.152240962334402E-2,9.1238688666146626,0.37460242392831145,0.14013848212089536,6.2212049999999998E-2,0,0.62367931249188757,11.627675731615598,0.49349037665654855,0.131712,0.69366586217639192,0.131712,6.8795999999999996E-2,0.655343478044348,4.7249999999999994E-4,3.3999999999999996E-2,9.1800000000000007E-2,5.7799999999999997E-2,3.4472499999999996E-2,3.4698015080330356,73.5,0.95491996289387726,33.454233624594373,35.818427108819591,null,95.491996289387728,1.2082521196822817,1.3861411746682795,0.66908467249188752,0.7163685421763919,0.655343478044348]
[null,null,null,null,null,null,99,13.5,1,14.85,14.85,6.1111111111111107,0.38118387051659863,5.3199132755585516,17.509956637779275,12.190043362220724,0,14.929198117725166,0.89152382575315459,0.25,1.2291921530209113,1.5357266808545968,2.3584564382886767E-3,2.3584564382886767E-3,7.2507770538418352,5.2573767884519285E-2,5.2573767884519285E-2,9.2173003444386197,0.38231381537814729,0.14156846663233308,6.2212049999999998E-2,0,0.63461905874237778,11.744033838451776,0.50341650741525634,0.13305600000000001,0.70772899965591074,0.13305600000000001,6.9498000000000004E-2,0.66864286931486594,4.7249999999999994E-4,3.3999999999999996E-2,9.1800000000000007E-2,5.7799999999999997E-2,3.4472499999999996E-2,3.5321418050568738,74.25,0.95458929616634391,34.024386937118891,36.533166982795542,null,95.458929616634393,1.2291921530209113,1.4118460583982886,0.68048773874237778,0.73066333965591079,0.66864286931486594]
[null,null,null,null,null,null,100,13.5,1,15,15,6.1728395061728394,0.38129283748083281,5.3206238030137882,17.660311901506894,12.339688098493106,0,15.078431167435813,0.90943634588439903,0.25,1.2504097950757382,1.5359317924633706,2.3590864710997428E-3,2.3590864710997428E-3,7.3236579631861849,5.3635965961740417E-2,5.3635965961740417E-2,9.3107674875713471,0.39010676043427045,0.14299845114377077,6.2212049999999998E-2,0,0.64569528039018376,11.860383436613004,0.51344073771171694,0.13440000000000002,0.72197947228417791,0.13440000000000002,7.0200000000000012E-2,0.68207725941329922,4.7249999999999994E-4,3.3999999999999996E-2,9.1800000000000007E-2,5.7799999999999997E-2,3.4472499999999996E-2,3.5952293595962397,75,0.95425639203688795,34.601364019509191,37.257273614208898,null,95.425639203688789,1.2504097950757382,1.4378747526743616,0.6920272803901838,0.74514547228417793,0.68207725941329922]

{"sheet":"Efficiency Plot Management","index":7,"n_rows":2,"n_cols":1,"rows_kept":2,"cut":false,"hidden":true,"merged":[]}
[]
[{"$f":"IF(PLOT_TYPE=1, \"EFF_Ch1\", \"EFF_Ch2\")","v":"EFF_Ch1"}]

{"sheet":"Schematic Management","index":8,"n_rows":17,"n_cols":14,"rows_kept":17,"cut":false,"hidden":true,"merged":[]}
[null,null,null,null,null,null,null,null,null,null,null,null,null,"3.3V or 5V fixed (FB1/2)"]
[{"$f":"IF(DITHER=1, CHOOSE(SCH_SETTING, \"SCH_ADJ_VOUT\", \"SCH_5V_FIXED\", \"SCH_3V3_FIXED\", \"SCH_ADJ_VOUT_NO_RT\", \"SCH_5V_FIXED_NO_RT\", \"SCH_3V3_FIXED_NO_RT\"), CHOOSE(SCH_SETTING, \"SCH_ADJ_VOUT_NO_DITH\", \"SCH_5V_FIXED_NO_DITH\", \"SCH_3V3_FIXED_NO_DITH\", \"SCH_ADJ_VOUT_NO_RT_NO_DITH\", \"SCH_5V_FIXED_NO_RT_NO_DITH\", \"SCH_3V3_FIXED_NO_RT_NO_DITH\"))","v":"SCH_5V_FIXED"},null,null,null,null,null,null,null,null,"With/without dither (DITH)",null,null,null,"With/without VOUT connected to VCCX"]
[null,null,null,null,null,null,null,null,null,"FPWM or DEM (DEMB)"]
[null,null,null,null,null,null,null,null,null,"Shunt or inductor DCR current sensing"]
[]
[]
[]
[]
[]
[]
[]
[]
[]
[]
[]
[]
[null," "]

{"sheet":"Standard Value Calculator","index":9,"n_rows":159,"n_cols":16,"rows_kept":159,"cut":false,"hidden":true,"merged":[]}
[]
["Capacitors","Css","Cc1ea","Cc2ea","Cout","Cin","Cres","Cdither","Cc3ea","Cc4ea"]
["Inputs",{"$f":"Css","v":4.583333333333334E-8},{"$f":"Cc1ea","v":6.6222995996006803E-9},{"$f":"Cc2ea","v":1.6683799933326911E-10},{"$f":"Cout","v":8.5000000000000006E-5},{"$f":"Cin","v":1.8E-5},{"$f":"Cres","v":5.0000000000000011E-8},{"$f":"Cdither_init","v":9.2592592592592591E-9},{"$f":"Cc3ea","v":0},{"$f":"Cc4ea","v":0},null,null,"Resistors","inputs","Standard Result"]
["Standard Result",{"$f":"SUM(B6:B158)/1000000000000","v":4.6999999999999997E-8},{"$f":"IF(C3=\"OPEN\",\"OPEN\",SUM(C6:C158)/1000000000000)","v":6.7999999999999997E-9},{"$f":"SUM(D6:D158)/1000000000000","v":1.8E-10},{"$f":"SUM(E6:E158)/1000000000000","v":8.2000000000000001E-5},{"$f":"SUM(F6:F158)/1000000000000","v":1.8E-5},{"$f":"SUM(G6:G158)/1000000000000","v":4.6999999999999997E-8},{"$f":"IF(H3=\"OPEN\",\"OPEN\",SUM(H6:H158)/1000000000000)","v":1E-8},0,0,null,null,"Rt",{"$f":"Rfadj","v":54.9},{"$f":"IF(N4>(INT(0.5+100*POWER(10,IF(96*(LOG(N4)-INT(LOG(N4)))-ROUND(96*(LOG(N4)-INT(LOG(N4))),0)<0,ROUND(96*(LOG(N4)-INT(LOG(N4))),0)-1,ROUND(96*(LOG(N4)-INT(LOG(N4))),0))/96))*POWER(10,INT(LOG(N4))-2)+INT(0.5+100*POWER(10,(IF(96*(LOG(N4)-INT(LOG(N4)))-ROUND(96*(LOG(N4)-INT(LOG(N4))),0)<0,ROUND(96*(LOG(N4)-INT(LOG(N4))),0)-1,ROUND(96*(LOG(N4)-INT(LOG(N4))),0))+1)/96))*POWER(10,INT(LOG(N4))-2))/2,INT(0.5+100*POWER(10,(IF(96*(LOG(N4)-INT(LOG(N4)))-ROUND(96*(LOG(N4)-INT(LOG(N4))),0)<0,ROUND(96*(LOG(N4)-INT(LOG(N4))),0)-1,ROUND(96*(LOG(N4)-INT(LOG(N4))),0))+1)/96))*POWER(10,INT(LOG(N4))-2),INT(0.5+100*POWER(10,IF(96*(LOG(N4)-INT(LOG(N4)))-ROUND(96*(LOG(N4)-INT(LOG(N4))),0)<0,ROUND(96*(LOG(N4)-INT(LOG(N4))),0)-1,ROUND(96*(LOG(N4)-INT(LOG(N4))),0))/96))*POWER(10,INT(LOG(N4))-2))","v":54.900000000000006},"Ω"]
["(pF)"]
[0.47,{"$f":"IF(IF((B$3*10^12-$A7)*(B$3*10^12-$A6)*-1<0,0,1)*IF(ABS(B$3*10^12-$A7)>(B$3*10^12-$A6),$A6,$A7)=B7,0,IF((B$3*10^12-$A7)*(B$3*10^12-$A6)*-1<0,0,1)*IF(ABS(B$3*10^12-$A7)>(B$3*10^12-$A6),$A6,$A7))","v":0},0,0,0,0,0,0,0,0]
[0.56000000000000005,{"$f":"IF(IF((B$3*10^12-$A8)*(B$3*10^12-$A7)*-1<0,0,1)*IF(ABS(B$3*10^12-$A8)>(B$3*10^12-$A7),$A7,$A8)=B8,0,IF((B$3*10^12-$A8)*(B$3*10^12-$A7)*-1<0,0,1)*IF(ABS(B$3*10^12-$A8)>(B$3*10^12-$A7),$A7,$A8))","v":0},{"$f":"IF(IF((C$3*10^12-$A8)*(C$3*10^12-$A7)*-1<0,0,1)*IF(ABS(C$3*10^12-$A8)>(C$3*10^12-$A7),$A7,$A8)=C8,0,IF((C$3*10^12-$A8)*(C$3*10^12-$A7)*-1<0,0,1)*IF(ABS(C$3*10^12-$A8)>(C$3*10^12-$A7),$A7,$A8))","v":0},{"$f":"IF(IF((D$3*10^12-$A8)*(D$3*10^12-$A7)*-1<0,0,1)*IF(ABS(D$3*10^12-$A8)>(D$3*10^12-$A7),$A7,$A8)=D8,0,IF((D$3*10^12-$A8)*(D$3*10^12-$A7)*-1<0,0,1)*IF(ABS(D$3*10^12-$A8)>(D$3*10^12-$A7),$A7,$A8))","v":0},{"$f":"IF(IF((E$3*10^12-$A8)*(E$3*10^12-$A7)*-1<0,0,1)*IF(ABS(E$3*10^12-$A8)>(E$3*10^12-$A7),$A7,$A8)=E8,0,IF((E$3*10^12-$A8)*(E$3*10^12-$A7)*-1<0,0,1)*IF(ABS(E$3*10^12-$A8)>(E$3*10^12-$A7),$A7,$A8))","v":0},{"$f":"IF(IF((F$3*10^12-$A8)*(F$3*10^12-$A7)*-1<0,0,1)*IF(ABS(F$3*10^12-$A8)>(F$3*10^12-$A7),$A7,$A8)=F8,0,IF((F$3*10^12-$A8)*(F$3*10^12-$A7)*-1<0,0,1)*IF(ABS(F$3*10^12-$A8)>(F$3*10^12-$A7),$A7,$A8))","v":0},{"$f":"IF(IF((G$3*10^12-$A8)*(G$3*10^12-$A7)*-1<0,0,1)*IF(ABS(G$3*10^12-$A8)>(G$3*10^12-$A7),$A7,$A8)=G8,0,IF((G$3*10^12-$A8)*(G$3*10^12-$A7)*-1<0,0,1)*IF(ABS(G$3*10^12-$A8)>(G$3*10^12-$A7),$A7,$A8))","v":0},0,0,0,null,null,"Rc1ea",{"$f":"Rcea1","v":4005.5306287500021},4020,"Ω"]
[0.68,0,0,0,0,0,0,0,0,0,null,null,"Rc1ea",{"$f":"Rcea2","v":0},{"$f":"IF(N8>(INT(0.5+100*POWER(10,IF(96*(LOG(N8)-INT(LOG(N8)))-ROUND(96*(LOG(N8)-INT(LOG(N8))),0)<0,ROUND(96*(LOG(N8)-INT(LOG(N8))),0)-1,ROUND(96*(LOG(N8)-INT(LOG(N8))),0))/96))*POWER(10,INT(LOG(N8))-2)+INT(0.5+100*POWER(10,(IF(96*(LOG(N8)-INT(LOG(N8)))-ROUND(96*(LOG(N8)-INT(LOG(N8))),0)<0,ROUND(96*(LOG(N8)-INT(LOG(N8))),0)-1,ROUND(96*(LOG(N8)-INT(LOG(N8))),0))+1)/96))*POWER(10,INT(LOG(N8))-2))/2,INT(0.5+100*POWER(10,(IF(96*(LOG(N8)-INT(LOG(N8)))-ROUND(96*(LOG(N8)-INT(LOG(N8))),0)<0,ROUND(96*(LOG(N8)-INT(LOG(N8))),0)-1,ROUND(96*(LOG(N8)-INT(LOG(N8))),0))+1)/96))*POWER(10,INT(LOG(N8))-2),INT(0.5+100*POWER(10,IF(96*(LOG(N8)-INT(LOG(N8)))-ROUND(96*(LOG(N8)-INT(LOG(N8))),0)<0,ROUND(96*(LOG(N8)-INT(LOG(N8))),0)-1,ROUND(96*(LOG(N8)-INT(LOG(N8))),0))/96))*POWER(10,INT(LOG(N8))-2))","v":{"$error":"#NUM!"}},"Ω"]
[0.82,0,0,0,0,0,0,0,0,0]
[1,0,0,0,0,0,0,0,0,0,null,null,"Rfb1",{"$f":"Rfb1_","v":49900},{"$f":"IF(N10>(INT(0.5+100*POWER(10,IF(96*(LOG(N10)-INT(LOG(N10)))-ROUND(96*(LOG(N10)-INT(LOG(N10))),0)<0,ROUND(96*(LOG(N10)-INT(LOG(N10))),0)-1,ROUND(96*(LOG(N10)-INT(LOG(N10))),0))/96))*POWER(10,INT(LOG(N10))-2)+INT(0.5+100*POWER(10,(IF(96*(LOG(N10)-INT(LOG(N10)))-ROUND(96*(LOG(N10)-INT(LOG(N10))),0)<0,ROUND(96*(LOG(N10)-INT(LOG(N10))),0)-1,ROUND(96*(LOG(N10)-INT(LOG(N10))),0))+1)/96))*POWER(10,INT(LOG(N10))-2))/2,INT(0.5+100*POWER(10,(IF(96*(LOG(N10)-INT(LOG(N10)))-ROUND(96*(LOG(N10)-INT(LOG(N10))),0)<0,ROUND(96*(LOG(N10)-INT(LOG(N10))),0)-1,ROUND(96*(LOG(N10)-INT(LOG(N10))),0))+1)/96))*POWER(10,INT(LOG(N10))-2),INT(0.5+100*POWER(10,IF(96*(LOG(N10)-INT(LOG(N10)))-ROUND(96*(LOG(N10)-INT(LOG(N10))),0)<0,ROUND(96*(LOG(N10)-INT(LOG(N10))),0)-1,ROUND(96*(LOG(N10)-INT(LOG(N10))),0))/96))*POWER(10,INT(LOG(N10))-2))","v":49900},"Ω"]
[1.2,0,0,0,0,0,0,0,0,0,null,null,"Rfb2",{"$f":"Rfb2_","v":15757.894736842107},{"$f":"IF(N11=\"OPEN\",\"OPEN\",IF(N11>(INT(0.5+100*POWER(10,IF(96*(LOG(N11)-INT(LOG(N11)))-ROUND(96*(LOG(N11)-INT(LOG(N11))),0)<0,ROUND(96*(LOG(N11)-INT(LOG(N11))),0)-1,ROUND(96*(LOG(N11)-INT(LOG(N11))),0))/96))*POWER(10,INT(LOG(N11))-2)+INT(0.5+100*POWER(10,(IF(96*(LOG(N11)-INT(LOG(N11)))-ROUND(96*(LOG(N11)-INT(LOG(N11))),0)<0,ROUND(96*(LOG(N11)-INT(LOG(N11))),0)-1,ROUND(96*(LOG(N11)-INT(LOG(N11))),0))+1)/96))*POWER(10,INT(LOG(N11))-2))/2,INT(0.5+100*POWER(10,(IF(96*(LOG(N11)-INT(LOG(N11)))-ROUND(96*(LOG(N11)-INT(LOG(N11))),0)<0,ROUND(96*(LOG(N11)-INT(LOG(N11))),0)-1,ROUND(96*(LOG(N11)-INT(LOG(N11))),0))+1)/96))*POWER(10,INT(LOG(N11))-2),INT(0.5+100*POWER(10,IF(96*(LOG(N11)-INT(LOG(N11)))-ROUND(96*(LOG(N11)-INT(LOG(N11))),0)<0,ROUND(96*(LOG(N11)-INT(LOG(N11))),0)-1,ROUND(96*(LOG(N11)-INT(LOG(N11))),0))/96))*POWER(10,INT(LOG(N11))-2)))","v":15800},"Ω"]
[1.5,0,0,0,0,0,0,0,0,0,null,null,"Rt1",{"$f":"'Variable Management'!B27*1000","v":288186.04651162791},{"$f":"IF(N12>(INT(0.5+100*POWER(10,IF(96*(LOG(N12)-INT(LOG(N12)))-ROUND(96*(LOG(N12)-INT(LOG(N12))),0)<0,ROUND(96*(LOG(N12)-INT(LOG(N12))),0)-1,ROUND(96*(LOG(N12)-INT(LOG(N12))),0))/96))*POWER(10,INT(LOG(N12))-2)+INT(0.5+100*POWER(10,(IF(96*(LOG(N12)-INT(LOG(N12)))-ROUND(96*(LOG(N12)-INT(LOG(N12))),0)<0,ROUND(96*(LOG(N12)-INT(LOG(N12))),0)-1,ROUND(96*(LOG(N12)-INT(LOG(N12))),0))+1)/96))*POWER(10,INT(LOG(N12))-2))/2,INT(0.5+100*POWER(10,(IF(96*(LOG(N12)-INT(LOG(N12)))-ROUND(96*(LOG(N12)-INT(LOG(N12))),0)<0,ROUND(96*(LOG(N12)-INT(LOG(N12))),0)-1,ROUND(96*(LOG(N12)-INT(LOG(N12))),0))+1)/96))*POWER(10,INT(LOG(N12))-2),INT(0.5+100*POWER(10,IF(96*(LOG(N12)-INT(LOG(N12)))-ROUND(96*(LOG(N12)-INT(LOG(N12))),0)<0,ROUND(96*(LOG(N12)-INT(LOG(N12))),0)-1,ROUND(96*(LOG(N12)-INT(LOG(N12))),0))/96))*POWER(10,INT(LOG(N12))-2))","v":287000},"Ω"]
[1.8,0,0,0,0,0,0,0,0,0,null,null,"Rt2",{"$f":"'Variable Management'!B28*1000","v":55248.888888888883},{"$f":"IF(N13=\"OPEN\",\"OPEN\",IF(N13>(INT(0.5+100*POWER(10,IF(96*(LOG(N13)-INT(LOG(N13)))-ROUND(96*(LOG(N13)-INT(LOG(N13))),0)<0,ROUND(96*(LOG(N13)-INT(LOG(N13))),0)-1,ROUND(96*(LOG(N13)-INT(LOG(N13))),0))/96))*POWER(10,INT(LOG(N13))-2)+INT(0.5+100*POWER(10,(IF(96*(LOG(N13)-INT(LOG(N13)))-ROUND(96*(LOG(N13)-INT(LOG(N13))),0)<0,ROUND(96*(LOG(N13)-INT(LOG(N13))),0)-1,ROUND(96*(LOG(N13)-INT(LOG(N13))),0))+1)/96))*POWER(10,INT(LOG(N13))-2))/2,INT(0.5+100*POWER(10,(IF(96*(LOG(N13)-INT(LOG(N13)))-ROUND(96*(LOG(N13)-INT(LOG(N13))),0)<0,ROUND(96*(LOG(N13)-INT(LOG(N13))),0)-1,ROUND(96*(LOG(N13)-INT(LOG(N13))),0))+1)/96))*POWER(10,INT(LOG(N13))-2),INT(0.5+100*POWER(10,IF(96*(LOG(N13)-INT(LOG(N13)))-ROUND(96*(LOG(N13)-INT(LOG(N13))),0)<0,ROUND(96*(LOG(N13)-INT(LOG(N13))),0)-1,ROUND(96*(LOG(N13)-INT(LOG(N13))),0))/96))*POWER(10,INT(LOG(N13))-2)))","v":54900},"Ω"]
[2.2000000000000002,{"$f":"IF(IF((B$3*10^12-$A15)*(B$3*10^12-$A14)*-1<0,0,1)*IF(ABS(B$3*10^12-$A15)>(B$3*10^12-$A14),$A14,$A15)=B15,0,IF((B$3*10^12-$A15)*(B$3*10^12-$A14)*-1<0,0,1)*IF(ABS(B$3*10^12-$A15)>(B$3*10^12-$A14),$A14,$A15))","v":0},0,0,0,0,0,0,0,0]
[2.7,0,0,0,0,0,0,0,0,0]
[3.3,0,0,0,0,0,0,0,0,0,null,null,"Rs",{"$f":"Rs_ideal*1000","v":3.3083880072461311},{"$f":"IF(N16=0,0,IF(N16>(INT(0.5+100*POWER(10,IF(96*(LOG(N16)-INT(LOG(N16)))-ROUND(96*(LOG(N16)-INT(LOG(N16))),0)<0,ROUND(96*(LOG(N16)-INT(LOG(N16))),0)-1,ROUND(96*(LOG(N16)-INT(LOG(N16))),0))/96))*POWER(10,INT(LOG(N16))-2)+INT(0.5+100*POWER(10,(IF(96*(LOG(N16)-INT(LOG(N16)))-ROUND(96*(LOG(N16)-INT(LOG(N16))),0)<0,ROUND(96*(LOG(N16)-INT(LOG(N16))),0)-1,ROUND(96*(LOG(N16)-INT(LOG(N16))),0))+1)/96))*POWER(10,INT(LOG(N16))-2))/2,INT(0.5+100*POWER(10,(IF(96*(LOG(N16)-INT(LOG(N16)))-ROUND(96*(LOG(N16)-INT(LOG(N16))),0)<0,ROUND(96*(LOG(N16)-INT(LOG(N16))),0)-1,ROUND(96*(LOG(N16)-INT(LOG(N16))),0))+1)/96))*POWER(10,INT(LOG(N16))-2),INT(0.5+100*POWER(10,IF(96*(LOG(N16)-INT(LOG(N16)))-ROUND(96*(LOG(N16)-INT(LOG(N16))),0)<0,ROUND(96*(LOG(N16)-INT(LOG(N16))),0)-1,ROUND(96*(LOG(N16)-INT(LOG(N16))),0))/96))*POWER(10,INT(LOG(N16))-2)))","v":3.3200000000000003},"mΩ"]
[3.9,0,0,0,0,0,0,0,0,0,null,null,"Cres",{"$f":"Cres","v":5.0000000000000011E-8},{"$f":"G4*1000000000000","v":47000},"pF"]
[4.7,0,0,0,0,0,0,0,0,0]
[5.6,0,0,0,0,0,0,0,0,0]
[6.8,0,0,0,0,0,0,0,0,0]
[8.1999999999999993,0,0,0,0,0,0,0,0,0]
[10,0,0,0,0,0,0,0,0,0,null,null,"Cdither",{"$f":"Cdither_init","v":9.2592592592592591E-9},{"$f":"H4","v":1E-8}]
[12,0,0,0,0,0,0,0,0,0]
[15,0,0,0,0,0,0,0,0,0]
[18,0,0,0,0,0,0,0,0,0]
[22,0,0,0,0,0,0,0,0,0]
[27,0,0,0,0,0,0,0,0,0]
[33,0,0,0,0,0,0,0,0,0]
[39,0,0,0,0,0,0,0,0,0]
[47,0,0,0,0,0,0,0,0,0,null,null,"Rc1",{"$f":"O7/1000&\" kΩ\"","v":"4.02 kΩ"},{"$f":"O7/1000","v":4.0199999999999996},"kΩ"]
[56,0,0,0,0,0,0,0,0,0,null,null,"Cc1",{"$f":"C4*1000000000&\" nF\"","v":"6.8 nF"},{"$f":"C4*1000000000","v":6.8},"nF"]
[68,0,0,0,0,0,0,0,0,0,null,null,"Cc2",{"$f":"D4*1000000000000&\" pF\"","v":"180 pF"},{"$f":"D4*1000000000000","v":180},"pF"]
[82,0,0,0,0,0,0,0,0,0]
[{"$f":"A22*10","v":100},0,0,0,0,0,0,0,0,0,null,null,"Rc2",{"$f":"O8/1000&\" kΩ\"","v":{"$error":"#NUM!"}},{"$f":"O8/1000","v":{"$error":"#NUM!"}},"kΩ"]
[{"$f":"A23*10","v":120},0,0,0,0,0,0,0,0,0,null,null,"Cc3",{"$f":"I4*1000000000&\" nF\"","v":"0 nF"},{"$f":"I4*1000000000","v":0},"nF"]
[150,0,0,180,0,0,0,0,0,0,null,null,"Cc4",{"$f":"J4*1000000000000&\" pF\"","v":"0 pF"},{"$f":"J4*1000000000000","v":0},"pF"]
[180,0,0,0,0,0,0,0,0,0]
[220,0,0,0,0,0,0,0,0,0]
[270,0,{"$f":"IF(IF((C$3*10^12-$A40)*(C$3*10^12-$A39)*-1<0,0,1)*IF(ABS(C$3*10^12-$A40)>(C$3*10^12-$A39),$A39,$A40)=C40,0,IF((C$3*10^12-$A40)*(C$3*10^12-$A39)*-1<0,0,1)*IF(ABS(C$3*10^12-$A40)>(C$3*10^12-$A39),$A39,$A40))","v":0},0,0,0,0,0,0,0]
[330,0,0,0,0,0,0,0,0,0]
[390,0,0,0,0,0,0,0,0,0]
[470,0,0,0,0,0,0,0,0,0]
[560,0,0,0,0,0,0,0,0,0]
[680,0,0,0,0,0,0,0,0,0]
[{"$f":"A33*10","v":820},0,0,0,0,0,0,0,0,0]
[1000,0,0,0,0,0,0,0,0,0]
[1200,0,0,0,0,0,0,0,0,0]
[1500,0,0,0,0,0,0,0,0,0]
[1800,0,0,0,0,0,0,0,0,0]
[2200,0,0,0,0,0,0,0,0,0]
[2700,0,0,0,0,0,0,0,0,0]
[3300,0,0,0,0,0,0,0,0,0]
[3900,0,0,0,0,0,0,0,0,0]
[4700,0,0,0,0,0,0,0,0,0]
[5600,0,6800,0,0,0,0,0,0,0]
[6800,0,0,0,0,0,0,0,0,0]
[8200,0,0,0,0,0,0,10000,0,0]
[10000,0,0,0,0,0,0,0,0,0]
[12000,0,0,0,0,0,0,0,0,0]
[15000,0,0,0,0,0,0,0,0,0]
[18000,0,0,0,0,0,0,0,0,0]
[22000,0,0,0,0,0,0,0,0,0]
[27000,0,0,0,0,0,0,0,0,0]
[33000,0,0,0,0,0,0,0,0,0]
[39000,47000,0,0,0,0,0,0,0,0]
[47000,0,0,0,0,0,47000,0,0,0]
[56000,0,0,0,0,0,0,0,0,0]
[68000,0,0,0,0,0,0,0,0,0]
[82000,0,0,0,0,0,0,0,0,{"$f":"IF(IF((J$3*10^12-$A70)*(J$3*10^12-$A69)*-1<0,0,1)*IF(ABS(J$3*10^12-$A70)>(J$3*10^12-$A69),$A69,$A70)=J70,0,IF((J$3*10^12-$A70)*(J$3*10^12-$A69)*-1<0,0,1)*IF(ABS(J$3*10^12-$A70)>(J$3*10^12-$A69),$A69,$A70))","v":0}]
[100000,0,0,{"$f":"IF(IF((D$3*10^12-$A71)*(D$3*10^12-$A70)*-1<0,0,1)*IF(ABS(D$3*10^12-$A71)>(D$3*10^12-$A70),$A70,$A71)=D71,0,IF((D$3*10^12-$A71)*(D$3*10^12-$A70)*-1<0,0,1)*IF(ABS(D$3*10^12-$A71)>(D$3*10^12-$A70),$A70,$A71))","v":0},0,0,0,0,0,0]
[120000,{"$f":"IF(IF((B$3*10^12-$A72)*(B$3*10^12-$A71)*-1<0,0,1)*IF(ABS(B$3*10^12-$A72)>(B$3*10^12-$A71),$A71,$A72)=B72,0,IF((B$3*10^12-$A72)*(B$3*10^12-$A71)*-1<0,0,1)*IF(ABS(B$3*10^12-$A72)>(B$3*10^12-$A71),$A71,$A72))","v":0},{"$f":"IF(IF((C$3*10^12-$A72)*(C$3*10^12-$A71)*-1<0,0,1)*IF(ABS(C$3*10^12-$A72)>(C$3*10^12-$A71),$A71,$A72)=C72,0,IF((C$3*10^12-$A72)*(C$3*10^12-$A71)*-1<0,0,1)*IF(ABS(C$3*10^12-$A72)>(C$3*10^12-$A71),$A71,$A72))","v":0},0,0,{"$f":"IF(IF((F$3*10^12-$A72)*(F$3*10^12-$A71)*-1<0,0,1)*IF(ABS(F$3*10^12-$A72)>(F$3*10^12-$A71),$A71,$A72)=F72,0,IF((F$3*10^12-$A72)*(F$3*10^12-$A71)*-1<0,0,1)*IF(ABS(F$3*10^12-$A72)>(F$3*10^12-$A71),$A71,$A72))","v":0},{"$f":"IF(IF((G$3*10^12-$A72)*(G$3*10^12-$A71)*-1<0,0,1)*IF(ABS(G$3*10^12-$A72)>(G$3*10^12-$A71),$A71,$A72)=G72,0,IF((G$3*10^12-$A72)*(G$3*10^12-$A71)*-1<0,0,1)*IF(ABS(G$3*10^12-$A72)>(G$3*10^12-$A71),$A71,$A72))","v":0},{"$f":"IF(IF((H$3*10^12-$A72)*(H$3*10^12-$A71)*-1<0,0,1)*IF(ABS(H$3*10^12-$A72)>(H$3*10^12-$A71),$A71,$A72)=H72,0,IF((H$3*10^12-$A72)*(H$3*10^12-$A71)*-1<0,0,1)*IF(ABS(H$3*10^12-$A72)>(H$3*10^12-$A71),$A71,$A72))","v":0},{"$f":"IF(IF((I$3*10^12-$A72)*(I$3*10^12-$A71)*-1<0,0,1)*IF(ABS(I$3*10^12-$A72)>(I$3*10^12-$A71),$A71,$A72)=I72,0,IF((I$3*10^12-$A72)*(I$3*10^12-$A71)*-1<0,0,1)*IF(ABS(I$3*10^12-$A72)>(I$3*10^12-$A71),$A71,$A72))","v":0},0]
[150000,0,0,0,0,0,0,0,0,0]
[180000,0,0,0,0,0,0,0,0,0]
[220000,0,0,0,0,0,0,0,0,0]
[270000,0,0,0,0,0,0,0,0,0]
[330000,0,0,0,0,0,0,0,0,0]
[390000,0,0,0,0,0,0,0,0,0]
[470000,0,0,0,0,0,0,0,0,0]
[560000,0,0,0,0,0,0,0,0,0]
[680000,0,0,0,0,0,0,0,0,0]
[820000,0,0,0,0,0,0,0,0,0]
[1000000,0,0,0,0,0,0,0,0,0]
[1200000,0,0,0,0,0,0,0,0,0]
[1500000,0,0,0,0,0,0,0,0,0]
[1800000,0,0,0,0,0,0,0,0,0]
[2200000,0,0,0,0,0,0,0,0,0]
[2700000,0,0,0,0,0,0,0,0,0]
[3300000,0,0,0,0,0,0,0,0,0]
[3900000,0,0,0,0,0,0,0,0,0]
[4700000,0,0,0,0,0,0,0,0,0]
[5600000,0,0,0,0,0,0,0,0,0]
[6800000,0,0,0,0,0,0,0,0,0]
[8200000,0,0,0,0,0,0,0,0,0]
[10000000,0,0,0,0,0,0,0,0,0]
[12000000,0,0,0,0,0,0,0,0,0]
[15000000,0,0,0,0,0,0,0,0,0]
[18000000,0,0,0,0,18000000,0,0,0,0]
[22000000,0,0,0,0,0,0,0,0,0]
[{"$f":"A87*10","v":27000000},0,0,0,0,0,0,0,0,0]
[33000000,0,0,0,0,0,0,0,0,0]
[39000000,0,0,0,0,0,0,0,0,0]
[47000000,0,0,0,0,0,0,0,0,0]
[56000000,0,0,0,0,{"$f":"IF(IF((F$3*10^12-$A104)*(F$3*10^12-$A103)*-1<0,0,1)*IF(ABS(F$3*10^12-$A104)>(F$3*10^12-$A103),$A103,$A104)=F104,0,IF((F$3*10^12-$A104)*(F$3*10^12-$A103)*-1<0,0,1)*IF(ABS(F$3*10^12-$A104)>(F$3*10^12-$A103),$A103,$A104))","v":0},{"$f":"IF(IF((G$3*10^12-$A104)*(G$3*10^12-$A103)*-1<0,0,1)*IF(ABS(G$3*10^12-$A104)>(G$3*10^12-$A103),$A103,$A104)=G104,0,IF((G$3*10^12-$A104)*(G$3*10^12-$A103)*-1<0,0,1)*IF(ABS(G$3*10^12-$A104)>(G$3*10^12-$A103),$A103,$A104))","v":0},{"$f":"IF(IF((H$3*10^12-$A104)*(H$3*10^12-$A103)*-1<0,0,1)*IF(ABS(H$3*10^12-$A104)>(H$3*10^12-$A103),$A103,$A104)=H104,0,IF((H$3*10^12-$A104)*(H$3*10^12-$A103)*-1<0,0,1)*IF(ABS(H$3*10^12-$A104)>(H$3*10^12-$A103),$A103,$A104))","v":0},{"$f":"IF(IF((I$3*10^12-$A104)*(I$3*10^12-$A103)*-1<0,0,1)*IF(ABS(I$3*10^12-$A104)>(I$3*10^12-$A103),$A103,$A104)=I104,0,IF((I$3*10^12-$A104)*(I$3*10^12-$A103)*-1<0,0,1)*IF(ABS(I$3*10^12-$A104)>(I$3*10^12-$A103),$A103,$A104))","v":0},0]
[68000000,0,0,0,0,0,0,0,0,0]
[82000000,0,0,0,82000000,0,0,0,0,0]
[100000000,0,0,0,0,0,0,0,0,0]
[120000000,0,0,0,0,0,0,0,0,0]
[150000000,0,0,0,0,0,0,0,0,0]
[180000000,0,0,0,0,0,0,0,0,0]
[220000000,0,0,0,0,0,0,0,0,0]
[270000000,0,0,0,0,0,0,0,0,0]
[330000000,0,0,0,0,0,0,0,0,0]
[390000000,0,0,0,0,0,0,0,0,0]
[470000000,0,0,0,0,0,0,0,0,0]
[560000000,0,0,0,0,0,0,0,0,0]
[680000000,0,0,0,0,0,0,0,0,0]
[820000000,0,0,0,0,0,0,0,0,0]
[1000000000,0,0,0,0,0,0,0,0,0]
[1200000000,0,0,0,0,0,0,0,0,0]
[1500000000,0,0,0,0,0,0,0,0,0]
[1800000000,0,0,0,0,0,0,0,0,0]
[2200000000,0,0,0,0,0,0,0,0,0]
[2700000000,0,0,0,0,0,0,0,0,0]
[3300000000,0,0,0,0,0,0,0,0,0]
[3900000000,0,0,0,0,0,0,0,0,0]
[4700000000,0,0,0,0,0,0,0,0,0]
[5600000000,0,0,0,0,0,0,0,0,0]
[6800000000,0,0,0,0,0,0,0,0,0]
[8200000000,0,0,0,0,0,0,0,0,0]
[10000000000,0,0,0,0,0,0,0,0,0]
[12000000000,0,0,0,0,0,0,0,0,0]
[15000000000,0,0,0,0,0,0,0,0,0]
[18000000000,0,0,0,0,0,0,0,0,{"$f":"IF(IF((J$3*10^12-$A134)*(J$3*10^12-$A133)*-1<0,0,1)*IF(ABS(J$3*10^12-$A134)>(J$3*10^12-$A133),$A133,$A134)=J134,0,IF((J$3*10^12-$A134)*(J$3*10^12-$A133)*-1<0,0,1)*IF(ABS(J$3*10^12-$A134)>(J$3*10^12-$A133),$A133,$A134))","v":0}]
[22000000000,0,0,0,{"$f":"IF(IF((E$3*10^12-$A135)*(E$3*10^12-$A134)*-1<0,0,1)*IF(ABS(E$3*10^12-$A135)>(E$3*10^12-$A134),$A134,$A135)=E135,0,IF((E$3*10^12-$A135)*(E$3*10^12-$A134)*-1<0,0,1)*IF(ABS(E$3*10^12-$A135)>(E$3*10^12-$A134),$A134,$A135))","v":0},0,0,0,0,{"$f":"IF(IF((J$3*10^12-$A135)*(J$3*10^12-$A134)*-1<0,0,1)*IF(ABS(J$3*10^12-$A135)>(J$3*10^12-$A134),$A134,$A135)=J135,0,IF((J$3*10^12-$A135)*(J$3*10^12-$A134)*-1<0,0,1)*IF(ABS(J$3*10^12-$A135)>(J$3*10^12-$A134),$A134,$A135))","v":0}]
[27000000000,{"$f":"IF(IF((B$3*10^12-$A136)*(B$3*10^12-$A135)*-1<0,0,1)*IF(ABS(B$3*10^12-$A136)>(B$3*10^12-$A135),$A135,$A136)=B136,0,IF((B$3*10^12-$A136)*(B$3*10^12-$A135)*-1<0,0,1)*IF(ABS(B$3*10^12-$A136)>(B$3*10^12-$A135),$A135,$A136))","v":0},{"$f":"IF(IF((C$3*10^12-$A136)*(C$3*10^12-$A135)*-1<0,0,1)*IF(ABS(C$3*10^12-$A136)>(C$3*10^12-$A135),$A135,$A136)=C136,0,IF((C$3*10^12-$A136)*(C$3*10^12-$A135)*-1<0,0,1)*IF(ABS(C$3*10^12-$A136)>(C$3*10^12-$A135),$A135,$A136))","v":0},0,0,0,0,0,0,0]
[33000000000,0,0,0,0,0,0,0,0,0]
[39000000000,0,0,0,0,0,0,0,0,0]
[47000000000,0,0,0,0,0,0,0,0,0]
[56000000000,0,0,0,0,0,0,0,0,0]
[68000000000,0,0,0,0,0,0,0,0,0]
[82000000000,0,0,0,0,0,0,0,0,0]
[100000000000,0,0,0,0,0,0,0,0,0]
[120000000000,0,0,0,0,0,0,0,0,0]
[150000000000,0,0,0,0,0,0,0,0,0]
[180000000000,0,0,0,0,0,0,0,0,0]
[220000000000,0,0,0,0,0,0,0,0,0]
[270000000000,0,0,0,0,0,0,0,0,0]
[330000000000,0,0,0,0,0,0,0,0,0]
[390000000000,0,0,0,0,0,0,0,0,0]
[470000000000,0,0,0,0,0,0,0,0,0]
[560000000000,0,0,0,0,0,0,0,0,0]
[680000000000,0,0,0,0,0,0,0,0,0]
[820000000000,0,0,0,0,0,0,0,0,0]
[1000000000000,0,0,0,0,0,0,0,0,0]
[1200000000000,0,0,0,0,0,0,0,0,0]
[1500000000000,0,0,0,0,0,0,0,0,0]
[1800000000000,0,0,0,0,0,0,0,0,0]
[2200000000000,0,0,0,0,0,0,0,0,0]
[2700000000000,2700000000000,2700000000000,2700000000000,2700000000000,2700000000000,2700000000000,2700000000000,2700000000000,2700000000000]

{"sheet":"Snubber","index":10,"n_rows":6,"n_cols":5,"rows_kept":6,"cut":false,"hidden":true,"merged":[]}
[null,null,"UNITS","STD UNITS"]
["Frequency of Ringing",85,"MHz",{"$f":"B2*1000000","v":85000000},"Hz"]
["SW capacitance",3000,"pF",{"$f":"B3*0.000000000001","v":3E-9},"F"]
["Lpar",{"$f":"1000000000*1/((D2*2*3.14159)^2*D3)","v":1.1686430773614742},"nH",{"$f":"B4/1000000000","v":1.1686430773614743E-9},"H"]
["Csnub",{"$f":"4*B3","v":12000},"pF",{"$f":"B5*0.000000000001","v":1.2E-8},"F"]
["Rsnub",{"$f":"SQRT(D4/D3)","v":0.62413755891936573},"Ω",{"$f":"B6","v":0.62413755891936573},"Ω"]

{"sheet":"Parallel Output Caps","index":11,"n_rows":17,"n_cols":5,"rows_kept":17,"cut":false,"hidden":true,"merged":[]}
[]
[]
[]
["Fsw",{"$f":"Fsw","v":400000}]
[]
["C1",20,"uF",{"$f":"B6/1000000","v":2.0000000000000002E-5},"F"]
["R1",0.5,"mOhms",{"$f":"B7/1000","v":5.0000000000000001E-4},"Ohms"]
[]
["C2",68,"uF",{"$f":"B9/1000000","v":6.7999999999999999E-5},"F"]
["R2",20,"mOhms",{"$f":"B10/1000","v":0.02},"Ohms"]
[]
[]
["I1 ",{"$f":"(D6/(D6+D9))*SQRT((D10*D9*B4)^2+1)/SQRT((((D7+D10)*D6*D9/(D9+D6))*B4)^2+1)","v":0.25667257397349275},"%"]
["I2 ",{"$f":"1-B13","v":0.74332742602650725},"%"]
[]
["I1 ",{"$f":"B13*(Iripple1/(2*SQRT(3)))","v":{"$error":"#NAME?"}},"A"]
["I2 ",{"$f":"B14*(Iripple1/(2*SQRT(3)))","v":{"$error":"#NAME?"}},"A"]