{"text_format":"1","workbook":"xlsx","n_sheets":14,"sheets":["Design the Regulator","BOM & Schematic","EMI Filter Design","EVM","Variable Management","Schematic Management","Stability Calculations","Bode Plot Management","Efficiency Calculations","Efficiency Plot Management","Input Filter Calculations","Standard Value Calculator","Snubber","Parallel Output Caps"],"not_rendered":{"charts":9,"images":33,"macros":1,"external_links":0,"defined_names":304,"comments":2,"pivot_tables":0},"unopened":[],"bounds":{"document_bytes":16777216,"sheet_cells":100000,"rows_first":2000,"rows_last":500,"rows_between":2000,"halvings":0,"cell_chars":16384,"cell_head_chars":4096},"cells_cut":0,"cells_raw":0,"read":"whole","date_system":"1900"}

{"sheet":"Design the Regulator","index":0,"n_rows":109,"n_cols":16,"rows_kept":109,"cut":false,"hidden":false,"merged":[[76,5,76,7],[2,13,2,14],[0,0,0,15],[87,5,87,6],[35,10,36,15]]}
["                      LM(2)5149/-Q1 Synchronous Buck Controller Design Tool"]
[null,null,null,null,null,null,null,null,null,null,null,null,null,"http://www.ti.com/product/lm5175"]
["About",null,"xx",null,null,"= Input Box",null,null,null,null,null,null,null,"TERMS OF USE",null,"                "]
[]
["Step 1: Operating Specifications"]
[null,null,null,"Input Voltage – Min, VIN(min) ",24,"V"]
[null,null,null,"Input Voltage – Nom, VIN(nom)",48,"V"]
[null,null,null,"Input Voltage – Max, VIN(max)",70,"V"]
[null,null,null,"Output Voltage, VOUT ",5,"V"]
[null,null,null,"Full Load Output Current, IOUT ",16,"A"]
[null,null,null,"Switching Frequency, FSW",300,"kHz"]
[null,null,null,"Frequency Set Resistor, RRT ",{"$f":"'Variable Management'!C443","v":73.2},"kΩ"]
[null,null,null,"Ambient Operating Temperature, TA",25,"°C"]
[]
["Step 2: Current Sense Resistor"]
[null,null,null,"Required IOCP Setpoint at VIN(nom)",22,"A"]
[null,null,null,"Recommended Shunt Resistance",{"$f":"Rs_ideal*1000","v":2.3574962459871922},"mΩ"]
[null,null,null,"Shunt Resistance, RS",2,"mΩ"]
[null,null,null,"Min Inductor Sat Current, ILO(SAT)",{"$f":"'Variable Management'!B95","v":30},"A"]
[null,null,null,"Max Power Loss in the Shunt",{"$f":"'Variable Management'!B105","v":1.4590710087198089},"W"]
[null,null,null,"VIN(min)",{"$f":"'Variable Management'!B97","v":26.952548117661301},"A"]
[null,null,"IOUT(typ) at OCP Inception:","VIN(nom)",{"$f":"'Variable Management'!B98","v":26.549270183514022},"A"]
[null,null,null,"VIN(max)",{"$f":"'Variable Management'!B99","v":26.422414688350262},"A"]
[]
["Step 3: Buck Inductance"]
[null,null,null,"Inductance for Ideal Slope Comp",{"$f":"Lopt*1000000","v":1.3888888888888891},"µH"]
[null,null,null,"Inductance for 35% Ripple Current",{"$f":"'Variable Management'!B41*1000000","v":2.6661706349206349},"µH"]
[null,null,null,"Inductance, LO ",2.2000000000000002,"µH"]
[null,null,null,"Inductor DCR ",3.5,"mΩ"]
[null,null,null,"DIL as a % at VIN(nom)",{"$f":"'Variable Management'!B68*100","v":43.134122706074734},"%"]
[null,null,null,"Estimate Core Loss at VIN(nom)",0.2,"W"]
[]
["Step 4: Output Capacitors"]
[null,null,null,"Output Voltage Ripple Spec",100,"mVPK-PK"]
[null,null,null,"Minimum Output Capacitance",{"$f":"'Variable Management'!B121","v":28.756081804049821},"µF"]
[null,null,null,"Output Capacitance (derated), COUT ",200,"µF",null,null,null,null,{"$f":"CHOOSE(SCH_MODE, \"\", \"** For Single-Output Operation in 2-Phase Mode, tie MODE to VDDA and use FB1 to set VOUT **\", \"** For Single-Output Operation in 3-Phase Mode, tie both MODE pins to VDDA. Use FB1 of master IC to set VOUT. Connect FB2 of master IC to AGND. Connect FB2 of slave IC to VDDA to configure it as a slave **\", \"** For Single-Output Operation in 4-Phase Mode, tie both MODE pins to VDDA. Use FB1 of master IC to set VOUT. Connect FB2 of master IC to AGND. Connect FB2 of slave IC to VDDA to configure it as a slave **\")","v":""}]
[null,null,null,"Maximum Permitted ESR",{"$f":"'Variable Management'!B125","v":14.339135046639184},"mΩ"]
[null,null,null,"Output Capacitor ESR",1,"mΩ",null,null,null,null,{"$f":"CHOOSE(SCH_MODE,  \"\", \"** Tie VCCX to GND if not used **\", \"** Slave controller (CNTRL2) not shown **\",\"** Slave controller (CNTRL2) not shown **\")","v":""},null,null,null,null,{"$f":"IF(SCH_MODE=1,  \"** Tie VCCX to GND if not used **\", \"\")","v":"** Tie VCCX to GND if not used **"}]
[null,null,null,"Resulting Output Voltage Ripple (max) ",{"$f":"'Variable Management'!B127*1000","v":15.948611389266551},"mVPK-PK",null,null,null,null,{"$f":"IF(OR(SCH_MODE=3, SCH_MODE=4),\"** Tie VCCX to GND if not used **\", \"\")","v":""}]
[null,null,null,"Output Capacitor RMS Current (max) ",{"$f":"'Variable Management'!B114","v":2.0655198427298282},"ARMS"]
[]
[{"$f":"CHOOSE(INFILTER_TYPE, \"Step 5: Input Capacitors\", \"Step 5: Input Capacitors & AEF (see EMI Filter Design)\", \"Step 5: Input Capacitors\")","v":"Step 5: Input Capacitors & AEF (see EMI Filter Design)"}]
[null,null,null,"Input Voltage Ripple Spec",400,"mVPK-PK"]
[null,null,null,"Minimum Input Capacitance",{"$f":"'Variable Management'!B148","v":21.99074074074074},"µF"]
[null,null,null,"Input Capacitance (derated), CIN ",30,"µF"]
[null,null,null,"Maximum Permitted ESR",{"$f":"'Variable Management'!B155","v":5.6065306853883587},"mΩ",null,null,null,null,null,null,null,null,null," "]
[null,null,null,"Input Capacitor ESR",1,"mΩ"]
[null,null,null,"Resulting Input Voltage Ripple (max)",{"$f":"'Variable Management'!B162*1000","v":315.74668941324143},"mVPK-PK"]
[null,null,null,"Input Capacitor RMS Current (max)",{"$f":"'Variable Management'!B138","v":6.5863567355736912},"ARMS"]
[null,null,null,"AEF Inductor",0.68,"µH"]
[{"$f":"\"Recommended Cinj = \"&'Standard Value Calculator'!S24&\"µF\"","v":"Recommended Cinj = 5.6µF"},null,null,"CINJ",0.47,"µF"]
[{"$f":"CHOOSE(OSC,\"Cdamp: DNP\",\"Recommended Caefdamp = \"&'Standard Value Calculator'!S25&\"µF\")","v":"Recommended Caefdamp = 2.7µF"},null,null,"CDAMP",0,"µF"]
[{"$f":"\"Recommended Raefdamp = \"&Rdamp_AEFstd&\"Ω\"","v":"Recommended Raefdamp = 41.2Ω"},null,null,"RDAMP",6.81,"Ω"]
[null,null,null,"Filter Attenuation at FSW",{"$f":"-'Variable Management'!B303","v":31.748500628322866},"dB"]
[null,null,null,"VIN Ripple Amplitude",{"$f":"VinRipple_dBuV","v":109.98677611394729},"dBµV"]
[null,null,null,"Conducted Emissions at FSW",{"$f":"'Variable Management'!B304","v":78.238275485624428},"dBµV"]
[]
["Step 6: Precision Enable, DRSS, FPWM/PFM"]
[]
[]
[null,null,null,"VIN UVLO Turn-on Threshold",22,"V"]
[null,null,null,"VIN UVLO Turn-off Threshold",20,"V"]
[null,null,null,"Upper Enable Resistor, RUV1",{"$f":"IF(UVLO_TYPE=1,'Variable Management'!B188,0)","v":200},"kΩ"]
[null,null,null,"Lower Enable Resistor, RUV2",{"$f":"IF(UVLO_TYPE=1,'Variable Management'!B189,\"DNP\")","v":9.5299999999999994},"kΩ"]
[null,null,null,"Configuration Resistor, RCNFG",{"$f":"IF(DRSS=1,41.2,29.4)","v":41.2},"kΩ"]
[null,null,null,{"$f":"IF(DEMB=1, \"* Tie PFM/SYNC to GND\", \"* Tie PFM/SYNC to VDDA\")","v":"* Tie PFM/SYNC to GND"}]
[]
["Step 7: Compensation Design"]
[null,null,null,"Load Pole Frequency",{"$f":"Fp_dominant","v":3209.6405680919383},"Hz"]
[null,null,null,"ESR Zero Frequency",{"$f":"Fesr/1000","v":795.77471636878192},"kHz"]
[null,null,null,"Desired Crossover Frequency",40,{"$f":"\"     kHz \"","v":"     kHz "}]
[null,null,null,"Error Amp Pole Frequency",{"$f":"Fp1_u","v":0.36567466719551112},"Hz"]
[null,null,null,{"$f":"CHOOSE(VOUT_setting, \"Upper Feedback Resistor\",\"\",\"\",\"\")","v":""},100,"kΩ"]
[null,null,null,{"$f":"CHOOSE(VOUT_setting, \"Lower Feedback Resistor\", \"* Pullup FB to VDDA with \"&'Variable Management'!D419,\"* Tie FB to VDDA\",\"* Pullup FB to VDDA with \"&'Variable Management'!D419)","v":"* Pullup FB to VDDA with 24.9kΩ"},{"$f":"IF(Vout=Vref,\"OPEN\",Rfb2_u/1000)","v":471},{"$f":"IF(Vout=Vref,\"\",\"kΩ\")","v":"kΩ"}]
[]
["Compensation Components"]
[null,"Calculated /","Std Values",{"$f":"C77","v":"Std Values"},null,"Actual P/Z Frequencies"]
["RCOMP",{"$f":"Rcea1/1000","v":5.3131858498021876},{"$f":"'Standard Value Calculator'!S32","v":5.36},{"$f":"C78","v":5.36},"kΩ",{"$f":"Fp1_u","v":0.36567466719551112},"Hz   (FPEA)"]
["CCOMP",{"$f":"Cc1ea*1000000000","v":7.4886775925446774},{"$f":"'Standard Value Calculator'!S33","v":6.8},{"$f":"C79","v":6.8},"nF",{"$f":"Fz1_u/1000","v":4.3666303575986714},"kHz (FZCOMP)"]
["CHF",{"$f":"IF(Cc2ea<0, \"N/A\", Cc2ea*1000000000000)","v":167.86708047977348},{"$f":"'Standard Value Calculator'!S34","v":180},{"$f":"C80","v":180},"pF",{"$f":"Fp2_u/1000","v":140.17347801773082},"kHz (FPCOMP)"]
[]
[]
["Efficiency / Power Loss Analyzer"]
[]
["Step 8: Efficiency"]
[null,null,null,null,null,"Power MOSFETs","(Q1, Q2) "]
[null,null,null,null,"'852","'824"]
[null,null,null,null,"High-side","  Low-side"]
[null,null,null,"On-State Resistance, RDS(on) ",12,4.0999999999999996,"mΩ"]
[null,null,null,"Total Gate Charge, QG ",8,25,"nC"]
[null,null,null,"Gate-Drain Charge, QGD ",2.9,9,"nC"]
[null,null,null,"Gate-Source Charge, QGS ",3.1,8.6999999999999993,"nC"]
[null,null,null,"Output Charge, QOSS ",null,30,"nC"]
[null,null,null,"Output Capacitance, COSS ",116,366,"pF"]
[null,null,null,"Gate Resistance, RG ",1.2,1.2,"Ω"]
[null,null,null,"Transconductance, gFS ",55,178,"S"]
[null,null,null,"Gate-Source Threshold Voltage, VTH ",3.1,3,"V"]
[null,null,null,"Body Diode Forward Voltage, VBD ",0.7,0.7,"V"]
[null,null,null,"Body Diode Rev Recovery Charge, QRR ",null,59,"nC"]
[null,null,null,"Thermal Resistance, θJA ",42,40.700000000000003,"°C/W"]
[]
["External Schottky Diode (if applicable)"]
[null,null,null,"Schottky Fwd Voltage, VFWDsch ",null,0,"V"]
[null,null,null,"Schottky Rev Recovery Charge, QRRsch ",null,0,"nC"]
[]
["Step 9: IC Power Loss"]
[null,null,null,"IC Power Dissipation",{"$f":"'Variable Management'!B362","v":4.9499999999999995E-2},"W"]
[null,null,null,"IC Junction Temperature (estimate)",{"$f":"'Variable Management'!B364","v":26.687950000000001},"°C"]
[null,null,null,{"$f":"CHOOSE(Ext_VCC, \"\", \"* Tie VCCX to GND\")","v":""}]

{"sheet":"BOM & Schematic","index":1,"n_rows":69,"n_cols":10,"rows_kept":69,"cut":false,"hidden":false,"merged":[[47,3,47,5],[45,3,45,5],[60,3,60,6],[61,3,61,6],[59,3,59,6],[52,3,52,6],[51,3,51,6],[57,3,57,6],[41,3,41,6],[58,3,58,6],[55,3,55,6],[56,3,56,6],[50,3,50,6],[54,3,54,6],[53,3,53,6],[49,3,49,6],[42,3,42,5],[43,3,43,5],[46,3,46,5],[48,3,48,5],[44,3,44,5],[62,0,63,0],[62,9,63,9],[62,3,63,6],[62,2,63,2],[62,1,63,1],[62,7,63,7],[62,8,63,8]]}
[]
[]
[]
[]
[]
[]
[]
[]
[]
[]
[]
[]
[]
[]
[]
[]
[]
[]
[]
[]
[]
[]
[]
[]
[]
[]
[]
[]
[]
[]
[]
[]
[]
[]
[]
["   ** Tie PFM/SYNC to VDDA for PFM, to GND for FPWM **"]
["   ** Tie VCCX to GND if not used **",null,null,null,null,null,null,null,{"$f":"IF(OR(SCH_MODE=3, SCH_MODE=4),\"** Tie VCCX to GND if not used **\", \"\")","v":""}]
[]
[]
[{"$f":"\"VIN = \"&VIN_min&\"V to \"&VIN_max&\"V, VOUT = \"& Vout &\"V, IOUT = \" &Iout & \"A,  Fsw = \" & Fsw/1000 &\"kHz, Current Limit = \"&ROUNDUP(Ilimit_DC,0)&\"A\"","v":"VIN = 24V to 70V, VOUT = 5V, IOUT = 16A,  Fsw = 300kHz, Current Limit = 22A"}]
["High-Efficiency Synchronous Buck Regulator BOM"]
["Count","Ref Des","Value","Description",null,null,null,"Size","Part Number","MFR"]
[1,"CBOOT",0.1,{"$f":"C43","v":0.1},null,null,null,"0603","Std","Std"]
[1,"CCOMP",{"$f":"'Design the Regulator'!D79","v":6.8},6.8,null,null,null,"0603","Std","Std"]
[1,"CHF",{"$f":"'Design the Regulator'!D80","v":180},180,null,null,null,"0603","Std","Std"]
[{"$f":"ROUNDUP('Design the Regulator'!E45/10,0)","v":3},"CIN",10,{"$f":"C46","v":10},null,null,null,1210,"Std","Std"]
[{"$f":"ROUNDUP('Design the Regulator'!E36/47,0)","v":5},"COUT",47,{"$f":"C47","v":47},null,null,null,1210,"Std","Std"]
[2,"CVCC, CVCCX",2.2000000000000002,2.2000000000000002,null,null,null,"0603","Std","Std"]
[1,"CVDDA",0.47,0.47,null,null,null,"0603","Std","Std"]
[1,"LO",{"$f":"'Design the Regulator'!E28","v":2.2000000000000002},{"$f":"\"Inductor, \"&Lf*1000000&\"µH, \"&Rdcr*1000&\"mΩ, >\"&ROUNDUP(Ilimit_DC*1.1,0)&\"A\"","v":"Inductor, 2.2µH, 3.5mΩ, >25A"},null,null,null,"-","-","Various"]
[1,"Q1","See description",{"$f":"'Design the Regulator'!E89","v":12},null,null,null,"Std",{"$f":"'Design the Regulator'!E87","v":"'852"},"-"]
[1,"Q2","See description",{"$f":"'Design the Regulator'!F89","v":4.0999999999999996},null,null,null,"Std",{"$f":"'Design the Regulator'!F87","v":"'824"},"-"]
[1,"RCOMP",{"$f":"'Design the Regulator'!D78","v":5.36},{"$f":"C53","v":5.36},null,null,null,"0603","Std","Std"]
[1,"RS",{"$f":"Rs*1000","v":2},2,null,null,null,"0508","Std","Std"]
[1,"RRT",{"$f":"'Design the Regulator'!E12","v":73.2},73.2,null,null,null,"0603","Std","Std"]
[1,"RFB1",{"$f":"'Design the Regulator'!E73","v":100},100,null,null,null,"0603","Std","Std"]
[1,"RFB2",{"$f":"'Design the Regulator'!E74","v":471},471,null,null,null,"0603","Std","Std"]
[1,"RCNFG",{"$f":"'Design the Regulator'!E65","v":41.2},{"$f":"C58","v":41.2},null,null,null,"0603","Std","Std"]
[1,"RPG",100,100,null,null,null,"0603","Std","Std"]
[1,"RCS",100,100,null,null,null,"0603","Std","Std"]
[1,"RUV1",{"$f":"'Design the Regulator'!E63","v":200},200,null,null,null,"0603","Std","Std"]
[1,"RVIN",2.2000000000000002,2.2000000000000002,null,null,null,"0603","Std","Std"]
[1,"U1",{"$f":"'Variable Management'!Q29","v":"LM5149"},{"$f":"CHOOSE(VARIANT, \"IC, LM5149, Synchronous Buck PWM Controller With AEF, 3.5V–80V Input\", \"IC, LM5149-Q1, Synchronous Buck PWM Controller With AEF, 3.5V–80V Input\", \"IC, LM25149, Synchronous Buck PWM Controller With AEF, 3.5V–42V Input\",  \"IC, LM25149-Q1 Synchronous Buck PWM Controller With AEF, 3.5V–42V Input\")","v":"IC, LM5149, Synchronous Buck PWM Controller With AEF, 3.5V–80V Input"},null,null,null,"VQFN-24",{"$f":"CHOOSE(VARIANT, \"LM5149RGYR\", \"LM5149QRGYRQ1\", \"LM25149RGYR\", \"LM25149QRGYRQ1\")","v":"LM5149RGYR"},"TI"]
[]
[]
["NOTES:"]
["** Choose logic-level power MOSFETs with RDS(on) rated at VGS = 4.5V **"]
["** Inductor saturation current should be higher than the peak inductor current at the OCP setpoint for all input voltages and operating temperatures **"]
["** Effective input and output capacitances should be appropriately derated for applied voltage and temperature, particularly with ceramics **"]

{"sheet":"EMI Filter Design","index":2,"n_rows":11,"n_cols":16,"rows_kept":11,"cut":false,"hidden":false,"merged":[[1,8,1,15],[1,0,1,7]]}
[]
["AEF",null,null,null,null,null,null,null,"Passive"]
[null,"Design tab – LAEF",{"$f":"'Design the Regulator'!E50 & \"µH\"","v":"0.68µH"},null,null,"LAEF",1,"µH",null,"Recommended range for LIN","0.1-10","µH",null,"Chosen LIN",0.68,"µH"]
[null,"Design tab – CINJ",{"$f":"'Design the Regulator'!E51 & \"µF\"","v":"0.47µF"},null,null,"CINJ",1,"µF",null,"Recommended range for CF","0.1-10","µF",null,"Chosen CF",0.47,"µF"]
[null,"Design tab – CDAMP",{"$f":"'Design the Regulator'!E52 & \"µF\"","v":"0µF"},null,null,"CDAMP",1,"µF",null,"Recommended range for CD","1-10","µF",null,"Chosen CD",10,"µF"]
[null,"Design tab – RDAMP",{"$f":"'Design the Regulator'!E53 & \"Ω\"","v":"6.81Ω"},null,null,"RDAMP",10,"Ω",null,"Recommended value for RD",{"$f":"Rdamp_PassiveStd","v":3.4800000000000005E-2},"Ω",null,"Chosen RD",0.35,"Ω"]
[]
[null,null,"VIN Ripple at FSW",null,null,{"$f":"VinRipple_dBuV","v":109.98677611394729},"dBµV","VIN Ripple"]
[]
[null,null,null,"AEF Attenuation at FSW",{"$f":"-'Input Filter Calculations'!AM97","v":25.671937963299285},"dB",null,null,null,null,null,"Passive Attenuation at FSW",{"$f":"-'Input Filter Calculations'!AA97","v":11.23066551897832},"dB"]
[null,null,null,"AEF EMI at FSW",{"$f":"VinRipple_dBuV-E10","v":84.314838150648001},"dBµV",null,null,null,null,null,"Passive EMI at FSW",{"$f":"VinRipple_dBuV-M10","v":98.756110594968959},"dBµV"]

{"sheet":"EVM","index":3,"n_rows":6,"n_cols":2,"rows_kept":6,"cut":false,"hidden":false,"merged":[[0,0,0,16]]}
[" LM(2)5149/-Q1 Buck Controller Design Tool"]
[]
[]
[]
[]
[null,"LM25149-Q1EVM-2100 PCB Layout"]

{"sheet":"Variable Management","index":4,"n_rows":451,"n_cols":27,"rows_kept":451,"cut":false,"hidden":true,"merged":[[4,4,4,7],[0,0,0,8]]}
["EXCEL Variables Names/Calculations"]
[null,"Input from user ="]
[null,"Output ="]
[null,"Constant"]
["Variable Name","Value","STD Units",null,"Notes",null,null,null,"Iteration"]
["Step 1: Operational Specs"]
["VIN_min",{"$f":"'Design the Regulator'!E6","v":24},"V","Minimum input voltage",null,null,null,null,1]
["VIN_nom",{"$f":"'Design the Regulator'!E7","v":48},"V","Nominal input voltage",null,null,null,null,null,null,{"$f":"CHOOSE(SCH_MODE, \"Efficiency vs. IOUT (Ch1)\", \"Efficiency vs. IOUT - 2 Ph\", \"Efficiency vs. IOUT - 3 Ph\", \"Efficiency vs. IOUT - 4 Ph\")","v":"Efficiency vs. IOUT (Ch1)"},1,null,"DRSS Enabled",1,null,null,null,null,"Dual  Outputs",1,null,"FPWM",1,null,{"$f":"CHOOSE(SCH_MODE, \"Bode Plot (Ch1)\", \"Bode Plot - 2 Ph\", \"Bode Plot - 3 Ph\", \"Bode Plot - 4 Ph\")","v":"Bode Plot (Ch1)"},1]
["VIN_max",{"$f":"'Design the Regulator'!E8","v":70},"V","Maximum input voltage",null,null,null,null,null,null,{"$f":"IF(MODE=1, \"Efficiency vs. IOUT (Ch2)\", \"N/A - Do Not Use\")","v":"Efficiency vs. IOUT (Ch2)"},2,null,"DRSS Disabled",2,null,null,null,null,"Single Output – 2  Phases",2,null,"PFM",2,null,{"$f":"IF(MODE=1, \"AEF Gain\", \"N/A - Do Not Use\")","v":"AEF Gain"},2]
[null,null,null,null,null,null,null,null,null,null,"PLOT_TYPE",1,null,"DRSS Yes/No",1,"1 = Yes, 2 = No",null,null,null,"Single Output – 3  Phases",3,null,"FPWM/PFM",1,null,"BODE_PLOT_TYPE",1]
["Vout",{"$f":"'Design the Regulator'!E9","v":5},"V","Output voltage - channel 1",null,null,null,null,null,null,null,null,null,null,null,null,null,null,null,"Single Output – 4  Phases",4]
["Iout",{"$f":"'Design the Regulator'!E10","v":16},"A","Output current - channel 1",null,null,null,null,1,null,null,null,null,null,null,null,null,null,null,"Single/Dual Yes/No",1]
[null,null,null,null,null,null,null,null,1,null,"Adjustable",1,null,"3.3V",1,null,null,null,null,"MODE (Single/Dual), DUAL = 1, SINGLE = 2",{"$f":"IF(U12=1, 1, 2)","v":1},null,"VCCX Connected",1]
["Rout",{"$f":"Vout/Iout","v":0.3125},"W","Load resistance - Channel 1",null,null,null,null,null,null,"5V",2,null,"5V",2,null,null,null,null,"SINGLE OUTPUT (1 = YES)",{"$f":"IF(U12=1, 2, 1)","v":2},null,"No External VCC",2]
[null,null,null,null,null,null,null,null,null,null,"3.3V",3,null,"Adjustable",3,null,null,null,null,"Number of Phases",{"$f":"SCH_MODE","v":1},null,"Ext_VCC",1]
["Pout",{"$f":"Vout*Iout","v":80},"W","Output power",null,null,null,null,null,null,"12V",4,null,"Ch2 Output Setting",{"$f":"IF(Vout2=3.3, 1, IF(Vout2=5, 2, 3))","v":3}]
[null,null,null,null,null,null,null,null,null,null,"Output Voltage Setting",{"$f":"IF(Vout=3.3, 3, IF(Vout=5, 2,  IF(Vout=12,4,1)))","v":2}]
["Efficiency",0.9,null,"Estimate of efficiency"]
["Pin",{"$f":"Pout/Efficiency","v":88.888888888888886},"W","Calculate input power assuming finite efficiency",null,null,null,null,null,null,null,null,null,null,null,null,null,null,null,null,null,null,"2.2 MHz Fsw Setting",1,null,"Internal Compensation",1]
[null,null,null,null,null,null,null,null,null,null,null,null,null,null,null,null,null,null,null,null,null,null,"440 kHz Fsw Setting",2,null,"External Compensation",2]
["Iin_Vinmin",{"$f":"Pin/VIN_min","v":3.7037037037037037},"A",null,null,null,null,null,null,null,null,{"$f":"Vout","v":5},null,null,null,null,null,null,null,null,null,null,"OSC",{"$f":"IF(Fsw>1000000,1,2)","v":2},null,"COMP_TYPE",2]
["Iin_Vinnom",{"$f":"Pin/VIN_nom","v":1.8518518518518519},"A","Input currents at min, nom, max Vin",null,null,null,{"$f":"AND(OSC=1, OR(Fsw/1000>2530, Fsw/1000<1800))","v":false}]
["Iin_Vinmax",{"$f":"Pin/VIN_max","v":1.2698412698412698},"A",null,null,null,null,{"$f":"AND(OSC=2, OR(Fsw/1000>500, Fsw/1000<300))","v":false}]
[null,null,null,null,null,null,null,{"$f":"OR(H22,H23)","v":false}]
["OSC setting",{"$f":"CHOOSE(OSC, 2200, 440)","v":440},"kHz",null,null,null,null,null,null,null,"SetVout_IntComp_nAEF",1,null,null,null,null,"LM5149 (80V)",1,null,null,null,null,"No Input Filter",1,null,"UVLO Divider",1]
["Fsw",{"$f":"'Design the Regulator'!E11*1000","v":300000},"Hz","Nominal switching frequency - determines RT resistor (SYNCIN must be 80-120% of this)",null,null,null,null,null,null,"SetVout_IntComp_AEF",2,null,null,null,null,"LM5149-Q1 (80V)",2,null,null,null,null,"AEF Input Filter",2,null,"No UVLO Divider",2]
["RT resistor to AGND",{"$f":"((1000000000/Fsw)-53)/45+0.1","v":72.996296296296293},"kΩ",null,null,null,null,null,null,null,"SetVout_ExtComp_nAEF",3,null,null,null,null,"LM25149 (42V)",3,null,null,null,null,"Passive LC Filter",3,null,"UVLO_TYPE",1]
[null,null,"kΩ",null,null,null,null,null,1,null,"SetVout_ExtComp_AEF",4,null,null,null,null,"LM25149-Q1 (42V)",4,null,null,null,null,"INFILTER_TYPE",2]
["Tsw",{"$f":"1/Fsw","v":3.3333333333333333E-6},"sec","Switching period",null,null,null,null,null,null,"AdjVout_IntComp_nAEF",5,null,null,null,"VARIANT",{"$f":"CHOOSE(VARIANT, \"LM5149\", \"LM5149-Q1\", \"LM25149\", \"LM25149-Q1\")","v":"LM5149"},1]
["Vref",0.8,"V","Reference voltage",null,null,null,null,null,null,"AdjVout_IntComp_AEF",6,null,null,null,"VIN-MAX",{"$f":"CHOOSE(VARIANT, 80, 80, 42, 42)","v":80},"V"]
["Rt",{"$f":"'Standard Value Calculator'!S12/1000","v":73.2},"kΩ","Frequency set resistor",null,{"$f":"IF(OR((Fsw=440000),(Fsw=2200000)),\"N/A\",Rfadj/1000)","v":7.3200000000000001E-2},null,null,null,null,"AdjVout_ExtComp_nAEF",7,null,null,null,"VOUT-MAX",{"$f":"CHOOSE(VARIANT, 60, 60, 36, 36)","v":60},"V"]
[null,null,null,null,null,null,null,null,null,null,"AdjVout_ExtComp_AEF",8]
["Step 2: Buck Inductor","Channel 1",null,null,null,null,null,null,null,null,"Schematic setting",{"$f":"(IF(OR(Vout=3.3,Vout=5,Vout=12),CHOOSE(COMP_TYPE,IF(INFILTER_TYPE=1,1,2),IF(INFILTER_TYPE=1,3,4)),CHOOSE(COMP_TYPE,IF(INFILTER_TYPE=1,5,6),IF(INFILTER_TYPE=1,7,8))))","v":4}]
["Don1",{"$f":"Vout/VIN_nom","v":0.10416666666666667},null,null,null,"Ideal Duty Cycle at VIN(nom)"]
["Doff1",{"$f":"1-34:34","v":0.89583333333333337},null,null,null,"Ideal 1- Duty Cycle at VIN(nom)"]
[]
["D_Vinmin",{"$f":"Vout/VIN_min","v":0.20833333333333334}]
["D_Vinnom",{"$f":"Vout/VIN_nom","v":0.10416666666666667}]
["D_Vinmax",{"$f":"Vout/VIN_max","v":7.1428571428571425E-2}]
[]
["L_Vinnom",{"$f":"(VIN_nom-Vout)*D1_Vinnom/(Fsw*(Iout/Number_of_Phases)*0.35)","v":2.666170634920635E-6},"H",null,null,"Calculated inductance for 35% ripple at VIN(nom)"]
["L_slopecomp",{"$f":"1000*Vout*Rs/24/Fsw","v":1.388888888888889E-6},"H",null,null,"Calculated inductance based on one times inductor downslope"]
[]
["Lopt",{"$f":"B42","v":1.388888888888889E-6},"H",null,null,"Slope comp"]
[]
["Lo",{"$f":"'Design the Regulator'!E28/1000000","v":2.2000000000000001E-6},"H",null,null,"Chosen inductance"]
["Rdcr",{"$f":"'Design the Regulator'!E29/1000","v":3.5000000000000001E-3},"W",null,null,"Chosen inductor DCR"]
[]
["Don2",{"$f":"(Vout+Iout*(Rdcr+Rs))/(Vin+Iout*Rs)","v":0.10592938041305797}]
["Doff2",{"$f":"1-_Don2","v":0.89407061958694201}]
[]
["D_Vinmin_2",{"$f":"CHOOSE(MODE, (Vout+Iout*(Rdcr+Rs))/(VIN_min+Iout*Rs), (Vout+Iout/Number_of_Phases*(Rdcr+Rs))/(VIN_min+Iout/Number_of_Phases*Rs))","v":0.21171770972037285},null,null,null,"Duty cycles adjusted for DCR/shunt voltage drops"]
["D_Vinnom_2",{"$f":"CHOOSE(MODE, (Vout+Iout*(Rdcr+Rs))/(VIN_nom+Iout*Rs), (Vout+Iout/Number_of_Phases*(Rdcr+Rs))/(VIN_nom+Iout/Number_of_Phases*Rs))","v":0.10592938041305797},null,null,null,"need to include RDS(on) later"]
["D_Vinmax_2",{"$f":"CHOOSE(MODE, (Vout+Iout*(Rdcr+Rs))/(VIN_max+Iout*Rs), (Vout+Iout/Number_of_Phases*(Rdcr+Rs))/(VIN_max+Iout/Number_of_Phases*Rs))","v":7.2652501713502404E-2}]
[]
["Iripple_Vinmin",{"$f":"(VIN_min-Vout)*D1_Vinmin_2/(Fsw*Lf)","v":6.0949037646773991},"A"]
["Iripple_Vinnom",{"$f":"(VIN_nom-Vout)*D1_Vinnom_2/(Fsw*Lf)","v":6.9014596329719575},"A"]
["Iripple_Vinmax",{"$f":"(VIN_max-Vout)*D1_Vinmax_2/(Fsw*Lf)","v":7.1551706232994787},"A"]
[]
["Ishunt_rms_Vinmin",{"$f":"SQRT((Iout/Number_of_Phases)^2+(Iripple_Vinmin^2)/12)","v":16.096448500369782},"A"]
["Ishunt_rms_Vinnom",{"$f":"SQRT((Iout/Number_of_Phases)^2+(Iripple_Vinnom^2)/12)","v":16.123559742050194},"A"]
["Ishunt_rms_Vinmax",{"$f":"SQRT((Iout/Number_of_Phases)^2+(Iripple_Vinmax^2)/12)","v":16.132773234032353},"A"]
["Max shunt power loss at full load",{"$f":"B61^2*Rs","v":0.51993835751092343},"W",null,null,"Note this is power loss at full load - not loss near OCP!"]
[]
["Max inductor ripple current",{"$f":"MAX(B56:B58)","v":7.1551706232994787},"A",null,null,"Ripple current at Vin(max)"]
[]
[null,{"$f":"B56/(Iout/Number_of_Phases)","v":0.38093148529233745}]
["% ripple current",{"$f":"B57/(Iout/Number_of_Phases)","v":0.43134122706074735}]
[null,{"$f":"B58/(Iout/Number_of_Phases)","v":0.44719816395621742}]
[]
["Inductor copper temerature",100,"°C"]
["DCR at hot",{"$f":"Rdcr*(1+0.0039*(B71-25))","v":4.52375E-3},"W"]
[]
[]
["Step 3: Sense Resistors, Slope Comp, Current Limit"]
[]
["Ilimit_DC",{"$f":"'Design the Regulator'!E16","v":22},"A",null,null,"Chosen OCP level - based on output current"]
[]
["Ilimit_inductor_Vinmin",{"$f":"CHOOSE(MODE, Ilimit_DC+Iripple_Vinmin/2, Ilimit_DC/Number_of_Phases+Iripple_Vinmin/2)","v":25.047451882338699},"A",null,null,"Peak inductor current at current limit inception"]
["Ilimit_inductor_Vinnom",{"$f":"CHOOSE(MODE, Ilimit_DC+Iripple_Vinnom/2, Ilimit_DC/Number_of_Phases+Iripple_Vinnom/2)","v":25.450729816485978},"A"]
["Ilimit_inductor_Vinmax",{"$f":"CHOOSE(MODE, Ilimit_DC+Iripple_Vinmax/2, Ilimit_DC/Number_of_Phases+Iripple_Vinmax/2)","v":25.577585311649738},"A"]
[]
[]
["CS threshold_min",5.1999999999999998E-2,"V"]
["CS threshold",0.06,"V"]
["CS threshold_max",6.8000000000000005E-2,"V"]
[]
["Shunt required to get OCP at VIN(min)",{"$f":"Buck_CS_threshold/B79","v":2.3954532493705204E-3},"W"]
["Shunt required to get OCP at VIN(nom)",{"$f":"Buck_CS_threshold/B80","v":2.3574962459871921E-3},"W"]
["Shunt required to get OCP at VIN(max)",{"$f":"Buck_CS_threshold/B81","v":2.3458039243709214E-3},"W"]
[]
["Rs_ideal",{"$f":"B89","v":2.3574962459871921E-3},"W",null,null,"Ideal Rs for the required OCP -- based on 73mV CL threshold"]
["Rs",{"$f":"'Design the Regulator'!E18/1000","v":2E-3},"W",null,null,"Selected (starndard value) current limit sense resistor"]
[]
["Current limit - peak",{"$f":"Buck_CS_threshold/Rs","v":30},"A",null,null,"Peak inductor current limit = min sat current"]
[]
["Iout_OCP_Vinmin",{"$f":"Number_of_Phases*(Buck_CS_threshold/Rs-Iripple_Vinmin/2)","v":26.952548117661301},"A",null,null,"Current limit setpoints (i.e. IOUT) after standard components are selected"]
["Iout_OCP_Vinnom",{"$f":"Number_of_Phases*(Buck_CS_threshold/Rs-Iripple_Vinnom/2)","v":26.549270183514022},"A"]
["Iout_OCP_Vinmax",{"$f":"Number_of_Phases*(Buck_CS_threshold/Rs-Iripple_Vinmax/2)","v":26.422414688350262},"A"]
[]
["Irms_OCP_Vinmin",{"$f":"SQRT((Iout_OCP_Vinmin/Number_of_Phases)^2+(Iripple_Vinmin^2)/12)","v":27.009914926928303},"A"]
["Irms_OCP_Vinnom",{"$f":"SQRT((Iout_OCP_Vinnom/Number_of_Phases)^2+(Iripple_Vinnom^2)/12)","v":26.623916429268789},"A"]
["Irms_OCP_Vinmax",{"$f":"SQRT((Iout_OCP_Vinmax/Number_of_Phases)^2+(Iripple_Vinmax^2)/12)","v":26.503025679794717},"A"]
[]
["Pshunt_Vinmin",{"$f":"B101^2*Rs","v":1.4590710087198089},"W",null,null,"Max power dissipations in shunt"]
["Pshunt_Vinnom",{"$f":"B102^2*Rs","v":1.4176658520653771},"W"]
["Pshunt_Vinmax",{"$f":"B103^2*Rs","v":1.4048207403677166},"W"]
[]
[]
["Step 4: Output Capacitor"]
["Icoutrms_VINmin",{"$f":"Iripple_Vinmin/SQRT(12)","v":1.75944716461068},"A",null,null,"Output Cap RMS current"]
["Icoutrms_VINnom",{"$f":"Iripple_Vinnom/SQRT(12)","v":1.9922797884488479},"A"]
["Icoutrms_VINmax",{"$f":"Iripple_Vinmax/SQRT(12)","v":2.0655198427298282},"A"]
["Max Cout rms current",{"$f":"MAX(B111:B113)","v":2.0655198427298282},"A"]
[]
["Vripple1",{"$f":"'Design the Regulator'!E34/1000","v":0.1},"V",null,null,"Output voltage ripple spec(pk-pk)"]
[]
["Output Ripple Spec (pk-pk)",{"$f":"Vo1_ripple*1000","v":100},"mV",null,null,"Vout ripple spec at Vin(nom)"]
[]
["Coutmin",{"$f":"Iripple_Vinnom/(Fsw*8*Vo1_ripple)","v":2.8756081804049822E-5},"F",null,null,"Minimum output capacitnace",null,{"$f":"Vo2_ripple","v":0},1]
["Reported Coutmin",{"$f":"IF(Cout_min*1000000<2, 2.2,Cout_min*1000000)","v":28.756081804049821},"uF"]
["Cout",{"$f":"'Design the Regulator'!E36/1000000","v":2.0000000000000001E-4},"F",null,null,"Chosen output capacitance",null,null,1]
["Resrmax",{"$f":"SQRT((Vo1_ripple/Iripple_Vinnom)^2-(1/(Fsw*Cout*8))^2)","v":1.4339135046639183E-2},"W",null,null,"Max ESR before ripple exceeds Vripple1",null,null,1]
[]
["Reported Cout ESR max",{"$f":"IF(OR(CoutEsrMax>0.3, CoutEsrMax<0, (ISERROR(CoutEsrMax))), \"N/A\", CoutEsrMax*1000)","v":14.339135046639184},"mΩ"]
["CoutEsr",{"$f":"'Design the Regulator'!E38/1000","v":1E-3},"W",null,null,"Chosen ESR",null,null,1,null,{"$f":"ISERROR(CoutEsrMax)","v":false},{"$f":"ISERROR(B125)","v":false}]
["Vripple",{"$f":"Iripple_Vinnom*SQRT(Cout_ESR^2+(1/(8*Fsw*Cout))^2)","v":1.5948611389266551E-2},"Vp-p",null,null,null,null,null,null,null,null,{"$f":"OR(CoutEsrMax>0.3,CoutEsrMax<0)","v":false}]
[null,null,null,null,null,null,null,null,null,null,{"$f":"OR(TRUE, FALSE, TRUE)","v":true}]
["Step 5: Input Capacitor"]
[null,null,null,null,null,null,null,null,null,null,"Two channels operating at full load"]
["Icinrms_VINmin",{"$f":"SQRT(D1_Vinmin_2*(Iout^2*(1-D1_Vinmin_2)+Iripple_Vinmin^2/12))","v":6.5863567355736912},"A",{"$f":"D1_Vinmax","v":7.1428571428571425E-2},null,"Calculate input cap rms current with one output unloaded",null,null,null,null,{"$f":"SQRT(Iout^2*D1_Vinmin*(1-D1_Vinmin)+Iout2^2*D2_Vinmin*(1-D2_Vinmin)-2*Iout*Iout2*D1_Vinmin*D2_Vinmin)","v":{"$error":"#NAME?"}},"A",{"$f":"SQRT(Iout^2*D1_Vinmin*(1-D1_Vinmin)+Iout2^2*D2_Vinmin*(1-D2_Vinmin)-2*Iout*Iout2*(0.5-D2_Vinmin*(1-D1_Vinmin)))","v":{"$error":"#NAME?"}},"A"]
["Icinrms_VINnom",{"$f":"SQRT(D1_Vinnom_2*(Iout^2*(1-D1_Vinnom_2)+Iripple_Vinnom^2/12))","v":4.9664664925453614},"A",{"$f":"D1_Vinmin","v":0.20833333333333334},null,null,null,null,null,null,{"$f":"SQRT(Iout^2*D1_Vinnom*(1-D1_Vinnom)+Iout2^2*D2_Vinnom*(1-D2_Vinnom)-2*Iout*Iout2*D1_Vinnom*D2_Vinnom)","v":{"$error":"#NAME?"}},"A"]
["Icinrms_VINmax",{"$f":"SQRT(D1_Vinmax_2*(Iout^2*(1-D1_Vinmax_2)+Iripple_Vinmax^2/12))","v":4.1901952503902766},"A",null,null,null,null,null,null,null,{"$f":"SQRT(Iout^2*D1_Vinmax*(1-D1_Vinmax)+Iout2^2*D2_Vinmax*(1-D2_Vinmax)-2*Iout*Iout2*D1_Vinmax*D2_Vinmax)","v":{"$error":"#NAME?"}},"A"]
["Icinrms - multiphase",{"$f":"Iout*SQRT((D1_Vinmin-F136/Number_of_Phases)*((F136+1)/Number_of_Phases-D1_Vinmin))","v":6.497862896539309},"A",null,null,null,null,null,null,null,{"$f":"MAX(K131:K133)","v":{"$error":"#NAME?"}},"A"]
["Max Cin rms current",{"$f":"MAX(B131:B133)","v":6.5863567355736912},"A",null,null,{"$f":"Number_of_Phases*D1_Vinnom","v":0.10416666666666667},"N*D"]
[null,null,null,null,null,{"$f":"FLOOR(Number_of_Phases*D1_Vinnom,1)","v":0},"floor(N*D)"]
["Icinrms - multiphase - max",{"$f":"Iout/2/Number_of_Phases","v":8},"A"]
["Final result",{"$f":"IF(D1_Vinmin<0.5, B135, B137)","v":6.5863567355736912},"A","…report this"]
[]
["Vinripple1",{"$f":"'Design the Regulator'!E43/1000","v":0.4},"Vp-p",null,null,"Input voltage ripple spec (pk-pk)"]
[]
["Cinmin_Vinmin",{"$f":"Iout/Number_of_Phases*D1_Vinmin*(1-D1_Vinmin)/(Vinripple1*Fsw)","v":2.199074074074074E-5},"F"]
["Cinmin_Vinnom",{"$f":"Iout/Number_of_Phases*D1_Vinnom*(1-D1_Vinnom)/(Vinripple1*Fsw)","v":1.2442129629629631E-5},"F"]
["Cinmin_Vinmax",{"$f":"Iout/Number_of_Phases*D1_Vinmax*(1-D1_Vinmax)/(Vinripple1*Fsw)","v":8.8435374149659865E-6},"F",null,null,"Calculate cap at Vinmax and 50% duty cycle (Vin = 2*Vout)"]
[]
["Cinmin_50%D",{"$f":"Iout*0.5*(1-0.5)/(Vinripple1*Fsw)","v":3.3333333333333335E-5},"F",null,null,"Buck 50% typically worst case"]
["Cinmin",{"$f":"IF(D1_Vinmin<0.5, B142,B146)","v":2.199074074074074E-5},"F",{"$f":"(VIN_min+VIN_max)/2","v":47}]
["Reported Cinmin",{"$f":"IF(Cinmin*1000000<2.2, 2.2,Cinmin*1000000)","v":21.99074074074074},"uF",{"$f":"2*Vout","v":10},null,"…report this"]
[]
["Cin",{"$f":"'Design the Regulator'!E45/1000000","v":3.0000000000000001E-5},"F",null,null,"Input capacitance"]
["CinEsrMax_Vinmin",{"$f":"-(Iout/Number_of_Phases*D1_Vinmin*(1-D1_Vinmin)/(Cin*Fsw)-Vinripple1)/(Iout/Number_of_Phases+Iripple_Vinmin/2)","v":5.6065306853883591E-3},"W"]
["CinEsrMax_Vinmax",{"$f":"-(Iout/Number_of_Phases*D1_Vinmax*(1-D1_Vinmax)/(Cin*Fsw)-Vinripple1)/(Iout/Number_of_Phases+Iripple_Vinmax/2)","v":1.4408629221122422E-2},"W"]
["CinEsrMax_50%D",{"$f":"-(Iout/Number_of_Phases*0.5*(1-0.5)/(Cin*Fsw)-Vinripple1)/(Iout/Number_of_Phases+Iripple_Vinmax/2)","v":-2.2701698772829514E-3},"W",null,null,"Calculate ESR at Vinmax and 50% duty cycle (Vin = 2*Vout)"]
["CinEsrMax",{"$f":"IF(VIN_min>2*Vout, B151,B153)","v":5.6065306853883591E-3},"W"]
["Reported Cin ESR max",{"$f":"IF(OR(CinEsrMax>0.3, CinEsrMax<0), \"N/A\",CinEsrMax*1000)","v":5.6065306853883587},"mΩ",null,null,"…report this"]
["RCinEsr",{"$f":"'Design the Regulator'!E47/1000","v":1E-3},"W",null,null,"Input capacitance series resistance (ESR)"]
[]
["Vinripple2_Vinmin",{"$f":"Iout/Number_of_Phases*D1_Vinmin_2*(1-D1_Vinmin_2)/(Cin*Fsw)+(Iout/Number_of_Phases +Iripple_Vinmin/2)*RCinEsr","v":0.31574668941324141},"Vp-p"]
["Vinripple2_Vinnom",{"$f":"Iout/Number_of_Phases*D1_Vinnom_2*(1-D1_Vinnom_2)/(Cin*Fsw)+(Iout/Number_of_Phases +Iripple_Vinnom/2)*RCinEsr","v":0.1878211240891324},"Vp-p"]
["Vinripple2_Vinmax",{"$f":"Iout/Number_of_Phases*D1_Vinmax_2*(1-D1_Vinmax_2)/(Cin*Fsw)+(Iout/Number_of_Phases +Iripple_Vinmax/2)*RCinEsr","v":0.13935379101524428},"Vp-p"]
["Vinripple2_50%D",{"$f":"Iout/Number_of_Phases*0.5*(1-0.5)/(Cin*Fsw)+(Iout/Number_of_Phases +Iripple_Vinmax/2)*RCinEsr","v":0.46402202975609413},"Vp-p",null,null,"Calculate ripple at Vinmax and 50% duty cycle (Vin = 2*Vout)"]
["Vinripple2",{"$f":"IF(D1_Vinmin<0.5, B158,B161)","v":0.31574668941324141},"Vp-p",null,null,"…report highest of these"]
[]
[null,{"$f":"Iout*D1_Vinmax_2*(1-D1_Vinmax_2)/(Cin*Fsw)","v":0.11977620570359454},"Vp-p"]
[]
["Step 6a: Soft Start"]
["Tss",{"$f":"'Design the Regulator'!E59/1000","v":0},"s","Soft-start time"]
["Iss",{"$f":"Cout*Vout/Tss","v":{"$error":"#DIV/0!"}},"A","Load cap current during soft start"]
["Css",{"$f":"0.000022*Tss/1.2","v":0},"F"]
["Css_u",{"$f":"'Standard Value Calculator'!B4","v":0},"F"]
[]
["Step 6b: Other Components - Dither, Hiccup, DEMB, MODE"]
["Tres",{"$f":"'Design the Regulator'!E62/1000","v":0.02},"s","Hiccup time"]
["Cres",{"$f":"0.00002*Tres/1.2","v":3.3333333333333335E-7},"F"]
["Cres_u",{"$f":"'Standard Value Calculator'!G4","v":3.3000000000000002E-7},"F"]
[]
["RPG1/2",100,"kΩ"]
["RFB1/2",null,"W",null,"Tie to VDDA or AGND for 3.3V/5V output, respectively. "]
["R_MODE",null,"W",null,"Tie to VDDA or AGND for Single/Dual operation, respectively. "]
["R_DEMB",null,"W",null,"Tie to VDDA or AGND for FPWM/DEM, respectively. "]
[]
["Enable Hysteresis Current",1.0000000000000001E-5,"A",null,"10 µA Hysteresis Current"]
["Turn ON Voltage",{"$f":"'Design the Regulator'!E61","v":22}]
["Hysteresis Voltage",{"$f":"'Design the Regulator'!E61-'Design the Regulator'!E62","v":2}]
[]
["Upper FB resistor",{"$f":"B184/B182","v":199999.99999999997},"W"]
["Lower FB resister",{"$f":"B186/(B183-1)","v":9523.8095238095229},"W"]
["Standard upper FB resistor",{"$f":"'Standard Value Calculator'!S40","v":200},"kΩ"]
["Standard lower FB resistor",{"$f":"'Standard Value Calculator'!S41","v":9.5299999999999994},"kΩ"]
[]
["Dither Modulation Frequency",{"$f":"'Design the Regulator'!E65*1000","v":41200},"Hz"]
["Cdither_calculated",{"$f":"10*10^-6/Fdither/0.12","v":2.0226537216828479E-9},"F"]
["Cdither_stdvalue",{"$f":"'Standard Value Calculator'!S21","v":2.1999999999999998E-9},"F"]
[]
[]
["Step 7: Compensation"]
["Pi",3.1415926500000002,null,"p"]
["CS Amp Gain",10]
["Ri",{"$f":"Rs*CSAmp_gain","v":0.02},"W",null,null,"Current Sense effective resistance = shunt resistor Rs * CS amp gain"]
["gm",{"$f":"IF(COMP_TYPE=1,0.00003,0.0012)","v":1.1999999999999999E-3},"S",null,null,"Error Amp Transconductance"]
[]
["Se_ext",{"$f":"B206/Ri*1000","v":3409090.9090909087},"A/s",null,null,"Slope Comp Slope - referred to inductor current"]
["Sn",{"$f":"(Vin-Vout)/Lf","v":19545454.545454543},"A/s",null,null,"On-time Slope"]
["Sf",{"$f":"Vout/Lf","v":2272727.2727272725},"A/s",null,null,"Off-time Slope"]
[]
["Se_int",{"$f":"Fsw*0.001*(5/22)","v":68.181818181818173},"mV/μs",null,null,"Slope Comp Slope - referred to IC"]
["Sn_int",{"$f":"Sn*Ri/1000","v":390.90909090909088},"mV/μs",null,null,"etc"]
["Sf_int",{"$f":"Sf*Ri/1000","v":45.454545454545446},"mV/μs",null,null,"etc"]
[]
["mc_buck",{"$f":"1+Se_ext/Sn","v":1.1744186046511629},null,null,null,"mc = 1 + Se/Sn for peak current-mode buck"]
["k_buck",{"$f":"mc_buck*(1-D1_Vinnom_2)","v":1.0500131695148971},null,null,null,"mc*(1-d)"]
[]
["mc",{"$f":"1+Se_ext/Sn","v":1.1744186046511629}]
["k",{"$f":"mc_buck*(1-D1_Vinnom_2)","v":1.0500131695148971}]
["Q",{"$f":"1/Pi/(k-0.5)","v":0.57873139079243685},null,null,null,"1/(Pi*(k-0.5))",null,"Q = 2/Pi = 0.636 gives ideal one-cycle damping"]
[]
["Error Amp (EA)"]
["GBW",6,"MHz",null,null,"EA gain-bandwidth product"]
["Cbw",{"$f":"gm/(2*Pi*GBW*1000000)","v":3.1830988654751269E-11},"F",null,null,"EA effective bandwidth limiting capacitance = gm/(2*Pi*GBW)"]
["RoEA",64000000,"W",null,null,"EA output resistance"]
["AEA",{"$f":"gm*RoEA","v":76800},"V/V",null,null,"EA DC gain = gm*RoEA"]
["Afb",{"$f":"IF(VOUT_setting=1,Vref/Vout,SQRT((1+(Fcross*zterm1)^2)/((1+Afbr-pterm4*(Fcross)^2)^2+(Fcross*pterm3)^2)))","v":0.15767527500119166},"V/V",null,null,"Feedback gain from Vout to FB"]
["Acs",{"$f":"1/Ri","v":50},null,null,null,"Acs = 1/Ri"]
["Am_buck",{"$f":"(Ro/Number_of_Phases)/Ri/((1+Ro/Number_of_Phases*(k-0.5)/(Fsw*Lf)))","v":12.396632885934837}]
["Am",{"$f":"(Ro*Number_of_Phases)/Ri/((1+Ro*Number_of_Phases*(k-0.5)/(Fsw*Lf)))","v":12.396632885934837},null,null,null,"Buck modulator gain"]
[]
["Scaling factor to calculate Rcomp - buck",{"$f":"2*Pi*Ri/gm","v":104.71975500000002},null,null,null,"2*Pi*Ri/gm -- scaling factor to calculate Rcomp given desired buck crossover frequency"]
["DC Gain is Adc = AEA*Afb*Am"]
[]
["Ro",{"$f":"Rout","v":0.3125},"W",null,null,"Output Resistance"]
[]
["Fp_load_buck",{"$f":"1/(2*Pi*Ro*Cout)+(k-0.5)/(2*Pi*Fsw*Lf*Cout/Number_of_Phases)","v":3209.6405680919383},"Hz",null,null,"Buck dominant pole frequency -- note slope comp influence"]
["Fp_dominant",{"$f":"Fload_u","v":3209.6405680919383},"Hz"]
[null,{"$f":"Cbw","v":3.1830988654751269E-11}]
["Fp_EA",{"$f":"1/(2*Pi*(RoEA+Rcea1_u)*Cc1ea_u)","v":0.36567466719551112},"Hz",null,null,"Error Amp LF pole -- related to amplifier ouptut resistance and comp cap"]
["Fp_HF",{"$f":"1/(2*Pi*Rcea1_u*(Cc2ea_u+Cbw))","v":140173.47801773081},"Hz",null,null,"Error Amp HF pole cancels zero related to Output Cap ESR"]
["Fesr",{"$f":"1/(2*Pi*Cout*Cout_ESR)","v":795774.71636878187},"Hz",null,null,"Cout ESR zero frequency"]
["F_mod",{"$f":"Fsw/2","v":150000},"Hz",null,null,"Zero-order sample-and-hold effects of current-mode control modeled as pole at Fsw/2"]
[null,null,null,"Internal Comp Crossover"]
["Desired Crossover Frequency",{"$f":"CHOOSE(COMP_TYPE,Fcross_Ch2,'Design the Regulator'!E71*1000)","v":40000},"Hz",{"$f":"Fsw/50","v":6000}]
["Rcea1",{"$f":"Fcross*Cout/Number_of_Phases*2*Pi*Ri/(gm*Afb)","v":5313.1858498021875},"W",null,null,"This component will largely determine the crossover frequency",null,null,null,null,{"$f":"Fcross/Fp_dominant/(gm*Afb*Am)","v":5313.1858498021875}]
["Cc1ea, Cc3ea",{"$f":"10/(Rcea1*Fcross*2*Pi)","v":7.4886775925446773E-9},"F",null,null,"This along with Rcea1 will set a zero at Fcrossover/5 to optimize phase margin"]
["Cc2ea, Cc4ea",{"$f":"MAX(1/(Rcea1*2*Pi*Fesr)-Cbw, 1/(Rcea1*2*Pi*(Fsw/2))-Cbw)","v":1.6786708047977347E-10},"F",null,null,"This along with Rcea1 places a pole at the output cap ESR zero"]
[]
[{"$f":"CHOOSE(COMP_TYPE,\"Internal Compensation\",\"External Compensation\")","v":"External Compensation"}]
["Chosen Compensation Components from the standard value sheet",null,null,"Internal Values"]
["Rcea1_u",{"$f":"CHOOSE(COMP_TYPE,D247,'Design the Regulator'!D78*1000)","v":5360},"W",400000,null,null,{"$f":"1/(Rcea1*2*Pi*(Fsw/2))-Cbw","v":1.6786708047977347E-10}]
["Cc1ea_u",{"$f":"CHOOSE(COMP_TYPE,Cc3ea_u,'Design the Regulator'!D79*0.000000001)","v":6.8000000000000005E-9},"F",{"$f":"50*0.000000000001","v":5.0000000000000002E-11}]
["Cc2ea_u",{"$f":"CHOOSE(COMP_TYPE,Cc4ea_u,'Design the Regulator'!D80*0.000000000001)","v":1.8E-10},"F",{"$f":"0.000000000001","v":9.9999999999999998E-13}]
[]
["Resulting Pole/Zero Locations",null,null,null,null,{"$f":"Cout","v":2.0000000000000001E-4},{"$f":"Cout_ESR","v":1E-3}]
["Fz1",{"$f":"1/(2*Pi*Rcea1_u*Cc1ea_u)","v":4366.6303575986713},"Hz",null,null,"This zero is set at or close to the dominant load pole"]
["Fp2",{"$f":"1/(2*Pi*Rcea1_u*(Cc1ea_u*(Cc2ea_u+Cbw)/(Cc1ea_u+Cc2ea_u+Cbw)))","v":144540.1083753295},"Hz",null,null,"This pole cancels the zero from the Output Cap ESR"]
[null,null,null,"Internal Values"]
["Rfb1",{"$f":"IF(VOUT_setting=1,'Design the Regulator'!E73*1000,2500000)","v":2500000},"W",null,null,"Upper Feedback Resistance - chosen by user"]
["Rfb2",{"$f":"IF(Vout=Vref,100000000,Vref*B255/((Vout-Vref)))","v":476190.47619047615},"W",null,null,"Lower Feedback Resistance"]
["Rfb2_u",{"$f":"IF(Vout=Vref,\"N/A\",CHOOSE(VOUT_setting,'Standard Value Calculator'!S11,471000,792000,177000))","v":471000},"W",null,null,"Std Value Lower Feedback Resistance"]
[]
["Rff",20000,"W"]
["Cff",3.67E-13,"F"]
["Cfb",2.1999999999999999E-12,"F"]
[]
["wff",{"$f":"1/(2*Pi*Rff*Cff)","v":21683234.778440922},"Hz"]
["wfbt",{"$f":"1/(2*Pi*Rfb1_*Cfb)","v":28937.262413410252},"Hz"]
["wfbb",{"$f":"1/(2*Pi*Rfb2_u*Cfb)","v":153594.8111115194},"Hz"]
["w1",{"$f":"1/(2*Pi*Rff*Cfb)","v":3617157.8016762817},"Hz"]
["wfft",{"$f":"1/(2*Pi*Cff*Rfb1_)","v":173465.8782275274},"Hz"]
["Cfb*(Rff+RFBT)/(Rff*RFBT))",{"$f":"2*Pi*Cfb*(Rff+Rfb1_)/(Rff*Rfb1_)","v":6.96679586064E-16},"Hz"]
[]
[]
[]
[]
["Other Input Variables"]
["Rfets",0,"W","Series resistance due to FETs"]
["Diode loss eq res",{"$f":"0.00000002*Fsw*0.6*4/Iripple1","v":{"$error":"#NAME?"}}]
["Fet loss eq res",{"$f":"_Don2*RdsonTop+Doff2*RdsonBot","v":{"$error":"#NAME?"}}]
["cap loss eq res",{"$f":"B278*Vin^2*Fsw/2/(((Iripple1/SQRT(3))^2))","v":{"$error":"#NAME?"}}]
["Sw cap",5.0000000000000001E-9]
[]
["Step 8: AEF"]
[]
["VinRipple_dBuV",{"$f":"20*LOG10(Vinripple2*1000000)","v":109.98677611394729},"dBuV"]
["CISPR 25 limit",{"$f":"CHOOSE(OSC,35,50)","v":50},"dBuV","Chooses CISPR conducted limit 35 at 2.1MHz and 50 at 440kHz"]
["Attenuation required",{"$f":"VinRipple_dBuV-B283+3","v":62.986776113947286},"dBuV","Margin of attenuation req"]
["Filter Frequency Required",{"$f":"Fsw/(POWER(10,Attn_req/40))","v":7988.2537485170824},"Hz","Assume 40dB/decade drop and set frequency based on attenuation"]
[]
["Lfilter",{"$f":"'Design the Regulator'!E50","v":0.68},"uH","user input"]
[]
["Gop_AEF",{"$f":"CHOOSE(OSC,20,100)","v":100}]
["n",2,null,null,null,"n should be 2 or 3"]
[]
["Passive Cf",{"$f":"1000000/(LinfilterPssv*POWER(2*Pi*Fx_infilter,2))","v":583.75101381924492},"uF",{"$f":"#REF!*0.000001","v":{"$error":"#REF!"}}]
["Cinj_AEF",{"$f":"1000000/(L_infilter*Gop_AEF*0.000001*POWER(2*Pi*Fx_infilter,2))","v":5.8375101381924486},"uF",{"$f":"'Design the Regulator'!E51*0.000001","v":4.6999999999999995E-7}]
[]
["Cdamp_AEF",{"$f":"CHOOSE(OSC,0,Cinj_AEF/nAEF)","v":2.9187550690962243},"uF",{"$f":"'Design the Regulator'!E52*0.000001","v":0}]
["Rdamp_AEF",{"$f":"CHOOSE(OSC, SQRT(L_infilter*0.00001*Gop_AEF/(CinjSel)),1.09*SQRT(L_infilter*0.00001*Gop_AEF/CinjSel))","v":41.460260388586107},"Ω",{"$f":"'Design the Regulator'!E53","v":6.81}]
["Ccomp_AEF",{"$f":"CHOOSE(OSC,5,1)","v":1},"nF",{"$f":"B297*0.000000001","v":1.0000000000000001E-9},null,"AEF Comp network & sense is specifically defined at 2.2MHz at 440kHz"]
["Rcomp_AEF",{"$f":"CHOOSE(OSC,200,1000)","v":1000},"Ω"]
["Csen_AEF",{"$f":"Gop_AEF*B297","v":100},"nF",{"$f":"B299*0.000000001","v":1.0000000000000001E-7}]
[]
["Rd_AEF",{"$f":"SQRT(L_infilter*0.000001/Cin)","v":0.15055453054181619},null,{"$f":"'Standard Value Calculator'!S14","v":0.15}]
[]
["Attenuation at Fsw",{"$f":"'Input Filter Calculations'!W97","v":-31.748500628322866},"dBuV"]
["Conducted EMC at Fsw",{"$f":"VinRipple_dBuV+B303","v":78.238275485624428},"dBuV"]
[]
[]
["Step 8: Efficiency"]
["VAR",0]
["Design"]
["Ta",{"$f":"'Design the Regulator'!E13","v":25},"°C","Ambient Temperature"]
["Components"]
["LTc",{"$f":"4000/1000000","v":4.0000000000000001E-3},"%/°C","Inductor DCR Temp Co"]
["θCA",20,"°C/W","Inductor Core to Ambient Thermal Resistance"]
["RCinEsr",{"$f":"RCinEsr","v":1E-3},"W","Input Capacitor ESR"]
[]
["Controller Characteristics"]
["VCC",5,"V","with 170mA current limit"]
["Top Driver"]
["RdsonDRT",1,"W","Drain-Source Resistance of Pullup High-side FET Driver"]
["RdsonDRT2",0.5,"W","Drain-Source Resistance of Pulldown High-side FET Driver"]
["Bottom Driver"]
["RdsonDRB",1,"W","Drain-Source Resistance of Pullup Low-side FET Driver"]
["RdsonDRB2",0.5,"W","Drain-Source Resistance of Pulldown Low-side FET Driver"]
["Deadtime"]
["Deadtime",1.4E-8,"s","Total Deadtime",null,null,"14ns for LM513-Q1"]
["IQ"]
["IQ ",2.2000000000000001E-6,"A","Quiescent Current of LM5143-Q1 Controller (One channel disabled)"]
[]
["High- & low-side MOSFETs - Ch1","Q1: high-side",null,"Q2: low-side"]
["Rdson",{"$f":"'Design the Regulator'!E89/1000","v":1.2E-2},"W",{"$f":"'Design the Regulator'!F89/1000","v":4.0999999999999995E-3},"W","Drain-Source Resistances of Channel 1 FETs"]
["RdsonTopTc",{"$f":"4000/1000000","v":4.0000000000000001E-3},"%/°C",4.0000000000000001E-3,"%/°C","Drain-Source Resistance Temp Co"]
["Qg",{"$f":"'Design the Regulator'!E90/1000000000","v":8.0000000000000005E-9},"C",{"$f":"'Design the Regulator'!F90/1000000000","v":2.4999999999999999E-8},"C","Gate Charge at VCC = 5V"]
["Qgd",{"$f":"'Design the Regulator'!E91/1000000000","v":2.8999999999999999E-9},"C",{"$f":"'Design the Regulator'!F91/1000000000","v":8.9999999999999995E-9},"C","Gate to Drain Charge"]
["Qgs",{"$f":"'Design the Regulator'!E92/1000000000","v":3.1E-9},"C",{"$f":"'Design the Regulator'!F92/1000000000","v":8.6999999999999985E-9},"C","Gate to Source Charge"]
["Qoss",{"$f":"'Design the Regulator'!E93/1000000000","v":0},"C",{"$f":"'Design the Regulator'!F93/1000000000","v":2.9999999999999997E-8},"C","Output Charge"]
["Coss",{"$f":"'Design the Regulator'!E94/1000000000000","v":1.16E-10},"F",{"$f":"'Design the Regulator'!F94/1000000000000","v":3.6599999999999998E-10},"F","Output Capacitance"]
["Rgate",{"$f":"'Design the Regulator'!E95","v":1.2},"W",{"$f":"'Design the Regulator'!F95","v":1.2},"W","Gate Resistance"]
["Gfs",{"$f":"'Design the Regulator'!E96","v":55},"S",{"$f":"'Design the Regulator'!F96","v":178},"S","Transconductance"]
["Vth",{"$f":"'Design the Regulator'!E97","v":3.1},"V",{"$f":"'Design the Regulator'!F97","v":3},"V","Threshold Voltage"]
["Vsp",{"$f":"Vth_Q1+(Iout/Number_of_Phases)/Gfs_Q1","v":3.3909090909090911},"V",{"$f":"Vth_Q2+(Iout/Number_of_Phases)/Gfs_Q2","v":3.0898876404494384},"V","Switch Point Voltage of FETs"]
[]
["Vsd - Buck",{"$f":"'Design the Regulator'!E98","v":0.7},"V",{"$f":"'Design the Regulator'!F98","v":0.7},"V","Diode Forward Voltage of MOSFET Body diode"]
["QrrTop",null,"C",{"$f":"'Design the Regulator'!F99/1000000000","v":5.8999999999999999E-8},"C","Reverse Recovery Charge of Body Diode"]
["TrrTop",4.0000000000000001E-8,"s",4.0000000000000001E-8,"s","Reverse Recovery Time of Body Diode"]
["θJA-MOSFET",{"$f":"'Design the Regulator'!E100","v":42},"°C/W",{"$f":"'Design the Regulator'!F100","v":40.700000000000003},"°C/W","Junction-to-Ambient Resistance"]
[]
[]
[]
["Anti-parallel Schottky Diode (optional)"]
["VfdSky",{"$f":"'Design the Regulator'!F103","v":0},"V",{"$f":"'Design the Regulator'!#REF!","v":{"$error":"#REF!"}},"V","Diode Forward Voltage"]
["QrrSky",{"$f":"'Design the Regulator'!F104/1000000000","v":0},"C",{"$f":"'Design the Regulator'!#REF!/1000000000","v":{"$error":"#REF!"}},"C","Diode Reverse Recovery Charge"]
["Ireverse",0,"A",0,"A","Reverse Leakage Current"]
[]
["Controller"]
["θJACtrl",34.1,"°C/W",null,null,"Junction-to-ambient thermal resistance of controller"]
["Outputs"]
["Top FET"]
["Tr",{"$f":"(Qgd_Q1+Qgs_Q1/2)*(RdsonDRT+Rgate1)/(VCC-Vsp_Q1)","v":6.0841807909604526E-9},"s"]
["Tf",{"$f":"(Qgd_Q1+Qgs_Q1/2)*(RdsonDRT2+Rgate1)/(Vsp_Q1)","v":2.2309651474530831E-9},"s"]
[]
["IC Power Disipation","Value","Units"]
["Power Dis",{"$f":"CHOOSE(Ext_VCC, (Qg_Q1+Qg_Q2)*Fsw*VCC, (Qg_Q1+Qg_Q2)*Fsw*Vin)","v":4.9499999999999995E-2},"W"]
["Temp rise",{"$f":"B362*ThetaJaCtrl","v":1.6879499999999998},"°C"]
["Junction temperature",{"$f":"B363 + Ta","v":26.687950000000001},"°C"]
[]
["Current (switching)",{"$f":"(Qg_Q1+Qg_Q2)*Fsw+Iq","v":9.9021999999999999E-3},"A"]
["Qrr Current",{"$f":"Qrr_Q2*Fsw","v":1.77E-2},"A"]
["Diode Current",{"$f":"C368/Vin","v":{"$error":"#NAME?"}},{"$f":"Deadtime*Fsw*(Ipp/2)*(Vsd_Q1+Vsd_Q2)","v":{"$error":"#NAME?"}}]
["Total Application Switching IQ",{"$f":"SUM(B366:B368)","v":{"$error":"#NAME?"}},"A"]
[]
["Low-side MOSFET/Diode"]
["Part Power"]
["Power Dis"]
[]
["SCHEMATIC LABELS"]
[{"$f":"\"RC1 = \"&'Design the Regulator'!D78&\"kΩ\"","v":"RC1 = 5.36kΩ"},{"$f":"'Design the Regulator'!D78&\"kΩ\"","v":"5.36kΩ"},null,{"$f":"'Design the Regulator'!D81&\"kΩ\"","v":"kΩ"}]
[{"$f":"\"RC2 = \"&'Design the Regulator'!D81&\"kΩ\"","v":"RC2 = kΩ"},{"$f":"'Design the Regulator'!D81&\"kΩ\"","v":"kΩ"}]
[]
[{"$f":"\"Lo = \"&'Design the Regulator'!E28&\"µH\"","v":"Lo = 2.2µH"},{"$f":"'Design the Regulator'!E28&\"µH\"","v":"2.2µH"},null,{"$f":"IF(MODE = 1, 'Design the Regulator'!I28&\"µH\", 'Design the Regulator'!E28&\"µH\")","v":"µH"}]
[{"$f":"\"Rdcr = \"&Rdcr*1000&\"mΩ\"","v":"Rdcr = 3.5mΩ"},{"$f":"Rdcr*1000&\"mΩ\"","v":"3.5mΩ"},null,{"$f":"IF(MODE=1, Rdcr2*1000&\"mΩ\", Rdcr*1000&\"mΩ\")","v":"0mΩ"}]
[{"$f":"\"Rs = \"&'Design the Regulator'!E18&\"mΩ\"","v":"Rs = 2mΩ"},{"$f":"'Design the Regulator'!E18&\"mΩ\"","v":"2mΩ"},null,{"$f":"IF(MODE = 1, 'Design the Regulator'!I18&\"mΩ\", 'Design the Regulator'!E18&\"mΩ\")","v":"mΩ"}]
[]
["IC",{"$f":"IF(VIN_max>42,\"LM5149(-Q1)\",\"LM25149(-Q1)\")","v":"LM5149(-Q1)"}]
[]
[{"$f":"IF((INFILTER_TYPE=1),\"AEF IS DISABLED!\",\"AEF\")","v":"AEF"},{"$f":"IF((INFILTER_TYPE=1),\"\",\"0.1µF\")","v":"0.1µF"},{"$f":"IF((INFILTER_TYPE=1),\"\",\"0.47Ω\")","v":"0.47Ω"},{"$f":"IF((INFILTER_TYPE=1),\"\",\"3Ω\")","v":"3Ω"},{"$f":"IF((INFILTER_TYPE=1),\"\",\"50kΩ\")","v":"50kΩ"},{"$f":"IF((INFILTER_TYPE=1),\"\",\"2.2µF\")","v":"2.2µF"}]
[{"$f":"\"LAEF =\"&L_infilter&\" uF\"","v":"LAEF =0.68 uF"},{"$f":"IF((INFILTER_TYPE=1),\"\",L_infilter&\"µH\")","v":"0.68µH"}]
[{"$f":"\"Cinj =\"&CinjSel*1000000&\" uF\"","v":"Cinj =0.47 uF"},{"$f":"IF((INFILTER_TYPE=1),\"\",CinjSel*1000000&\"µF\")","v":"0.47µF"}]
[{"$f":"\"Cdamp =\"&CdampSel*1000000&\" uF\"","v":"Cdamp =0 uF"},{"$f":"IF((INFILTER_TYPE=1),\"\",IF(OSC=1,\"DNP\",CdampSel*1000000&\"µF\"))","v":"0µF"}]
[{"$f":"\"Rdamp =\"&RdampSel&\"Ω\"","v":"Rdamp =6.81Ω"},{"$f":"IF((INFILTER_TYPE=1),\"\",RdampSel&\"Ω\")","v":"6.81Ω"}]
[{"$f":"\"Rcomp =\"&Rcomp_AEF&\"Ω\"","v":"Rcomp =1000Ω"},{"$f":"IF((INFILTER_TYPE=1),\"\",Rcomp_AEF&\"Ω\")","v":"1000Ω"}]
[{"$f":"\"Ccomp =\"&Ccomp_AEF*1000000000000&\"pF\"","v":"Ccomp =1000pF"},{"$f":"IF((INFILTER_TYPE=1),\"\",Ccomp_AEF*1000000000000&\"pF\")","v":"1000pF"}]
[{"$f":"\"Csen =\"&Csen_AEF*1000000&\"µF\"","v":"Csen =0.1µF"},{"$f":"IF((INFILTER_TYPE=1),\"\",Csen_AEF*1000000&\"µF\")","v":"0.1µF"}]
[null,"CDAMP"]
[]
[{"$f":"\"VOUT = \"&'Design the Regulator'!E9&\"V\"","v":"VOUT = 5V"},{"$f":"'Design the Regulator'!E9&\"V\"","v":"5V"},null,{"$f":"IF(MODE=1, 'Design the Regulator'!I10&\"V\", \"\")","v":"V"}]
[]
[{"$f":"\"COUT = \"&'Design the Regulator'!$E$36&\"µF\"","v":"COUT = 200µF"},{"$f":"ROUND('Design the Regulator'!$E$36/Number_of_Phases, 0)&\"µF\"","v":"200µF"},null,{"$f":"IF(MODE=1, 'Design the Regulator'!$I$36&\"µF\", ROUND('Design the Regulator'!$E$36/Number_of_Phases, 0)&\"µF\")","v":"µF"}]
["Capacitance per component (Cout)",{"$f":"\"22µF\"","v":"22µF"}]
["# of output caps",{"$f":"ROUNDUP(Cout*1000000/22,0)&\" x\"","v":"10 x"}]
[]
["CIN",{"$f":"Cin*1000000&\"µF\"","v":"30µF"}]
["Capacitance per component (Cin)",{"$f":"\"10µF\"","v":"10µF"}]
["# of input caps",{"$f":"ROUNDUP(Cin*1000000/10,0)&\" x\"","v":"3 x"}]
["Cd",{"$f":"CHOOSE(INFILTER_TYPE,\"\",4*Cin*1000000&\"µF\")","v":"120µF"}]
["Rd",{"$f":"CHOOSE(INFILTER_TYPE,\"\",D301&\"Ω\")","v":"0.15Ω"}]
[]
[{"$f":"\"RC1 = \"&Rcea1_u/1000&\"kΩ\"","v":"RC1 = 5.36kΩ"},{"$f":"IF(COMP_TYPE=1,\"100kΩ\",ROUND(Rcea1_u/1000,2)&\"kΩ\")","v":"5.36kΩ"}]
[{"$f":"\"CC1 = \"&Cc1ea_u*10^9&\"nF\"","v":"CC1 = 6.8nF"},{"$f":"IF(COMP_TYPE=1,\"\",Cc1ea_u*10^9&\"nF\")","v":"6.8nF"}]
[{"$f":"\"CC2 = \"&IF(Cc2ea_u>0, Cc2ea_u*10^12&\"pF\", \"OPEN\")","v":"CC2 = 180pF"},{"$f":"IF(COMP_TYPE=1,\"\",IF(Cc2ea_u>0, ROUND(Cc2ea_u*10^12,1)&\"pF\", \"N/A\"))","v":"180pF"}]
[]
[{"$f":"\"gm = \"&$B$200*1000&\"mS\"","v":"gm = 1.2mS"},{"$f":"$B$200*1000&\"mS\"","v":"1.2mS"}]
[{"$f":"\"RoEA = \"&RoEA/1000000&\"MΩ\"","v":"RoEA = 64MΩ"},{"$f":"RoEA/1000000&\"MΩ\"","v":"64MΩ"}]
[{"$f":"\"GBW = \"&GBW&\"MHz\"","v":"GBW = 6MHz"},{"$f":"GBW&\"MHz\"","v":"6MHz"}]
[]
[{"$f":"\"Cslope = \"&Cslope&\"pF\"","v":{"$error":"#NAME?"}},{"$f":"ROUND(Cslope*1,0)&\"pF\"","v":{"$error":"#NAME?"}}]
["Cd",{"$f":"IF(DRSS=1, ROUND(Cdither*1000000000,1)&\"nF\", \"\")","v":"2.2nF"},{"$f":"IF(DRSS=1, \"Cd\", \"\")","v":"Cd"}]
[{"$f":"\"RFB1 = \"&'Design the Regulator'!E73&\"kΩ\"","v":"RFB1 = 100kΩ"},{"$f":"IF(VOUT_setting=1, 'Design the Regulator'!E73&\"kΩ\", \"\")","v":""},null,{"$f":"'Design the Regulator'!I73&\"kΩ\"","v":"kΩ"}]
[{"$f":"\"RFB2 = \"&IF(Vout=Vref,\"OPEN\",'Design the Regulator'!E74&\"kΩ\")","v":"RFB2 = 471kΩ"},{"$f":"IF(VOUT_setting=1, IF(Vout=Vref,\"OPEN\",Rfb2_u/1000&\"kΩ\"), \"\")","v":""},null,{"$f":"IF(Vout2=Vref,\"OPEN\",Rfb4_u/1000&\"kΩ\")","v":"0kΩ"}]
[{"$f":"\"RFBSET = \"&CHOOSE(VOUT_setting,\"\",\"24.9kΩ\",\"0Ω\",\"48.7kΩ\")","v":"RFBSET = 24.9kΩ"},null,null,{"$f":"CHOOSE(VOUT_setting,\"\",\"24.9kΩ\",\"0Ω\",\"48.7kΩ\")","v":"24.9kΩ"}]
[]
["RENT",{"$f":"IF((UVLO_TYPE=1),B188&\"kΩ\",\"0Ω\")","v":"200kΩ"}]
["RENB",{"$f":"IF((UVLO_TYPE=1),B189&\"kΩ\",\"\")","v":"9.53kΩ"}]
[]
[{"$f":"CHOOSE(BODE_PLOT_TYPE, \"Crossover frequency = \"&ROUND('Stability Calculations'!U4,0)&\"kHz\",  \"Fsw Attenuation = \"&ROUND('Input Filter Calculations'!W97,1)&\" dB\")","v":"Crossover frequency = 38kHz"},{"$f":"CHOOSE(BODE_PLOT_TYPE, ROUND('Stability Calculations'!U4,1)&\" kHz\", ROUND(#REF!,1)&\" kHz\")","v":"37.8 kHz"},null,{"$f":"'Stability Calculations'!U4","v":37.802750000000003}]
[{"$f":"CHOOSE(BODE_PLOT_TYPE, \"Phase margin = \"&ROUND('Stability Calculations'!U5,0)&\"°\", \"°\")","v":"Phase margin = 50°"},{"$f":"CHOOSE(BODE_PLOT_TYPE, ROUND('Stability Calculations'!U5,0)&\"°\", ROUND(#REF!,0)&\"°\")","v":"50°"}]
[{"$f":"IF(loopPM<45,CHOOSE(COMP_TYPE,\"* Phase margin is too low – increase Cout\",\"* Phase margin is too low – adjust compensation\"),\"\")","v":""}]
[]
["Full-load/high line efficiency",{"$f":"IF(PLOT_TYPE=1, ROUND('Efficiency Calculations'!AZ109,1)&\"%\", ROUND(#REF!,1)&\"%\")","v":"93.3%"}]
["Half-load/mid-line efficiency",{"$f":"IF(PLOT_TYPE=1, ROUND('Efficiency Calculations'!AZ59,1)&\"%\", ROUND(#REF!,1)&\"%\")","v":"94.5%"}]
["OSC pin setting",{"$f":"IF(VOUT_setting=1, \"\", IF(OSC=1, \"Tie OSC to VDDA\", \"Tie OSC to AGND\"))","v":"Tie OSC to AGND"}]
[]
[{"$f":"\"CDITH = \"&Cdither*1000000000&\"nF\"","v":"CDITH = 2.2nF"},{"$f":"Cdither*1000000000&\"nF\"","v":"2.2nF"}]
[{"$f":"\"Rs = \"&Rs&\"Ω\"","v":"Rs = 0.002Ω"},{"$f":"'Standard Value Calculator'!S6&\"Ω\"","v":"Ω"}]
["Rset",{"$f":"'Standard Value Calculator'!S16&\"mΩ\"","v":"2.37mΩ"}]
["Rs",{"$f":"'Standard Value Calculator'!S6&\"mΩ\"","v":"mΩ"}]
[{"$f":"\"Rshunt = \"&ROUND(Rshunt,1)&\"mΩ\"","v":{"$error":"#NAME?"}},{"$f":"IF(Rshunt=\"0\", \"N/A\",ROUND(Rshunt,1)&\"mΩ\")","v":{"$error":"#NAME?"}}]
[]
["Rpgood","20kΩ"]
["RDAMP"]
[]
["VCCX",{"$f":"IF((Ext_VCC=1),\"5V\",\"GND\")","v":"5V"}]
["RCNFG",{"$f":" 'Design the Regulator'!E65&\"kΩ\"","v":"41.2kΩ"}]
["Rt",{"$f":" Rfadj&\"kΩ\"","v":"73.2kΩ"},{"$f":"Rfadj","v":73.2},{"$f":"Fsw","v":300000},null,{"$f":"OR((Fsw=440000),(Fsw=2200000))","v":false},null,{"$f":"OR(OR(AND(OSC=1, OR(Fsw/1000>2530, Fsw/1000<1800)), AND(OSC=2, OR(Fsw/1000>500, Fsw/1000<300))), OR((Fsw=440000),(Fsw=2200000)))","v":false}]
["Css",{"$f":"'Standard Value Calculator'!B4*1000000000&\"nF\"","v":"0nF"},{"$f":"IF(MODE=1,\"Css\",\"\")","v":"Css"}]
["Cres",{"$f":"IF(Cres_u = 0, \"N/A\", Cres_u*1000000000 &\"nF\")","v":"330nF"},{"$f":"IF(Cres_u = 0, \"N/A\", Cres_u*1000000 &\"µF\")","v":"0.33µF"},{"$f":"Cres_u","v":3.3000000000000002E-7}]
[]
["Blank out",{"$f":"IF(B76=\"y\",\"\",\"|\")","v":"|"}]
["OUTPUT CURRENT",{"$f":"'Design the Regulator'!$E$10&\"A\"","v":"16A"},null,{"$f":"IF(MODE=1,'Design the Regulator'!#REF!&\"A\",\"\")","v":{"$error":"#REF!"}}]
["VIN",{"$f":"VIN_nom&\"V\"","v":"48V"}]
["VIN range",{"$f":"VIN_min&\"V\"&\"...\"&VIN_max&\"V\"","v":"24V...70V"}]
[null,{"$f":"IF(INFILTER_TYPE=1,B450,\"\")","v":""},{"$f":"IF(INFILTER_TYPE=1,\"\",B450)","v":"24V...70V"}]

{"sheet":"Schematic Management","index":5,"n_rows":17,"n_cols":2,"rows_kept":17,"cut":false,"hidden":true,"merged":[]}
[]
[{"$f":"IF(MODE=1, CHOOSE(SCH_SETTING, \"SCH_SetVout_IntComp_nAEF\",\"SCH_SetVout_IntComp_AEF\",\"SCH_SetVout_ExtComp_nAEF\",\"SCH_SetVout_ExtComp_AEF\",\"SCH_AdjVout_IntComp_nAEF\",\"SCH_AdjVout_IntComp_AEF\",\"SCH_AdjVout_ExtComp_nAEF\",\"SCH_AdjVout_ExtComp_AEF\"))","v":"SCH_SetVout_ExtComp_AEF"}]
[]
[]
[]
[]
[]
[]
[]
[]
[]
[]
[]
[]
[]
[]
[null," "]

{"sheet":"Stability Calculations","index":6,"n_rows":687,"n_cols":35,"rows_kept":687,"cut":false,"hidden":true,"merged":[[9,1,10,1],[1,0,1,3],[1,9,1,11],[9,0,11,0],[9,18,9,19],[1,19,1,21],[10,6,10,7],[1,4,1,6],[9,2,9,7],[9,8,9,13],[9,20,9,22],[9,14,9,17],[1,12,1,14],[1,15,1,18],[9,27,9,28],[9,30,9,31],[10,2,10,3],[10,4,10,5],[10,8,10,9],[10,10,10,11],[10,12,10,13],[10,18,10,19],[10,14,10,15],[10,16,10,17]]}
[]
["Divider Network & EA Poles/Zeros",null,null,null,"Modulator",null,null,null,null,"Power Stage Poles/Zeros",null,null,"Complex Pole Pair",null,null,"Feedback natural frequencies",null,null,null,"Total System"]
[null,"Afb1",{"$f":"Afb","v":0.15767527500119166},"V/V","Acs",{"$f":"Acs","v":50},"A/V","gm",{"$f":"gm","v":1.1999999999999999E-3},"z_ESR",{"$f":"Fesr","v":795774.71636878187},"Hz","p3",{"$f":"Fsw/2","v":150000},"Hz","zterm1",{"$f":"((1/wffHz)+(1/wfftHz))","v":5.8109410928520001E-6},null,null,"Adc",{"$f":"IF(VOUT_setting=1,Am*Afb*AEA,Am*AEA)","v":952061.40563979547},"V/V"]
[null,"EA zero, z1",{"$f":"Fz1_u","v":4366.6303575986713},"Hz","Am",{"$f":"Am","v":12.396632885934837},"V/V",null,null,"p_dom",{"$f":"Fp_dominant","v":3209.6405680919383},"Hz","pterm1",{"$f":"Q*pole3","v":86809.708618865523},null,"pterm3",{"$f":"((1/wfbtHz)+(1/wffHz)+(1/wfftHz)+(Afbr/wffHz))","v":4.0613251007724614E-5},null,null,"Crossover",{"$f":"AI7","v":37.802750000000003},"kHz"]
[null,"EA pole, p1",{"$f":"Fp1_u","v":0.36567466719551112},"Hz","Q",{"$f":"Q","v":0.57873139079243685},null,null,null,null,null,null,"pterm2",{"$f":"pole3^2","v":22500000000},null,"pterm4",{"$f":"1/(wffHz*wfbtHz)","v":1.5937437150456741E-12},null,null,"Phase Margin",{"$f":"AI9","v":49.658202376360066},"°"]
[null,"Aea",{"$f":"AEA","v":76800},"V/V","mc",{"$f":"mc","v":1.1744186046511629},null,null,null,null,null,null,null,null,null,"Afbr",{"$f":"Rfb1_/Rfb2_u","v":5.3078556263269636},null,null,"radconv",{"$f":"180/Pi","v":57.295779578552292},null,null,null,null,null,null,null,null,null,null,null,null,"XOVER SEARCH"]
[null,"EA pole, p2",{"$f":"Fp2_u","v":140173.47801773081},"Hz","k",{"$f":"k","v":1.0500131695148971},null,null,null,null,null,null,null,null,null,null,null,null,null,null,null,null,null,null,null,null,null,null,null,null,null,null,null,"xover",{"$f":"SUM(AH12:AH613)/1000","v":37.802750000000003}]
[]
[null,null,null,null,null,null,null,null,null,null,null,null,null,null,null,null,null,null,null,null,null,null,null,null,null,null,null,null,null,null,null,null,null,"phase margin",{"$f":"SUM(AI13:AI613)","v":49.658202376360066}]
["Freq (Hz)",null,"Power Stage",null,null,null,null,null,"Error Amplifier",null,null,null,null,null,"Feedback Gain",null,null,null,"Sampling Double Pole",null,"System Response",null,null,null,null,null,null,"ERROR AMP Response",null,null,"PLANT Response"]
[null,null,"p_dom",null,"z_ESR",null,"z_RHP",null,"p1",null,"z1",null,"p2",null,"z1",null,"p1p2",null,"p3"]
[null,null,"Gain(V/V)","Phase(rad)","Gain(V/V)","Phase(rad)","Gain(V/V)","Phase(rad)","Gain(V/V)","Phase(rad)","Gain(V/V)","Phase(rad)","Gain(V/V)","Phase(rad)","Gain(V/V)","Phase(rad)","Gain(V/V)","Phase(rad)","Gain(V/V)","Phase(rad)","Gain (dB)","Phase (°)","Phase Margin (°)",null,null,"Fsquare",null,"Gain(dB)","Phase(Deg)",null,"Gain(dB)","Phase(Deg)"]
[1,{"$f":"A13/1000","v":1E-3},{"$f":"SQRT(1+(A13/pole1)^2)","v":1.0000000485352412},{"$f":"ATAN(A13/pole1)","v":3.1156135599247234E-4},{"$f":"SQRT(1+(A13/Zero1)^2)","v":1.0000000000007896},{"$f":"ATAN(A13/Zero1)","v":1.2566370599993386E-6},{"$f":"IF(VIN_nom>Vout, 1, SQRT(1+(A13/z_RHP)^2))","v":1},{"$f":"IF(VIN_nom>Vout, 0, -ATAN(A13/z_RHP))","v":0},{"$f":"SQRT(1+(A13/Pole2)^2)","v":2.9117738334304453},{"$f":"ATAN(A13/Pole2)","v":1.2202262493862612},{"$f":"SQRT(1+(A13/Zero2)^2)","v":1.0000000262226838},{"$f":"ATAN(A13/Zero2)","v":2.2900953381090362E-4},{"$f":"SQRT(1+(A13/pole4)^2)","v":1.0000000000254472},{"$f":"ATAN(A13/pole4)","v":7.1340171773189746E-6},{"$f":"IF(VOUT_setting=1,1,SQRT(1+(A13*zterm1)^2))","v":1.0000000000168834},{"$f":"IF(VOUT_setting=1,0,ATAN(((A13*zterm1))))","v":5.8109410927865939E-6},{"$f":"IF(VOUT_setting=1,1,SQRT((1+Afbr-pterm4*(A13)^2)^2+(A13*$Q$4)^2))","v":6.3078556264561154},{"$f":"IF(VOUT_setting=1,0,ATAN(A13*$Q$4/(1+Afbr-$Q$5*(A13)^2)))","v":6.438519429275934E-6},{"$f":"SQRT((1-(Z13/pterm2))^2+(A13/pterm1)^2)","v":1.0000000000219043},{"$f":"IF((ATAN((A13/pterm1)/(1-A13^2/pterm2))>0),ATAN((A13/pterm1)/(1-A13^2/pterm2)),PI()+ATAN((A13/pterm1)/(1-A13^2/pterm2)))","v":1.1519448871677142E-5},{"$f":"20*LOG10(((E13*K13*G13*O13)/(C13*I13*S13*M13*Q13))*Adc)","v":94.292511337890446},{"$f":"((F13+L13+H13+P13)-(D13+J13+T13+N13+R13))*radconv","v":-69.919576814275487},{"$f":"IF(V13>0,V13,V13+180)","v":110.08042318572451},null,{"$f":"IF(U13<0,A13,1000000000)","v":1000000000},{"$f":"A13^2","v":1},null,{"$f":"20*LOG10((K13/(I13*M13))*AEA)","v":88.424071849337935},{"$f":"(L13-(J13+N13))*radconv","v":-69.901101690103886},null,{"$f":"20*LOG10((E13*G13/(C13*S13))*Acs*Am)","v":55.845474468799438},{"$f":"(F13+H13-(D13+T13))*radconv","v":-1.8439166581557611E-2},null,{"$f":"SUM((U14<0)*(U13>0))*A13","v":0},{"$f":"IF(AH13>0,W11,0)","v":0}]
[1.0965,{"$f":"A14/1000","v":1.0965E-3},1.0000000583545148,3.4162702460939325E-4,1.0000000000009495,1.3779025362891282E-6,1,0,3.1609182559757043,1.2489024135629991,1.0000000315278539,2.5110895293553869E-4,1.0000000000305955,7.8224498349034072E-6,1.0000000000202993,6.3716969082259915E-6,{"$f":"IF(VOUT_setting=1,1,SQRT((1+Afbr-pterm4*(A14)^2)^2+(A14*$Q$4)^2))","v":6.3078556264822438},7.059836554181686E-6,1.0000000000263358,1.2631075687794529E-5,93.579398782201352,-71.563156086297511,108.43684391370249,null,1000000000,1.2023122500000001,null,87.710959378981372,-71.542898112771468,null,55.84547438347321,-2.0218546028544393E-2,null,0,0]
[1.2022999999999999,1.2022999999999999E-3,1.0000000701589178,3.7459021290973791E-4,1.0000000000011413,1.5108547372368504E-6,1,0,3.43660517826551,1.2755402685265698,1.0000000379055525,2.7533816035635642E-4,1.0000000000367844,8.5772288522257739E-6,1.0000000000244056,6.9864944758222864E-6,{"$f":"IF(VOUT_setting=1,1,SQRT((1+Afbr-$Q$5*(A15)^2)^2+(A15*$Q$4)^2))","v":6.3078556265136552},7.7410319097716704E-6,1.0000000000316633,1.3849833378418735E-5,92.853071227131665,-73.090002435016217,106.90999756498378,null,1000000000,1.4455252899999997,null,86.984631926495624,-73.067789793534118,null,55.845474280896866,-2.216940967160894E-2,null,0,0]
[1.3183,1.3183000000000001E-3,1.0000000843501169,4.1073132579801574E-4,1.0000000000013722,1.6566246361964847E-6,1,0,3.7412390178446895,1.3002155486467204,1.0000000455727922,3.0190326452834038E-4,1.0000000000442248,9.4047748447418712E-6,1.0000000000293421,7.6605636425569403E-6,6.3078556265514161,8.487900163529501E-6,1.000000000038068,1.518608944753435E-5,92.115354873238459,-74.504460306510467,105.49553969348953,null,1000000000,1.7379148900000001,null,86.246915695928337,-74.480104550876945,null,55.845474157580064,-2.430835274257585E-2,null,0,0]
[1.4454,1.4454000000000001E-3,1.0000001013989088,4.5033076808076276E-4,1.0000000000016496,1.8163432065220026E-6,1,0,4.0772280407388735,1.3230036324009853,1.0000000547839363,3.3101037386756632E-4,1.0000000000531637,1.0311508427906313E-5,1.0000000000352727,8.3991342554107729E-6,6.3078556265967825,9.3062359829379334E-6,1.0000000000457623,1.6650211399125986E-5,91.36836385780154,-75.810853755733845,104.18914624426615,null,1000000000,2.0891811599999999,null,85.499924828650705,-75.784149812165552,null,55.845474009431726,-2.6651970467656275E-2,null,0,0]
[1.5849,1.5849E-3,1.0000001219160568,4.9379356895582047E-4,1.0000000000019833,1.9916440763913668E-6,1,0,4.4480467988122152,1.3440403034162482,1.0000000658689683,3.6295720054363174E-4,1.0000000000639209,1.1306703824042834E-5,1.0000000000424099,9.2097605378007458E-6,6.3078556266513788,1.0204409443250137E-5,1.0000000000550218,1.8257174516726951E-5,90.612276865069802,-77.016970102794645,102.98302989720536,null,1000000000,2.51190801,null,84.743838014219349,-76.987688879879173,null,55.845473831144538,-2.9224233731037049E-2,null,0,0]
[1.7378,1.7378000000000001E-3,1.0000001465739383,5.4143128905624117E-4,1.0000000000023843,2.1837838828645288E-6,1,0,4.8563840984804409,1.3633981640240702,1.0000000791911616,3.9797275380324797E-4,1.000000000076849,1.2397495050320078E-5,1.0000000000509872,1.0098253430814951E-5,6.307855626716993,1.1188859063889125E-5,1.0000000000661502,2.0018498249209107E-5,89.849403156219267,-78.126974917447399,101.8730250825526,null,1000000000,3.0199488400000001,null,83.980964519653455,-78.094868848689558,null,55.845473616875758,-3.2043581657878344E-2,null,0,0]
[1.9055,1.9055000000000001E-3,1.0000001762280644,5.9368011330453163E-4,1.0000000000028668,2.3945219178254238E-6,1,0,5.3060009703802447,1.381196555877312,1.0000000952127328,4.3637764660620044E-4,1.0000000000923968,1.3593869730774571E-5,1.000000000061303,1.1072748251976958E-5,6.3078556267959014,1.2268598772047427E-5,1.0000000000795333,2.1950309824993028E-5,89.080317104264623,-79.147714040326107,100.85228595967389,null,1000000000,3.63093025,null,83.211878725402343,-79.112509694112816,null,55.845473359191274,-3.5135829025480382E-2,null,0,0]
[2.0893000000000002,2.0893000000000001E-3,1.0000002118647795,6.5094507019603691E-4,1.0000000000034466,2.6254918094519678E-6,1,0,5.8003998260229039,1.3975287556625642,1.0000001144665855,4.7846959084310592E-4,1.0000000001110809,1.4905102087721613E-5,1.0000000000736995,1.214079922469917E-5,6.3078556268907295,1.3451998642972121E-5,1.0000000000956164,2.4067584527612214E-5,88.306504846126913,-80.084539323233201,99.915460676766799,null,1000000000,4.3651744900000002,null,82.438066776958721,-80.045939250362565,null,55.845473049520102,-3.8524946677779968E-2,null,0,0]
[2.2909000000000002,2.2909000000000002E-3,1.0000002547237339,7.1375581233100243E-4,1.0000000000041438,2.8788298407460477E-6,1,0,6.3441666445710281,1.4125110866670381,1.0000001376224799,5.2463790204436314E-4,1.0000000001335521,1.634331995034218E-5,1.0000000000886085,1.3312284948828261E-5,6.3078556270047761,1.4750004159678206E-5,1.0000000001149592,2.6389905420148914E-5,87.52817164689219,-80.944125395942635,99.055874604057365,null,1000000000,5.2482228100000006,null,81.659733950181533,-80.901800739599352,null,55.845472677090086,-4.2242281100279805E-2,null,0,0]
[2.5118999999999998,2.5118999999999996E-3,1.0000003062399381,7.8261083566250511E-4,1.0000000000049818,3.1565466310035161E-6,1,0,6.9416275666867664,1.4262349106829759,1.0000001654557256,5.7524899458383184E-4,1.0000000001605622,1.7919937746093365E-5,1.000000000106529,1.4596502930098304E-5,6.3078556271418593,1.6172916953233318E-5,1.000000000138209,2.8935703620798365E-5,86.746436902916855,-81.731716123637611,98.268283876362389,null,1000000000,6.309641609999999,null,80.877999653897916,-81.685308466934714,null,55.845472229431479,-4.6317334832513685E-2,null,0,0]
[2.7542,2.7542000000000001E-3,1.0000003681697232,8.5810210382179482E-4,1.0000000000059894,3.4610297906381803E-6,1,0,7.5979264728141436,1.4387984952940913,1.0000001989152361,6.3073798540615763E-4,1.0000000001930318,1.9648510107576726E-5,1.0000000001280718,1.6004493956566494E-5,6.3078556273066519,1.7732970210527565E-5,1.0000000001661586,3.1726866082417454E-5,85.961761108457623,-82.452952772960174,97.547047227039826,null,1000000000,7.5856176399999997,null,80.093324397627597,-82.402068596443485,null,55.84547169128237,-5.0785142122242777E-2,null,0,0]
[3.02,3.0200000000000001E-3,1.000000442660727,9.4091504787154501E-4,1.0000000000072011,3.795043921181781E-6,1,0,8.3190290483349614,1.4502986040474155,1.0000002391613405,6.9160869392878078E-4,1.0000000002320877,2.1544731872535292E-5,1.0000000001539844,1.7549042098611521E-5,6.3078556275048712,1.9444328674271385E-5,1.0000000001997771,3.4788735592524819E-5,85.17420972408344,-83.1133921643425,96.8866078356575,null,1000000000,9.1204000000000001,null,79.305773660603151,-83.057597303509297,null,55.84547104398051,-5.56862689113179E-2,null,0,0]
[3.3113000000000001,3.3113000000000001E-3,1.0000005321746042,1.0316727854595119E-3,1.0000000000086575,4.1611022967539844E-6,1,0,9.1103657702971059,1.460809631062211,1.0000002875240257,7.5831913720817671E-4,1.0000000002790199,2.3622871075262907E-5,1.0000000001851228,1.9241769238386101E-5,6.3078556277430646,2.1319869383279458E-5,1.0000000002401754,3.8144351048865052E-5,84.384945906637157,-83.717308291855787,96.282691708144213,null,1000000000,10.964707690000001,null,78.516510621059922,-83.656131632245192,null,55.845470266134988,-6.1057593242743333E-2,null,0,0]
[3.6307999999999998,3.6308E-3,1.0000006398257548,1.131216525419093E-3,1.0000000000104086,4.5625978374163394E-6,1,0,9.979274640075003,1.4704201731367177,1.0000003456859459,8.3148763827413201E-4,1.0000000003354617,2.590218956205636E-5,1.0000000002225704,2.1098364916796457E-5,6.3078556280295217,2.337697633995167E-5,1.0000000002887595,4.1824814963393324E-5,83.593682249787463,-84.269792936889928,95.730207063110072,null,1000000000,13.182708639999998,null,77.725247899731656,-84.202713481596973,null,55.845469330682739,-6.6948900475086282E-2,null,0,0]
[3.9811000000000001,3.9811000000000004E-3,1.0000007692423913,1.2403563183858888E-3,1.000000000012514,5.0027977995242642E-6,1,0,10.932829594431411,1.4792006739809398,1.0000004156073581,9.1170961838409417E-4,1.0000000004033149,2.8401235777469957E-5,1.0000000002675895,2.3133937580626164E-5,6.3078556283738951,2.5632389694727125E-5,1.0000000003471663,4.5860077903178149E-5,82.801009652711016,-84.774897209161921,95.225102790838079,null,1000000000,15.849157210000001,null,76.932576427325245,-84.701345926468193,null,55.84546820609588,-7.3408131932100634E-2,null,0,0]
[4.3651999999999997,4.3651999999999996E-3,1.0000009248372108,1.3600268366489277E-3,1.0000000000150453,5.4854720942569805E-6,1,0,11.979198937568835,1.48722103157708,1.0000004996723633,9.9967210146174358E-4,1.0000000004848937,3.1141411772894237E-5,1.0000000003217151,2.536592005307715E-5,6.3078556287879293,2.8105425005791586E-5,1.0000000004173879,5.0284698214837409E-5,82.007105064405323,-85.236643255426628,94.763356744573372,null,1000000000,19.054971039999998,null,76.138673191185774,-85.15599568891605,null,55.845466854029638,-8.0490604438647195E-2,null,0,0]
[4.7862999999999998,4.7862999999999994E-3,1.0000011118771217,1.4912250610654718E-3,1.000000000018088,6.0146419602054721E-6,1,0,13.127101573162859,1.4945441764433802,1.0000006007265778,1.0961079118669682E-3,1.000000000582959,3.4145546403110765E-5,1.0000000003867788,2.7812907345545897E-5,6.3078556292856378,3.0816685535184606E-5,1.0000000005018008,5.5135538134764241E-5,81.212282947537318,-85.658655168550339,94.341344831449661,null,1000000000,22.908667689999998,null,75.343852699751096,-85.570227742296538,null,55.845465228716492,-8.8255322440738929E-2,null,0,0]
[5.2481,5.2481000000000003E-3,1.0000013367836227,1.6351037481043666E-3,1.0000000000217466,6.5949569544903879E-6,1,0,14.386624782372332,1.5012312257872049,1.0000007222394247,1.2018643767145428E-3,1.000000000700878,3.7440035531428935E-5,1.0000000004650151,3.0496399939942391E-5,6.3078556298841084,3.3789993804616493E-5,1.0000000006033032,6.045521962378879E-5,80.416480622792875,-86.044456027460711,93.955543972539289,null,1000000000,27.542553609999999,null,74.548052329511734,-85.947496808755233,null,55.845463274355978,-9.6770509677395533E-2,null,0,0]
[5.7544000000000004,5.7544000000000007E-3,1.0000016071519837,1.7928468040158824E-3,1.0000000000261451,7.2311922979379609E-6,1,0,15.768133724145478,1.507334691900406,1.000000868314495,1.3178117215491927E-3,1.0000000008426329,4.1051988422799572E-5,1.0000000005590659,3.3438479412244672E-5,6.3078556306035516,3.7049816187685387E-5,1.0000000007253231,6.628751658762997E-5,79.620051991293906,-86.397076461782802,93.602923538217198,null,1000000000,33.113119360000006,null,73.751626047594456,-86.290763313986716,null,55.84546092494805,-0.10610623344022764,null,0,0]
[6.3095999999999997,6.3095999999999994E-3,1.0000019322372007,1.9658250630846643E-3,1.0000000000314335,7.9288771936098444E-6,1,0,17.283635082955538,1.5129057982181391,1.0000010439521037,1.4449575741494404E-3,1.0000000010130758,4.5012794752374516E-5,1.0000000006721506,3.6664713903029506E-5,6.3078556314685947,4.0624482169570969E-5,1.0000000008720373,7.268311460133177E-5,78.82295481240773,-86.719476712345298,93.280523287654702,null,1000000000,39.811052159999996,null,72.95453169379492,-86.602906210317727,null,55.845458100070317,-0.11634362401778267,null,0,0]
[6.9183000000000003,6.9183000000000005E-3,1.0000023230335373,2.155471660752006E-3,1.0000000000377911,8.6937921719789704E-6,1,0,18.945685763070468,1.5179893222320673,1.0000012550922657,1.5843553597866471E-3,1.0000000012179713,4.9355270998607619E-5,1.0000000008080936,4.0201833741020095E-5,6.3078556325084953,4.4543608939242479E-5,1.0000000010484078,7.9695003129715279E-5,78.02544841943832,-87.0142488467541,92.9857511532459,null,1000000000,47.862874890000008,null,72.157028696960012,-86.886432582464252,null,55.845454704186977,-0.12756749889510774,null,0,0]
[7.5857999999999999,7.5858000000000002E-3,1.0000027929256414,2.3634378101575542E-3,1.0000000000454352,9.5325974094592564E-6,1,0,20.768757776053601,1.5226284582070198,1.0000015089664847,1.7372188043492621E-3,1.0000000014643371,5.4117227451793779E-5,1.0000000009715513,4.4080636913605635E-5,6.3078556337588676,4.8841320649137473E-5,1.0000000012604751,8.7384235251815358E-5,77.227442709047963,-87.283898253688093,92.716101746311907,null,1000000000,57.544361639999998,null,71.359027070067739,-87.143749904502101,null,55.84545062099086,-0.13987558210004847,null,0,0]
[8.3176000000000005,8.3176000000000014E-3,1.0000033577823033,2.5914370174669314E-3,1.0000000000546243,1.0452204409875373E-5,1,0,22.76787297685599,1.5268606549223802,1.0000018141484115,1.9048074279896133E-3,1.0000000017604933,5.9337901205432306E-5,1.0000000011680434,4.8333083596269033E-5,6.307855635261939,5.3553029155412697E-5,1.0000000015154009,9.581416793644596E-5,76.429201677121966,-87.530602281612389,92.469397718387611,null,1000000000,69.182469760000004,null,70.560790946906749,-87.376933916371129,null,55.845445712588884,-0.15336928439109707,null,0,0]
[9.1201000000000008,9.1201000000000008E-3,1.0000040369700469,2.8414631674611567E-3,1.0000000000656732,1.146065565040423E-5,1,0,24.960514968734319,1.5307223256907789,1.000002181101477,2.0885868488747564E-3,1.0000000021165938,6.5062949968162681E-5,1.0000000014043073,5.2996363811304073E-5,6.3078556370692445,5.871994098148064E-5,1.0000000018219257,1.0505852565641189E-4,75.630577331364947,-87.756484136532364,92.243515863467636,null,1000000000,83.176224010000013,null,69.762172503480656,-87.587989589464115,null,55.845439810694437,-0.16816661025231566,null,0,0]
[10,0.01,1.0000048535124633,3.1156035796571888E-3,1.0000000000789568,1.2566370599338535E-5,1,0,27.364990146262119,1.5342451461013811,1.0000026222649825,2.2900913746600714E-3,1.00000000254471,7.134017165337331E-5,1.0000000016883517,5.8109410863113912E-5,6.3078556392420495,6.4385194206290929E-5,1.0000000021904405,1.1519448871918773E-4,74.831738965202206,-87.96339730050903,92.03660269949097,null,1000000000,100,null,68.963341233293974,-87.778646630621381,null,55.845432715243149,-0.18439109398854331,null,0,0]
[10.965,1.0964999999999999E-2,1.0000058354346251,3.4162570887697761E-3,1.0000000000949307,1.3779025362027965E-5,1,0,30.002340276985873,1.5374594190841191,1.0000031527804747,2.511084304203741E-3,1.000000003059536,7.8224498191075824E-5,1.000000002029926,6.3716968996895023E-5,6.3078556418549301,7.0598365427822487E-5,1.0000000026335936,1.2631075688113077E-4,74.032538309907054,-88.15312236902156,91.84687763097844,null,1000000000,120.23122499999999,null,68.164149111162246,-87.95054338762192,null,55.845424182710772,-0.20218470642653119,null,0,0]
[12.023,1.2022999999999999E-2,1.0000070158674255,3.7458847838864129E-3,1.000000000114134,1.5108547371230402E-5,1,0,32.894156245876438,1.540391105614477,1.0000037905481349,2.7533747152771494E-3,1.0000000036784427,8.577228831402217E-5,1.0000000024405551,6.9864944645686754E-5,6.3078556449960477,7.7410318947438453E-5,1.0000000031663372,1.384983337883868E-4,73.233261213951522,-88.3271923124029,91.6728076875971,null,1000000000,144.55252899999999,null,67.364882273469036,-88.105066891391047,null,55.845413925207069,-0.22169310290901093,null,0,0]
[13.183,1.3183E-2,1.000008434976474,4.1072903923563327E-3,1.0000000001372202,1.6566246360464517E-5,1,0,36.065037624607427,1.5430650876879042,1.0000045572689493,3.0190235646737301E-3,1.0000000044224895,9.4047748172908083E-5,1.0000000029342118,7.6605636277216478E-5,6.307855648772283,8.4879001437187756E-5,1.0000000038067995,1.5186089448087945E-4,72.433902762118336,-88.487084616099793,91.512915383900207,null,1000000000,173.79148899999998,null,66.565536154039677,-88.243528369870802,null,55.845401593715252,-0.24308221732241911,null,0,0]
[14.454000000000001,1.4454E-2,1.0000101398399968,4.5032775435624043E-3,1.0000000001649552,1.8163432063242567E-5,1,0,39.53958585542766,1.5455025202017219,1.0000054783787744,3.3100917702805488E-3,1.0000000053163602,1.0311508391725314E-4,1.0000000035272727,8.3991342358575899E-5,6.3078556533089181,9.3062359568270406E-5,1.0000000045762274,1.6650211399855632E-4,71.634981408843174,-88.634063215182223,91.365936784817777,null,1000000000,208.91811600000003,null,65.766629616421312,-88.367025506239486,null,55.845386779154111,-0.2665179779401346,null,0,0]
[15.849,1.5848999999999999E-2,1.0000121915321021,4.9378959572388918E-3,1.0000000001983325,1.991644076130662E-5,1,0,43.353339345918435,1.5477280069878194,1.0000065868753563,3.6295562265342834E-3,1.0000000063920775,1.1306703776342439E-4,1.0000000042409845,9.2097605120221667E-5,6.3078556587684709,1.0204409408825993E-4,1.0000000055021854,1.8257174517688908E-4,70.835164416899033,-88.76961269913231,91.23038730086769,null,1000000000,251.19080099999999,null,64.96683045412081,-88.476802746475968,null,55.845368950829041,-0.29224006081686155,null,0,0]
[17.378,1.7378000000000001E-2,1.0000146572874851,5.414260514071117E-3,1.0000000002384457,2.1837838825208578E-5,1,0,47.533637049960404,1.549757040909463,1.0000079190851188,3.9797067377199211E-3,1.0000000076848941,1.239749498743961E-4,1.0000000050987361,1.0098253396832654E-4,6.3078556653298632,1.1188859018509915E-4,1.0000000066150188,2.0018498250477194E-4,70.035584738115887,-88.894678344248504,91.105321655751496,null,1000000000,301.99488400000001,null,64.167272203231491,-88.573620657627629,null,55.845347524519894,-0.32043281562780662,null,0,0]
[19.055,1.9054999999999999E-2,1.0000176226527087,5.9367320832617787E-3,1.0000000002866867,2.3945219173723484E-5,1,0,52.118755067323029,1.5516081983488175,1.0000095212284048,4.3637490442279487E-3,1.0000000092396646,1.3593869647876724E-4,1.0000000061302876,1.1072748207176732E-4,6.3078556732207396,1.2268598712222192E-4,1.0000000079533373,2.1950309826664804E-4,69.235713117561147,-89.010405140948222,90.989594859051778,null,1000000000,363.09302500000001,null,63.367426352207346,-88.658365635083939,null,55.845321756895061,-0.35135433399484378,null,0,{"$f":"IF(AH45>0,W43,0)","v":0}]
[20.893000000000001,2.0893000000000002E-2,1.0000211862557769,6.509359682134736E-3,1.0000000003446603,2.6254918088547314E-5,1,0,57.144236928780963,1.5532958560565617,1.0000114465937029,4.78465976153266E-3,1.0000000111081033,1.4905101978447119E-4,1.0000000073699502,1.2140799165644294E-4,6.3078556827035666,1.345199856411154E-4,1.0000000095616559,2.4067584529815914E-4,68.436130769125626,-89.117691685860564,90.882308314139436,null,1000000000,436.51744900000006,null,62.567874971990527,-88.731696172215848,null,55.84529079096658,-0.38524425172753779,null,0,0]
[22.909000000000002,2.2909000000000002E-2,1.0000254720522204,7.137438132018681E-3,1.000000000414383,2.8788298399587083E-5,1,0,62.65656423239917,1.5548356294470085,1.00001376215424,5.2463313679311854E-3,1.0000000133552054,1.6343319806285037E-4,1.0000000088608465,1.3312284870975905E-4,6.3078556941082118,1.4750004055715888E-4,1.0000000114959209,2.6389905423054063E-4,67.636230839537333,-89.21753058093978,90.78246941906022,null,1000000000,524.82228100000009,null,61.768012286438328,-88.794290892514411,null,55.845253549684884,-0.4224159360103335,null,0,0]
[25.119,2.5118999999999999E-2,1.0000306235296088,7.8259501824213297E-3,1.0000000004981893,3.1565466299656284E-5,1,0,68.699485641877729,1.5562396629770179,1.0000165454370629,5.752427129447556E-3,1.0000000160562084,1.7919937556194038E-4,1.0000000106528948,1.45965028274716E-4,6.3078557078165263,1.6172916816187876E-4,1.000000013820896,2.8935703624627997E-4,66.83647204869456,-89.31070977670187,90.68929022329813,null,1000000000,630.96416099999999,null,60.968298262281948,-88.846642272404026,null,55.845208786309243,-0.46316428561361439,null,0,0]
[27.542000000000002,2.7542000000000001E-2,1.0000368163013824,8.580812535470864E-3,1.0000000005989362,3.4610297892700425E-5,1,0,75.324953824273919,1.5575201238091236,1.0000198913277549,6.3072970501977469E-3,1.0000000193031973,1.9648509857252543E-4,1.0000000128071913,1.6004493821284569E-4,6.3078557242958668,1.7732970029875063E-4,1.0000000166158458,3.1726866087465648E-4,66.036739493953888,-89.398035787117934,90.601964212882066,null,1000000000,758.56176400000004,null,60.168619522841283,-88.889205968300715,null,55.845154974989235,-0.50783947489866554,null,0,0]
[30.2,3.0199999999999998E-2,1.0000442651027923,9.4088755992689649E-3,1.000000000720118,3.7950439193780811E-5,1,0,82.593125807806132,1.5586884858100771,1.0000239158509183,6.9159777744205123E-3,1.0000000232087733,2.1544731542517609E-4,1.0000000153984439,1.7549041920261082E-4,6.3078557441177123,1.9444328436106143E-4,1.0000000199776957,3.4788735599180175E-4,65.236609114895927,-89.480292657234003,90.519707342765997,null,1000000000,912.04,null,59.368553873562803,-88.922359798363644,null,55.845090249997014,-0.55684693968584931,null,0,0]
[33.113,3.3112999999999997E-2,1.0000532160585998,1.0316365517903341E-2,1.0000000008657386,4.1611022943763817E-5,1,0,90.558690620282903,1.5597535398763067,1.000028751993377,7.5830474739670304E-3,1.0000000279020016,2.3622870640240161E-4,1.0000000185122839,1.92417690032881E-4,6.3078557679371032,2.131986906933477E-4,1.0000000240175426,3.8144351057637998E-4,64.436848660539923,-89.55809914461345,90.44190085538655,null,1000000000,1096.470769,null,58.568871202009383,-88.946353308909579,null,55.845012472947161,-0.61055517207059673,null,0,0]
[36.308,3.6308E-2,1.0000639805491973,1.1311687595106427E-2,1.0000000010408649,4.5625978342819678E-5,1,0,99.295479424817771,1.5607252046191802,1.0000345680030898,8.3146866844426882E-3,1.0000000335461705,2.5902188988569656E-4,1.0000000222570498,2.1098364606868806E-4,6.3078557965827757,2.3376975926081117E-4,1.0000000288759425,4.1824814974958618E-4,63.636818734362713,-89.6321788971524,90.3678211028476,null,1000000000,1318.2708640000001,null,57.768934817127693,-88.961411712123819,null,55.84491893856999,-0.66946163690966565,null,0,0]
[39.811,3.9810999999999999E-2,1.0000769213102818,1.2402933513122407E-2,1.0000000012513992,5.0027977953923348E-5,1,0,108.87458975393444,1.5616113180327098,1.0000415598808314,9.1168461135869728E-3,1.0000000403315088,2.8401235021463278E-4,1.0000000267589531,2.3133937172059804E-4,6.3078558310201869,2.5632389149136611E-4,1.0000000347166405,4.586007791842425E-4,62.836825861846577,-89.703130518408528,90.296869481591472,null,1000000000,1584.9157210000001,null,56.969054395936006,-88.96765376901449,null,55.844806495562665,-0.73404524185638464,null,0,0]
[43.652000000000001,4.3652000000000003E-2,1.0000924794876356,1.3599438308371724E-2,1.0000000015045201,5.4854720888099988E-5,1,0,119.37805794443564,1.5624194800562656,1.0000499660005111,9.9963913587649417E-3,1.0000000484893752,3.1141410776276056E-4,1.0000000321714946,2.5365919514477858E-4,6.3078558724235476,2.8105424286557957E-4,1.0000000417387862,5.0284698234935826E-4,62.03680405048965,-89.771561922933273,90.228438077066727,null,1000000000,1905.497104,null,56.169167778539901,-88.965133816743361,null,55.844671311601353,-0.80485848557416784,null,0,0]
[47.863,4.7863000000000003E-2,1.0001111815933001,1.4911156437723068E-2,1.0000000018087958,6.0146419530251606E-5,1,0,130.89339009748917,1.5631564472923394,1.0000600708715843,1.0960644565641388E-2,1.0000000582959152,3.4145545089350542E-4,1.00000003867789,2.7812906635554503E-4,6.307855922194368,3.0816684587077752E-4,1.0000000501800814,5.5135538161258301E-4,61.236865090091939,-89.838044102962925,90.161955897037075,null,1000000000,2290.8667689999997,null,55.369391328725499,-88.953832532033218,null,55.844508813038416,-0.88249053293557067,null,0,0]
[52.481000000000002,5.2481E-2,1.0001336695178484,1.6349595097737656E-2,1.0000000021746729,6.594956945024751E-5,1,0,143.52176581577086,1.5638286861328834,1.0000722213605888,1.2018070914475062E-2,1.0000000700878107,3.7440033799529543E-4,1.0000000465015195,3.0496399003977325E-4,6.3078559820413993,3.3789992554749375E-4,1.0000000603303352,6.0455219658715265E-4,60.436774052935121,-89.903160060875948,90.096839939124052,null,1000000000,2754.255361,null,54.56949569472927,-88.933650516451465,null,55.844313424331744,-0.96762245432342131,null,0,0]
[57.544000000000004,5.7544000000000005E-2,1.0001607024148917,1.7926566697920435E-2,1.0000000026145071,7.2311922854599996E-5,1,0,157.36709984699277,1.5644417156265868,1.0000868277176755,1.3177362072683515E-2,1.0000000842632844,4.1051986139743968E-4,1.0000000559065938,3.3438478178419946E-4,6.3078560539857298,3.7049814540063053E-4,1.0000000725323315,6.6287516633671334E-4,59.636742456734694,-89.967444063652721,90.032555936347279,null,1000000000,3311.3119360000005,null,53.769698988274712,-88.9044215247811,null,55.844078551961466,-1.0609533955500112,null,0,0]
[63.095999999999997,6.3095999999999999E-2,1.0001932052426046,1.9655744241526326E-2,1.0000000031433547,7.9288771771604853E-5,1,0,172.54971506228907,1.5650008631654104,1.0001043898162492,1.444858027834244E-2,1.0000001013075794,4.5012791742684113E-4,1.00000006721506,3.6664712276511757E-4,6.3078561404901015,4.0624479997555042E-4,1.0000000872037595,7.2683114662026762E-4,58.836606321253043,-90.031453669734816,89.968546330265184,null,1000000000,3981.1052159999995,null,52.969845262552397,-88.865892255257549,null,55.843796163094169,-1.1632926346919923,null,0,0]
[69.183000000000007,6.9183000000000008E-2,1.0002322766473253,2.1551412754971636E-2,1.000000003779101,8.6937921502948558E-5,1,0,189.19540402266941,1.5655107615277013,1.0001255014300339,1.5842241377526226E-2,1.0000001217971315,4.9355267031129884E-4,1.0000000808093685,4.0201831596888249E-4,6.3078562444800745,4.4543606076016107E-4,1.0000001048408049,7.9695003209725405E-4,58.036523309780975,-90.095717781091651,89.904282218908349,null,1000000000,4786.2874890000012,null,52.170101721593731,-88.817744435354314,null,55.843456717695844,-1.2754856922019693,null,0,0]
[75.858000000000004,7.5858000000000009E-2,1.0002792539627925,2.3630022963517187E-2,1.0000000045435207,9.5325973808736326E-5,1,0,207.44910208539994,1.565975848601485,1.0001508853791075,1.7370458229528322E-2,1.0000001464337049,5.4117222221567493E-4,1.0000000971551228,4.4080634087050432E-4,6.3078563695172942,4.8841316874618027E-4,1.0000001260475349,8.7384235357290511E-4,57.236315860882989,-90.160793945631127,89.839206054368873,null,1000000000,5754.4361640000006,null,51.37030241589563,-88.759559985267657,null,55.843048604694232,-1.3985062900470702,null,0,0]
[83.176000000000002,8.3176E-2,1.0003357224392877,2.5908629510548911E-2,1.0000000054624287,1.0452204372193052E-4,1,0,227.46121425206744,1.5663999587167718,1.0001813985529862,1.9045794078184668E-2,1.0000001760493109,5.9337894310811394E-4,1.0000001168043418,4.8333079870230088E-4,6.3078565198244414,5.3553024179742517E-4,1.0000001515401313,9.5814168075485735E-4,56.436174139412699,-90.227215992190139,89.772784007809861,null,1000000000,6918.2469760000004,null,50.570651272355846,-88.69086125621827,null,55.842558063065049,-1.533363928186148,null,0,0]
[91.201000000000008,9.1201000000000004E-2,1.0004036163664618,2.8407064545969179E-2,1.0000000065673313,1.146065560072872E-4,1,0,249.40675762785781,1.5667868015963886,1.0002180866046742,2.0882862698531252E-2,1.0000002116593512,6.5062940879184056E-4,1.0000001404307193,5.299635889937502E-4,6.3078567005549511,5.8719934422199038E-4,1.0000001821926356,1.0505852583970353E-3,55.635885368816261,-90.295561557238329,89.704438442761671,null,1000000000,8317.6224010000005,null,49.770952303293768,-88.611049651900856,null,55.841968305179705,-1.6812325381219,null,0,0]
[100,0.1,1.0004852346977924,3.11460613371588E-2,1.0000000078956834,1.2566370533853279E-4,1,0,273.46895357700527,1.5671395964219013,1.0002621924696042,2.2896951544230677E-2,1.0000002544709732,7.1340159671733549E-4,1.0000001688351676,5.8109404387912688E-4,6.3078569178354229,6.4385185559450223E-4,1.0000002190441417,1.1519448896081304E-3,54.835562781856709,-90.366396300728454,89.633603699271546,null,1000000000,10000,null,48.971338690253802,-88.519461097348113,null,55.841259383736464,-1.8433394456334464,null,0,0]
[109.65,0.10965000000000001,1.0005833750019242,3.4149422768406594E-2,1.000000009493077,1.3779025275696436E-4,1,0,299.85837025103183,1.5674614128727882,1.0003152288598582,2.5105619866156382E-2,1.0000003059535603,7.8224482395257183E-4,1.000000202992587,6.3716960460408483E-4,6.3078571791233724,7.0598354028387014E-4,1.0000002633594733,1.2631075719967274E-3,54.035007506682447,-90.440333355663981,89.559666644336019,null,1000000000,12023.122500000001,null,48.171635829861543,-88.415296874820854,null,55.840407032059225,-2.021093732752508,null,0,0]
[120.23,0.12023,1.0007013432624832,3.7441517214850346E-2,1.0000000114134102,1.5108547257419971E-4,1,0,328.79104536591808,1.5677548767437703,1.0003789837175707,2.7526861997596821E-2,1.0000003678442062,8.5772267490473626E-4,1.0000002440554956,6.9864933392079062E-4,6.3078574932350184,7.7410303919619615E-4,1.0000003166338949,1.3849833420831713E-3,53.234459925980389,-90.517969959577115,89.482030040422885,null,1000000000,14455.252900000001,null,47.372112772594193,-88.297708722928817,null,55.839382584486941,-2.2159380577824681,null,0,0]
[131.83000000000001,0.13183,1.0008431457574407,4.1050061414146577E-2,1.000000013722026,1.6566246210431698E-4,1,0,360.5130980788839,1.5680224989154561,1.0004556241366791,3.0181159999276241E-2,1.0000004422488518,9.4047720721860957E-4,1.0000002934211336,7.660562144192922E-4,6.3078578708585749,8.487898162647347E-4,1.0000003806801716,1.5186089503445781E-3,52.433871993936364,-90.599957436548451,89.400042563451549,null,1000000000,17379.148900000004,null,46.572756198396796,-88.165703756090622,null,55.838151317841763,-2.4295133942427674,null,0,0]
[144.54,0.14454,1.0010134755741211,4.5002674804224617E-2,1.000000016495513,1.8163431865496582E-4,1,0,395.27064773629911,1.5682664119821661,1.0005476893962195,3.3088957168852157E-2,1.0000005316358891,1.0311504773627836E-3,1.000000352727219,8.3991322805399232E-4,6.3078583245218036,9.3062333457391414E-4,1.0000004576230646,1.6650211472817773E-3,51.633721289795737,-90.686922082469408,89.313077917530592,null,1000000000,20891.811599999997,null,45.774084341912285,-88.018269635409851,null,55.836672579751728,-2.6634551407908522,null,0,0]
[158.49,0.15849000000000002,1.0012184183702286,4.9339285274157825E-2,1.0000000198332304,1.9916440500601767E-4,1,0,433.41920036407703,1.56848908962962,1.0006584729116943,3.6279795822400249E-2,1.0000006392075524,1.1306699006306494E-3,1.0000004240983558,9.2097579341657071E-4,6.3078588704769052,1.020440596641364E-3,1.0000005502190183,1.8257174613880143E-3,50.832631372914264,-90.779734932054509,89.220265067945491,null,1000000000,25119.080100000003,null,44.974773458394225,-87.853908579590367,null,55.8348936782442,-2.9201274390227412,null,0,0]
[173.78,0.17377999999999999,1.0014646668657838,5.409032057180143E-2,1.0000000238445599,2.1837838481537569E-4,1,0,475.23222230793317,1.5686920908213506,1.0007915983335045,3.9776286806707167E-2,1.0000007684891223,1.239748869939859E-3,1.0000005098734819,1.0098249998605005E-3,6.3078595266156308,1.1188854480592174E-3,1.0000006615025583,2.0018498377278892E-3,50.031693952686396,-90.879036454439515,89.120963545560485,null,1000000000,30199.488400000002,null,44.175973150089625,-87.6714552789729,null,55.832756724787636,-3.2013324720658831,null,0,0]
[190.55,0.19055000000000002,1.0017607307124299,5.9298416689440608E-2,1.0000000286686757,2.3945218720648198E-4,1,0,521.09256661054098,1.5688772807791487,1.0009516745309541,4.3610099893368233E-2,1.0000009239660446,1.3593861358101307E-3,1.0000006130285815,1.1072743727157327E-3,6.3078603157028335,1.2268592729703918E-3,1.0000007953347152,2.1950309993830617E-3,49.230333078392839,-90.985706417483229,89.014293582516771,null,1000000000,36309.302500000005,null,43.377181024333716,-87.469259282831047,null,55.830188166825572,-3.5095954245662924,null,0,0]
[208.93,0.20893,1.0021164084282341,6.5002807680200572E-2,1.0000000344660356,2.6254917491311388E-4,1,0,571.35573981300422,1.5690461028260698,1.001144011540307,4.7810500282139831E-2,1.0000011108097244,1.4905091051012416E-3,1.0000007369947574,1.214079326016184E-3,6.307861263984802,1.3451990678061867E-3,1.0000009561669987,2.4067584750167887E-3,48.429081016273358,-91.100532943633695,88.899467056366305,null,1000000000,43651.744900000005,null,42.579013937885662,-87.245779651548901,null,55.827103420177394,-3.8472406842608198,null,0,0]
[229.09,0.22909000000000002,1.0025440016910019,7.1254755436360798E-2,1.0000000414383055,2.8788297612247825E-4,1,0,626.48663524521908,1.5692001228722812,1.0013752791974047,5.2415739701060102E-2,1.0000013355196435,1.6343305400594345E-3,1.0000008860842604,1.3312277085748749E-3,6.307862404448171,1.4749993659497426E-3,1.000001149594129,2.6389905713540334E-3,47.6272736932371,-91.224526741888241,88.775473258111759,null,1000000000,52482.2281,null,41.780913903431347,-86.998983928750434,null,55.823396407033073,-4.2173053039472261,null,0,0]
[251.19,0.25119000000000002,1.0030577250098025,7.8101906298802592E-2,1.0000000498189319,3.1565465261768159E-4,1,0,686.92279969866797,1.5693405586159266,1.0016531908738238,5.7461579316745504E-2,1.0000016056195555,1.7919918566298109E-3,1.0000010652889217,1.459649256481409E-3,6.3078637752780482,1.6172903111664886E-3,1.0000013820925371,2.8935704007545687E-3,46.825307236149968,-91.358603785356564,88.641396214643436,null,1000000000,63096.416100000002,null,40.983399405278305,-86.72695831779653,null,55.818944779173108,-4.6226133004382683,null,0,0]
[275.42,0.27542,1.0036749452987614,8.5600538863786407E-2,1.0000000598936343,3.4610296524562381E-4,1,0,753.18382010164009,1.569468629269926,1.0019871781202938,6.2990363709033478E-2,1.0000019303178846,1.9648484824892434E-3,1.0000012807183143,1.6004480293112884E-3,6.3078654232097096,1.7732951964658577E-3,1.0000016615888421,3.1726866592213221E-3,46.022993250284401,-91.503828505039849,88.496171494960151,null,1000000000,75856.176400000011,null,40.186431278319212,-86.427424169014628,null,55.813599318264373,-5.066500922835167,null,0,0]
[302,0.30199999999999999,1.0044168539497949,9.381532735627944E-2,1.0000000720117892,3.7950437390080741E-4,1,0,825.87132355495248,1.5695854841177925,1.0023887606016253,6.9050925073757277E-2,1.0000023208746647,2.1544698540841376E-3,1.0000015398432076,1.7549024085250272E-3,6.3078674053909243,1.9444304619635059E-3,1.0000019977757295,3.4788736264600257E-3,45.219820788919776,-91.661401627251493,88.338598372748507,null,1000000000,91204,null,39.38968028018494,-86.09773937485545,null,55.807178333757179,-5.5528030948222895,null,0,0]
[331.13,0.33112999999999998,1.0053076618204186,0.10280361469958436,1.0000000865738579,4.161102056616229E-4,1,0,905.53224386877116,1.5696920036633617,1.0028711190093651,7.568707103202052E-2,1.0000027901962976,2.3622827138111281E-3,1.0000018512267039,1.9241745493540233E-3,6.3078697873252541,2.1319837674950363E-3,1.0000024017631568,3.8144351934750625E-3,44.416460804781224,-91.832355657288787,88.167644342711213,null,1000000000,109647.0769,null,38.594024273690003,-85.735526138987936,null,55.79947493138188,-6.0849229271438494,null,0,0]
[363.08,0.36307999999999996,{"$f":"SQRT(1+(A77/pole1)^2)","v":1.0063779206592962},{"$f":"ATAN(A77/pole1)","v":0.11264285068248303},{"$f":"SQRT(1+(A77/Zero1)^2)","v":1.0000001040864896},{"$f":"ATAN(A77/Zero1)","v":4.5625975208448278E-4},{"$f":"IF(VIN_nom>Vout, 1, SQRT(1+(A77/z_RHP)^2))","v":1},{"$f":"IF(VIN_nom>Vout, 0, -ATAN(A77/z_RHP))","v":0},{"$f":"SQRT(1+(A77/Pole2)^2)","v":992.90494178468111},{"$f":"ATAN(A77/Pole2)","v":1.5697891808668487},{"$f":"SQRT(1+(A77/Zero2)^2)","v":1.0034509056813194},{"$f":"ATAN(A77/Zero2)","v":8.2957951508537936E-2},{"$f":"SQRT(1+(A77/pole4)^2)","v":1.0000033546114955},{"$f":"ATAN(A77/pole4)","v":2.5902131640129934E-3},{"$f":"IF(VOUT_setting=1,1,SQRT(1+(A77*zterm1)^2))","v":1.0000022257025347},{"$f":"IF(VOUT_setting=1,0,ATAN(((A77*zterm1))))","v":2.10983336141863E-3},6.3078726518854564,{"$f":"IF(VOUT_setting=1,0,ATAN(A77*$Q$4/(1+Afbr-$Q$5*(A77)^2)))","v":2.3376934539159401E-3},{"$f":"SQRT((1-(Z77/pterm2))^2+(A77/pterm1)^2)","v":1.0000028876071105},{"$f":"IF((ATAN((A77/pterm1)/(1-A77^2/pterm2))>0),ATAN((A77/pterm1)/(1-A77^2/pterm2)),PI()+ATAN((A77/pterm1)/(1-A77^2/pterm2)))","v":4.1824816131199594E-3},{"$f":"20*LOG10(((E77*K77*G77*O77)/(C77*I77*S77*M77*Q77))*Adc)","v":43.612154024210376},{"$f":"((F77+L77+H77+P77)-(D77+J77+T77+N77+R77))*radconv","v":-92.018074822176914},{"$f":"IF(V77>0,V77,V77+180)","v":87.981925177823086},null,{"$f":"IF(U77<0,A77,1000000000)","v":1000000000},{"$f":"A77^2","v":131827.0864},null,{"$f":"20*LOG10((K77/(I77*M77))*AEA)","v":37.7989644038866},{"$f":"(L77-(J77+N77))*radconv","v":-85.337562670328452},null,{"$f":"20*LOG10((E77*G77/(C77*S77))*Acs*Am)","v":55.790228712442456},{"$f":"(F77+H77-(D77+T77))*radconv","v":-6.6674567302139982},null,{"$f":"SUM((U78<0)*(U77>0))*A77","v":0},{"$f":"IF(AH77>0,W75,0)","v":0}]
[398.11,{"$f":"A78/1000","v":0.39811000000000002},1.0076630655854968,0.1234054130345716,1.0000001251399213,5.002797382199555E-4,1,0,1088.7004314359174,1.5698778003465363,1.0041474736753855,9.091963056154645E-2,1.0000040331428375,2.8401159421161527E-3,1.0000026758917606,2.3133896315555083E-3,6.307876095616459,2.5632334590297897E-3,1.0000034716826385,4.5860079442577072E-3,42.807070558573486,-92.219807282504974,87.780192717495026,null,1000000000,158491.57210000002,null,37.004971467982195,-84.900787958896913,null,55.779139014414085,-7.3047043267400324,null,0,0]
[436.52,0.43651999999999996,1.0092060011576813,0.13517341590801565,1.0000001504520093,5.4854715441118602E-4,1,0,1193.7391138177986,1.5699586227225555,1.0049843032417671,9.9636220155039479E-2,1.000004848925883,3.1141311115037698E-3,1.0000032171443269,2.536586565475619E-3,{"$f":"IF(VOUT_setting=1,1,SQRT((1+Afbr-$Q$5*(A79)^2)^2+(A79*$Q$4)^2))","v":6.3078802359377715},2.8105352363531799E-3,1.000004173905505,5.0284700244052228E-3,42.00098190608449,-92.438937875355421,87.561062124644579,null,1000000000,190549.71039999998,null,36.212179373456493,-84.421694856659244,null,55.765843456388559,-8.0015469160337336,null,0,0]
[478.63,0.47863,1.0110576416776134,0.14803176072966553,1.0000001808795731,6.0146412349941785E-4,1,0,1308.8960833929286,1.5700323241288552,1.0059893315377828,0.10917499821187973,1.0000058295747083,3.4145413714246728E-3,1.0000038677815972,2.7812835636744212E-3,6.3078852129987251,3.0816589776925104E-3,1.0000050180469848,5.5135540809517153E-3,41.193810334104469,-92.676845551607855,87.323154448392145,null,1000000000,229086.67689999999,null,35.420937903835316,-83.896598151231345,null,55.749914556047962,-8.763037156864117,null,0,0]
[524.80999999999995,0.52481,1.0132796703396818,0.16207626970537309,1.0000002174672626,6.5949559984613214E-4,1,0,1435.1831682010827,1.5700995515657323,1.0071965020343729,0.11961277008768217,1.0000070087567483,3.7439860611046599E-3,1.0000046501412374,3.0496305407992988E-3,6.3078911976712968,3.3789867568883602E-3,1.0000060330896845,6.0455223149543944E-3,40.385095271003955,-92.935039057858276,87.064960942141724,null,1000000000,275425.53609999997,null,34.631301053088499,-83.321285513272329,null,55.730837789059144,-9.5948828234260866,null,0,0]
[575.44000000000005,0.57544000000000006,1.0159444204802612,0.17740016743722309,1.0000002614506762,7.2311910376641542E-4,1,0,1573.6395430419695,1.5701608572099301,1.0086457740160237,0.13102624910335398,1.0000084262932756,4.1051757836491516E-3,1.0000055906439036,3.3438354796774517E-3,6.3078983920601557,3.704964977916923E-3,1.0000072533143276,6.628752123492467E-3,39.574789333780359,-93.214888471353689,86.785111528646311,null,1000000000,331131.19360000006,null,33.843819473085233,-82.691548536771791,null,55.708015169358788,-10.502648738451448,null,0,0]
[630.96,0.63096000000000008,1.0191392355058746,0.19410760283456646,1.0000003143354184,7.9288755322250799E-4,1,0,1725.4684630000386,1.5702167740082629,1.0103855961825641,0.14350262569367991,1.0000101307071552,4.5012490777303158E-3,1.0000067214836448,3.6664549626048686E-3,6.3079070424333414,4.0624262798086095E-3,1.0000087204932921,7.2683120726958232E-3,38.76242286048268,-93.517850346205833,86.482149653794167,null,1000000000,398110.52160000004,null,33.058738815806123,-82.002601938420099,null,55.68073144248865,-11.492560922475787,null,0,0]
[691.83,0.69183000000000006,1.0229666293233293,0.21229941099142013,1.0000003779100402,8.6937899818843466E-4,1,0,1891.9278766195371,1.5702677653952148,1.0124731409117287,0.15712960686167818,1.0000121796397248,4.9354870289153342E-3,1.0000080809045389,4.0201617185782468E-3,6.3079174413382537,4.4543319756745227E-3,1.0000104842500761,7.9695011203497236E-3,37.947805169602532,-93.845178434563522,86.154821565436478,null,1000000000,478628.74890000006,null,32.276697302727172,-81.249635022300339,null,55.648157776113095,-12.570667288913047,null,0,0]
[758.58,0.75858000000000003,1.0275497996866512,0.23208545000377295,1.0000004543519636,9.5325945223126852E-4,1,0,2074.4671594421229,1.5703142752790762,1.0149775132786245,0.17200542726058726,1.0000146432643513,5.4116699208127342E-3,1.0000097154655712,4.4080351434824683E-3,6.3079299449266646,4.8840939428007671E-3,1.0000126049986162,8.7384245893329382E-3,37.130353189121983,-94.198111438256944,85.801888561743056,null,1000000000,575443.61640000006,null,31.498094344458664,-80.427261385741474,null,55.609311773611481,-13.743573892483301,null,0,0]
[831.76,0.83175999999999994,1.0330323125697283,0.25356635722394455,1.0000005462427359,1.0452200603963634E-3,1,0,2274.5903804646878,1.5703566871829462,1.0179798628365615,0.18822612055033028,1.0000176047776745,5.9337204863283994E-3,1.0000116803666523,4.8332707271557512E-3,6.3079449754483239,5.3552526621181299E-3,1.0000151543674327,9.5814181961277629E-3,36.30980459265573,-94.577503036380236,85.422496963619764,null,1000000000,691824.69759999996,null,30.723791268118447,-79.530225435627344,null,55.563069883448229,-15.017370238863293,null,0,0]
[912.01,0.91200999999999999,1.0395862464988204,0.27685013527217167,1.000000656732924,1.1460650633181709E-3,1,0,2494.0477291030543,1.5703953721479085,1.0215782285814152,0.20589912566677102,1.0000211657133589,6.5062032004404953E-3,1.0000140429743098,5.2995867714745876E-3,6.3079630482203184,5.871927850743996E-3,1.0000182197756997,1.0505854414004243E-2,35.485428841593759,-94.984067641317807,85.015932358682193,null,1000000000,831762.24009999994,null,29.954377928714557,-78.55265415861092,null,55.508111836444641,-16.398620754385323,null,0,0]
[1000,1,1.0474113255209978,0.30202951444012244,1.0000007895680385,1.2566363985333933E-3,1,0,2734.6714349351419,1.5704306521440001,1.0258876002808324,0.22512748549902786,1.0000254467767749,7.1338961544340036E-3,1.0000168833756682,5.810875688090673E-3,6.3079847758641723,6.4384320896621414E-3,1.0000219051544457,1.1519451307766163E-2,34.656775906085748,-95.417924643750325,84.582075356249675,null,1000000000,1000000,null,29.190895903147172,-77.488935844019466,null,55.44294617378241,-17.893032466473311,null,0,0]
[1096.5,1.0965,1.0567445448281869,0.3291962249124652,1.0000009493072493,1.3779016642553354E-3,1,0,2998.5671946715634,1.5704628341787188,1.0310459295759156,0.24602211585594225,1.0000305948926873,7.8222902871377346E-3,1.0000202990547198,6.3716106832546185E-3,6.3080109040760908,7.0597214118508613E-3,1.0000263370174045,1.263107889814606E-2,33.823024801173219,-95.878787425631359,84.121212574368641,null,1000000000,1202312.25,null,28.434243194731849,-76.333047681972559,null,55.365854087247996,-19.506313903027518,null,0,0]
[1202.3,1.2022999999999999,1.0678566573907875,0.35841137184808336,1.0000011413403671,1.5108535876392514E-3,1,0,3287.8953984701702,1.5704921808613359,1.0372131441415364,0.26868057517643801,1.0000367837508715,8.5770185227522899E-3,1.0000244052547229,6.9863808064263141E-3,6.3080423143978699,7.7408801191097059E-3,1.0000316649362728,1.3849837608658792E-2,32.983775807356167,-96.365398069701527,83.634601930298473,null,1000000000,1445525.2899999998,null,27.685905294232874,-75.07973777484392,null,55.274950579430552,-21.242430668545939,null,0,{"$f":"IF(AH90>0,W90,0)","v":0}]
[1318.3,1.3183,1.0810644018581752,0.38972317156478598,1.0000013722016512,1.6566231207174151E-3,1,0,3605.117250332296,1.570518943302659,1.0445791433257769,0.29320200116284972,1.0000442239170653,9.4044975762806338E-3,1.0000293416871948,7.6604137965430794E-3,6.3080800755354893,8.4877000639618696E-3,1.0000380702529641,1.5186095021039655E-2,32.138315030140262,-96.875782575042308,83.124217424957692,null,1000000000,1737914.89,null,26.947279409739973,-73.723707988970546,null,55.168124805779151,-23.104674574445379,null,0,0]
[1445.4,1.4454,1.0967213994894867,0.42312898440276314,1.0000016495499615,1.8163412090937291E-3,1,0,3952.6939542781897,1.570543334779265,1.0533602781628697,0.31965844685136574,1.000053162189924,1.0311142986958137E-2,1.0000352721060612,8.398936757048418E-3,6.3081254400990083,9.3059722503494174E-3,1.0000457655373685,1.6650218740212514E-2,31.286502827776125,-97.406602699292407,82.593397300707593,null,1000000000,2089181.1600000001,null,26.220437607374102,-72.261209792642703,null,55.04316536083973,-25.093423600955628,null,0,0]
[1584.9,1.5849000000000002,1.1152722216473387,0.45867018052941211,1.0000019833210967,1.991641443017847E-3,1,0,4334.1805828118877,1.570565602673055,1.0638317258835592,0.34817104209378291,1.0000639187328855,1.1306222039293464E-2,1.000042408945325,9.2095001616366492E-3,6.3081800330638389,1.0204061746419251E-2,1.0000550265724897,1.8257184187321616E-2,30.426271087619348,-97.954644802810932,82.045355197189068,null,1000000000,2511908.0100000002,null,25.505987940707389,-70.68584810680079,null,54.897396470692463,-27.211812514671134,null,0,0]
[1737.8,1.7378,1.1371666096309503,0.49624079315288472,1.0000023844531807,2.1837804114535103E-3,1,0,4752.3118071075351,1.5705859028900753,1.076281714744354,0.3787575484681967,1.0000768459891161,1.2396859953271935E-2,1.0000509860613906,1.0097910196628722E-2,6.3082456432585916,1.1188400722481241E-2,1.0000661570067546,2.0018510985050482E-2,29.558287475030429,-98.513860844736584,81.486139155263416,null,1000000000,3019948.84,null,24.806977636342896,-68.99702244577351,null,54.728439005898871,-29.454357894161323,null,0,0]
[1905.5,1.9055,1.1629514864129782,0.53575961720621845,1.0000028668634982,2.3945173413275301E-3,1,0,5210.9161668248034,1.5706044219600992,1.0910662100130022,0.41146803584778568,1.0000923923789642,1.3593032472451982E-2,1.0000613009980246,1.1072295758167122E-2,6.3083245466613107,1.2267994531233554E-2,1.0000795432302592,2.195032659565932E-2,28.6815910552316,-99.078185036913894,80.921814963086106,null,1000000000,3630930.25,null,24.12516232205941,-67.192446272516506,null,54.533576953256102,-31.81723027105345,null,0,0]
[2089.3000000000002,2.0893000000000002,1.1932014097001127,0.57703937101243674,1.0000034465976813,2.6254857767965666E-3,1,0,5713.5487345192514,1.5706213042210864,1.1085725886480469,0.44627543186274971,1.0001110748653264,1.4903998453163932E-2,1.0000736967873063,1.214020276413354E-2,6.3084193671753566,1.3451202157650194E-2,1.0000956308042643,2.4067606603514931E-2,27.796651619373204,-99.639787853447828,80.360212146552172,null,1000000000,4365174.4900000012,null,23.463423662335131,-65.27420948290991,null,54.310399072678138,-34.290463638259375,null,0,0]
[2290.9,2.2909000000000002,1.2285957564067798,0.61989859730899322,1.0000041438220404,2.8788218878713725E-3,1,0,6264.8584512411471,1.5706367062684268,1.1292674522751607,0.48316313776160763,1.0001335431366387,1.6341865062327054E-2,1.0000886045399076,1.3311498645794839E-2,6.3085334024040014,1.4748954171667545E-2,1.0001149798005484,2.6389934473943964E-2,26.902908870636779,-100.19098682899427,79.809013171005731,null,1000000000,5248222.8100000005,null,22.823775499930548,-63.243965777181927,null,54.056332020319715,-36.864660916847967,null,0,0]
[2511.9,2.5119000000000002,1.2698346231632118,0.66404758907118688,1.0000049818809074,3.1565361473576306E-3,1,0,6869.22079093296,1.5706507498751896,1.1536513679493019,0.52202143339346119,1.0001605491964241,1.7918019942471559E-2,1.0001065232753052,1.4595466430222533E-2,6.3086704693394164,1.6171532871751607E-2,1.0001382387211186,2.8935741842548188E-2,26.001314682983676,-100.7231270336016,79.2768729663984,null,1000000000,6309641.6100000003,null,22.209172193093082,-61.108661097853016,null,53.769374232772485,-39.524163980313588,null,0,0]
[2754.2,2.7542,1.3177023875090963,0.70917910889225866,1.0000059893456696,3.4610159711740791E-3,1,0,7531.8316289127151,1.570663556965165,1.1822988250636681,0.56271493015666196,1.0001930133476973,1.9645982168509081E-2,1.0001280637132675,1.6003127683794718E-2,6.3088352393066547,1.7731145779579367E-2,1.0001662014736665,3.1726916343129338E-2,25.092546416992285,-101.22832905808519,78.771670941914806,null,1000000000,7585617.6399999987,null,21.622081170204975,-58.876834212055513,null,53.447736769002255,-42.252486702105848,null,0,0]
[3020,3.02,1.3730701547409634,0.75496590667973484,1.0000072011532537,3.7950257021632516E-3,1,0,8258.7072418775624,1.5706752424686024,1.2158629602246487,0.60507206070021291,1.0002320608096917,2.1541399291935461E-2,1.0001539725855424,1.7547240913621379E-2,6.3090334238806891,1.9441923505999464E-2,1.000199839137871,3.4788801659302891E-2,24.17728804081549,-101.6999483787702,78.300051621229798,null,1000000000,9120400,null,21.064660121507352,-56.559218328594724,null,53.089947284280434,-45.032172733991274,null,0,0]
[3311.3,3.3113000000000001,1.4367844276312753,0.8009865890750949,1.0000086573486873,4.1610782808478696E-3,1,0,9055.3169722876719,1.5706858944373001,1.2550092168225808,0.64880422303170004,1.0002789811037949,2.3618478381052303E-2,1.0001851057096953,1.9239395040826026E-2,6.3092715688491641,2.1316699081878859E-2,1.0002402652935405,3.8144437827936896E-2,23.257921030771421,-102.13244305908979,77.867556940910205,null,1000000000,10964707.690000001,null,20.539666706315082,-54.173168173664209,null,52.695631173561978,-47.840254130971779,null,0,0]
[3630.8,3.6308000000000002,1.5098516215353295,0.84688959294618937,1.0000104085953438,4.5625661775222709E-3,1,0,9929.0444324740583,1.5706956121683793,1.3005275895827932,0.69364813762225541,1.0003354054637918,2.5896399103403911E-2,1.0002225457378444,2.1095235173355899E-2,6.3095579548011536,2.3372797186778087E-2,1.0002888893213864,4.1824928873913217E-2,22.335478941973545,-102.52354341196829,77.476456588031709,null,1000000000,13182708.640000001,null,20.048553907216899,-51.734873156427518,null,52.26437100493564,-50.658175564443226,null,0,0]
[3981.1,3.9811000000000001,1.5932624939149544,0.89227447768513668,1.0000125139146128,5.0027560635419379E-3,1,0,10886.999767652944,1.5707044741244871,1.3532238871915854,0.73924710365936308,1.0004032337983126,2.839360304739913E-2,1.0002675537415853,2.312981197638236E-2,6.3099022266353773,2.5626880829702426E-2,1.0003473541526726,4.5860227291512796E-2,21.412242818236365,-102.87342581801975,77.126574181980246,null,1000000000,15849157.209999999,null,19.592951496821339,-49.26583184877714,null,51.796820372795565,-53.464522462630327,null,0,0]
[4365.2,4.3651999999999997,1.6880981243007793,0.9367833189573388,1.0000150450888714,5.4854170752813292E-3,1,0,11937.386991542591,1.5707125563682631,1.4139819575348251,0.78523435380343432,1.0004847762599069,3.1131350785614981E-2,1.000321663216595,2.5360481760722194E-2,6.3103161124035392,2.8098163425804422E-2,1.0004176592251817,5.0284893919154527E-2,20.49010252297446,-103.18569008207122,76.814309917928782,null,1000000000,19054971.039999999,null,19.173706600532658,-46.788280970507067,null,51.294024838674147,-56.240551506325346,null,0,0]
[4786.3,4.7862999999999998,1.7954819630031713,0.98008311224788602,1.000018087795371,6.0145694334542907E-3,1,0,13088.957052115909,1.5707199265135763,1.4837295969224022,0.83121692371289047,1.0005827893483243,3.4132285385646846E-2,1.0003867041376604,2.7805739048864662E-2,6.310813606994631,3.0807114093782152E-2,1.0005021930032953,5.5135794168199595E-2,19.57105941058899,-103.46706790216695,76.532932097833054,null,1000000000,22908667.690000001,null,18.791158175956998,-44.326036946113902,null,50.757650166398811,-58.9690648330469,null,0,0]
[5248.1,5.2481,1.9166556895721849,1.0219045525187138,1.0000217464921615,6.594861344588282E-3,1,0,14351.828232973307,1.570726649260817,1.5634830894600891,0.87682167604424688,1.0007006326878707,3.7422556312787791E-2,1.0004649071356144,3.0486951028391877E-2,6.3114117685286821,3.3777377432206698E-2,1.0006038701933988,6.0455554060290878E-2,18.656505076801555,-103.72731684681206,76.272683153187941,null,1000000000,27542553.610000003,null,18.444860120080552,-41.90198093164129,null,50.189538155727853,-61.636808369218372,null,0,0]
[5370.3,5.3703000000000003,1.9492369362965356,1.0320954771012647,1.0000227709883616,6.7484155580010054E-3,1,0,14686.005059186913,1.5707282347578353,1.5850964727733208,0.88811404653305959,1.0007336283812247,3.8293084310108146E-2,1.000486804236792,3.1196372764211971E-2,6.3115792539815896,3.4563262953844452E-2,1.0006323473163268,6.1863253696440551E-2,18.428850721812115,-103.79041535940685,76.20958464059315,null,1000000000,28840122.090000004,null,18.363895043350961,-41.30494418373403,null,50.042889265859287,-62.292562577502437,null,0,0]
[5432.85,5.4328500000000002,1.9659905277454495,1.0371808959923225,1.0000233045166442,6.8270145846533814E-3,1,0,14857.058745613649,1.5707290187214833,1.5962362311437936,0.89377553126745979,1.0007508111760219,3.8738655430497843E-2,1.0004982074391298,3.1559489375389216E-2,6.311666473917505,3.4965514707075762E-2,1.0006471783932096,6.258380735928222E-2,18.314466622574546,-103.82200705014019,76.177992949859814,null,1000000000,29515859.122500002,null,18.323991855699358,-41.006139264813285,null,49.968429385858848,-62.620716908683626,null,0,0]
[5495.4,5.4954000000000001,1.9827941026682776,1.0421802476101554,1.0000238442228713,6.9056135269525802E-3,1,0,15028.112432049307,1.5707297848385957,1.6074264426417453,0.8993583672358112,1.0007681926466581,3.9184211161869764E-2,1.0005097425578142,3.1922597661524332E-2,6.3117547026303367,3.5367755347935681E-2,1.0006621819067467,6.3304361275600546E-2,18.201491978180385,-103.85317164711866,76.146828352881343,null,1000000000,30199421.159999996,null,18.285087980994202,-40.711838683999254,null,49.894379890221302,-62.943939967705425,null,0,0]
[5559.4,5.5593999999999992,2.0000376297711431,1.0472084137374071,1.0000244028346883,6.9860344187610808E-3,1,0,15203.131391800551,1.5707305508718352,1.6189271893017916,0.90499055876487433,1.0007861826718865,3.9640079411367435E-2,1.0005216816113822,3.2294114609667503E-2,6.3118460206943094,3.5779308877495614E-2,1.0006777117274905,6.4041618943979972E-2,18.087324814935506,-103.8846546603618,76.115345339638196,null,1000000000,30906928.359999996,null,18.246283749060659,-40.415301096817586,null,49.819038977048287,-63.269666640986266,null,0,0]
[5623.4,5.6233999999999993,2.0173308575533082,1.0521504968274904,1.0000249679141757,7.0664552202035812E-3,1,0,15378.150351560511,1.5707312994686029,1.6304785654755833,0.91054312010585259,1.0008043806688547,4.0095931177152815E-2,1.0005337587584913,3.2665622640144568E-2,6.3119383947570178,3.6190850503879463E-2,1.0006934221231758,6.4778876880992944E-2,17.974568311312701,-103.91576585861479,76.08423414138521,null,1000000000,31622627.559999995,null,18.208460271583448,-40.123324039856833,null,49.744128222799475,-63.590461140113227,null,0,0]
[5688.9,5.6888999999999994,2.0350795348141895,1.0571213183410406,1.0000255529345281,7.1487607895267856E-3,1,0,15557.271318198569,1.5707320481704363,1.6423519855728281,0.91614476801405031,1.0008232205099052,4.0562449704199817E-2,1.0005462619448378,3.3045828549785099E-2,6.3120340272021735,3.6612025169957527E-2,1.0007096877314934,6.5533414580701582E-2,17.860596996068992,-103.94725800951159,76.052741990488414,null,1000000000,32363583.209999997,null,18.17073322014312,-39.829145696182302,null,49.667907015597294,-63.913784297846107,null,0,0]
[5754.4,5.7543999999999995,2.0528776267711111,1.0620060665004714,1.0000261447292524,7.2310662619940866E-3,1,0,15736.392284845146,1.5707327798279316,1.6542761994414197,0.92166583244353051,1.0008422781614288,4.1028950566241972E-2,1.0005589097630567,3.3426024902206232E-2,6.3121307656272627,3.7033187079458955E-2,1.0007261425342791,6.6287952565069558E-2,17.748037785760509,-103.97843346356811,76.021566536431891,null,1000000000,33113119.359999996,null,18.133968506893638,-39.53958245704316,null,49.59213584084543,-64.232175837512983,null,0,0]
[5821.4,5.8213999999999997,2.0711331056266986,1.0669157000117302,1.0000267570853707,7.3152564912387519E-3,1,0,15919.61525837001,1.5707335112064273,1.6665249021380488,0.92723141701052791,1.0008619975843758,4.1506116167066363E-2,1.000571996858318,3.3814918039090411E-2,6.3122308636447517,3.7463980567767084E-2,1.0007431699377103,6.7059770341418537E-2,17.634328904476511,-104.01003058612307,75.989969413876935,null,1000000000,33888697.959999993,null,18.0973252081757,-39.248079430455071,null,49.515094389541467,-64.552875273356591,null,0,0]
[5888.4,5.8883999999999999,2.0894376350494883,1.0717394263662461,1.0000273765296648,7.3994466167806973E-3,1,0,16102.838231903197,1.5707342259412309,1.6788244724722423,0.93271561911516265,1.0008819448815891,4.1983262856973347E-2,1.000585235273987,3.4203800944151562E-2,6.312332118769528,3.7894760399364298E-2,1.0007603953614377,6.783158841888802E-2,17.522031641416397,-104.04136625262011,75.958633747379892,null,1000000000,34673254.559999995,null,18.061624526847236,-38.961237238362997,null,49.438522216991814,-64.868652614877874,null,0,0]
[5957,5.9569999999999999,2.1082287748301605,1.0765914428710044,1.0000280181107459,7.4856471440901242E-3,1,0,16290.436679439536,1.5707349410861948,1.6914693092531687,0.93824797981857011,1.0009026046198426,4.2471784275271901E-2,1.0005989466086407,3.4601959881489203E-2,6.3124369907548381,3.8335813197497126E-2,1.0007782373414733,6.8621838286455974E-2,17.408482013167234,-104.07321328467245,75.926786715327552,null,1000000000,35485849,null,18.026015933776257,-38.672287509241976,null,49.360606461804863,-65.186991738857884,null,0,0]
[6025.6,6.0256000000000007,2.1270686690655141,1.0813576192729837,1.0000286671225569,7.5718475601529514E-3,1,0,16478.035126984018,1.5707356399476538,1.7041651476693587,0.94369807434347608,1.0009235032167874,4.2960285410163765E-2,1.000612816564423,3.5000107843814632E-2,6.3125430756533278,3.8776851347298039E-2,1.0007962869796059,6.9412088472936839E-2,17.296345763876701,-104.10485326499813,75.895146735001873,null,1000000000,36307855.360000007,null,17.991331752486083,-38.38804918982143,null,49.283179965043516,-65.500412611876371,null,0,0]
[6095.8,6.0958000000000006,2.1463971117181679,1.0861482289428983,1.0000293389643722,7.6600583650415473E-3,1,0,16670.009048531843,1.5707363388250228,1.7172087185295135,0.94919168785959673,1.0009451365091868,4.3460158917075623E-2,1.0006271742245345,3.540753056280966E-2,6.3126528904487422,3.9228160761427516E-2,1.0008149726162114,7.022077048240144E-2,17.183023825405204,-104.13704927831684,75.862950721683163,null,1000000000,37158777.640000001,null,17.956763910806973,-38.101969005704888,null,49.204452337364259,-65.816174286900775,null,0,0]
[6166,6.1660000000000004,2.1657739341695308,1.0908532233992185,1.0000300185875517,7.748269050719906E-3,1,0,16861.982970087629,1.5707370217889338,1.7303033321366805,0.95460231332801793,1.0009670199004266,4.3960010692163515E-2,1.0006416979772421,3.5814941522406281E-2,6.3127639752658906,3.9679454480682087E-2,1.0008338757842368,7.1029452828993159E-2,17.071115029336646,-104.16909240986173,75.830907590138267,null,1000000000,38019556,null,17.923100986690539,-37.820641529561222,null,49.126233239402914,-66.127030597664685,null,0,0]
[6237.8,6.2378,2.1856410987837838,1.0955790489832937,1.0000307217501159,7.8384901116094041E-3,1,0,17058.332365646937,1.5707377044173314,1.7437480009451987,0.96005203342882284,1.0009896607555082,4.4471232361014523E-2,1.00065672456223,3.6231625896964166E-2,6.3128789056320045,4.014101767391743E-2,1.0008534348581037,7.1856567032342375E-2,16.95808376780786,-104.20173849893956,75.798261501060438,null,1000000000,38910148.840000004,null,17.889575582509401,-37.537725523681168,null,49.046755081598079,-66.440021325719869,null,0,0]
[6309.6,6.3096000000000005,2.2055561962348254,1.1002196328518572,1.0000314330527587,7.9287110448883619E-3,1,0,17254.681761214015,1.5707383715098093,1.7572436647544181,0.96541820296953151,1.001012563204956,4.4982430770690737E-2,1.0006719248818745,3.6648297684899744E-2,6.3129951644296556,4.0602564068631171E-2,1.0008732215730349,7.2683681591403732E-2,16.846463531409771,-104.23428525552255,75.765714744477449,null,1000000000,39811052.160000004,null,17.856934488654911,-37.259594389480867,null,48.967803957405536,-66.748128090924524,null,0,0]
[6383.05,6.3830499999999999,2.2259772089639509,1.1048808370712051,1.000032169124297,8.0210051668759864E-3,1,0,17455.543364347148,1.5707390384034856,1.7711010164943735,0.97082291010906618,1.0010362626262488,4.5505352432154776E-2,1.0006876542735266,3.7074531625370263E-2,6.3131154694105973,4.1074699448594015E-2,1.000893698587995,7.352980402727205E-2,16.733704426436308,-104.26750623020838,75.732493769791617,null,1000000000,40743327.302500002,null,17.824427398787897,-36.979926894972628,null,48.887580934340697,-67.058386601359075,null,0,0]
[6456.5,6.4565000000000001,2.2464457052211646,1.1094571980672068,1.0000329137143018,8.113299152211751E-3,1,0,17656.404967487877,1.5707396901238202,1.7850092994809759,0.97614354678938187,1.0010602357649638,4.60282491910049E-2,1.000703565459746,3.7500752089033612E-2,6.3132371644244181,4.1546816842437308E-2,1.0009144139152055,7.4375926838260234E-2,16.622354362902975,-104.30068040354573,75.699319596454274,null,1000000000,41686392.25,null,17.79278422376527,-36.705073986781755,null,48.807903371363722,-67.363783982492421,null,0,0]
[6531.7,6.5316999999999998,2.2674497295443325,1.1140568966940716,1.0000336848700107,8.2077919660719853E-3,1,0,17862.052245319599,1.5707403421864772,1.7993004900430152,0.98150557766843605,1.0010850636381059,4.6563578251403386E-2,1.0007200440758146,3.7937113443838315E-2,6.3133631989323078,4.2030163929996284E-2,1.0009358697445432,7.5242209534394922E-2,16.509777086068855,-104.33462382630653,75.665376173693474,null,1000000000,42663104.890000001,null,17.761251625591665,-36.428561703726928,null,48.726889062370866,-67.671547604120803,null,0,0]
[6606.9,6.6068999999999996,2.2885008456331799,1.1185720673650759,1.0000344649548984,8.3022846333561818E-3,1,0,18067.699523158743,1.5707409794055276,1.8136425968246472,0.98678295346628897,1.0011101783851275,4.7098880605711921E-2,1.0007367132339233,3.8373460344882732E-2,6.3134906903277619,4.2513491728126268E-2,1.000957575474313,7.6108492626384347E-2,16.398608787566161,-104.36857190620613,75.631428093793872,null,1000000000,43651127.609999992,null,17.73056382434789,-36.156897418922561,null,48.646439284201833,-67.974468161700941,null,0,0]
[6683.85,6.6838500000000005,2.3100892533726261,1.1231070316920821,1.0000352724366224,8.3989761121448028E-3,1,0,18278.132475689072,1.5707416166103727,1.8283699200866974,0.99209728278663822,1.0011361745272898,4.7646612165695268E-2,1.0007539675395563,3.8819946460561812E-2,6.3136226566561824,4.3008046983114355E-2,1.0009800450675335,7.6994935642816786E-2,16.286277809204048,-104.40334038604671,75.596659613953292,null,1000000000,44673850.822500005,null,17.700006258044095,-35.883827993453366,null,48.564697667739118,-68.279551908200361,null,0,0]
[6760.8,6.7608000000000006,2.3317242898851931,1.1275579302977445,1.000036089267903,8.4956674338818611E-3,1,0,18488.565428226648,1.5707422393101553,1.8431480543138632,0.99732653855124453,1.0011624710045273,4.8194315116614955E-2,1.000771421338442,3.9266417091498355E-2,6.3137561482803779,4.3502581573359303E-2,1.0010027764338507,7.7881379076093438E-2,16.17535381875928,-104.43816387637706,75.561836123622939,null,1000000000,45708416.640000001,null,17.670273322265512,-35.615630453424508,null,48.483538774377891,-68.579819076541341,null,0,0]
[6839.55,6.83955,2.3539123451816142,1.1320281423469154,1.0000369348864933,8.5946203764315048E-3,1,0,18703.920789017971,1.570742862068877,1.8583232187145269,1.0025918572601187,1.0011896935346605,4.8754799871246646E-2,1.000789489950028,3.9723315262704437E-2,6.3138943416469528,4.4008662582321063E-2,1.0010263106148471,7.8788558460902838E-2,16.063257513988852,-104.47388264598261,75.526117354017387,null,1000000000,46779444.202500001,null,17.640668968081563,-35.346099005674994,null,48.401080115960333,-68.882251324865308,null,0,0]
[6918.3,6.9183000000000003,2.3761465592242739,1.1364147828467066,1.0000377902971134,8.6935731506656618E-3,1,0,18919.276149816382,1.5707434706500554,1.87354906708261,1.0077717378731534,1.0012172305645273,4.9315253971290274E-2,1.0008077674747944,4.0180196840829498E-2,6.3140341322965936,4.4514721448103957E-2,1.0010501190754566,7.9695738284260853E-2,15.952566169428724,-104.5097055089043,75.490294491095696,null,1000000000,47862874.890000001,null,17.611869203261428,-35.081460231540383,null,48.31922221122695,-69.179895310887716,null,0,0]
[6998.9,6.9988999999999999,2.3989495594201098,1.1408201864762613,1.0000386759428523,8.7948503534398936E-3,1,0,19139.690652431116,1.57074407934646,1.8891838070642233,1.0129867016321523,1.0012457401378532,4.9888842186589823E-2,1.0008266906969172,4.0647794129522206E-2,6.3141788608153737,4.5032645487313901E-2,1.0010747709289212,8.0624230088569782E-2,15.840694830544113,-104.54649960573801,75.453500394261994,null,1000000000,48984601.209999993,null,17.583196778398531,-34.815563877182335,null,48.236058159643882,-69.479702251674922,null,0,0]
[7079.5,7.0795000000000003,2.4217982401513503,1.1451425462989389,1.0000395718460415,8.8961273757909767E-3,1,0,19360.105155052785,1.5707446741828661,1.9048690807948652,1.0181159197709182,1.0012745791056508,5.0462397549311623E-2,1.0008458327387155,4.1115373634041871E-2,6.3143252623195263,4.5550545794602257E-2,1.0010997102280279,8.1552722353779791E-2,15.730226340909365,-104.58344552460501,75.416554475394989,null,1000000000,50119320.25,null,17.555309009968866,-34.554577708547519,null,48.153512701715229,-69.774751169553099,null,0,0]
[7161.95,7.16195,2.4452172934960181,1.1494804529647706,1.0000404989260456,8.9997288059607827E-3,1,0,19585.57879949093,1.570745268819502,1.9209653725793447,1.0232760598192641,1.001304420802432,5.1049083261520432E-2,1.0008656405430258,4.159366680922455E-2,6.3144767550604044,4.6080308553953585E-2,1.0011255194417168,8.2502526643454116E-2,15.618639227199985,-104.62141654984299,75.378583450157009,null,1000000000,51293527.802499995,null,17.527564245261296,-34.292572147161252,null,48.069706840020139,-70.071778766227851,null,0,0]
[7244.4,7.2443999999999997,2.4686814860611128,1.15373597703663,1.0000414367397208,9.1033300429329434E-3,1,0,19811.052443935845,1.5707458499207752,1.9371119631607914,1.0283503095154771,1.0013346071277085,5.163573380308132E-2,1.0008856773006323,4.2071940943887498E-2,6.3146299982198908,4.6610045905702814E-2,1.001151629587951,8.3452331416357078E-2,15.508451051166222,-104.65958543811998,75.340414561880024,null,1000000000,52481331.359999992,null,17.500583390903714,-34.035484949809856,null,47.986536424882985,-70.364086226713624,null,0,0]
[7328.75,7.3287500000000003,2.492731776064586,1.1580065819608019,1.0000424072721408,9.2093184924593348E-3,1,0,20041.721963759814,1.570746430882648,1.9536813904349783,1.0334545611914874,1.0013658456748586,5.223586646423066E-2,1.0009064127045164,4.2561216625781419E-2,6.3147885840121845,4.7151964072612323E-2,1.0011786529131599,8.442402424645358E-2,15.397136699879489,-104.69885675250204,75.301143247497961,null,1000000000,53710576.5625,null,17.473743045892402,-33.777451226202231,null,47.902100609349233,-70.65837507248537,null,0,0]
[7413.1,7.4131,2.5168266593344306,1.1621954926500393,1.0000433890385667,9.3153067350735738E-3,1,0,20272.391483590396,1.5707469986235649,1.9703008608602615,1.0384728331451567,1.0013974448505649,5.2835961467031095E-2,1.0009273877061191,4.3050471918695099E-2,6.3149490015555108,4.7693855033479587E-2,1.0012059913536893,8.5395717582530978E-2,15.287217339757236,-104.7383703423134,75.261629657686598,null,1000000000,54954051.610000007,null,17.447646076885245,-33.524340862644642,null,47.818316847514481,-70.947983224225268,null,0,0]
[7499.45,7.4994499999999995,2.5415377175111908,1.166401377293578,1.0000444057200695,9.423807819381921E-3,1,0,20508.530345925054,1.5707475665968946,1.9873649173304533,1.0435230216860873,1.0014301667862004,5.3450245704092507E-2,1.0009491082112008,4.355130644825983E-2,6.3151151199841875,4.824856611882633E-2,1.0012343045022907,8.6390450999995094E-2,15.176101986636763,-104.77908800071148,75.220911999288518,null,1000000000,56241750.302499995,null,17.42167259112431,-33.270214809893297,null,47.733214979494917,-71.239740036110149,null,0,0]
[7585.8,7.5857999999999999,2.5662928678558345,1.170526191549194,1.0000454341745562,9.5323086818008759E-3,1,0,20744.669208266179,1.570748121639618,2.0044787966267106,1.0484870998376521,1.0014632665818488,5.4064489566975044E-2,1.0009710797786449,4.4052119116553184E-2,6.3152831577602866,4.8803248034634747E-2,1.0012629480549329,8.7385184947097613E-2,15.066379200453985,-104.82009100010856,75.179908999891438,null,1000000000,57544361.640000001,null,17.396422970947199,-33.021019464891275,null,47.648782272149461,-71.526851899977643,null,0,0]
[7674.15,7.67415,2.5916657039298827,1.1746649129662572,1.0000464986347695,9.6433223602460563E-3,1,0,20986.277413111533,1.5707486766099357,2.0220393076030199,1.0534790572011374,1.0014975240701534,5.4692918003985333E-2,1.0009938200766386,4.4564508496257385E-2,6.3154570739371065,4.937074670657178E-2,1.0012925970987141,8.8402959023566832E-2,14.955521600879136,-104.86235334981498,75.137646650185019,null,1000000000,58892578.222499996,null,17.37131049012423,-32.77103947079231,null,47.563079024404288,-71.815936713922483,null,0,0]
[7762.5,7.7625000000000002,2.6170820714643384,1.1787233145750484,1.0000475754195666,9.7543358009950596E-3,1,0,21227.885617963209,1.5707492189473056,2.0396493386956922,1.0583849354214994,1.0015321770450154,5.5321303201945157E-2,1.0010168231664485,4.5076874461341961E-2,6.315632999074805,4.9938214137519102E-2,1.0013225922136251,8.9420733652861059E-2,14.846052370767932,-104.90494208074742,75.095057919252582,null,1000000000,60256406.25,null,17.346901666017715,-32.525988247074366,null,47.478060969963913,-72.10041958713029,null,0,0]
[7852.9,7.8529,2.6431319276480321,1.182795026526972,1.000048689945997,9.867924856508269E-3,1,0,21475.099898881708,1.5707497612373407,2.0577179091246518,1.0633176094399281,1.0015680433937286,5.5964223659442522E-2,1.0010406319909084,4.5601104425844301E-2,6.3158150854812138,5.0518815903066637E-2,1.0013536416184694,9.0462124450057066E-2,14.735445361234143,-104.94886927808022,75.051130721919776,null,1000000000,61668038.409999996,null,17.322628108874532,-32.28023454353125,null,47.39177134908725,-72.386870621719112,null,0,0]
[7943.3,7.9432999999999998,{"$f":"SQRT(1+(A141/pole1)^2)","v":2.6692247481602864},{"$f":"ATAN(A141/pole1)","v":1.1867871981182758},{"$f":"SQRT(1+(A141/Zero1)^2)","v":1.0000498173755006},{"$f":"ATAN(A141/Zero1)","v":9.981513657372508E-3},{"$f":"IF(VIN_nom>Vout, 1, SQRT(1+(A141/z_RHP)^2))","v":1},{"$f":"IF(VIN_nom>Vout, 0, -ATAN(A141/z_RHP))","v":0},{"$f":"SQRT(1+(A141/Pole2)^2)","v":21722.314179806377},{"$f":"ATAN(A141/Pole2)","v":1.5707502911841382},{"$f":"SQRT(1+(A141/Zero2)^2)","v":2.0758356741579269},{"$f":"ATAN(A141/Zero2)","v":1.0681642955311663},{"$f":"SQRT(1+(A141/pole4)^2)","v":1.0016043237075525},{"$f":"ATAN(A141/pole4)","v":5.660709780666489E-2},{"$f":"IF(VOUT_setting=1,1,SQRT(1+(A141*zterm1)^2))","v":1.0010647159052775},{"$f":"IF(VOUT_setting=1,0,ATAN(((A141*zterm1))))","v":4.6125309310238762E-2},6.3159992748010136,{"$f":"IF(VOUT_setting=1,0,ATAN(A141*$Q$4/(1+Afbr-$Q$5*(A141)^2)))","v":5.109938420677225E-2},{"$f":"SQRT((1-(Z141/pterm2))^2+(A141/pterm1)^2)","v":1.0013850535428417},{"$f":"IF((ATAN((A141/pterm1)/(1-A141^2/pterm2))>0),ATAN((A141/pterm1)/(1-A141^2/pterm2)),PI()+ATAN((A141/pterm1)/(1-A141^2/pterm2)))","v":9.1503515823198586E-2},{"$f":"20*LOG10(((E141*K141*G141*O141)/(C141*I141*S141*M141*Q141))*Adc)","v":14.626222398312013},{"$f":"((F141+L141+H141+P141)-(D141+J141+T141+N141+R141))*radconv","v":-104.99316210051899},{"$f":"IF(V141>0,V141,V141+180)","v":75.006837899481013},null,{"$f":"IF(U141<0,A141,1000000000)","v":1000000000},{"$f":"A141^2","v":63096014.890000001},null,{"$f":"20*LOG10((K141/(I141*M141))*AEA)","v":17.299038196481821},{"$f":"(L141-(J141+N141))*radconv","v":-32.039404224712136},null,{"$f":"20*LOG10((E141*G141/(C141*S141))*Acs*Am)","v":47.30618263287549},{"$f":"(F141+H141-(D141+T141))*radconv","v":-72.66876437692784},null,{"$f":"SUM((U142<0)*(U141>0))*A141","v":0},0]
[8035.8,{"$f":"A142/1000","v":8.0358000000000001},2.6959668789182918,1.1907920531293461,1.0000509843514094,1.0097740869485316E-2,1,0,21975.271270360467,1.5707508210995156,2.0944239067927399,1.0730366565911125,1.0016418752708274,5.7264857491739776E-2,1.0010896440200747,4.6661665261073647E-2,6.3161899194202142,5.1693404129001239E-2,1.00141757052687,9.2569099404328031E-2,14.515859998308551,-105.03887289646117,74.961127103538828,null,1000000000,64574081.640000001,null,17.275581780483201,-31.797955715240711,null,47.219322533369848,-72.952619780146847,null,0,0]
[8128.3,8.1282999999999994,2.7227514001335438,1.1947181761662569,1.0000521648367402,1.0213967808773476E-2,1,0,22228.228360920588,1.570751338954026,2.1130609853835618,1.07782318172124,1.0016798601596579,5.7922567575298158E-2,1.0011148601116537,4.7197994346713401E-2,{"$f":"IF(VOUT_setting=1,1,SQRT((1+Afbr-$Q$5*(A143)^2)^2+(A143*$Q$4)^2))","v":6.3163827653974307},5.2287388209216537E-2,1.001450467290353,9.3634683584224068E-2,14.406877174063222,-105.08498672169132,74.915013278308678,null,1000000000,66069260.890000001,null,17.252789195032133,-31.56142170928975,null,47.133178705166657,-73.231964223467145,null,0,0]
[8222.9500000000007,8.2229500000000009,2.7502010683390283,1.1986563320589934,1.0000533867444041,1.0332895953397946E-2,1,0,22487.064994672732,1.5707518567851124,2.1321804761217691,1.0826342317182487,1.0017191764395179,5.8595513042384598E-2,1.0011409603791253,4.7746761330911727E-2,6.316582372233003,5.2895140878805882E-2,1.0014845219232127,9.472503601347422E-2,14.296754456967056,-105.1325983207015,74.867401679298496,null,1000000000,67616906.702500015,null,17.230128388126612,-31.324355453806106,null,47.045764828691517,-73.513262447132504,null,0,0]
[8270.2750000000015,8.2702750000000016,2.7639416589984718,1.200596061583266,1.0000540030024734,1.0392359916306132E-2,1,0,22616.483311551026,1.570752111255878,2.1417584805132202,1.0850075180775012,1.001739004682215,5.8931965890909335E-2,1.0011541235667296,4.8021134051857775E-2,6.3166830398337277,5.319900284391265E-2,1.0015016984376484,9.5270212461190426E-2,14.242210813342195,-105.15656813689974,74.843431863100264,null,1000000000,68397448.575625017,null,17.219041092497157,-31.207668070038135,null,47.002332703986852,-73.652230037865365,null,0,0]
[8317.6,8.3176000000000005,2.7776925462181827,1.2025165931234882,1.000054622796692,1.0451823805717762E-2,1,0,22745.901628430765,1.5707523628308975,2.151348440879457,1.0873596590226959,1.0017589463177909,5.9268405382239313E-2,1.0011673621196218,4.8295499537332663E-2,6.3167842835197447,5.3502855156392755E-2,1.0015189744381514,9.5815389063736017E-2,14.188006677845186,-105.18064847598279,74.819351524017208,null,1000000000,69182469.760000005,null,17.208111799024898,-31.09219129802819,null,46.959082222842703,-73.790097678217805,null,0,0]
[8366.0499999999993,8.3660499999999995,2.7917808244087516,1.2044631726965735,1.0000552609877618,1.051270118169215E-2,1,0,22878.396450467597,1.570752617437797,2.1611785912653247,1.0897460761153324,1.0017794794629309,5.9612828726829971E-2,1.0011809934474363,4.857637964338804E-2,6.3168885307104983,5.3813920525913488E-2,1.0015367641980935,9.6373525650353023E-2,14.132861405121462,-105.20541657667481,74.794583423325193,null,1000000000,69990792.602499992,null,17.197083280480754,-30.975208262240184,null,46.914990551155029,-73.930119326495813,null,0,0]
[8414.5,8.4145000000000003,2.8058795748845493,1.2063901974879856,1.0000559028850866,1.0573578479742472E-2,1,0,23010.891272505905,1.5707528691126855,{"$f":"SQRT(1+(A148/Zero2)^2)","v":2.1710209380359542},{"$f":"ATAN(A148/Zero2)","v":1.0921108688788068},1.0018001314417266,5.9957237911791139E-2,1.0011947037599029,4.8857252078884451E-2,6.316993381642332,5.4124975662602791E-2,1.0015546582635535,9.6931662398264992E-2,14.078063278069102,-105.23030214132355,74.769697858676452,null,1000000000,70803810.25,null,17.186214145674658,-30.859463229970498,null,46.87108678555817,-74.069020582019576,null,0,0]
[8462.9500000000007,8.4629500000000011,2.8199886405745893,1.2082979465892196,1.0000565484886592,1.0634455699417652E-2,1,0,23143.386094545644,1.5707531179059195,2.1808753160635508,1.0944543038151842,1.001820902246829,6.0301632856294987E-2,1.0012084930537772,4.9138116799822239E-2,6.3170988362851856,5.4436020507882925E-2,1.0015726566515246,9.7489799306937269E-2,14.023608011299721,-105.25530588866428,74.744694111335718,null,1000000000,71621522.702500015,null,17.175501354942824,-30.744940930029699,null,46.827369680301217,-74.206817435549141,null,0,0]
[8511.4,8.5114000000000001,2.8341078674218929,1.2101866940975021,1.0000571977984725,1.069533284026661E-2,1,0,23275.880916586801,1.5707533638667097,2.1907415629913789,1.0967766435727746,1.0018417918708471,6.0646013479533856E-2,1.0012223613257958,4.9418973762209037E-2,6.3172048946088317,5.4747055003187904E-2,1.001590759379096,9.8047936375809927E-2,13.969491393634607,-105.28042847202001,74.719571527979994,null,1000000000,72443929.959999993,null,17.164941937903972,-30.631626311967725,null,46.783837994560258,-74.34352559169254,null,0,0]
[8560.9500000000007,8.5609500000000001,2.8485580069897631,1.2120989503055799,1.0000578656835049,1.0757592042663158E-2,1,0,23411.383877003918,1.5707536125322303,2.2008439212102671,1.0991301600203403,1.0018632786573529,6.0998197961023973E-2,1.0012366261452808,4.9706199179445409E-2,6.3173139852248799,5.5065140403040724E-2,1.00160938104547,9.8618745452406828E-2,13.914492078888854,-105.30624496276751,74.693755037232492,null,1000000000,73289864.902500018,null,17.154298393388213,-30.516972684260804,null,46.739508467522583,-74.482227563385152,null,0,0]
[8610.5,8.6105,2.8630184577788471,1.2139918966408525,1.0000585374449646,1.0819851161659266E-2,1,0,23546.886837422462,1.5707538583358087,2.2109583585490085,1.1014621560953819,1.0018848897035384,6.135036729268134E-2,1.0012509735628683,4.9993416388787675E-2,6.3174237071801143,5.5383214853751646E-2,1.0016281118795065,9.9189554695294904E-2,13.859838286673583,-105.33218693106529,74.667813068934706,null,1000000000,74140710.25,null,17.14380919586003,-30.403551051075787,null,46.695370266693743,-74.619823175168122,null,0,0]
[8660.0499999999993,8.66005,2.8774890643360069,1.2158658107566505,1.0000592130828441,1.0882110196772446E-2,1,0,23682.38979784241,1.5707541013265705,2.2210847099889133,1.1037729006061887,1.0019066250013626,6.1702521388134812E-2,1.0012654035750075,5.0280625343202469E-2,6.3175340604416439,5.5701278292713069E-2,1.0016469518997979,9.9760364103792257E-2,13.805525742967333,-105.35825488065917,74.641745119340825,null,1000000000,74996466.002499983,null,17.133471381127755,-30.291346008698156,null,46.65142208221517,-74.756328335394031,null,0,0]
[8709.6,8.7096,2.8919696742113863,1.2177209652857977,1.0000598925971351,1.0944369147520212E-2,1,0,23817.892758263744,1.5707543415525227,2.231222813314397,1.1060626583918935,1.0019284845427396,6.20546601610358E-2,1.0012799161781274,5.0567825995664582E-2,6.317645044976393,5.6019330657330536E-2,1.0016659011250442,0.10033117367718873,13.751550248123168,-105.38444925499282,74.615550745007184,null,1000000000,75857132.160000011,null,17.123282053072991,-30.18034238076655,null,46.607662610529339,-74.891758664760019,null,0,{"$f":"IF(AH154>0,W154,0)","v":0}]
[8760.3250000000007,8.7603249999999999,2.9068038747493303,1.219600959210996,1.0000605922404124,1.1008104383071069E-2,1,0,23956.608957404856,1.5707545846601034,2.2416133324826135,1.1083852474390103,1.0019509911379738,6.2415133386820747E-2,1.0012948584729369,5.0861828509372847E-2,6.3177593152045644,5.6344913594791823E-2,1.0016854128409689,0.10091551926822805,13.696639633969411,-105.41139614714447,74.588603852855528,null,1000000000,76743294.105625018,null,17.113001957235461,-30.067935354198287,null,46.563059576326182,-75.029303158481582,null,0,0]
[8811.0499999999993,8.8110499999999998,2.9216482446808891,1.221461855834858,1.0000612959461104,1.107183952918463E-2,1,0,24095.325156547358,1.5707548249685552,2.2520158322326829,1.110686391821776,1.0019736279218092,6.2775590371679041E-2,1.0013098873145609,5.1155822223018482E-2,6.317874246929482,5.6670484793750982E-2,1.0017050390424991,0.1014998650304821,13.642073568506767,-105.43847628894926,74.561523711050739,null,1000000000,77634602.102499992,null,17.102871542469842,-29.956755925477001,null,46.518651567516009,-75.165753472369488,null,0,0]
[8861.7749999999996,8.8617749999999997,2.936502629783587,1.2233039319832177,1.0000620037142205,1.1135574585343281E-2,1,0,24234.041355691243,1.570755062525945,2.2624301473069139,1.1129663631398412,1.0019963948854225,6.3136031023046837E-2,1.0013250026991032,5.1449807086177801E-2,6.3179898401150494,5.6996044187097535E-2,1.0017247797500393,0.10208421096309586,13.587847777964999,-105.46568997632055,74.534310023679453,null,1000000000,78531056.15062499,null,17.092887911742768,-29.846788530539474,null,46.474437207330361,-75.3011254673564,null,0,0]
[8912.5,8.9124999999999996,2.9513668788367733,1.225127459421649,1.0000627155447341,1.1199309551029409E-2,1,0,24372.75755483648,1.5707552973792456,{"$f":"SQRT(1+(A158/Zero2)^2)","v":2.2728561152904878},{"$f":"ATAN(A158/Zero2)","v":1.1152254288983701},1.0020192920199402,6.3496455248385583E-2,1.0013402046226441,5.1743783048436222E-2,6.3181060947249676,5.7321591707735722E-2,1.0017446349841101,0.10266855706518251,13.533958063356604,-105.49303744977415,74.50696255022585,null,1000000000,79432656.25,null,17.083048235105529,-29.738017839858074,null,46.430415126698662,-75.435434714441527,null,0,0]
[8964.4,8.9643999999999995,2.9665854998251366,1.226974307344509,1.0000634480688126,1.1264520786944976E-2,1,0,24514.686992701583,1.5707555349218216,2.2835354861031116,1.1175154611538398,1.0020428542658972,6.3865211286154161E-2,1.001355848250375,5.204455944010259E-2,6.3182257268163458,5.7654667891900512E-2,1.0017650687053512,0.10326643920509754,13.479163581528852,-105.52115706928049,74.478842930719509,null,1000000000,80360467.359999999,null,17.073126742407002,-29.627950431366227,null,46.385570905715284,-75.571771100648277,null,0,0]
[9016.2999999999993,9.0162999999999993,2.9818141360769084,1.2288022971111658,1.00006418484566,1.1329731927051766E-2,1,0,24656.616430568058,1.570755769729693,2.294226720816535,1.1197841618382456,1.0020665527642403,6.4233949932178069E-2,1.0013715824643674,5.2345326406981536E-2,6.3183460512520657,5.7987731504885016E-2,1.0017856223642203,0.10386432152044685,13.424712265128832,-105.54941708712494,74.450582912875063,null,1000000000,81293665.689999983,null,17.063350163770437,-29.519104078707521,null,46.340925101131305,-75.707027009635041,null,0,0]
[9068.2000000000007,9.0682000000000009,2.9970526349232989,1.23061170406362,1.000064925875267,1.1394942970795371E-2,1,0,24798.545868435875,1.5707560018498141,2.304929654341453,1.1220318045931172,1.0020903875053031,6.460267108742139E-2,1.001387407260351,5.2646083895103397E-2,6.3184670679925805,5.832078247487063E-2,1.0018062959830736,0.10446220401017618,13.370599849094575,-105.57781759670196,74.422182403298038,null,1000000000,82232251.24000001,null,17.053715674495905,-29.411463100393135,null,46.296476272550031,-75.841218217307741,null,0,0]
[9120.1,9.1201000000000008,3.0123008466868941,1.2324027984609103,1.0000656711576239,1.1460153917621384E-2,1,0,24940.475306305012,1.5707562313280707,2.3156441244617523,1.1242586588548149,1.0021143584793635,6.4971374652876487E-2,1.001403322634032,5.294683185050874E-2,6.3185887769981184,5.8653820730055276E-2,1.001827089584393,0.10506008667319557,13.316822143344268,-105.60635864105086,74.393641358949139,null,1000000000,83176224.010000005,null,17.044220515787657,-29.305012055813087,null,46.252222988650622,-75.974360208338027,null,0,0]
[9173.2000000000007,9.1732000000000014,3.0279115175988398,1.2342166295222041,1.000066438073314,1.1526872531121071E-2,1,0,25085.686349675361,1.5707564634247531,2.3266181015608325,1.1265157627019309,1.0021390246796598,6.5348584848493235E-2,1.0014196997320586,5.3254523593721757E-2,6.3187140165022511,5.8994546057676109E-2,1.0018484881619818,0.10567179339098878,13.262143137598301,-105.63570503487189,74.36429496512811,null,1000000000,84147598.24000001,null,17.034647205954428,-29.197315381686021,null,46.20714740317807,-76.109510591315171,null,0,0]
[9226.2999999999993,9.2262999999999984,3.0435320480790571,1.2360118479375843,1.000067209440666,1.1593591041995545E-2,1,0,25230.897393047038,1.5707566928498695,2.3376038203333929,1.1287516630428791,1.0021638334648131,6.5725776421935445E-2,1.0014361716355971,5.3562205244062994E-2,6.3188399805687983,5.9335257923725133E-2,1.0018700123825204,0.10628350028775502,13.207805858687605,-105.66519847713157,74.334801522868432,null,1000000000,85124611.689999983,null,17.025214105370125,-29.090832358933181,null,46.162273507898291,-76.243594564369076,null,0,0]
[9279.4,9.279399999999999,3.0591622870943533,1.2377887273401968,1.0000679852596703,1.1660309449651067E-2,1,0,25376.108436420032,1.570756919649283,2.3486011160123508,1.1309666352194265,1.0021887848242348,6.610294926726136E-2,1.001452738339969,5.3869876743776711E-2,6.3189666691544355,5.9675956251358291E-2,1.0018916622704985,0.10689520736221007,13.153806052156069,-105.69483886535768,74.305161134642319,null,1000000000,86107264.359999999,null,17.015918462160311,-28.985547208191104,null,46.117599800191741,-76.376627805484588,null,0,0]
[9332.5,9.3324999999999996,3.0748020865896182,1.2395475362643293,1.0000687655303162,1.1727027753493904E-2,1,0,25521.319479794314,1.570757143867813,2.3596098267302774,1.1331609502644706,1.0022138787472759,6.6480103278561048E-2,1.0014693998404696,5.4177538035118662E-2,6.3190940822155941,6.0016640963749979E-2,1.0019134378505452,0.10750691461302982,13.100139538664838,-105.72462605175497,74.275373948245033,null,1000000000,87095556.25,null,17.006757589123961,-28.881444396918429,null,46.073124787882449,-76.508625700501213,null,0,0]
[9386.85,9.3868500000000008,3.0908198038642634,1.2413293098823903,1.00006956877897,1.1795316530750465E-2,1,0,25669.948862232402,1.5707573707375386,2.3708893432023408,1.1353858067203979,1.0022397110195225,6.686611606516317E-2,1.0014865517256277,5.4492431191981036E-2,6.319225244854886,6.0365331381142563E-2,1.0019358562294338,0.10813302193326856,13.04555055844957,-105.75526626602826,74.244733733971742,null,1000000000,88112952.922499999,null,16.997517892369338,-28.776099414039145,null,46.027807032199334,-76.64267445726405,null,0,0]
[9441.2000000000007,9.4412000000000003,3.1068472324209346,1.2430927056238936,1.0000703766912979,1.1863605197990554E-2,1,0,25818.578244671789,1.5707575949952299,2.3821804843727303,1.1375895830963803,1.0022656926236595,6.7252108896158791E-2,1.0015038029124819,5.4807313531817774E-2,6.3193571663870332,6.0714007371924845E-2,1.0019584063404054,0.10875912943533719,12.991302121734805,-105.78605982202818,74.213940177971821,null,1000000000,89136257.440000013,null,16.988413888898219,-28.671960937743322,null,45.982694307400664,-76.775670255984082,null,0,0]
[9495.5499999999993,9.4955499999999997,3.1228842227373987,1.2448379955653195,1.0000711892672884,1.1931893754577531E-2,1,0,25967.207627112453,1.5707578166857388,2.3934830857245881,1.1397725564694996,1.0022918235480738,6.7638081658085714E-2,1.0015211533959008,5.5122184992747729E-2,6.319489846764518,6.1062668853778104E-2,1.0019810882103202,0.10938523711768462,12.937389980754695,-105.81700642808697,74.18299357191303,null,1000000000,90165469.80249998,null,16.979442896381912,-28.569013088752442,null,45.937785048007704,-76.907628685442958,null,0,0]
[9549.9,9.5498999999999992,3.1389306282587968,1.24656544666586,1.0000720065069304,1.2000182199874766E-2,1,0,26115.837009554391,1.5707580358528954,2.4047969856685687,1.1419349995035772,1.0023181037810871,6.8024034237517572E-2,1.0015386031707236,5.543704551290269E-2,6.3196232859395503,6.1411315744404456E-2,1.0020039018661913,0.11001134497871504,12.883809963073567,-105.84810575214034,74.151894247859659,null,1000000000,91200590.00999999,null,16.970602296002081,-28.467240240592751,null,45.893077700361353,-77.038565041220735,null,0,0]
[9605.5249999999996,9.6055250000000001,3.155363066600867,1.248315224011612,1.0000728477472776,1.2070072512118507E-2,1,0,26267.953097841459,1.5707582575933674,2.4163878327518047,1.1441271929897854,1.002345155115093,6.8419019885727683E-2,1.001556565108124,5.5759280972081576E-2,6.319760641129621,6.1768126369380248E-2,1.0020273871969507,0.11065214092595632,12.829312633201766,-105.88009238440586,74.119907615594144,null,1000000000,92266110.52562499,null,16.96168665169326,-28.364280521243181,null,45.847529023721741,-77.171530381757464,null,0,0]
[9661.15,9.6611499999999992,3.1718050656649259,1.2500468656263106,1.000073693872628,1.2139962706440421E-2,1,0,26420.069186129804,1.5707584767804552,2.4279901813951539,1.1462984456776042,1.0023723628201826,6.8813984153118013E-2,1.0015746310391063,5.608150484005521E-2,6.3198987910340332,6.2124921536142338E-2,1.0020510106270821,0.11129293705683539,12.775154582966104,-105.91223815957716,74.087761840422843,null,1000000000,93337819.32249999,null,16.952902234718376,-28.262519249933447,null,45.802188588451145,-77.303456638723347,null,0,0]
[9716.7749999999996,9.7167750000000002,3.1882564775356057,1.2517606417851779,1.0000745448829693,1.2209852782158033E-2,1,0,26572.185274419408,1.5707586934580104,2.4396038675001241,1.148449036012569,1.0023997268836229,6.9208926918208291E-2,1.0015928009580428,5.6403717050540793E-2,6.3200377356006774,6.2481701156532524E-2,1.0020747721860377,0.11193373336949423,12.721331573594574,-105.94454260376116,74.055457396238836,null,1000000000,94415716.40062499,null,16.944246433018478,-28.16194046846174,null,45.757054767790926,-77.434359297680587,null,0,0]
[9772.4,9.7723999999999993,3.2047171572510122,1.2534568176350309,1.0000754007782893,1.2279742738588874E-2,1,0,26724.301362710241,1.5707589076688862,2.4512287299193103,1.1505792379304105,1.0024272472926095,6.9603848059558299E-2,1.0016110748592748,5.6725917537269945E-2,6.3201774747771529,6.2838465142416006E-2,1.0020986719034368,0.11257452986202469,12.667839441787814,-105.97700520756453,74.022994792435469,null,1000000000,95499801.75999999,null,16.935716696824826,-28.06252847696409,null,45.712125948164669,-77.564253550352561,null,0,0]
[9829.2999999999993,9.8292999999999999,3.2215645787580343,1.2551739332286203,1.0000762813460879,1.2351234542923828E-2,1,0,26879.904156846304,1.5707591242812866,2.4631314483981259,1.1527374531282046,1.0024555602551446,7.0007798826492149E-2,1.0016298752017607,5.7055491094587144E-2,6.320321239047888,6.3203390371865911E-2,1.0021232624105409,0.1132300144582201,12.613459275820231,-106.01037497084116,73.989625029158844,null,1000000000,96615138.48999998,null,16.927119285820751,-27.962028939787388,null,45.666377734269325,-77.696097349191646,null,0,0]
[9886.2000000000007,9.8862000000000005,3.2384214001551177,1.2568731777270354,1.0000771670253457,1.242272622099634E-2,1,0,27035.506950983614,1.5707593384002627,2.4750455294988623,1.1548749002807801,1.0024840367853356,7.0411726710108605E-2,1.0016487843359203,5.7385052244314977E-2,6.3204658346611247,6.3568299055385621E-2,1.0021479975454599,0.11388549923842634,12.559416751551719,-106.04390904381663,73.956090956183374,null,1000000000,97736950.440000013,null,16.918648580765048,-27.862717869971586,null,45.620840653764752,-77.826917227478148,null,0,0]
[9943.1,9.9431000000000012,3.2552874754162047,1.2585548190179461,1.0000780578160486,1.249421777207594E-2,1,0,27191.109745122143,1.5707595500686211,2.4869708099202108,1.1569918584707632,1.0025126768692438,7.0815631580555399E-2,1.0016678022555925,5.7714600915570499E-2,6.3206112615598151,6.3933191098716549E-2,1.0021728773404375,0.11454098420043608,12.505707646979475,-106.07760677865596,73.922393221344038,null,1000000000,98865237.610000014,null,16.910302043737143,-27.764579272272741,null,45.575513022518848,-77.956728533960344,null,0,0]
[10000,10,3.2721626614466102,1.260219119865631,1.0000789537181833,1.2565709195432186E-2,1,0,27346.712539261876,1.5707597593281935,2.4989071293260401,1.1590886021906008,1.0025414804928527,7.1219513308025131E-2,1.0016869289545809,5.8044137037487016E-2,6.3207575196865911,6.4298066407626253E-2,1.0021979018278993,0.11519646934198594,12.452327815514403,-106.11146749691736,73.888532503082644,null,1000000000,100000000,null,16.902077197728016,-27.667597414391448,null,45.530393170901434,-78.085546323834578,null,0,0]
[10058.25,10.058249999999999,3.2894475165312858,1.2619052142760785,1.0000798761711098,1.2638896679420995E-2,1,0,27506.007139590693,1.5707599711001152,2.5111379184757991,1.1612144351931803,1.0025711368976635,7.1632953358038431E-2,1.0017066221252171,5.8381478605533478E-2,6.3209081088936969,6.467158125479168E-2,1.002223669958896,0.11586750659927438,12.398018335294996,-106.14629968014133,73.853700319858675,null,1000000000,101168393.0625,null,16.893780742508952,-27.569496658866701,null,45.484416317892517,-78.216406686356265,null,0,0]
[10116.5,10.1165,3.3067416254533986,1.263573676993784,1.000080803980862,1.2712084028004673E-2,1,0,27665.30173992072,1.5707601804333056,2.5233799458351753,1.1633196509287007,1.0026009646644853,7.2046368878711395E-2,1.0017264292849097,5.8718806871441265E-2,6.3210595691172466,6.5045078364267261E-2,1.0022495897990822,0.11653854403974119,12.344045378442184,-106.18130114313171,73.818698856868295,null,1000000000,102343572.25,null,16.885606756072985,-27.472575640574188,null,45.43865372638475,-78.346256845550514,null,0,0]
[10174.75,10.17475,3.3240448437772909,1.265224774000109,1.0000817371474247,1.2785271240399564E-2,1,0,27824.596340251952,1.570760387369649,2.5356330486300647,1.165404529491004,1.0026309637780244,7.2459759730923876E-2,1.0017463504268971,5.9056121759232312E-2,6.321211900294645,6.5418557635039093E-2,1.0022756613838391,0.11720958166077301,12.290404730757565,-106.21647107019253,73.783528929807474,null,1000000000,103525537.5625,null,16.877552768320051,-27.376818305747676,null,45.393103652225122,-78.475112040921928,null,0,0]
[10233,10.233000000000001,3.3413570299838455,1.2668587661471176,1.0000826756707835,1.2858458315822009E-2,1,0,27983.890940584359,1.5707605919500769,2.5478970670716974,1.1674693462956593,1.0026611342229008,7.2873125775606062E-2,1.0017663855443792,5.939342319294675E-2,6.3213651023629334,6.5792018966122662E-2,1.0023018847487482,0.11788061945969329,12.237092253593149,-106.25180861973109,73.748191380268906,null,1000000000,104714289,null,16.869616368848735,-27.282208868614539,null,45.347764367112042,-78.602987218084422,null,0,0]
[10292.5,10.2925,3.3590498367673178,1.2685104291167066,1.0000836398645712,1.2933215787115848E-2,1,0,28146.603879980888,1.5707607985299423,2.5604353683008352,1.1695580419119012,1.0026921289718782,7.3295336579948286E-2,1.0017869682633709,5.9737948885642718E-2,6.3215224910878058,6.6173475862610465E-2,1.002328827584742,0.1185660573921863,12.182970315155719,-106.2880766420854,73.7119233579146,null,1000000000,105935556.25,null,16.861628615062351,-27.186738158315364,null,45.301667978036349,-78.73260994862585,null,0,0]
[10352,10.352,3.3767517109669849,1.270144779550098,1.0000846096474949,1.3007973113842709E-2,1,0,28309.316819378608,1.5707610027350971,2.572984730916632,1.1716263718540072,1.0027233024516544,7.3717521207478445E-2,1.0018076698875304,6.0082460380486244E-2,6.3216807883479955,6.6554913828308193E-2,1.0023559288606343,0.11925149550443663,12.129182287614661,-106.32451770788131,73.675482292118687,null,1000000000,107163904,null,16.853758649833221,-27.092432679310704,null,45.255787926961915,-78.861240762491761,null,0,0]
[10411.5,10.4115,3.3944625107251087,1.2717620796347004,1.0000855850195387,1.3082730295167426E-2,1,0,28472.029758777491,1.5707612046062547,2.5855449938543833,1.1736746150973807,1.0027546546455606,7.4139679510144704E-2,1.001828490409487,6.0426957596581121E-2,6.3218399940752645,6.6936332755685626E-2,1.0023831886149912,0.11993693379338567,12.075723993269751,-106.3611308474342,73.638869152565803,null,1000000000,108399332.25,null,16.846004086436,-26.999276441337283,null,45.210122422854234,-78.988894681786746,null,0,0]
[10471,10.471,3.4121820970583907,1.2733625864726421,1.0000865659806859,1.315748733025485E-2,1,0,28634.742698177521,1.5707614041832028,2.5981159990254126,1.1757030458993298,1.0027861855368339,7.4561811339951156E-2,1.0018494298218277,6.0771440453051433E-2,6.3220001082009896,6.7317732537245226E-2,1.0024106068865954,0.12062237225590464,12.022591329405593,-106.39791506996802,73.602084930031978,null,1000000000,109641841,null,16.83836259609388,-26.90725372440896,null,45.164669691714813,-79.11558643724625,null,0,0]
[10532,10.532,3.4303573747426532,1.2749862725173282,1.0000875774741611,1.3234128843790906E-2,1,0,28801.557644454355,1.570761606450513,2.6110149097290507,1.177762327898259,1.0028186968184958,7.4994557511442433E-2,1.0018710205347281,6.1124592759438774E-2,6.3221652017833607,6.7708727450945083E-2,1.0024388809779294,0.12132509085650246,11.968453016561025,-106.43580317497354,73.564196825026457,null,1000000000,110923024,null,16.830643469411996,-26.814071675226685,null,45.118290140769233,-79.244488369746833,null,0,0]
[10593,10.593,3.4485416007299259,1.2765928393050643,1.0000885948420604,1.3310770201845727E-2,1,0,28968.37259073235,1.5707618063883027,2.6239247839247777,1.1798013548805408,1.0028513958850649,7.5427275543639705E-2,1.0018927361921328,6.1477729800973269E-2,6.3223312499958135,6.8099702012609661E-2,1.0024673217629758,0.12202780963264398,11.914648460817665,-106.47386892753332,73.526131072466683,null,1000000000,112211649,null,16.823038411550677,-26.722048407279104,null,45.072130504522967,-79.372409460040984,null,0,0]
[10654,10.654,3.4667346342093497,1.2781825479964799,1.0000896180843659,1.3387411403519428E-2,1,0,29135.187537011494,1.5707620040365851,2.6368454605823399,1.1818204075173906,1.002884282718173,7.5859965277254846E-2,1.0019145767859177,6.1830851490573893E-2,6.3224982527631424,6.8490656106512865E-2,1.0024959292842348,0.12273052858072547,11.861173475617292,-106.51211120114294,73.487888798857057,null,1000000000,113507716,null,16.815545092209582,-26.631167832456214,null,45.02618892665248,-79.499364671375659,null,0,0]
[10715,10.715,3.4849363372429703,1.2797556546408753,1.0000906472010598,1.3464052447912126E-2,1,0,29302.002483291762,1.5707621994344623,2.649776781678864,1.183819761659451,1.0029173572993493,7.6292626553063028E-2,1.0019365423079123,6.2183957741182516E-2,6.3226662100097206,6.8881589616965527E-2,1.0025247035844465,0.1234332476970639,11.808023949886834,-106.55052885258668,73.44947114741332,null,1000000000,114811225,null,16.808161238121016,-26.541414138797833,null,44.9804635692864,-79.625368674135657,null,0,0]
[10777.5,10.7775,3.5035944737992346,1.2813504872953889,1.0000917077167251,1.3542577944079658E-2,1,0,29472.919436448919,1.5707623973430707,2.6630369642118836,1.1858481326952122,1.00295143990044,7.6735897358054528E-2,1.0019591775310901,6.2545730828237542E-2,6.3228392872470245,6.9282114776692466E-2,1.0025543584754208,0.12415324696225184,11.753900809806741,-106.59007188860946,73.409928111390542,null,1000000000,116154506.25,null,16.800707031003931,-26.450605924693747,null,44.93383617656653,-79.753499594048577,null,0,0]
[10840,10.84,3.5222614272934583,1.2829284196364692,1.0000927743991963,1.3621103273223396E-2,1,0,29643.836389607222,1.5707625929695224,2.6763079946512129,1.1878563957251855,1.0029857195570469,7.7179137950257964E-2,1.0019819438845161,6.2907487522712482E-2,6.3230133663202297,6.9682618082457404E-2,1.002584188540047,0.12487324639598864,11.700110830086302,-106.62979655635598,73.370203443644016,null,1000000000,117505600,null,16.793363083882408,-26.360947952633854,null,44.887431921621996,-79.880662216555095,null,0,0]
[10902.5,10.9025,3.5409370582834274,1.284489711150864,1.000093847248454,1.3699628434375468E-2,1,0,29814.753342766642,1.570762786353066,2.6895897124189498,1.1898448323210551,1.003020196248966,7.7622348158619917E-2,1.0020048413592524,6.3269227731043279E-2,6.3231884471466051,7.0083099409947003E-2,1.0026141938250774,0.12559324599405114,11.646649824183628,-106.66970158095234,73.330298419047665,null,1000000000,118864506.25,null,16.786127127419597,-26.272424082197148,null,44.84124888717556,-80.006871408964201,null,0,0]
[10965,10.965,3.5596212301891295,1.2860346162055432,1.0000949262644778,1.3778153426568006E-2,1,0,29985.670295927168,1.5707629775320548,2.702881959965401,1.1918137191494809,1.0030548699558801,7.8065527812158211E-2,1.0020278699463101,6.3630951359691629E-2,6.3233645296429559,7.0483558634889601E-2,1.0026443743775273,0.12631324575212685,11.593513681315793,-106.70978567516885,73.290214324831155,null,1000000000,120231225,null,16.778996948218651,-26.18501845395258,null,44.795285175768583,-80.132141745238144,null,0,0]
[11028.75,11.02875,3.5786877456499977,1.2875937966170854,1.0000960332138042,1.3858248743538566E-2,1,0,30160.00558815202,1.5707631703023601,2.7164507399361963,1.1938021254562663,1.0030904400805918,7.8517539403942363E-2,1.0020514941676477,6.3999892283545551E-2,6.3235451656228729,7.0892004145452422E-2,1.0026753391505545,0.1270476456656438,11.539645303454096,-106.75085458237371,73.249145417626295,null,1000000000,121633326.5625,null,16.771830898345783,-26.097000565941133,null,44.748626189441083,-80.258965094362011,null,0,0]
[11092.5,11.092499999999999,3.5977628688328336,1.2891364473835587,1.0000971465789923,1.3938343882689604E-2,1,0,30334.340880377975,1.5707633608569149,2.7300301533139733,1.1957707584616866,1.0031262151366453,7.8969518847378253E-2,1.0020752547791927,6.436881576139955E-2,6.3237268435639038,7.1300426399487915E-2,1.0027064863714485,0.12778204573628965,11.486106507102809,-106.79210705474934,73.207892945250663,null,1000000000,123043556.25,null,16.76477041835879,-26.01011363572842,null,44.70219146143635,-80.384841383776646,null,0,0]
[11156.25,11.15625,3.6168464635471551,1.2906628227504635,1.0000982663600206,1.4018438842994059E-2,1,0,30508.676172605024,1.5707635492337031,2.7436200422101509,1.197719896619992,1.0031621951021157,7.9421465961249632E-2,1.0020991517712432,6.473772169407388E-2,6.3239095633762581,7.1708825265253129E-2,1.0027378160909486,0.12851644595919781,11.432893162313162,-106.83354169494422,73.166458305055784,null,1000000000,124461914.0625,null,16.757813329050361,-25.92434170085447,null,44.655979040934611,-80.509785180456191,null,0,0]
[11220,11.22,3.6359383964018654,1.2921731719301537,1.0000993925568675,1.4098533623424885E-2,1,0,30683.01146483314,1.5707637354698463,2.757220251728369,1.1996498134903213,1.0031983799549558,7.9873380564419019E-2,1.0021231851340424,6.5106609982417338E-2,6.3240933249696427,7.2117200611051105E-2,1.002769328360078,0.12925084632940284,11.380001213791374,-106.87515709764845,73.124842902351546,null,1000000000,125888400,null,16.750957505068495,-25.839669079283688,null,44.609986997915342,-80.633810762991075,null,0,0]
[11285.5,11.285500000000001,3.6555629688310978,1.293708546292168,1.0001005563513161,1.4180826895675364E-2,1,0,30862.132431750968,1.5707639246268874,2.7712043900945322,1.2016129709343795,1.0032357714952838,8.0337666614564748E-2,1.0021480202632969,6.5485606134234986E-2,6.3242832159738995,7.2536761624785354E-2,1.0028018958609799,0.13000540685786371,11.325987895468675,-106.9181016734796,73.081898326520403,null,1000000000,127362510.25,null,16.744016776644827,-25.753800912181621,null,44.562959956320469,-80.76029931053732,null,0,0]
[11351,11.351000000000001,3.6751960667485721,1.2952275200959331,1.0001017269186123,1.4263119975843119E-2,1,0,31041.253398669887,1.5707641116008988,2.7851991013751611,1.2035564073622862,1.0032733792785089,8.0801917957179198E-2,1.0021729993320254,6.5864583447598338E-2,6.32447420654516,7.2956297527817113E-2,1.0028346561815324,0.13075996753086913,11.272305416127264,-106.96123404377536,73.038765956224637,null,1000000000,128845201,null,16.737178568671101,-25.669060562400581,null,44.516161493349571,-80.88584819460047,null,0,0]
[11416.5,11.416499999999999,3.6948375542497396,1.2967303478281371,1.0001029042587328,1.4345412862814219E-2,1,0,31220.374365589883,1.5707642964294544,2.7992042269913862,1.2054804039901381,1.0033112032803149,8.1266134396057024E-2,1.0021981223294651,6.6243541815059745E-2,6.3246662965838238,7.33758081774568E-2,1.0028676093780147,0.13151452834270402,11.218949612189892,-107.00455266568169,72.995447334318314,null,1000000000,130336472.25,null,16.730440743420807,-25.585431908356156,null,44.469589583065101,-81.010471995930089,null,0,0]
[11482,11.481999999999999,3.7144872982471355,1.2982172788856892,1.0001040883716534,1.4427705555474757E-2,1,0,31399.495332510927,1.5707644791492712,2.8132196114053243,1.2073852370119489,1.0033492434762483,8.1730315735082562E-2,1.0022233892447927,6.6622481129204131E-2,6.3248594859897338,7.379529343106718E-2,1.002900755507022,0.13226908928754094,11.165916395785832,-107.04805599241648,72.951944007583521,null,1000000000,131836324,null,16.723801216503617,-25.502899116164176,null,44.423242221899343,-81.134185003646465,null,0,0]
[11548.75,11.54875,3.734520396772663,1.2997164849101661,1.0001053020500352,1.4511568518307729E-2,1,0,31582.034638496421,1.570764663223768,2.8275128613754212,1.2093069869788851,1.0033882320269203,8.2203319182642787E-2,1.0022492864057733,6.7008632396264409E-2,6.3250574931499575,7.4222757853184301E-2,1.0029347327452041,0.13303805038109137,11.112198820274928,-107.09257795670332,72.907422043296677,null,1000000000,133373626.5625,null,16.717134006956286,-25.419902601616609,null,44.376239335700525,-81.259336413054982,null,0,0]
[11615.5,11.615500000000001,3.7545617994923077,1.3011996890731214,1.0001065227621371,1.4595431277007248E-2,1,0,31764.573944482971,1.5707648451826479,2.8418164486336712,1.211209398597048,1.0034274450504359,8.2676285766932908E-2,1.0022753330072161,6.7394763650709386E-2,6.3252566418265959,7.4650195601782474E-2,1.0029689104696899,0.13380701160019007,11.058807922924816,-107.13728849155025,72.862711508449749,null,1000000000,134919840.25,null,16.710564675112437,-25.338011859512058,null,44.329465519708179,-81.383571002222311,null,0,0]
[11682.25,11.68225,{"$f":"SQRT(1+(A205/pole1)^2)","v":3.7746113741320335},{"$f":"ATAN(A205/pole1)","v":1.3026671397871694},{"$f":"SQRT(1+(A205/Zero1)^2)","v":1.0001077505079332},{"$f":"ATAN(A205/Zero1)","v":1.4679293830394452E-2},{"$f":"IF(VIN_nom>Vout, 1, SQRT(1+(A205/z_RHP)^2))","v":1},{"$f":"IF(VIN_nom>Vout, 0, -ATAN(A205/z_RHP))","v":0},{"$f":"SQRT(1+(A205/Pole2)^2)","v":31947.11325047056},{"$f":"ATAN(A205/Pole2)","v":1.5707650250621759},2.8561302178717147,1.2130927487397103,{"$f":"SQRT(1+(A205/pole4)^2)","v":1.0034668825204796},{"$f":"ATAN(A205/pole4)","v":8.3149215280684169E-2},{"$f":"IF(VOUT_setting=1,1,SQRT(1+(A205*zterm1)^2))","v":1.0023015290374708},{"$f":"IF(VOUT_setting=1,0,ATAN(((A205*zterm1))))","v":6.7780874778961456E-2},6.3254569319118481,{"$f":"IF(VOUT_setting=1,0,ATAN(A205*$Q$4/(1+Afbr-$Q$5*(A205)^2)))","v":7.5077606526071206E-2},{"$f":"SQRT((1-(Z205/pterm2))^2+(A205/pterm1)^2)","v":1.00300328874139},{"$f":"IF((ATAN((A205/pterm1)/(1-A205^2/pterm2))>0),ATAN((A205/pterm1)/(1-A205^2/pterm2)),PI()+ATAN((A205/pterm1)/(1-A205^2/pterm2)))","v":0.13457597293830487},{"$f":"20*LOG10(((E205*K205*G205*O205)/(C205*I205*S205*M205*Q205))*Adc)","v":11.005739608790897},{"$f":"((F205+L205+H205+P205)-(D205+J205+T205+N205+R205))*radconv","v":-107.18218595404498},{"$f":"IF(V205>0,V205,V205+180)","v":72.817814045955018},null,{"$f":"IF(U205<0,A205,1000000000)","v":1000000000},{"$f":"A205^2","v":136474965.0625},null,{"$f":"20*LOG10((K205/(I205*M205))*AEA)","v":16.704091176089065},{"$f":"(L205-(J205+N205))*radconv","v":-25.257211016382701},null,{"$f":"20*LOG10((E205*G205/(C205*S205))*Acs*Am)","v":44.28291872376677},{"$f":"(F205+H205-(D205+T205))*radconv","v":-81.506903003836086},null,{"$f":"SUM((U206<0)*(U205>0))*A205","v":0},0]
[11749,{"$f":"A206/1000","v":11.749000000000001},3.7946689911599725,1.3041190804873617,1.0001089852873979,1.4763156177290506E-2,1,0,32129.652556459172,1.5707652028977923,2.8704540167695671,1.214957309300468,1.0035065444105893,8.3622107516726649E-2,1.0023278744848216,6.8166965667478888E-2,6.3256583632973102,7.5504990475317807E-2,1.0030378676215563,0.13534493438877981,10.952989857203555,-107.22726870134909,72.772731298650911,null,1000000000,138039001,null,16.697711516087594,-25.177484484033659,null,44.236596920910841,-81.62934636538354,null,0,0]
[11817.5,11.817500000000001,3.8152606917157832,1.305593211937065,1.0001102597520208,1.4849216946575844E-2,1,0,32316.977537137664,1.5707653833070965,2.8851636168423678,1.2168514985195602,1.0035474794203276,8.4107358702897456E-2,1.0023550659688276,6.8563157627354057E-2,{"$f":"IF(VOUT_setting=1,1,SQRT((1+Afbr-$Q$5*(A207)^2)^2+(A207*$Q$4)^2))","v":6.3258662621161301},7.5943551044054411E-2,1.0030735616952275,0.13613405598698744,10.899184212964501,-107.27372430643732,72.726275693562684,null,1000000000,139653306.25,null,16.691260121988314,-25.096768617751277,null,44.189292505652219,-81.754090294279791,null,0,0]
[11886,11.885999999999999,3.8358605940514887,1.3070515133327101,1.0001115416238977,1.4935277495885432E-2,1,0,32504.302517817203,1.5707655616369729,2.8998834637055966,1.2187264645500431,1.0035886507147906,8.4592570189352026E-2,1.0023824147820224,6.8959328030158765E-2,6.3260753626298083,7.6382082883332675E-2,1.0031094671658496,0.13692317768891715,10.845705707047912,-107.32037153764527,72.679628462354728,null,1000000000,141276996,null,16.684903456078096,-25.017151765277625,null,44.142220784204184,-81.877927246434538,null,0,0]
[11954.5,11.954499999999999,3.8564685667339957,1.3084942321966866,1.0001128309029996,1.5021337823945316E-2,1,0,32691.627498497761,1.5707657379231679,2.9146134021093166,1.2205824855600065,1.0036300582648991,8.5077741752523375E-2,1.0024099209115285,6.9355476753303835E-2,6.3262856647192045,7.6820585830442739E-2,1.003145584100736,0.1377122994869639,10.792550226864552,-107.36720862568073,72.632791374319268,null,1000000000,142910070.25,null,16.678639521701541,-24.938617977993825,null,44.095379640529131,-82.000871403473312,null,0,0]
[12023,12.023,3.8770844810737057,1.3099216110492828,1.0001141275892984,1.5107397929481568E-2,1,0,32878.952479179323,1.5707659122006121,2.9293532798208495,1.2224198346466795,1.0036717020414128,8.5562873168956485E-2,1.0024375843443962,6.9751603674240811E-2,6.3264971682645115,7.7259059722740261E-2,1.0031819125675776,0.13850142137338203,10.739713734735732,-107.41423380514433,72.585766194855665,null,1000000000,144552529,null,16.672466372482507,-24.861151597779557,null,44.048766983220204,-82.122936660414254,null,0,0]
[12093,12.093,3.898159912090986,1.3113646460826403,1.000115460322432,1.519534233166445E-2,1,0,33070.379466738144,1.5707660882546597,2.9444260414072887,1.2242784069436521,1.0037145017371458,8.6058586193610079E-2,1.0024660160402894,7.0156382256264249E-2,6.326714544356788,7.7707105047800235E-2,1.0032192551499277,0.13930782338419589,10.686045656187188,-107.46248121558298,72.537518784417017,null,1000000000,146240649,null,16.666249859330634,-24.783075600470088,null,44.001367506067027,-82.246781066390284,null,0,0]
[12163,12.163,3.9192433731314988,1.3127921585280986,1.0001168007906562,1.5283286498781691E-2,1,0,33261.80645429797,1.5707662622822693,2.9595088702769661,1.2261180415009429,1.0037575480559826,8.6554256822576475E-2,1.0024946119765972,7.0561137812163582E-2,6.3269331748444975,7.8155119688442437E-2,1.0032568187739646,0.14011422547048769,10.632702395487696,-107.51092133361003,72.489078666389972,null,1000000000,147938569,null,16.660124195544416,-24.706082110518857,null,43.954202293194918,-82.369736111384398,null,0,0]
[12233,12.233000000000001,3.9403347352970486,1.3142043917830069,1.0001181489939392,1.537123042947389E-2,1,0,33453.2334418588,1.5707664343182282,2.9746016132902757,1.2279390140343023,1.0038008409661949,8.7049884817763615E-2,1.0025233721392648,7.0965870211295065E-2,6.3271530595976255,7.8603103471316355E-2,1.0032946035131418,0.14092062762353205,10.579679875031889,-107.55955229300004,72.440447706999961,null,1000000000,149646289,null,16.654087457328995,-24.630155318928477,null,43.907269190680225,-82.491815740615394,null,0,0]
[12303,12.303000000000001,3.9614338723867508,1.3156015843059508,1.0001195049322502,1.5459174122381663E-2,1,0,33644.660429420612,1.5707666043965314,2.9897041203003005,1.2297415951889243,1.0038443804358785,8.7545469941204185E-2,1.0025522965141589,7.1370579323060263E-2,6.3273741984854315,7.9051056223144484E-2,1.0033326094413233,0.14172702983444713,10.526974091473056,-107.6083722350331,72.391627764966898,null,1000000000,151363809,null,16.648137769509805,-24.555279707184827,null,43.860566070237027,-82.61303361632288,null,0,0]
[12374.5,12.374499999999999,3.9829930319903943,1.3170134319326259,1.000120897911779,1.5549002076099125E-2,1,0,33840.189423859738,1.570766776132883,{"$f":"SQRT(1+(A215/Zero2)^2)","v":3.0051401794815797},{"$f":"ATAN(A215/Zero2)","v":1.2315640925466687},1.0038891074020468,8.8051630238956693E-2,1.0025820102104872,7.1783936595957665E-2,6.3276013706610792,7.9508575746827015E-2,1.0033716582089136,0.1425507121430836,10.473461802036558,-107.65843149512624,72.341568504873763,null,1000000000,153128250.25,null,16.642148556417439,-24.479868988912603,null,43.81309740939443,-82.735973284101561,null,0,0]
[12446,12.446,4.0045600454540713,1.3184100749864625,1.0001222989613221,1.5638829778865364E-2,1,0,34035.718418299846,1.5707669458960463,3.0205861181892959,1.2333679569574569,1.0039340915398893,8.8557745306446209E-2,1.0026118952020528,7.2197269297480438E-2,6.3278298510178583,7.9966062530106782E-2,1.003410937903688,0.14337439449286268,10.420271755806619,-107.70868403071346,72.291315969286543,null,1000000000,154902916,null,16.636246358682435,-24.405523155303527,null,43.765864284532924,-82.858041810762046,null,0,0]
[12517.5,12.5175,4.0261347865641977,1.3197917524036276,1.0001237080808456,1.5728657229231793E-2,1,0,34231.24741274093,1.5707671137198345,3.0360417856364372,1.2351534611574657,1.0039793328148376,8.9063814890484733E-2,1.002641951473539,7.2610577288601277E-2,6.3280596394140902,8.0423516388564917E-2,1.0034504486056841,0.14419807687380787,10.367399915299947,-107.75912788953838,72.240872110461623,null,1000000000,156687806.25,null,16.630429325915177,-24.332226567156511,null,43.718864508435587,-82.979252885849661,null,0,0]
[12589,12.589,4.047717131753366,1.3211586982555847,1.0001251252703154,1.5818484425749853E-2,1,0,34426.776407182966,1.5707672796372913,3.0515070339968737,1.2369208728273873,1.004024831192132,8.9569838738022947E-2,1.0026721790095425,7.3023860430343326E-2,6.3282907357073075,8.0880937137863707E-2,1.0034901903953857,0.14502175927576841,10.314842316500227,-107.80976113023091,72.19023886976909,null,1000000000,158482921,null,16.62469565463266,-24.259963874892204,null,43.67209592044523,-83.099619920172827,null,0,{"$f":"IF(AH218>0,W218,0)","v":0}]
[12662.25,12.66225,4.069835475213182,1.3225440637276453,1.0001265855148425,1.5910509925256444E-2,1,0,34627.091076315111,1.5707674476725373,3.0673605864441824,1.2387130552912002,1.0040717097479588,9.008820009088038E-2,1.0027033239676486,7.3447232979368879E-2,6.3285288443596599,8.1349518972650761E-2,1.0035311446117561,0.14586560174751506,10.261320146756724,-107.86182801986519,72.138171980134814,null,1000000000,160332575.0625,null,16.618906258039445,-24.186988929006802,null,43.624420160435932,-83.222071454420643,null,0,0]
[12735.5,12.7355,4.0919615452035032,1.3239144498992832,1.0001280542291093,1.6002535155258648E-2,1,0,34827.405745448232,1.5707676137748272,3.0832238896671251,1.2404868017106339,1.0041188580711065,9.0606512903762523E-2,1.0027346486434421,7.3870579152593263E-2,6.3287683254101692,8.1818065666300607E-2,1.0035723415386915,0.14670944421918614,10.208119595686881,-107.9140895876737,72.085910412326299,null,1000000000,162192960.25,null,16.613200666430664,-24.11506739877051,null,43.576982536990911,-83.343664753410309,null,0,0]
[12808.75,12.80875,4.1140952170618625,1.3252700933456443,1.0001295314130787,1.6094560114199002E-2,1,0,35027.720414582291,1.570767777977323,3.0990967939322314,1.2422423841144614,1.0041662761235763,9.1124776905038757E-2,1.0027661530200802,7.4293898800749533E-2,6.3290091787030711,8.2286577020874094E-2,1.0036137812641828,0.14755328667929268,10.155236629715612,-107.96654378529223,72.033456214707769,null,1000000000,164064076.5625,null,16.607577084806774,-24.044183684419448,null,43.529780811399242,-83.464413371330224,null,0,0]
[12882,12.882,4.1362363687517734,1.3266112257957248,1.0001310170667128,1.6186584800520064E-2,1,0,35228.035083717288,1.5707679403124328,3.1149791524682908,1.2439800694363903,1.0042139638671588,9.1642991823234501E-2,1.0027978370806268,7.4717191774627503E-2,6.3292514040817291,8.2755052838523399E-2,1.0036554638767097,0.14839712911614963,10.102667288805232,-108.01918857857488,71.980811421425116,null,1000000000,165945924,null,16.602033763935314,-23.974322478081252,null,43.482812772719569,-83.584330584693646,null,0,0]
[12957.25,12.95725,4.1589897204370718,1.3279741039876309,1.0001325521039319,1.6281121820740117E-2,1,0,35433.819095355226,1.570768105168618,3.1313048528504908,1.2457468385768815,1.0042632344618105,9.2175304557508025E-2,1.0028305733270324,7.5152014302433262E-2,6.3295016717489334,8.3236282591367367E-2,1.0036985375997016,0.14926401158284444,10.048985108926356,-108.07346712306082,71.926532876939177,null,1000000000,167890327.5625,null,16.596420876253525,-23.903602781494918,null,43.434803380782895,-83.706669887629232,null,0,0]
[13032.5,13.032500000000001,4.1817507131095368,1.3293221485489881,1.0001340960795559,1.6375658549918497E-2,1,0,35639.603106994102,1.5707682681210351,3.1476402261076326,1.2474952750516404,1.0043127895933581,9.270756491148921E-2,1.0028634991668477,7.5586808360406252E-2,6.3297533871130254,8.3717474417210447E-2,1.003741867845146,0.1501308939993625,9.9956256725937749,-108.12794250919247,71.872057490807535,null,1000000000,169846056.25,null,16.590889091999632,-23.833930359035918,null,43.387035969131574,-83.828159299939074,null,0,0]
[13107.75,13.107749999999999,4.204519222676657,1.3306555955235106,1.0001356489935442,1.647019498636677E-2,1,0,35845.387118633924,1.5707684292024722,3.1639851224191458,1.2492256522023395,1.0043626292196843,9.3239772591373976E-2,1.0028966145813989,7.6021573786966626E-2,6.3300065500013298,8.4198628101856757E-2,1.0037854547105804,0.15099777635238235,9.9425849175371912,-108.18261258131797,71.817387418682031,null,1000000000,171813110.0625,null,16.585436656684614,-23.765289534424905,null,43.339508229834351,-83.948812345265296,null,0,0]
[13183,13.183,4.2272951276788584,1.3319746760780424,1.0001372108458548,1.6564731128396536E-2,1,0,36051.171130274663,1.5707685884449685,3.1803393949579339,1.2509382381857437,1.0044127532984388,9.3771927303535632E-2,1.0029299195519077,7.6456310420599097E-2,6.3302611602402008,8.4679743431214344E-2,1.0038292982940862,0.15186465862835971,9.8898588558743601,-108.2374752013914,71.762524798608595,null,1000000000,173791489,null,16.580061860926911,-23.697664928423123,null,43.29221788423969,-84.068642267813104,null,0,0]
[13259.75,13.25975,4.2505325321878074,1.3333054865149969,1.0001388130387474,1.6661151406764704E-2,1,0,36261.057148792897,1.5707687489999078,3.1970291755198703,1.2526669082139885,1.0044641694982701,9.43146348845363E-2,1.0029640836506934,7.689968307376821E-2,6.3305223364995431,8.5170409367725949E-2,1.003874280383368,0.15274882085606561,9.8364018821837789,-108.29362757363468,71.70637242636532,null,1000000000,175820970.0625,null,16.574658175865132,-23.629723484577799,null,43.244227080218245,-84.190026378363726,null,0,0]
[13336.5,13.336499999999999,4.2737773827601222,1.334621822846124,1.0001404245297709,1.6757571375312079E-2,1,0,36470.943167312049,1.5707689077068971,3.2137284105179189,1.2543776182158404,1.004515881514122,9.4857286748677744E-2,1.0029984448980123,7.7343025435498022E-2,6.3307850180183012,8.5661034955062512E-2,1.0039195297351542,0.15363298297445349,9.7832641220426737,-108.34997581141576,71.65002418858424,null,1000000000,177862232.25,null,16.569331802138187,-23.562807776225281,null,43.196478531642597,-84.310581195225197,null,0,0]
[13413.25,13.41325,4.2970295585570044,1.3359239154400264,1.0001420453188803,1.685399103224737E-2,1,0,36680.82918583211,1.5707690645976584,3.2304369533324291,1.2560706367798593,1.0045678893003114,9.5399882584998624E-2,1.003033003273603,7.7786337334630612E-2,6.3310492046091413,8.6151619966410076E-2,1.0039650464552532,0.15451714496842842,9.73044157219352,-108.40651770494219,71.593482295057811,null,1000000000,179915275.5625,null,16.564081062480234,-23.496902398375418,null,43.148969912358467,-84.430319916784029,null,0,0]
[13490,13.49,4.3202889413034464,1.3372119898998622,1.00014367540603,1.6950410375779313E-2,1,0,36890.715204353066,1.5707692197031913,3.2471546602806423,1.2577462273736917,1.0046201928109031,9.5942422082733764E-2,1.0030677587570904,7.8229618600079417E-2,6.3313148960836862,8.6642164175069578E-2,1.004010830650061,0.15540130682264905,9.6779303024733316,-108.46325106474636,71.536748935253641,null,1000000000,181980100,null,16.558904322792291,-23.431992239414619,null,43.101698926138312,-84.549255468372607,null,0,0]
[13568.5,13.5685,4.344086002933099,1.3385151631924825,1.0001453522797124,1.7049027879900737E-2,1,0,37105.386897564327,1.570769376530158,3.2642628859162515,1.2594422644177414,1.0046739947771701,9.6497273584077073E-2,1.0031035105901396,7.8682975388314425E-2,6.3315882022174481,8.7143850985832869E-2,1.0040579355880737,0.15630562855832739,9.6245396931096536,-108.52147382305776,71.478526176942239,null,1000000000,184104192.25,null,16.553684437460102,-23.36661610962479,null,43.053593559696097,-84.670085250156035,null,0,0]
[13647,13.647,4.3678903615589943,1.3398041344495712,1.0001470388801876,1.7147645052373494E-2,1,0,37320.058590776498,1.5707695315529309,3.2813804034127565,1.2611206112900137,1.0047281060093818,9.7052065491380984E-2,1.0031394685787178,7.9136299768157906E-2,6.3318630822419637,8.7645494632639084E-2,1.0041053205644175,0.15720995011454703,9.5714666309412912,-108.57989231146638,71.420107688533619,null,1000000000,186240609,null,16.548538639920412,-23.302250034158195,null,43.005732021489813,-84.790101323961906,null,0,0]
[13725.5,13.7255,4.3917018985253229,1.3410791303605056,1.0001487352074068,1.7246261891281103E-2,1,0,37534.730283989549,1.5707696848024659,3.298507068110542,1.2627815340161437,1.0047825264575727,9.7606797472777992E-2,1.0031756327006565,7.9589591556785869E-2,6.3321395359522938,8.814709487330287E-2,1.0041529856948348,0.15811427147408449,9.5187071369315639,-108.63850425465142,71.361495745348577,null,1000000000,188389350.25,null,16.543465313517196,-23.238878753627723,null,42.958111948961005,-84.909316677257806,null,0,0]
[13804,13.804,4.4155204977003768,1.342340372907318,1.0001504412613202,1.7344878394707108E-2,1,0,37749.401977203474,1.570769836309015,3.3156427382623885,1.2644252935113058,1.0048372560715033,9.8161469196619763E-2,1.0032120029336631,8.0042850571454133E-2,6.3324175631423643,8.8648651465767378E-2,1.0042009310957072,0.1590185926194409,9.4662573046778622,-108.69730740034829,71.302692599651706,null,1000000000,190550416,null,16.538462883355262,-23.176487301426299,null,42.910731010423532,-85.02774402778455,null,0,0]
[13884.25,13.88425,4.4398772665133279,1.343615742000126,1.000152195402598,1.7445693006436867E-2,1,0,37968.859345107761,1.570769989422182,3.3331695779933335,1.2660882223813517,1.0048935253006712,9.8728443581020134E-2,1.0032493969992318,8.0506180018181162E-2,6.3327034146621139,8.9161343885598737E-2,1.0042502351771618,0.15994307355042153,9.4129543085179641,-108.75761676677214,71.242383233227855,null,1000000000,192772398.0625,null,16.533420620992356,-23.113702507526899,null,42.862538602555098,-85.14800989808144,null,0,0]
[13964.5,13.964499999999999,4.4642411782709432,1.3448771922922154,1.0001539597089728,1.7546507263510293E-2,1,0,38188.316713012944,1.5707701407755539,3.3507055386036533,1.2677337498428927,1.0049501175266289,9.9295354291055182E-2,1.0032870064204571,8.0969474827435259E-2,6.3329909101595705,8.9673990178275778E-2,1.0042998324125076,0.16086755421969487,9.3599669034389841,-108.81812126983813,71.18187873016187,null,1000000000,195007260.25,null,16.528449250743474,-23.051910991792319,null,42.814591278361362,-85.26747828516595,null,0,0]
[14044.75,14.044750000000001,4.4886121166588282,1.3461249464525311,1.0001557341803908,1.7647321163880014E-2,1,0,38407.774080918978,1.5707702903992959,3.3682504776365616,1.2693621388417764,1.0050070326948124,9.98622009731161E-2,1.0033248311731209,8.1432734804237669E-2,6.3332800494108872,9.0186590085610238E-2,1.0043497229281551,0.16179203460766323,9.3072911402279761,-108.87881857869067,71.121181421309331,null,1000000000,197255002.5625,null,16.523547217264145,-22.991097670003271,null,42.766886643779799,-85.386161946023307,null,0,0]
[14125,14.125,4.5129899678418699,1.3473592225115243,1.0001575188167982,1.77481347054987E-2,1,0,38627.231448825863,1.5707704383228887,3.3858042555158807,1.2709736472386182,1.0050642707503583,0.10042898327383849,1.0033628712328708,8.1895959753698774E-2,6.3335708321909738,9.0699143349557296E-2,1.0043999068512119,0.16271651469442172,9.2549231416979882,-108.93970638803049,71.060293611969513,null,1000000000,199515625,null,16.518713005510445,-22.93124774927762,null,42.719422336472299,-85.504073371855043,null,0,0]
[14207.25,14.20725,4.5379824235165502,1.3486104965727463,1.0001593584782138,1.7851460359720121E-2,1,0,38852.158159235973,1.5707705881989604,3.4038045396586232,1.272608065517068,1.0051232702999751,0.10100982381257222,1.0034020827286843,8.2370692698712916E-2,6.333870567136624,9.1224421855229332E-2,1.0044516460646977,0.16366403444962691,9.2015654044516229,-109.00230694659096,70.997693053409037,null,1000000000,201845952.5625,null,16.513827149057946,-22.870890778600355,null,42.671022065322639,-85.62413485379065,null,0,0]
[14289.5,14.2895,4.5629819064119115,1.3498480616933242,1.0001612088174823,1.7954785632731261E-2,1,0,39077.08486964694,1.5707707363496666,3.4218138207860052,1.2742252839283301,1.0051826089139158,0.10159059597008864,1.0034415203448956,8.2845388434456116E-2,6.3341720280695277,9.1749650815214162E-2,1.0045036937651151,0.16461155384508488,9.1485229408030584,-109.06510279810304,70.934897201896959,null,1000000000,204189810.25,null,16.509009438877264,-22.811515270910924,null,42.62286932479411,-85.743410872514602,null,0,0]
[14371.75,14.37175,4.5879883016561154,1.3510721382089581,1.0001630698345443,1.8058110522328016E-2,1,0,39302.011580058766,1.5707708828046298,3.4398319575865686,1.2758255642291552,1.0052422865321362,0.10217129936674747,1.0034811840548445,8.3320046751396024E-2,6.3344752147433026,9.2274829952162643E-2,1.0045560500915889,0.16555907285834984,9.0957918008268592,-109.12809154421547,70.871908455784535,null,1000000000,206547198.0625,null,16.504258367672861,-22.753106208597721,null,42.574961672043408,-85.861914051172846,null,0,0]
[14454,14.454000000000001,4.6130014968367199,1.3522829418400966,1.0001649415293403,1.8161435026306336E-2,1,0,39526.938290471415,1.5707710275927991,3.4578588116254583,1.27740916306888,1.0053023030942643,0.10275193362318383,1.0035210738317224,8.3794667440100737E-2,6.3347801269102009,9.2799958988887196E-2,1.0046087151840104,0.16650659146662972,9.0433681067452394,-109.19127081473648,70.808729185263516,null,1000000000,208918116,null,16.499572467418474,-22.695648866659571,null,42.527296697104461,-85.979656748457046,null,0,0]
[14622.5,14.6225,4.6642651078980268,1.3547228704139822,1.0001688092873837,1.8373107720669177E-2,1,0,39987.730396304127,1.5707713191240387,3.4948158589232232,1.2806023376182649,1.0054263131424521,0.10394122216246339,1.003603499153529,8.4766872288575087E-2,6.3354101670541443,9.3875597634153166E-2,1.00471757138568,0.16844770725292893,8.93691534930195,-109.32128702707853,70.678712972921474,null,1000000000,213817506.25,null,16.490170309091297,-22.580851359033666,null,42.430396534257547,-86.218544148403041,null,0,0]
[14706.75,14.70675,4.6899071555125973,1.3559228286779414,1.0001707599711425,1.8478943451560353E-2,1,0,40218.126449221738,1.5707714623845326,3.5133075345907905,1.2821737247547558,1.0054888513485274,0.10453575600267929,1.0036450674911068,8.5252914600667792E-2,6.335727901701417,9.4413336927599095E-2,1.0047724860354674,0.16941826440876578,8.8841568790851273,-109.38658511536056,70.61341488463944,null,1000000000,216288495.5625,null,16.485565845597293,-22.524889996111401,null,42.38231837879259,-86.336841580758858,null,0,0]
[14791,14.791,4.715555882675762,1.3571097350727996,1.0001727218579723,1.8584778768433272E-2,1,0,40448.522502140171,1.570771604012994,3.5318077946639712,1.2837286532665275,1.0055517449209554,0.10513021568117639,1.0036868729072423,8.5738916538440249E-2,6.3360474457031213,9.495102247194076E-2,1.004827725255856,0.17038882103848876,8.8317051622510014,-109.45207328095819,70.547926719041811,null,1000000000,218773681,null,16.481023887583774,-22.469867300261129,null,42.334484892998375,-86.454391189676954,null,0,0]
[14877.25,14.87725,4.7418202878097295,1.3583115146551832,1.0001747419228644,1.8693126065038895E-2,1,0,40684.387897561937,1.5707717473418981,3.5507559824548354,1.2853037055165051,1.005616499566734,0.10573870991464748,1.0037299162932123,8.62364135564197E-2,6.3363764493256367,9.5501416076549342E-2,1.0048846121738564,0.17138241701562462,8.7783220956090737,-109.51931046052994,70.480689539470063,null,1000000000,221332567.5625,null,16.476437414485694,-22.414495817338782,null,42.285766819775155,-86.573969101003073,null,0,0]
[14963.5,14.9635,4.7680914659785012,1.3595000528344376,1.0001767737288969,1.880147292271285E-2,1,0,40920.253292984533,1.5707718890184992,3.5697128853978306,1.2868620330188774,1.0056816265093094,0.10634712556240591,1.0037732080842898,8.673386778435821E-2,6.3367073486441585,9.6051752720137981E-2,1.0049418395839016,0.17237601238491246,8.7252525325714796,-109.58674180212384,70.413258197876161,null,1000000000,223906332.25,null,16.471913557130073,-22.360077994569092,null,42.237300075941107,-86.692788326136011,null,0,0]
[15049.75,15.04975,4.7943693058417169,1.36067556395233,1.0001788172759982,1.8909819338914037E-2,1,0,41156.118688407943,1.5707720290712053,3.5886783653817003,1.2884038933059314,1.0057471256763573,0.10695546218932812,1.0038167482483362,8.7231278981607263E-2,6.3370401433617722,9.6602032084443928E-2,1.0049994076536171,0.17336960711714747,8.6724925432957143,-109.65436480182763,70.345635198172374,null,1000000000,226494975.0625,null,16.467450909540247,-22.306599053135784,null,42.189082137373603,-86.810861144426667,null,0,0]
[15136,15.135999999999999,4.8206536984587958,1.3618382578216657,1.0001808725640968,1.9018165311101429E-2,1,0,41391.984083832154,1.5707721675277768,3.6076522871375674,1.2899295388090126,1.0058129969951595,0.10756371936063749,1.0038605367530333,8.7728646907645189E-2,6.3373748331799238,9.7152253851408063E-2,1.0050573165515488,0.17436320118268844,8.6200382697784121,-109.72217698846318,70.277823011536825,null,1000000000,229098496,null,16.463048102690522,-22.25404450646786,null,42.141110514836868,-86.928199575710579,null,0,0]
[15224,15.224,4.8474780405252131,1.363011545707562,1.0001829816543661,1.9128709147107001E-2,1,0,41632.63515394694,1.5707723071767197,3.6270197499824088,1.291469684556241,1.0058805883123241,0.10818423564085189,1.0039054696363878,8.8236061510317057E-2,6.3377182666620886,9.7713579846313389E-2,1.0051167518598769,0.17537695440948442,8.5668308597427263,-109.79155752802892,70.208442471971082,null,1000000000,231770176,null,16.458616254647648,-22.201361620526935,null,42.092416871256802,-87.047174105971067,null,0,0]
[15312,15.311999999999999,4.8743089821997216,1.3641719183016561,1.0001851029667597,1.9239252515554171E-2,1,0,41873.286224062518,1.5707724452205023,3.6463957248908025,1.2929934660380902,1.0059485668820729,0.10880466829518769,1.0039506609716853,8.8743430562594594E-2,6.3380636722945018,9.8274845214622791E-2,1.0051765423248367,0.17639070687852171,8.5139338045224449,-109.86112991541575,70.138870084584255,null,1000000000,234457344,null,16.45424393375054,-22.149611454549326,null,42.043974513889324,-87.165408627892035,null,0,0]
[15400,15.4,4.9011464150952131,1.3653195846157824,1.0001872365011992,1.9349795413744292E-2,1,0,42113.937294178897,1.5707725816866416,3.6657800768877729,1.2945011357205076,1.0060169326259036,0.10942501686299126,1.0039961107240261,8.9250753809429068E-2,6.3384110497548027,9.8836049619184116E-2,1.0052366881284007,0.1774044585568986,8.4613432267548845,-109.93089162963474,70.069108370365257,null,1000000000,237160000,null,16.449929797628357,-22.09877951848485,null,41.995780907464081,-87.28291511523895,null,0,0]
[15488,15.488,4.9279902331597079,1.3664547492431924,1.0001893822576073,1.9460337838978766E-2,1,0,42354.588364296047,1.5707727166020293,3.6851726737805195,1.2959929410516471,1.0060856854648885,0.11004528088399271,1.0040418188583171,8.9758030995912161E-2,6.3387603987188612,9.9397192723070724E-2,1.0052971894535354,0.17841820941123063,8.409055319718453,-110.00084018399268,69.999159816007321,null,1000000000,239878144,null,16.445672539210459,-22.04885160976789,null,41.947833552050149,-87.399705288583462,null,0,0]
[15578.25,15.578250000000001,4.9555269222904377,1.367606162505802,1.000191595571726,1.9573706138964309E-2,1,0,42601.392444729478,1.5707728533837542,3.7050695323007372,1.2975066652090461,1.0061565981734939,0.11068131562951813,1.0040889640054727,9.0278230228929585E-2,6.3391207273191741,9.9972619211429053E-2,1.0053596071530995,0.17945787914032355,8.3557409687639037,-110.07276869357953,69.927231306420467,null,1000000000,242681873.0625,null,16.441364174978943,-21.998571547702308,null,41.898913463591605,-87.518749571587207,null,0,0]
[15668.5,15.6685,4.983070108608235,1.3687448487296032,1.0001938217406217,1.968707393575074E-2,1,0,42848.196525163708,1.5707729885897634,3.7249747897663426,1.299004214902679,1.0062279178554221,0.11131726047020897,1.0041363808408164,9.0798380473506662E-2,6.3394831288313558,0.10054798050726431,1.0054223991797377,0.18049754793000072,8.3027370744920308,-110.14488853119859,69.855111468801411,null,1000000000,245501892.25,null,16.437112958707701,-21.949212972698042,null,41.850247164957764,-87.637064623987314,null,0,0]
[15758.75,15.758749999999999,5.010619684968729,1.3698710148659692,1.0001960607642082,1.9800441226427365E-2,1,0,43095.000605598703,1.5707731222471293,3.7448883122482419,1.3004858413856293,1.0062996444241428,0.11195311491085064,1.0041840693258612,9.131848145514318E-2,6.3398476028999848,0.10112327624788613,1.0054855657340636,0.1815372157426523,8.2500397512123751,-110.21719712468509,69.782802875314914,null,1000000000,248338201.5625,null,16.432917589108641,-21.900761462191191,null,41.801832071439506,-87.754662301235925,null,0,0]
[15849,15.849,5.0381755465464924,1.3709848634672732,1.0001983126423997,1.9913808008083563E-2,1,0,43341.804686034469,1.5707732543823072,3.7648099685959227,1.3019517908758746,1.0063717777926566,0.11258887845666173,1.0042320294219074,9.1838532899497519E-2,6.3402141491676849,0.10169850607085866,1.0055491070177851,0.1825768825401233,8.1976451841435996,-110.28969193828432,69.710308061715679,null,1000000000,251190801,null,16.428776799304899,-21.853202882097705,null,41.753665634823932,-87.87155420670986,null,0,0]
[15941.25,15.94125,5.0663484532508098,1.3721108720839725,1.0002006277086795,2.0029686543893782E-2,1,0,43594.078108973736,1.5707733878994441,3.7851813746248983,1.3034342760197921,1.0064459300156172,0.11323863649206042,1.0042813330113678,9.2370057548028919E-2,6.3405909595601155,0.10228641486705733,1.0056144439075341,0.18363958795554444,8.1443985139043154,-110.36398313878965,69.636016861210351,null,1000000000,254123451.5625,null,16.42459937025637,-21.805498783207369,null,41.704686166063716,-87.990318932409053,null,0,0]
[16033.5,16.0335,5.0945277125048909,1.373224425561669,1.0002029562054264,2.0145564541723896E-2,1,0,43846.351531913766,1.5707735198801787,3.8055610105083391,1.3049008862749303,1.0065205070827488,0.11388829851544124,1.0043309203009323,9.2901529860279913E-2,6.3409699342506025,0.1028742540267498,1.0056801727488727,0.18470229222792478,8.0914603267456968,-110.43846366151426,69.561536338485737,null,1000000000,257073122.25,null,16.420476395662774,-21.758698659332591,null,41.655961227291428,-88.108369996541896,null,0,0]
[16125.75,16.12575,5.122713219475532,1.3743257267027076,1.000205298132546,2.0261441998465728E-2,1,0,44098.624954854553,1.570773650350878,3.8259487447326408,1.3063518690637199,1.006595508899623,0.11453786399981186,1.0043807912485807,9.3432949543782173E-2,6.3413510728511762,0.10346202316370012,1.0057462937607586,0.18576499531473198,8.0388267674177367,-110.51313091360049,69.486869086399508,null,1000000000,260039813.0625,null,16.41640662717473,-21.712788305528591,null,41.6074882112719,-88.225719016568007,null,0,0]
[16218,16.218,5.1509048716011092,1.3754149739899324,1.0002076534899442,2.0377318911011182E-2,1,0,44350.898377796082,1.5707737793373104,3.8463444485208682,1.3077874668269907,1.0066709353713024,0.11518733241866244,1.0044309458120615,9.3964316306244244E-2,6.3417343749717432,0.10404972189195619,1.005812807163341,0.18682769717282638,7.9864940509000224,-110.58798234009092,69.412017659909083,null,1000000000,263023524,null,16.412388849526128,-21.66775380226867,null,41.559264547914523,-88.342377362423022,null,0,0]
[16312.5,16.3125,5.1797903919195427,1.3765184929034127,1.00021008022061,2.0496021522199561E-2,1,0,44609.324811054015,1.5707739099570646,3.867245740195405,1.3092423750168234,1.0067486417305143,0.11585254033522925,1.0044826176895494,9.4508588055378553E-2,6.3421292688312061,0.10465168132683014,1.0058813499385766,0.18791631726866767,7.933192980951711,-110.66484774702553,69.335152252974467,null,1000000000,266097656.25,null,16.408325749076916,-21.622514793439141,null,41.510120598964015,-88.461176517260597,null,0,0]
[16407,16.407,5.2086821499832645,1.3776097710344684,1.000212521044477,2.0614723555719274E-2,1,0,44867.751244312705,1.5707740390721481,3.8881551298725463,1.3106816380631572,1.006826793508703,0.11651764527670361,1.0045345870960043,9.5052803650121392E-2,6.3425264321997599,0.10525356605757764,1.0059503049504412,0.18900493598151741,7.8801997860421533,-110.74190111426921,69.258098885730789,null,1000000000,269189649,null,16.404314726886223,-21.578166199053527,null,41.461232971486893,-88.579274280784915,null,0,0]
[16501.5,16.5015,5.2375800425655417,1.3786890083745367,1.0002149759614423,2.0733425008229497E-2,1,0,45126.17767757213,1.5707741667084114,3.9090724876051319,1.3121055011052731,1.0069053906021539,0.11718264667869407,1.0045868539852505,9.5596962776851493E-2,6.3429258646511517,0.10585537567024747,1.0060196724394659,0.19009355326299898,7.8275106157585581,-110.81913981585619,69.18086018414381,null,1000000000,272299502.25,null,16.400354577923661,-21.53469394280949,null,41.412599019733548,-88.696682109080911,null,0,0]
[16596,16.596,5.2664839686836356,1.3797564006382204,1.0002174449714023,2.0852125876389502E-2,1,0,45384.604110832282,1.5707742928911164,3.9299976861635733,1.3135142043142618,1.0069844329065938,0.11784754397735123,1.0046394183108585,9.6141065122146471E-2,6.3433275657568036,0.10645710975120735,1.0060894526474871,0.19118216906405328,7.7751216898512308,-110.89656126539741,69.103438734602591,null,1000000000,275427216,null,16.396444129229405,-21.49208423305836,null,41.364216136045002,-88.813411213149848,null,0,0]
[16692.5,16.692499999999999,5.2960057418687763,1.3808343584969105,1.0002199807789802,2.0973338325731797E-2,1,0,45648.49988659603,1.570774420269982,3.9513737081071501,1.3149373213900757,1.0070656073994688,0.11852640515958174,1.0046934020058464,9.6696623938740192E-2,6.3437401092084418,0.10707150056900129,1.0061611358516178,0.19229382277350263,7.7219299897049272,-110.97580720740399,69.024192792596011,null,1000000000,278639556.25,null,16.392501022353457,-21.449448809700982,null,41.315065699764716,-88.931921753140912,null,0,0]
[16789,16.789000000000001,5.3255336007443486,1.3819003639309326,1.0002225312821735,2.1094550158687071E-2,1,0,45912.395662360512,1.5707745461845484,3.9727576464911385,1.3163451210275916,1.0071472459261137,0.11920515659871724,1.0047476957616535,9.7252122885081019E-2,6.3441550174475108,0.1076858117533873,1.0062332499430506,0.19340547483360979,7.6690436263355624,-111.05523838724612,68.944761612753879,null,1000000000,281870521,null,16.388607367527179,-21.407684639197679,null,41.266171693797311,-89.049747410458821,null,0,0]
[16885.5,16.8855,5.3550674446408051,1.3829546122544789,1.0002250964808697,2.1215761371698283E-2,1,0,46176.291438125714,1.5707746706599206,3.9941493741660588,1.3177378437111236,1.0072293483736954,0.11988379769611267,1.0048022995280175,9.7807561628071346E-2,6.3445722900101407,0.10830004286495126,1.0063057951835095,0.19451712518990869,7.6164587901264378,-111.13485217499669,68.865147825003305,null,1000000000,285120110.25,null,16.384762012871779,-21.366777909950784,null,41.217531460005716,-89.166899372865558,null,0,0]
[16982,16.981999999999999,{"$f":"SQRT(1+(A269/pole1)^2)","v":5.3846071750770497},{"$f":"ATAN(A269/pole1)","v":1.3839972946016454},{"$f":"SQRT(1+(A269/Zero1)^2)","v":1.0002276763749556},{"$f":"ATAN(A269/Zero1)","v":2.1336971961208515E-2},{"$f":"IF(VIN_nom>Vout, 1, SQRT(1+(A269/z_RHP)^2))","v":1},{"$f":"IF(VIN_nom>Vout, 0, -ATAN(A269/z_RHP))","v":0},{"$f":"SQRT(1+(A269/Pole2)^2)","v":46440.187213891622},{"$f":"ATAN(A269/Pole2)","v":1.5707747937206333},4.0155487666460212,1.3191157250354604,{"$f":"SQRT(1+(A269/pole4)^2)","v":1.0073119146287757},{"$f":"ATAN(A269/pole4)","v":0.12056232785372407},{"$f":"IF(VOUT_setting=1,1,SQRT(1+(A269*zterm1)^2))","v":1.0048572132544009},{"$f":"IF(VOUT_setting=1,0,ATAN(((A269*zterm1))))","v":9.8362939834834268E-2},6.3449919264299419,{"$f":"IF(VOUT_setting=1,0,ATAN(A269*$Q$4/(1+Afbr-$Q$5*(A269)^2)))","v":0.10891419346463285},{"$f":"SQRT((1-(Z269/pterm2))^2+(A269/pterm1)^2)","v":1.0063787718361312},{"$f":"IF((ATAN((A269/pterm1)/(1-A269^2/pterm2))>0),ATAN((A269/pterm1)/(1-A269^2/pterm2)),PI()+ATAN((A269/pterm1)/(1-A269^2/pterm2)))","v":0.19562877378717608},{"$f":"20*LOG10(((E269*K269*G269*O269)/(C269*I269*S269*M269*Q269))*Adc)","v":7.5641717406807194},{"$f":"((F269+L269+H269+P269)-(D269+J269+T269+N269+R269))*radconv","v":-111.21464598134183},{"$f":"IF(V269>0,V269,V269+180)","v":68.785354018658168},null,{"$f":"IF(U269<0,A269,1000000000)","v":1000000000},{"$f":"A269^2","v":288388324},null,{"$f":"20*LOG10((K269/(I269*M269))*AEA)","v":16.380963837196237},{"$f":"(L269-(J269+N269))*radconv","v":-21.326715090513549},null,{"$f":"20*LOG10((E269*G269/(C269*S269))*Acs*Am)","v":41.16914237878288},{"$f":"(F269+H269-(D269+T269))*radconv","v":-89.283388588577935},null,{"$f":"SUM((U270<0)*(U269>0))*A269","v":0},0]
[17081,{"$f":"A270/1000","v":17.081},5.4149181997922859,1.3850551661796944,1.0002303383769424,2.1461322069763769E-2,1,0,46710.919667786904,1.570774918524471,4.0375103850198455,1.3205141216035439,1.0073971017732204,0.12125832059846921,1.0049138716720338,9.8932642820378322E-2,6.3454248902782355,0.10954417057417698,1.0064540876745669,0.19676921968423708,7.5108357138768582,-111.29669138744811,68.703308612551893,null,1000000000,291760561,null,16.377115147533488,-21.2864774666096,null,41.119757985203982,-89.402218165665161,null,0,0]
[17180,17.18,5.4452352168327733,1.3861012592572417,1.0002330158453578,2.1585671514509974E-2,1,0,46981.652121682899,1.5707750418899409,4.0594798133609906,1.3218973849360454,1.0074827768241046,0.12195419530758114,1.0049708562091741,9.9502281383419738E-2,{"$f":"IF(VOUT_setting=1,1,SQRT((1+Afbr-$Q$5*(A271)^2)^2+(A271*$Q$4)^2))","v":6.3458603410472847},0.11017406201117372,1.0065298581333011,0.19790966360973283,7.4578053441339121,-111.3789208678933,68.621079132106701,null,1000000000,295152400,null,16.373313817371638,-21.247100067879835,null,41.070632461701024,-89.520372809454969,null,0,0]
[17279,17.279,5.475558126663767,1.3871357672088507,1.0002357087800779,2.1710020291606898E-2,1,0,47252.384575579614,1.5707751638417662,4.0814569255523505,1.3232657541566242,1.0075689396569658,0.12264995133731349,1.0050281668103496,0.10007185516526641,6.3462982782252482,0.11080386730272061,1.0066060835010819,0.19905010550152652,7.4050768091047487,-111.46133175609584,68.538668243904155,null,1000000000,298563841,null,16.369558730560364,-21.208569158080365,null,41.021763101637212,-89.637863596153565,null,0,0]
[17378,17.378,5.5058868319240819,1.3881588792487709,1.0002384171809777,2.1834368397214435E-2,1,0,47523.117029477013,1.570775284404107,4.103441598134995,1.32461946349021,1.0076555901466759,0.12334558804459897,1.0050858034197827,0.10064136380747594,6.3467387012975074,0.11143358597631529,1.0066827640682159,0.20019054529662539,7.3526463560068915,-111.54392142774877,68.456078572251229,null,1000000000,301994884,null,16.365848800849854,-21.170871281650495,null,40.973147238037697,-89.754701363549685,null,0,0]
[17479.25,17.47925,5.536910721186004,1.3891936494347623,1.0002412031337424,2.1961541897574769E-2,1,0,47800.002493690976,1.5707754062938946,4.1259336164985756,1.3259890146025448,1.007744714242053,0.12405691058649597,1.0051450871000802,0.10122374807748741,6.3471917047285116,0.11207752635272551,1.0067616585147696,0.20135690194271083,7.299328782560778,-111.62857037048924,68.371429629510757,null,1000000000,305524180.5625,null,16.362100161036388,-21.133164546336779,null,40.923685933630068,-89.873530136499937,null,0,0]
[17580.5,17.580500000000001,5.5679404730203697,1.3902168872991376,1.0002440052634169,2.2088714687452451E-2,1,0,48076.887957905637,1.5707755267797012,4.1484332898270804,1.3273437122858862,1.0078343481455247,0.12476810696220722,1.0052047116566027,0.10180606345576594,6.3476473072353601,0.11272137513087303,1.0068410297058643,0.20252325625968207,7.2463152699721807,-111.71340089570471,68.286599104295291,null,1000000000,309073980.25,null,16.358396547758172,-21.09630154058452,null,40.87448426051423,-89.991698063352061,null,0,0]
[17681.75,17.681750000000001,5.5989759899553366,1.3912287824545997,1.0002468235698656,2.2215886762739973E-2,1,0,48353.773422120983,1.5707756458856459,4.1709404942389465,1.3286837919832388,1.007924491721081,0.12547917648604201,1.0052646770286955,0.10238830955968918,6.3481055082585343,0.1133651318066137,1.0069208779570968,0.20368960817734813,7.1936020187900764,-111.79841032885807,68.201589671141932,null,1000000000,312644283.0625,null,16.35473689001897,-21.060268736597919,null,40.825539489755009,-90.109216004327408,null,0,0]
[17783,17.783000000000001,5.6300171766504121,1.3922295204262052,1.0002496580529514,2.2343058119329937E-2,1,0,48630.658886337013,1.5707757636352979,4.1934551084711877,1.3300094842937997,1.0080151448319863,0.12619011847306744,1.0053249831553719,0.10297048600691368,6.3485663072354876,0.11400879587624997,1.0070012035857605,0.20485595762456321,7.1411852986058868,-111.88359603870387,68.116403961296129,null,1000000000,316235089,null,16.351120145581351,-21.025052884122896,null,40.776848932698456,-90.226094585387727,null,0,0]
[17886.5,17.886500000000002,5.6617539305454638,1.3932411541840104,1.0002525722442599,2.2473054758958149E-2,1,0,48913.69736086965,1.5707758826237539,4.2164775825151466,1.3313500010786958,1.0081083389590086,0.12691672663900869,1.0053869815515546,0.10356552731491669,6.3490400307945025,0.1146666673520398,1.0070838079684277,0.20604822331988926,7.0879064373100356,-111.9708542652414,68.0291457347586,null,1000000000,319926882.25,null,16.347466327324231,-20.98988532874624,null,40.72733635539123,-90.344920463857534,null,0,0]
[17990,17.989999999999998,5.6934964140954358,1.3942415087986686,1.0002555033388643,2.2603050638912922E-2,1,0,49196.735835402957,1.5707760002430819,{"$f":"SQRT(1+(A279/Zero2)^2)","v":4.2395075512066205},{"$f":"ATAN(A279/Zero2)","v":1.3326759562410202},1.0082020652277714,0.12764320009196478,1.0054493358853116,0.10416049502893822,6.3495164678564588,0.1153244409972429,1.0071669118569264,0.2072404862803352,7.0349297635623467,-112.05829126523959,67.941708734760411,null,1000000000,323640100,null,16.343855236540659,-20.955544295955988,null,40.678083859920349,-90.463099981856757,null,0,0]
[18093.5,18.093499999999999,5.7252445319995191,1.3952307698894377,1.000258451336616,2.273304575480738E-2,1,0,49479.774309936947,1.5707761165167777,4.2625448930678278,1.3339875811792661,1.008296323489879,0.12836953810279728,1.0055120460904252,0.1047553887414877,6.349995617810678,0.11598211627529215,1.0072505155956575,0.20843274642678139,6.9822515057812602,-112.14590436363368,67.854095636366324,null,1000000000,327374742.25,null,16.340285847328147,-20.922016487164758,null,40.629088700083081,-90.580643770303595,null,0,0]
[18197,18.196999999999999,5.7569981910423973,1.3962091190682695,1.0002614162373653,2.2863040102254796E-2,1,0,49762.812784471593,1.5707762314678018,4.2855894891945487,1.3352851025144199,1.0083911135961487,0.12909573994321125,1.0055751121003162,0.10535020804538542,6.35047748004318,0.11663969265011817,1.007334619530863,0.20962500367904463,6.9298679607809177,-112.23369092945559,67.766309070544409,null,1000000000,331130809,null,16.336757161382597,-20.889288877533748,null,40.580348170471353,-90.697562230453599,null,0,0]
[18303,18.303000000000001,5.7895244949366411,1.3971999750761459,1.0002644702742742,2.299617360868858E-2,1,0,50052.687937135772,1.5707763478478853,4.3091981156907773,1.3365995781210638,1.0084887444308392,0.12983934098694633,1.0056400701738848,0.10595931741387424,6.350973792155532,0.11731304943713648,1.0074212737912536,0.210846056330869,6.8765207903363628,-112.32377504332527,67.67622495667473,null,1000000000,334999809,null,16.333184416363334,-20.856586842497929,null,40.530691478899534,-90.816667273428564,null,0,{"$f":"IF(AH282>0,W282,0)","v":0}]
[18409,18.408999999999999,5.8220564194460005,1.3981797588180434,1.0002675420402927,2.3129306299790875E-2,1,0,50342.56308980062,1.5707764628877237,4.3328141066713224,1.3378997268626844,1.0085869327936918,0.13058279765900477,1.0057054013059437,0.10656834787219167,6.3514729478424563,0.11798630134876383,1.0075084534450625,0.21206710577332713,6.8234750924843688,-112.4140356584407,67.585964341559304,null,1000000000,338891281,null,16.329652330153305,-20.82469732768439,null,40.481296251045094,-90.935137785124468,null,0,0]
[18515,18.515000000000001,5.8545938708751182,1.3991486530024229,1.0002706315352576,2.3262438170849838E-2,1,0,50632.438242466123,1.5707765766103357,4.3564373423688743,1.3391857773744122,1.0086856785218923,0.13132610917980944,1.0057711054237959,0.10717729898395824,6.3519749464336916,0.1186594478107787,1.0075961588702251,0.21328815191678177,6.7707271016582276,-112.50447008728625,67.495529912713749,null,1000000000,342805225,null,16.326159914736273,-20.793607189917481,null,40.432159708783544,-91.052984229099152,null,0,0]
[18621,18.620999999999999,5.8871367575842593,1.4001068363806597,1.0002737387590046,2.3395569217153807E-2,1,0,50922.313395132282,1.570776689038216,4.3800677055635635,1.3404579535462704,1.0087849814517662,0.13206927477072908,1.0058371824543482,0.10778617031314355,6.35247978725537,0.11933248824951813,1.0076843904466923,0.21450919467040264,6.7182731205626354,-112.59507568746456,67.404924312535442,null,1000000000,346741641,null,16.322706208772072,-20.763303557920352,null,40.383279115582837,-91.170216842117796,null,0,0]
[18729.5,18.729500000000002,5.9204527007302037,1.401076708255053,1.0002769376270684,2.3531839287545455E-2,1,0,51219.025225928017,1.5707768027997473,4.4042626505272455,1.341745993677149,1.0088872033290961,0.1328298159071799,1.0059052040378038,0.1084093187331603,6.3529994775645786,0.12002129188172585,1.0077752482667555,0.21575903199540822,6.6648827207893069,-112.68799277507438,67.312007224925622,null,1000000000,350794170.25,null,16.319210160804353,-20.733086609863335,null,40.333507939705562,-91.289589111218731,null,0,0]
[18838,18.838000000000001,5.9537741506289512,1.4020357248716571,1.000280155069688,2.3668108483830871E-2,1,0,51515.7370567244,1.5707769152508289,4.4284648225219323,1.3430199572679014,1.0089900086513677,0.13359020250131798,1.0059736161753738,0.10903238263956026,6.3535221443124295,0.12070998321613065,1.0078666581612659,0.21700886557236862,6.6117927359157882,-112.78108374228016,67.21891625771984,null,1000000000,354870244,null,16.315752713530472,-20.703667258441094,null,40.283999256548867,-91.408339255197532,null,0,0]
[18946.5,18.9465,5.9871010153363438,1.4029840657271073,1.000283391086684,2.3804376800957674E-2,1,0,51812.44888752143,1.570777026413974,4.4526741037016935,1.3442800697525306,1.0090933972402587,0.13435043372121969,1.0060424187873835,0.10965536156587653,6.354047786764534,0.12139856163935168,1.0079586205442397,0.2182586952999532,6.5589994125257647,-112.87434589675505,67.125654103244955,null,1000000000,358969862.25,null,16.312332917367605,-20.675032540860869,null,40.234750261651172,-91.526477552937507,null,0,0]
[19055,19.055,6.0204332049293221,1.4039219064206814,1.0002866456778761,2.3940644233873671E-2,1,0,52109.160718319101,1.5707771363111835,4.4768903787354093,1.3455265518655013,1.0091973689165086,0.13511050873601965,1.0061116117937254,0.11027825504603328,6.354576404182569,0.12208702653863336,1.008051135831892,0.2195085210754964,6.5064990651978771,-112.9677765921018,67.032223407898201,null,1000000000,363093025,null,16.308949848449238,-20.64716976362493,null,40.185758192826448,-91.644014059943359,null,0,0]
[19165.75,19.165749999999999,6.0544620153818096,1.4048685447780509,1.0002899869163611,2.4079736571979822E-2,1,0,52412.025559433481,1.5707772472041084,4.5016159302867829,1.3467850498385432,1.0093040978505394,0.1358861837157844,1.0061826422163169,0.11091397706608633,6.3551190510870104,0.12278965064450585,1.0081461402960572,0.22078426071323964,6.4532083955003099,-113.06331590896556,66.936684091034437,null,1000000000,367325973.0625,null,16.30553356789693,-20.619512397523245,null,40.136012307586959,-91.763377535746372,null,0,0]
[19276.5,19.276499999999999,6.0884961907341255,1.4058046007107974,1.0002933475070055,2.4218827978186256E-2,1,0,52714.890400548509,1.5707773568227983,4.5263485336745699,1.3480297965461661,1.0094114339256259,0.13666169419879454,1.0062540792225587,0.11154960907935507,6.3556647960554189,0.12349215518115225,1.0082417217174959,0.22205999601290138,6.4002154291522029,-113.15902540009205,66.840974599907952,null,1000000000,371583452.25,null,16.302153686906294,-20.592633422915863,null,40.08652843043177,-91.882134488120911,null,0,0]
[19387.25,19.387250000000002,6.1225356415184633,1.4067302490700091,1.000296727449614,2.4357918447120552E-2,1,0,53017.755241664156,1.5707774651890911,4.5510880739304822,1.3492610123534403,1.0095193769481066,0.13743703930485981,1.0063259227258636,0.11218515059143633,6.3562136382899208,0.12419453949893607,1.008337880545928,0.22333572686095052,6.3475164554735555,-113.25490239345089,66.745097606549109,null,1000000000,375865462.5625,null,16.298809300629078,-20.566520164634301,null,40.037303754847727,-92.000294929099425,null,0,0]
[19498,19.498000000000001,6.1565802802319585,1.4076456609114516,1.0003001267439906,2.4497007973410496E-2,1,0,53320.62008278042,1.5707775723243278,4.575834438540662,1.350478913024554,1.009627926723309,0.13821221815496046,1.006398172639176,0.11282060110836012,6.3567655769883888,0.1248968029489132,1.0084346172334457,0.22461145314237901,6.2951078307641701,-113.35094426313587,66.649055736864128,null,1000000000,380172004,null,16.295499528728648,-20.541160211159831,null,39.988335516786485,-92.117868653173602,null,0,0]
[19611.75,19.611750000000001,6.1915524320856798,1.4085753890287815,1.0003036382635391,2.4639864174877658E-2,1,0,53631.688937652158,1.5707776811020262,4.6012581220575424,1.3517161650879594,1.0097400483221268,0.139008221083391,1.0064728026411973,0.11347316948757023,6.3573356891909043,0.12561796283241497,1.008534576355925,0.22592173146717351,6.2415780540974453,-113.4497566441048,66.550243355895205,null,1000000000,384620738.0625,null,16.292135235522274,-20.515884730486107,null,39.938304917197691,-92.238026511105403,null,0,0]
[19725.5,19.7255,6.2265298757599643,1.4094946724641648,1.0003071701970345,2.478271937045284E-2,1,0,53942.75779252452,1.5707777886251593,4.6266887717314269,1.3529398178661405,1.0098528095707973,0.13980404675089672,1.0065478611814587,0.11412564082020456,6.3579090661546882,0.12633899382583863,1.0086351460420662,0.22723200472384367,6.1883469879287407,-113.54873748509661,66.451262514903391,null,1000000000,389095350.25,null,16.288805650928566,-20.491378203276859,null,39.888539059547071,-92.357585700093864,null,0,0]
[19839.25,19.83925,6.2615125225728754,1.410403684711891,1.0003107225442613,2.4925573554316068E-2,1,0,54253.826647397502,1.5707778949153066,4.6521262733217164,1.3541500907441388,1.0099662102550717,0.1405996942089659,1.0066233481640983,0.11477801457249559,6.3584857069966789,0.12705989522836592,1.0087363267894993,0.22854227278286685,6.1354108945778352,-113.64788408699651,66.352115913003487,null,1000000000,393595840.5625,null,16.285509896785339,-20.467628006585791,null,39.839035083563559,-92.476556153541893,null,0,0]
[19953,19.952999999999999,6.2965002858002554,1.4113025954787872,1.0003142953050017,2.5068426720647616E-2,1,0,54564.895502271094,1.5707779999935558,4.6775705150424116,1.3553471984922274,1.0100802501595842,0.14139516251041415,1.0066992634927368,0.11543029021116769,6.3590656108291101,0.12778066633996421,1.0088381190984785,0.22985253551304527,6.0827661040015855,-113.74719379805981,66.252806201940189,null,1000000000,398122209,null,16.282247118871013,-20.444621781921239,null,39.789790172668809,-92.594947587750823,null,0,0]
[20069,20.068999999999999,6.3321852959755978,1.4122090558154379,1.0003179597586906,2.5214104500051453E-2,1,0,54882.117367461477,1.5707781059235451,4.7035248774931073,1.3565546449348924,1.0101972038852107,0.14220617986187262,1.0067771214817707,0.11609536640914529,6.3596603448043689,0.1285155595554979,1.0089425552294402,0.23118870990224016,6.0293762549036405,-113.8486331570106,66.151366842989404,null,1000000000,402764761,null,16.278952902190863,-20.42191413743425,null,39.739835113733207,-92.715094370739862,null,0,0]
[20185,20.184999999999999,6.3678754508033677,1.4131053559700906,1.0003216454409871,2.5359781209048086E-2,1,0,55199.339232652463,1.5707782106360086,4.7294860220697998,1.3577488372472037,1.0103148219130942,0.14301700891380323,1.0068554247258663,0.11676033945513904,6.360258470252429,0.12925031580686899,1.009047628413954,0.23252487846876424,5.9762818456837135,-113.95023671803729,66.049763281962711,null,1000000000,407434225,null,16.275691257692312,-20.399955040151195,null,39.690143688941731,-92.834658745896022,null,0,0]
[20301,20.300999999999998,6.4035706642627543,1.4139916643971839,1.0003253523516562,2.5505456841466365E-2,1,0,55516.561097844053,1.5707783141518172,4.7554538376968116,1.3589299891229605,1.0104331040112531,0.14382764866600017,1.0069341731211492,0.11742520878519465,6.3608599862167177,0.12998493435422603,1.0091533391909542,0.23386104106804589,5.9234791912093163,-114.05200181499572,65.94799818500428,null,1000000000,412130601,null,16.272461351519489,-20.378732190207486,null,39.640713046203288,-92.953650357017935,null,0,0]
[20417,20.417000000000002,6.4392708522282724,1.4148681458790089,1.0003290804904621,2.5651131391135413E-2,1,0,55833.782963036232,1.5707784164913674,4.7814282156832295,1.3600983097598658,1.0105520499465055,0.14463809811971987,1.0070133665631869,0.11808997383590053,6.3614648917356051,0.1307194144585837,1.0092596881021942,0.23519719755366764,5.8709646727292295,-114.15392582891997,65.846074171080033,null,1000000000,416853889,null,16.269262372533618,-20.358233545402481,null,39.591540377087,-93.072078637399855,null,0,0]
[20536,20.536000000000001,6.4758994038371887,1.4157572524729487,1.0003329271051433,2.580057225447268E-2,1,0,56159.208841983978,1.5707785202762388,4.8080810524842867,1.3612837269290825,1.0106747616354761,0.1454693086834993,1.0070950704617758,0.11877182213672263,6.3620889625290227,0.13147274510452076,1.0093694510899383,0.23656790330218264,5.8173877057767154,-114.25864824755055,65.741351752449447,null,1000000000,421727296,null,16.266011971672029,-20.337944948247184,null,39.541361170175669,-93.192994016496215,null,0,0]
[20655,20.655000000000001,6.5125330171257039,1.4166363571382072,1.000336796059659,2.5950011965176812E-2,1,0,56484.634720932328,1.5707786228652352,4.8347405711691724,1.3624560725777681,1.0107981714409318,0.14630031685392367,1.0071772424999981,0.11945355949525804,6.362716598399409,0.13222592848131343,1.0094798868097838,0.23793860229856259,5.7641064635316654,-114.363532473832,65.636467526168005,null,1000000000,426629025,null,16.262792459260972,-20.318393629247353,null,39.491447602649224,-93.3133360064637,null,0,0]
[20774,20.774000000000001,6.5491716071543999,1.4175056263683985,1.0003406873537504,2.6099450516586593E-2,1,0,56810.060599881253,1.5707787242789075,4.8614066618093306,1.3636155585587533,1.0109222791072019,0.14713112155758021,1.007259882563281,0.12013518530504019,6.3633477982920255,0.13297896379401478,1.0095909958558296,0.23930929437862117,5.7111172466364968,-114.46857582872356,65.531424171276441,null,1000000000,431559076,null,16.259603029403308,-20.299567389805354,null,39.441796780150625,-93.433114137658151,null,0,0]
[20893,20.893000000000001,6.5858150908626039,1.4183652230118677,1.0003446009871564,2.6248887902041093E-2,1,0,57135.486478830768,1.5707788245373386,4.8880792168481841,1.3647623922408645,1.0110470843772958,0.14796172172270525,1.0073429905364379,0.12081669896021549,6.3639825611465675,0.13373185024865566,1.0097027788252735,0.24067997937608945,5.65841642245831,-114.57377568120945,65.426224318790545,null,1000000000,436517449,null,16.256442898271647,-20.281454288305731,null,39.392405852973425,-93.552337731457598,null,0,0]
[21014.75,21.014749999999999,6.6233103576781431,1.4192348399400132,1.0003486281810439,2.6401777458824081E-2,1,0,57468.432703722974,1.5707789259375389,4.915374734917985,1.3659228458116754,1.0111754955051351,0.14881130363021017,1.0074285032056061,0.12151384517706472,6.3646356791983099,0.13450198045504708,1.009817843104803,0.24208233236160862,5.6047924684458117,-114.68156589232966,65.318434107670342,null,1000000000,441619717.5625,null,16.253239266000282,-20.263648463811254,null,39.342139586455019,-93.673752092494723,null,0,0]
[21136.5,21.136500000000002,6.6608105768702526,1.4200946656633828,1.0003526787581085,2.6554665781035644E-2,1,0,57801.37892861577,1.5707790261695727,4.9426767991751701,1.3670704808248682,1.0113046363030913,0.14966066917214019,1.0075145054147179,0.12221087271476121,6.3652925245262271,0.13527195316565768,1.0099336140899455,0.24348467757458606,5.5514629044756418,-114.78951449559872,65.210485504401277,null,1000000000,446751632.25,null,16.250064710040547,-20.246564624803298,null,39.292139470540086,-93.794605084223107,null,0,0]
[21258.25,21.25825,6.6983156652619575,1.4209448633680537,1.0003567527180666,2.670755286154335E-2,1,0,58134.325153509133,1.570779125253511,4.9699853017374709,1.3682055055340394,1.0114345064916697,0.15050981720610662,1.0076009970384212,0.12290778092648304,6.3659530959767459,0.13604176753340083,1.0100500924303033,0.24488701483012693,5.4984240468027163,-114.89761882287443,65.102381177125565,null,1000000000,451913193.0625,null,16.246918458134015,-20.2301907749256,null,39.242402592763014,-93.914906046331211,null,0,0]
[21380,21.38,6.7358255415181238,1.4217855926615435,1.0003608500606318,2.68604386932151E-2,1,0,58467.271378403071,1.5707792232089677,4.997300137055614,1.3693281237711801,1.0115651057899406,0.1513587465915604,1.0076879779506942,0.12360456916609341,6.3666173923902321,0.13681142271228169,1.0101672787788489,0.24628934394101229,5.4456722780327196,-115.00587625428707,64.994123745712926,null,1000000000,457104400,null,16.243799759224697,-20.2145151712405,null,39.192926085801822,-94.034664113337953,null,0,0]
[21504.5,21.5045,6.7741875318741549,1.4226356827597417,1.0003650641314727,2.7016776499395233E-2,1,0,58807.737949239738,1.5707793222299375,5.0252383812424668,1.3704634767741506,1.0116994086740638,0.15222662367467593,1.0077774293831463,0.12431697120912182,6.3673005443492015,0.13759829679647662,1.0102878449075969,0.24772333921654832,5.3920221786524571,-115.116734575709,64.883265424290997,null,1000000000,462443520.25,null,16.240638349924286,-20.199195603377575,null,39.142598357330613,-94.156575068967342,null,0,0]
[21629,21.629000000000001,6.8125543624836888,1.4234761984130362,1.0003693026525395,2.7173112984603523E-2,1,0,59148.204520076979,1.5707794201109464,5.0531830314616712,1.3715862739606399,1.0118344733783129,0.15309426971405685,1.0078673921885049,0.12502924643478103,6.3679875889730635,0.13838500263355735,1.0104091527814825,0.24915732557189452,5.3386648385928668,-115.22774760484111,64.772252395158887,null,1000000000,467813641,null,16.23750422883893,-20.184582127662352,null,39.092536970922367,-94.277937013908812,null,0,0]
[21753.5,21.753499999999999,6.8509259520269792,1.4243072993012709,1.0003735656235215,2.7329448141214734E-2,1,0,59488.671090914766,1.5707795168715666,5.0811339820196926,1.3726967196819935,1.0119702995976541,0.15396168349613135,1.0079578662298458,0.12574139415439881,6.3686785250022107,0.13917153932247425,1.0105312031096263,0.25059130279924963,5.2855965948425521,-115.33891269014632,64.661087309853684,null,1000000000,473214762.25,null,16.23439665727475,-20.170662967214028,null,39.04273900119253,-94.398759085674271,null,0,0]
[21878,21.878,6.8893022209860257,1.4251291415990461,1.0003778530441063,2.7485781961604023E-2,1,0,59829.13766175312,1.5707796125309255,5.1090911295123558,1.3737950139400443,1.0121068870254983,0.15482886380937538,1.0080488513695165,0.12645341368006682,6.3693733511704504,0.13995790596339414,1.0106539966048058,0.25202527068822483,5.2328138502429935,-115.45022722842985,64.549772771570147,null,1000000000,478646884,null,16.231314916861297,-20.157426594452389,null,38.993201568280909,-94.519050220791669,null,0,0]
[22005.25,22.00525,6.9285309131917163,1.4259597284365157,1.0003822604320691,2.7645567549911342E-2,1,0,60177.124578534233,1.5707797091846827,5.137672102815757,1.3749052144388496,1.0122472777389027,0.15571495618762837,1.008142374234043,0.12718102735674416,6.3700875435579167,0.14076146548955776,1.010780271123249,0.25349090269492214,5.1791565725254483,-115.56415230236939,64.435847697630606,null,1000000000,484231027.5625,null,16.228191071949812,-20.14459168282783,null,38.942836216464372,-94.641458829703694,null,0,0]
[22132.5,22.1325,6.9677643313912778,1.4267809622580427,1.0003866933610006,2.7805351726209428E-2,1,0,60525.111495315912,1.5707798047270254,5.1662593384626332,1.3760031298014319,1.0123884630072872,0.15660080211661237,1.0082364307317997,0.12790850566305659,6.3708057971402789,0.14156484547569928,1.0109073235193182,0.25495652449340123,5.1257901507811789,-115.67822815552327,64.321771844476729,null,1000000000,489847556.25,null,16.22509275659668,-20.132446473478041,null,38.892737096405426,-94.763331046290233,null,0,0]
[22259.75,22.25975,7.0070023961997361,1.4275929990725653,1.0003911518305608,2.7965134482358208E-2,1,0,60873.09841209813,1.5707798991770141,5.194852733068096,1.3770889602175427,1.0125304424982784,0.15748640030942529,1.0083310207134557,0.12863584786699517,6.3715281105443129,0.14236804496500821,1.0110351545658698,0.25642213585056806,5.0727109473952838,-115.79245215810623,64.207547841893771,null,1000000000,495496470.0625,null,16.222019265402359,-20.120979423733175,null,38.842901274727595,-94.884675796316088,null,0,0]
[22387,22.387,7.0462450299910913,1.4283959914627178,1.0003956358404087,2.8124915810218056E-2,1,0,61221.085328880894,1.5707799925532759,5.2234521854889602,1.378162901608027,1.01267321587782,0.15837174948143912,1.0084261440288891,0.12936305323740085,6.3722544823896623,0.14317106300202651,1.0111637650397176,0.25788773653045444,5.0199153899959184,-115.90682172858031,64.093178271419688,null,1000000000,501177769,null,16.218969912407598,-20.110179235619185,null,38.793325863851699,-95.005501809068619,null,0,0]
[22517.5,22.517499999999998,7.0864945974474205,1.4292102549431067,1.0004002608998179,2.8288776505140403E-2,1,0,61577.959927232325,1.5707800872182489,5.2527882640138621,1.3792521242213363,1.0128204599387349,0.15927945072950009,1.0085242506018433,0.13010868874769979,6.3730036197638702,0.14399440087820609,1.0112964706199921,0.25939075771478864,4.966062349781037,-116.02426086709275,63.97573913290725,null,1000000000,507037806.25,null,16.215867050214662,-20.099784251390545,null,38.742751778148808,-95.1288839141815,null,0,0]
[22648,22.648,7.1267488103536634,1.4300153204982748,1.0004049128200527,2.8452635680545683E-2,1,0,61934.834525584309,1.5707801807922843,5.2821305052511587,1.3803292468349222,1.0129685382412581,0.16018688734490827,1.0086229177770987,0.13085417879082886,6.3737570225705573,0.14481754588400358,1.0114299976171679,0.26089376715745732,4.9125002229212331,-116.14184775569603,63.858152244303966,null,1000000000,512931904,null,16.212788173678476,-20.090067321238685,null,38.692445567371941,-95.25173843131239,null,0,0]
[22778.5,22.778500000000001,7.1670075904349204,1.4308113420765325,1.0004095916007387,2.8616493327655961E-2,1,0,62291.709123936816,1.5707802732941321,5.3114788070666989,1.3813944675022767,1.013117450419589,0.16109405794958828,1.0087221453901514,0.1315995225809761,6.3745146892975706,0.14564049699334086,1.0115643468820272,0.26239676459444522,4.859225360008864,-116.25957976107543,63.740420238924571,null,1000000000,518860062.25,null,16.209732602574888,-20.081017019650798,null,38.6424042610615,-95.3740741664257,null,0,0]
[22909,22.908999999999999,7.2072708611564416,1.4315984702325069,1.0004142972414987,2.8780349437693819E-2,1,0,62648.583722289863,1.5707803647421155,5.340833069550408,1.3824479800321243,1.0132671961060822,0.16200096116802393,1.008821933275627,0.1323447193332879,6.3752766184249223,0.14646325318166356,1.0116995192696918,0.263899749758502,4.8062341771556589,-116.3774542986491,63.622545701350901,null,1000000000,524822281,null,16.206699675521932,-20.072622164443477,null,38.59262493542915,-95.495899730856792,null,0,0]
[23042.25,23.042249999999999,7.2483871474304911,1.432393161859612,1.0004191297579401,2.8947656859145781E-2,1,0,63012.978666585739,1.5707804570483586,5.3708119572962856,1.38351180926148,1.0134209570088342,0.16292669804975918,1.0089244019047885,0.13310546693268829,6.3760590000202626,0.14730314495548602,1.011838390334509,0.26543439407903535,4.752415374668824,-116.49795721574803,63.502042784251969,null,1000000000,530945285.0625,null,16.203625532863423,-20.064715344490889,null,38.54206394972897,-95.619774840735715,null,0,0]
[23175.5,23.1755,7.2895079596716919,1.4331788881151839,1.0004239902776162,2.9114962659568155E-2,1,0,63377.373610882147,1.5707805482931527,5.4007968558818762,1.3845638270389387,1.0135755861380331,0.16385215326714503,1.0090274543169511,0.13386605958123152,6.3768458223223501,0.14814283135267098,1.0119781213943055,0.26696902503043302,4.6988849844506593,-116.6186034399439,63.381396560056103,null,1000000000,537103800.25,null,16.200573662478323,-20.057469071887674,null,38.491770086206301,-95.743135599546534,null,0,0]
[23308.75,23.30875,7.3306332217154981,1.4339557989095117,1.0004288788001185,2.9282266829618438E-2,1,0,63741.768555179086,1.5707806384947018,5.4307876657445968,1.385604226697944,1.0137310830963753,0.16477732536419212,1.0091310903332666,0.13462649644651623,6.3776370836878717,0.14898231128748174,1.0121187133733522,0.26850364231766005,4.6456393927315922,-116.73939037001003,63.260609629989972,null,1000000000,543297826.5625,null,16.197543417212373,-20.050872187064417,null,38.441740376861908,-95.865990580147169,null,0,0]
[23442,23.442,7.3717628590888324,1.4347240408503907,1.0004337953250366,2.9449569359954682E-2,1,0,64106.163499476526,1.5707807276707961,5.4607842894896512,1.3866331974258086,1.0138874474845714,0.16570221288774045,1.0092353097739493,0.13538677669720262,6.3784327824650546,0.14982158367586831,1.0122601672005922,0.2700382456421041,4.5926750504063296,-116.86031545302605,63.139684546973953,null,1000000000,549527364,null,16.194534167853519,-20.044913768145914,null,38.39197190041218,-95.988348165971544,null,0,0]
[23578.5,23.578499999999998,7.4139001189354028,1.4355021816872371,1.0004388607999888,2.9620950729855353E-2,1,0,64479.446125342729,1.5707808179768137,5.4915184669290964,1.3876756080533217,1.0140485246419708,0.16664936205818362,1.0093426759059849,0.13616543710976478,6.3792524878698629,0.15068110978979976,1.0124059657326954,0.27161026352223405,4.5387068739740339,-116.984330557763,63.015669442236998,null,1000000000,555945662.25,null,16.191472652994854,-20.039460862852991,null,38.341257421048837,-96.113182912600337,null,0,0]
[23715,23.715,7.4560418171802878,1.4362715268502395,1.0004439556591065,2.979233035923675E-2,1,0,64852.728751209448,1.5707809072432557,5.5222585451371877,1.3887064144722114,1.0142105112043025,0.16759620952634482,1.0094506538842385,0.13694393141220856,6.3800768462491337,0.15154041581218708,1.0125526706554508,0.27318226610423557,4.4850264956268369,-117.10848536415729,62.891514635842711,null,1000000000,562401225,null,16.188431889283201,-20.034655483908782,null,38.290811013416153,-96.237512927445536,null,0,0]
[23851.5,23.851500000000001,7.4981878789887499,1.4370322237379356,1.0004490799019414,2.9963708238058363E-2,1,0,65226.011377076684,1.5707809954879697,5.5530044261182789,1.389725807224081,1.0143734067358943,0.16854275373943453,1.0095592435123883,0.137722258714367,6.3809058557997824,0.1523995005832646,1.0127002829826282,0.27475425305533291,4.4316303013399692,-117.23277727840924,62.767222721590755,null,1000000000,568894052.25,null,16.185411255158922,-20.030486626137918,null,38.240629683533754,-96.361346637329888,null,0,0]
[23988,23.988,7.5403382311915177,1.4377844164935916,1.000454233528042,3.0135084356280307E-2,1,0,65599.2940029444,1.5707810827283981,5.583756014016803,1.3907339727491101,1.0145372107989099,0.16948899314783131,1.0096684445930866,0.13850041812726438,6.3817395147094897,0.15325836294515768,1.0128488037330934,0.27632622403874435,4.378514741752296,-117.35720375516931,62.642796244830691,null,1000000000,575424144,null,16.182410146368223,-20.026943519517552,null,38.190710484772083,-96.484692282333285,null,0,0]
[24127.75,24.127749999999999,7.5834965333436566,1.4385458555306148,1.000459540300048,3.0310539023808973E-2,1,0,65981.464310380936,1.5707811710233404,5.6152455970260196,1.3917547013243925,1.0147058557356943,0.17045744467417717,1.0097808789558167,0.13929693028530801,6.3825978374641581,0.15413744278841382,1.0130018028856291,0.27793560600432671,4.3244216228871526,-117.48472956534496,62.515270434655037,null,1000000000,582148320.0625,null,16.179357197418184,-20.023953324172211,null,38.139871272689518,-96.610477507962031,null,0,0]
[24267.5,24.267499999999998,7.6266591825630536,1.4392986763570952,1.0004648778702137,3.0485991824605901E-2,1,0,66363.634617817967,1.570781258301349,5.6467409652309311,1.3927640444718912,1.0148754520466241,0.17142557343150311,1.0098939538125786,0.14009326458222832,6.3834610297375294,0.15501628705536549,1.0131557564123455,0.27954497050544275,4.2706153330977674,-117.61239117330038,62.387608826699619,null,1000000000,588911556.25,null,16.176323485998264,-20.021596914218957,null,38.089300719890787,-96.735768052814777,null,0,0]
[24407.25,24.407250000000001,7.6698261054591503,1.4400430236261561,1.0004702462380461,3.0661442747898896E-2,1,0,66745.804925255492,1.5707813445798922,5.6782420223657208,1.3937621896057761,1.015045999254826,0.17239337776725058,1.010007668948254,0.14088942006794461,6.3843290895547709,0.15589489450966298,1.0133106654231496,0.28115431716751738,4.2170922641703577,-117.74018599807795,62.259814001922052,null,1000000000,595713852.5625,null,16.173308416424408,-20.019863457933027,null,38.038995812190265,-96.860572184060644,null,0,0]
[24547,24.547000000000001,{"$f":"SQRT(1+(A333/pole1)^2)","v":7.7129972302771685},{"$f":"ATAN(A333/pole1)","v":1.4407790387903578},{"$f":"SQRT(1+(A333/Zero1)^2)","v":1.0004756454030497},{"$f":"ATAN(A333/Zero1)","v":3.0836891782916442E-2},{"$f":"IF(VIN_nom>Vout, 1, SQRT(1+(A333/z_RHP)^2))","v":1},{"$f":"IF(VIN_nom>Vout, 0, -ATAN(A333/z_RHP))","v":0},{"$f":"SQRT(1+(A333/Pole2)^2)","v":67127.975232693512},{"$f":"ATAN(A333/Pole2)","v":1.5707814298760403},5.7097486742717951,1.3947493200939549,{"$f":"SQRT(1+(A333/pole4)^2)","v":1.0152174968810739},{"$f":"ATAN(A333/pole4)","v":0.17336085603239926},{"$f":"IF(VOUT_setting=1,1,SQRT(1+(A333*zterm1)^2))","v":1.0101220241466031},{"$f":"IF(VOUT_setting=1,0,ATAN(((A333*zterm1))))","v":0.14168539579370953},6.3852020149309912,{"$f":"IF(VOUT_setting=1,0,ATAN(A333*$Q$4/(1+Afbr-$Q$5*(A333)^2)))","v":0.15677326391707108},{"$f":"SQRT((1-(Z333/pterm2))^2+(A333/pterm1)^2)","v":1.0134665310334907},{"$f":"IF((ATAN((A333/pterm1)/(1-A333^2/pterm2))>0),ATAN((A333/pterm1)/(1-A333^2/pterm2)),PI()+ATAN((A333/pterm1)/(1-A333^2/pterm2)))","v":0.28276364561150041},{"$f":"20*LOG10(((E333*K333*G333*O333)/(C333*I333*S333*M333*Q333))*Adc)","v":4.1638488724094564},{"$f":"((F333+L333+H333+P333)-(D333+J333+T333+N333+R333))*radconv","v":-117.86811150714331},{"$f":"IF(V333>0,V333,V333+180)","v":62.131888492856689},null,{"$f":"IF(U333<0,A333,1000000000)","v":1000000000},{"$f":"A333^2","v":602555209},null,{"$f":"20*LOG10((K333/(I333*M333))*AEA)","v":16.170311409661647},{"$f":"(L333-(J333+N333))*radconv","v":-20.018742355603376},null,{"$f":"20*LOG10((E333*G333/(C333*S333))*Acs*Am)","v":37.988953583264085},{"$f":"(F333+H333-(D333+T333))*radconv","v":-96.98489798523353},null,{"$f":"SUM((U334<0)*(U333>0))*A333","v":0},0]
[24690,{"$f":"A334/1000","v":24.69},7.7571766111946951,1.4415236898678168,1.0004812020093288,3.1016419062158657E-2,1,0,67519.03322170036,1.5707815161562912,5.7419937343903404,1.3957481924021835,1.0153939661510039,0.17435049454226187,1.0102397011049447,0.14249969551529956,6.3861002754197376,0.15767181281947845,1.0136270128228488,0.2844103810397024,4.1096531405862224,-117.99914471415113,62.000855285848871,null,1000000000,609596100,null,16.167262815720793,-20.018218241421756,null,37.938016449363971,-97.111628183929199,null,0,0]
[24833,24.832999999999998,7.8013602447879133,1.442259906566673,1.0004867908608024,3.1195944341460696E-2,1,0,67910.091210707702,1.5707816014428582,5.7742444595708431,1.3967359077399286,1.0155714295357539,0.17533978815713328,1.0103580477808047,0.14331380501321347,{"$f":"IF(VOUT_setting=1,1,SQRT((1+Afbr-$Q$5*(A335)^2)^2+(A335*$Q$4)^2))","v":6.3870036261669227},0.1585701098664529,1.0137884986028418,0.28605709657517941,4.0557429385987804,-118.1303095398014,61.869690460198598,null,1000000000,616677889,null,16.164231958900046,-20.01831355660044,null,37.88734821913441,-97.237874103146524,null,0,0]
[24976,24.975999999999999,7.8455480592076681,1.4429878305947312,1.0004924119569301,3.1375467609284211E-2,1,0,68301.149199715524,1.5707816857528094,5.8065007554178827,1.3977126501015007,1.0157498865142738,0.17632873512184769,1.0104770639388725,0.14412772327533677,6.3879120650133654,0.15946815374256776,1.0139509895864884,0.28770379179714634,4.0021146696575753,-118.26160342084344,61.738396579156557,null,1000000000,623800576,null,16.161218269481953,-20.019017659456306,null,37.836945863697096,-97.363643838696518,null,0,0]
[25119,25.119,7.8897399842076954,1.4437076005204719,1.0004980652971682,3.1554988854091644E-2,1,0,68692.207188723856,1.5707817691028241,5.8387625296058703,1.3986785994994131,1.0159293365629622,0.17731733368518143,1.0105967493426165,0.14494144929104386,6.3888255897889579,0.16036594313475566,1.0141144869928169,0.28935046627983219,3.9487648012127217,-118.3930238422645,61.606976157735502,null,1000000000,630964161,null,16.158221193728167,-20.020320136649996,null,37.786806402426201,-97.48894530623447,null,0,0]
[25265.25,25.265250000000002,7.9349404513386315,1.4444354358787939,1.0005038804735111,3.1738588022661676E-2,1,0,69092.152859301015,1.5707818533712348,5.8717630983420221,1.3996555221442812,1.0161138916548034,0.17832803820805049,1.0107198468550997,0.14577346917822231,6.3897651348447893,0.1612838722400958,1.0142827425184928,0.29103454328194217,3.8944867832372614,-118.52755940662495,61.472440593375055,null,1000000000,638332857.5625,null,16.155172626047051,-20.022260523909974,null,37.735796275464608,-97.616618247707365,null,0,0]
[25411.5,25.4115,7.9801450743397169,1.4451550257688968,1.0005097293751011,3.1922185050807704E-2,1,0,69492.098529878684,1.5707819366696709,5.9047692083178118,1.400621524220192,1.0162994843533935,0.17933837462075219,1.0108436438748736,0.14660528584781171,6.3907099950091766,0.1622015323921302,1.0144520533314667,0.29271859767450598,3.8404926894364007,-118.66222215705977,61.337777842940227,null,1000000000,645744332.25,null,16.152140313163944,-20.024805466947342,null,37.685054972255251,-97.743817585856348,null,0,0]
[25557.75,25.557749999999999,8.0253537829843129,1.4458665087851867,1.0005156120013468,3.2105779926190056E-2,1,0,69892.044200456818,1.5707820190147841,5.9377807671276273,1.401576786050361,1.0164861140903863,0.18034834106282374,1.0109681401449662,0.14743689822357928,6.3916601679253446,0.163118922193937,1.0146224207551806,0.29440262898574571,3.7867789396132689,-118.79700955234357,61.202990447656433,null,1000000000,653198585.0625,null,16.149123711252876,-20.027944528360297,null,37.634579454460564,-97.870551235232099,null,0,0]
[25704,25.704000000000001,8.0705665086130516,1.4465700204496021,1.0005215283516533,3.2289372636469922E-2,1,0,70291.989871035403,1.5707821004228466,5.9707976843943422,1.4025214840488438,1.0166737802946775,0.18135793567818362,1.0110933354070806,0.14826830523095119,6.3926156512246761,0.1640360402512199,1.0147938461195769,0.29608663673834118,3.7333420174099445,-118.93191909915726,61.068080900842745,null,1000000000,660695616,null,16.146122291790149,-20.031667494954682,null,37.584366732270993,-97.996826934028249,null,0,0]
[25853.75,25.853750000000002,8.1168653404121027,1.4472822469114528,1.000527621233531,3.2477356762118319E-2,1,0,70701.50689099585,1.570782182824789,6.0046102101336594,1.4034780243916569,1.0168670110272373,0.18239130431742545,1.0112222508081661,0.14911939523816617,6.39359950083767,0.16497482340217606,1.0149704715881858,0.29781092061570213,3.6789094999969425,-119.07018126692164,60.929818733078363,null,1000000000,668416389.0625,null,16.143064238826561,-20.036074153375786,null,37.533221569861524,-98.125657996337168,null,0,0]
[26003.5,26.003499999999999,8.1631682429188182,1.4479863939837101,1.0005337494716537,3.2665338591615703E-2,1,0,71111.023910956777,1.5707822642776519,{"$f":"SQRT(1+(A343/Zero2)^2)","v":6.0384281683765018},{"$f":"ATAN(A343/Zero2)","v":1.4044238514653993},1.0170613272087117,0.18342427919578097,1.0113518985052903,0.14997026765492369,6.3945889129833349,0.16591331869623652,1.0151482090827448,0.29953517876258157,3.6247599556549153,-119.20856636099016,60.791433639009838,null,1000000000,676182012.25,null,16.140021029203307,-20.041072021684936,null,37.482345739119609,-98.254024801032557,null,0,0]
[26153.25,26.15325,8.2094751472546488,1.4486825976815403,1.0005399130653723,3.2853318111718884E-2,1,0,71520.54093091817,1.5707823447977387,6.0722514683577664,1.4053591425867977,1.0172567282170735,0.18445685833508779,1.0114822782168649,0.15082092133309549,6.395583885080474,0.16685152464521699,1.0153270600520388,0.30125941064836087,3.5708898077921476,-119.34707185342434,60.652928146575661,null,1000000000,683992485.5625,null,16.136992142200704,-20.0466508279758,null,37.431736182024771,-98.381935111566023,null,0,0]
[26303,26.303000000000001,8.2557859860805269,1.4493709909993986,1.0005461120140329,3.3041295309185689E-2,1,0,71930.057950880015,1.5707824244009807,6.1060800213092667,1.4062840712178066,1.0174532134273027,0.18548903976207462,1.0116133896598571,0.15167135512640972,6.3965844145349955,0.16778943976386834,1.0155070259519094,0.30298361573623528,3.5172955435638622,-119.48569526404003,60.514304735959968,null,1000000000,691847809,null,16.133977071819871,-20.052800521463134,null,37.381389889573398,-98.50939651796061,null,0,0]
[26456,26.456,8.3031058965582361,1.4500663932022193,1.0005524820110112,3.3233349732759314E-2,1,0,72348.462652410773,1.5707825048011268,6.1406480847707927,1.4072185476734984,1.0176550820235166,0.18654320965462765,1.0117481020220478,0.15254001746132212,6.3976123951880819,0.16874740839390587,1.0156920506332636,0.30474521272640559,3.462819472305199,-119.62744644947111,60.372553550528892,null,1000000000,699919936,null,16.130910324039821,-20.059663056827581,null,37.330219756758645,-98.639168294226749,null,0,{"$f":"IF(AH346>0,W346,0)","v":0}]
[26609,26.609000000000002,8.3504297767788849,1.4507539137135912,1.0005588889127988,3.3425401703843657E-2,1,0,72766.867353941998,1.570782584276682,6.1752214504926419,1.4081425611754812,1.0178580810642233,0.18759696023584516,1.0118835776196962,0.1534084478504176,6.3986461715213787,0.1697050703078827,1.015878242259515,0.30650678059014058,3.4086241730935174,-119.76931564026668,60.230684359733317,null,1000000000,708038881,null,16.12785697619362,-20.067100997536478,null,37.279318241652646,-98.768486954532392,null,0,0]
[26762,26.762,8.3977575596303975,1.4514336851360645,1.0005653327186865,3.3617451208318681E-2,1,0,73185.272055473688,1.5707826628435038,6.2098000299130334,1.4090562849179591,1.0180622098731993,0.18865028941711015,1.012019816146287,0.15427664507721903,6.3996857407267171,0.17066242393130665,1.0160656024060479,0.30826831873475963,3.3547060959015824,-119.91130033827413,60.088699661725869,null,1000000000,716204644,null,16.124816533164442,-20.075104301532484,null,37.228682287013932,-98.897360063294954,null,0,0]
[26915,26.914999999999999,8.4450891794996625,1.4521058371284508,1.0005718134279613,3.3809498232065464E-2,1,0,73603.676757005815,1.5707827405170898,6.2443837364186381,1.4099598883278792,1.0182674677710015,0.18970319511521605,1.0121568172937447,0.15514460792730847,6.4007310999820186,0.17161946769293743,1.0162541326558396,0.31002982656073913,3.301061753814698,-120.05339809249055,59.946601907509447,null,1000000000,724417225,null,16.121788513872634,-20.083663142895627,null,37.178308884666457,-99.0257950158759,null,0,0]
[27071.75,27.071750000000002,8.4935848002603009,1.4527866941415599,1.0005784912486142,3.4006249703270652E-2,1,0,74032.336475732809,1.5707828191839304,6.2798203113467652,1.4108753167228147,1.0184789267244572,0.19078146597357939,1.0122979668761842,0.15603360004521907,6.401808082481093,0.1725996454233116,1.0164484988813287,0.31183447652168766,3.2463828996543413,-120.19909336721217,59.800906632787829,null,1000000000,732879648.0625,null,16.118698673939797,-20.092997836064168,null,37.126970029279605,-99.156931046676533,null,0,0]
[27228.5,27.2285,8.5420843136527367,1.4534598200407005,1.0005852078022843,3.4202998540654284E-2,1,0,74460.996194460269,1.570782896945027,6.3152620897601626,1.411780470947948,1.0186915693384009,0.19185928792615811,1.0124399162613382,0.15692234358263318,6.4028911362929577,0.17357949458813449,1.0166440966590913,0.31363909336347895,3.1919841505481887,-120.344902246511,59.655097753489002,null,1000000000,741391212.25,null,16.11562089513923,-20.102895423498861,null,37.075900515307076,-99.287622370594264,null,0,0]
[27385.25,27.385249999999999,8.590587653747578,1.4541253451626535,1.0005919630881923,3.4399744729037222E-2,1,0,74889.655913188166,1.5707829738159327,6.3507089845406313,1.4126755215453692,1.0189053948717535,0.19293665875058361,1.0125826651128442,0.1578108372404145,6.4039802583377332,0.17455901350848585,1.0168409277160033,0.31544367641890564,3.1378619533279437,-120.49082224123269,59.509177758767308,null,1000000000,749951917.5625,null,16.112554703030685,-20.113346007416482,null,37.025097261471409,-99.417876418018082,null,0,0]
[27542,27.542000000000002,8.6390947560909002,1.454783396944201,1.0005987571055532,3.459648825324154E-2,1,0,75318.315631916499,1.5707830498118462,6.3861609104917649,1.4135606353357781,1.0191204025799361,0.19401357623053628,1.012726213092636,0.15869907972173522,6.405075445520386,0.17553820050908717,1.0170389937871911,0.31724822501311045,3.0840128180073685,-120.63685090924969,59.363149090750312,null,1000000000,758561764,null,16.10949963670533,-20.12433990358004,null,36.974557236135077,-99.547700452740926,null,0,0]
[27702.5,27.702500000000001,8.688766147951295,1.4554495780668899,1.0006057537908122,3.4797935783925031E-2,1,0,75757.230367839744,1.5707831267347152,6.4224660947793613,1.4144567982915659,1.0193417781675378,0.19511578523559633,1.0128740229135704,0.15960831040931989,6.4062031146269005,0.17654046736441206,1.0172430797883876,0.31909590820567507,3.0291547845235485,-120.78648318776972,59.213516812230282,null,1000000000,767428506.25,null,16.106382543246404,-20.136149879957923,null,36.923077753813608,-99.680192175123395,null,0,0]
[27863,27.863,8.7384413520241182,1.4561081854319975,1.0006127910811922,3.4999380489230104E-2,1,0,76196.145103763411,1.5707832027713824,6.4587763790125976,1.4153428857615009,1.0195643915788311,0.19621751426227069,1.0130226698331515,0.16051727501436927,6.4073371359246218,0.17754238268564534,1.0174484643104718,0.32094355381174711,2.974575825500581,-120.93622436557128,59.063775634428723,null,1000000000,776346769,null,16.10327617783426,-20.148509587640959,null,36.871867967398828,-99.812247961495757,null,0,0]
[28023.5,28.023499999999999,8.7881203036633231,1.4567593469058624,1.0006198689758361,3.5200822352867318E-2,1,0,76635.059839687528,1.5707832779370747,6.4950916776589747,1.4162190653442588,1.0197882420031883,0.19731876095119516,1.0131721534829365,0.16142597215232643,6.408477506041911,0.17854394468633802,1.0176551492428036,0.32279116108175748,2.9202723907314381,-121.0860719668094,58.913928033190601,null,1000000000,785316552.25,null,16.100180086936334,-20.161409289623201,null,36.820924777433568,-99.943875096045772,null,0,0]
[28184,28.184000000000001,8.8378029396715778,1.4574031875051514,1.0006269874738829,3.5402261358548591E-2,1,0,77073.974575612083,1.5707833522466716,6.5314119070765866,1.417085500972173,1.020013328626191,0.19841952294975063,1.0133224734926261,0.16233440044121586,6.4096242215906649,0.17954515158410836,1.0178631364836821,0.32463872925760906,2.8662409931177764,-121.23602356239394,58.763976437606061,null,1000000000,794337856,null,16.097093830030808,-20.174839459331203,null,36.770245134547125,-100.07508069919825,null,0,0]
[28348,28.347999999999999,8.8885727391299181,1.4580536333348542,1.0006343031442781,3.560809014606698E-2,1,0,77522.460660918587,1.5707834273075545,6.5685291745475229,1.4179609326686775,1.0202445997578868,0.1995437860033496,1.0134769350378727,0.16326235955049812,6.4108024943561883,0.18056782300101445,1.0180770064733582,0.32652654590220087,2.8113087772595908,-121.38935007155419,58.61064992844581,null,1000000000,803609104,null,16.093949984394495,-20.189100746591308,null,36.718729437095085,-100.20871930559737,null,0,0]
[28512,28.512,8.9393462564473616,1.4586966906560248,1.0006416612064146,3.5813915915245513E-2,1,0,77970.946746225542,1.5707835015049423,6.6056514194377254,1.418826525571935,1.020477159860055,0.20066753805233284,1.0136322690299122,0.16419003504837398,6.4119873851139646,0.18159011990932222,1.0182922402249959,0.32841432010134131,2.7566534265846414,-121.54278017677233,58.457219823227675,null,1000000000,812934144,null,16.090815516139152,-20.203896427298176,null,36.66748262467862,-100.34193232263313,null,0,0]
[28676,28.675999999999998,8.9901234286318523,1.4593324841255118,1.0006490616593575,3.6019738648711642E-2,1,0,78419.432831532889,1.5707835748536505,6.6427785583003445,1.4196824433437898,1.0207110080516537,0.20179077660876812,1.0137884750677122,0.16511742546889671,6.4131788901963942,0.18261204042074855,1.0185088397925151,0.33030205101846599,2.7022714155207854,-121.69631143039328,58.30368856960672,null,1000000000,822312976,null,16.087689994668619,-20.219216982619685,null,36.616501599304115,-100.47472684568061,null,0,0]
[28840,28.84,9.0409041941020014,1.4599611356232776,1.0006565045021663,3.6225558329094389E-2,1,0,78867.918916840688,1.5707836473681569,6.6799105095328546,1.4205288460644911,1.0209461434475702,0.20291349919217916,1.0139455527482368,0.16604452934898167,6.4143770059181389,0.18363358265151442,1.0187268072394333,0.33218973780758637,2.6481592810213375,-121.84994143083016,58.150058569169843,null,1000000000,831745600,null,16.084573001793014,-20.235053099341858,null,36.565783313084957,-100.60710981047096,null,0,0]
[29008,29.007999999999999,9.0929271777140457,1.4605978392598866,1.0006641728300605,3.6436394817835428E-2,1,0,79327.34368715639,1.5707837208011302,6.7179530245623527,1.4213861904303844,1.0211883476036874,0.204063067664671,1.0141073649596566,0.1669939468836131,6.4156111945618788,0.18467964634934866,1.0189515114632512,0.3341234190880692,2.5930036129703229,-122.00741843014849,57.992581569851509,null,1000000000,841464064,null,16.081388403332543,-20.251800514740516,null,36.5140972907868,-100.74230197712669,null,0,0]
[29176,29.175999999999998,9.1449538055814088,1.4612272985980308,1.0006718856388208,3.6647228065848983E-2,1,0,79786.768457472543,1.5707837933884263,6.7560004219391114,1.422233878894954,1.0214319006270045,0.20521208944248429,1.0142700909888738,0.16794306063092831,6.4168523123619412,0.18572530910154014,1.0191776555203533,0.3360570522340901,2.538123984855293,-122.1649940933976,57.835005906602404,null,1000000000,851238976,null,16.078211904355328,-20.269069800781516,null,36.462680662342315,-100.87707650383284,null,0,0]
[29344,29.344000000000001,9.1969840158582841,1.4618496360843962,1.0006796429274185,3.6858058054466833E-2,1,0,80246.193227789088,1.5707838651445702,6.7940526196381823,1.4230720724721997,1.0216768015528706,0.2063605618836864,1.0144337303961299,0.16889186902757736,6.4181003552991474,0.18677056889789906,1.0194052416600354,0.33799063630527015,2.4835168686009883,-122.32266598188154,57.677334018118458,null,1000000000,861070336,null,16.07504309320101,-20.286851581502852,null,36.411530308040383,-101.01144035345763,null,0,0]
[29512,29.512,9.2490177480862954,1.4624649714325471,1.0006874446948191,3.7068884765022521E-2,1,0,80705.61799810607,1.5707839360837561,6.8321095374517711,1.4239009286425821,1.0219230494122222,0.20750848235466676,1.0145982827394833,0.16984037051341508,6.4193553193350246,0.18781542373327215,1.019634272141992,0.33992417035071593,2.4291787987169111,-122.48043170272534,57.51956829727466,null,1000000000,870958144,null,16.071881570158205,-20.305136683857253,null,36.360643158792591,-101.14540033167039,null,0,0]
[29684,29.684000000000001,9.302293965718949,1.4630878256390365,1.0006954782974393,3.7284727743607853E-2,1,0,81175.981453430984,1.5707840078800881,6.8710773804857999,1.4247400067847922,1.0221765547193515,0.20868315968423651,1.0147676983317264,0.17081113578330454,6.420647329472275,0.18888473443755185,1.0198702544364764,0.34190368809048405,2.3738221421480761,-122.64204850859471,57.357951491405288,null,1000000000,881139856,null,16.068651917974826,-20.324369214549765,null,36.308813937827054,-101.28213836935996,null,0,0]
[29856,29.856000000000002,9.3555737510498798,1.4637035858003209,1.0007035585199018,3.7500567246582413E-2,1,0,81646.34490875632,1.5707840788491847,6.910050006553198,1.4255696207177644,1.0224314697934338,0.20985725288647075,1.0149380699062578,0.17178157605436498,6.4219465855792421,0.1899536164300861,1.0201077554969851,0.34388315134291292,2.3187403394463866,-122.80375873436276,57.196241265637241,null,1000000000,891380736,null,16.065429093863955,-20.344110489060508,null,36.257254252105156,-101.4184670254424,null,0,0]
[30028,30.027999999999999,9.4088570434703822,1.4643123719682931,1.0007116853610778,3.7716403253920158E-2,1,0,82116.708364082064,1.570784149005261,6.9490273351790872,1.4263899285450106,1.0226877935802743,0.21103075916242048,1.0151093969817337,0.17275168966286511,6.4232530832596346,0.19102206757559081,1.0203467777820792,0.3458625590530861,2.2639298660425342,-122.96555995396602,57.034440046033978,null,1000000000,901680784,null,16.062212705286896,-20.364351289171996,null,36.205960966002955,-101.55439311908965,null,0,0]
[30200,30.2,9.4621437837330138,1.4649143015114685,1.0007198588198316,3.7932235745596968E-2,1,0,82587.0718194082,1.5707842183622087,6.9880092876744655,1.4272010848929177,1.0229455250209112,0.21220367572240037,1.0152816790744363,0.17372147494865303,6.4245668180962445,0.19209008574439893,1.0205873237615488,0.34784191015438976,2.2093872598718551,-123.127449786778,56.872550213221999,null,1000000000,912040000,null,16.059002371185183,-20.385082596403592,null,36.154930994907033,-101.68992331505709,null,0,0]
[30375.75,30.37575,9.5165958000144073,1.4655223914152866,1.0007282586310202,3.8152770235225494E-2,1,0,83067.690291929364,1.5707842884199701,7.027845833519982,1.428020630738321,1.0232103285231151,0.21340155255640306,1.015458703288258,0.17471206294740055,6.4259166663463363,0.19318093974368925,1.020834690670797,0.34986435611718109,2.1539286508802755,-123.29295829606836,56.707041703931637,null,1000000000,922686188.0625,null,16.055727913392175,-20.40676337934817,null,36.103057283512349,-101.82800622273659,null,0,0]
[30551.5,30.551500000000001,9.5710512952376892,1.4661235619573567,1.0007367071122708,3.8373301011959703E-2,1,0,83548.308764450936,1.5707843576717053,7.0676870464430097,1.4288309374097041,1.0234765994779671,0.21459880782065655,1.0156367235878165,0.17570230465801101,6.4272740613755595,0.19427133720313411,1.0210836536880379,0.35188674068673709,2.0987426018988655,-123.45855443950845,56.541445560491553,null,1000000000,933394152.25,null,16.052459007625643,-20.428937868465667,null,36.0514521409102,-101.96568937535046,null,0,0]
[30727.25,30.727250000000002,9.6255102103574171,1.4667179301438709,1.0007452042623508,3.8593828054443384E-2,1,0,84028.927236972901,1.5707844261312454,7.1075328479597646,1.4296321592221495,1.0237443367404351,0.2157954385691675,1.0158157394494238,0.17669219832103691,6.4286389984042343,0.19536127586901994,1.0213342154841538,0.35390906268706979,2.0438256122777574,-123.62423581698083,56.375764183019172,null,1000000000,944163892.5625,null,16.049195282095607,-20.451597054152575,null,36.000112434347862,-102.10297941070415,null,0,0]
[30903,30.902999999999999,9.6799724876532256,1.4673056103672542,1.0007537500800201,3.881435134132253E-2,1,0,84509.545709495243,1.5707844938121061,7.1473831613276699,1.4304244470964516,1.0240135391603822,0.21699144186616937,1.0159957503468335,0.17768174218099572,6.4300114726301905,0.19645075349384636,1.0215863787420467,0.3559313209292857,1.9891742433136317,-123.7900000730459,56.209999926954097,null,1000000000,954995409,null,16.045936375955471,-20.474732121851726,null,35.94903508206103,-102.23988281610573,null,0,0]
[31083,31.082999999999998,9.735755202078602,1.4679006862668105,1.0007625529991504,3.9040203424023104E-2,1,0,85001.786534838597,1.5707845623362802,7.18820173645378,1.4312267877543601,1.0242907689784806,0.21821571355532018,1.0161811451488094,0.17869485084263906,6.431424943890546,0.19756609670912076,1.0218463026672366,0.35800241423028206,1.9334730943714231,-123.95985634669164,56.040143653308363,null,1000000000,966152889,null,16.042603292377947,-20.498910915361115,null,35.89699135295723,-102.37970268779195,null,0,0]
[31263,31.263000000000002,9.7915413248014573,1.468488981626753,1.0007714069654414,3.9266051521953137E-2,1,0,85494.027360182328,1.5707846300713839,7.22902488672967,1.4320200670947996,1.0245695332135896,0.21943932087949,1.0163675825669685,0.17970758886419291,6.4328463110176877,0.19868095156390531,1.0221079121789394,0.36007343808628767,1.8780434595855089,-124.12979469328634,55.870205306713657,null,1000000000,977375169,null,16.039274531564189,-20.523570773598983,null,35.845216435928776,-102.51913031258069,null,0,0]
[31443,31.443000000000001,9.8473307978967437,1.4690706112806182,1.0007803119775387,3.9491895612178876E-2,1,0,85986.268185526467,1.5707846970309689,7.2698525350814149,1.4328044367765178,1.0248498306136022,0.2206622607183053,1.01655506202766,0.18071995437275304,6.4342755687797517,0.19979531566408998,1.0223712101982652,0.36214439117771829,1.8228818373957951,-124.29981272073742,55.700187279262579,null,1000000000,988662249,null,16.035949739237672,-20.548702829151367,null,35.793707179446791,-102.65817219565635,null,0,0]
[31623,31.623000000000001,9.9031235647412679,1.4696456874923935,1.0007892680340791,3.9717735671769006E-2,1,0,86478.50901087097,1.5707847632282781,7.3106846061484134,1.4335800451144638,1.0251316599208982,0.22188452996278216,1.0167435829544502,0.18173194549984681,6.4357127119204947,0.2009091866224989,1.0226361996592945,0.36421527217062866,1.767984788218351,-124.469908081269,55.530091918731003,null,1000000000,1000014129,null,16.032628571650726,-20.574298406824749,null,35.742460483414035,-102.79683469415602,null,0,0]
[31807,31.806999999999999,9.9601595175699291,1.4702268839451211,1.0007984758711999,3.9948590209490327E-2,1,0,86981.688521223521,1.5707848301222402,7.3524285510797238,1.4343639846670277,1.0254213341355729,0.2231332644077367,1.0169373690708499,0.18276603642450207,6.4371899362486911,0.20204729808894539,1.0229088290843291,0.36633209681752305,1.7121377439981544,-124.64386086926272,55.356139130737276,null,1000000000,1011685249,null,16.029236999535637,-20.600933025270106,null,35.690343173962034,-102.93819292567025,null,0,0]
[31991,31.991,10.01719879652055,1.4708014617683556,1.000807737043709,4.0179440486998029E-2,1,0,87484.868031576465,1.5707848962467055,7.3941769635081753,1.4351390722574631,1.0257126064238096,0.22438129158997352,1.0171322422281179,0.18379973220961285,6.4386753891263373,0.20318488923061445,1.0231832322027157,0.36844884326107763,1.6565600860240721,-124.81788964131853,55.18211035868147,null,1000000000,1023424081,null,16.025848520864898,-20.628034256528721,null,35.638493832883157,-103.07916770101887,null,0,0]
[32175,32.174999999999997,10.074241345096679,1.4713695330078209,1.0008170515501256,4.0410286479805838E-2,1,0,87988.047541929773,1.5707849616148755,7.4359297681865879,1.4359054560580662,1.0260054754245784,0.22562860822572442,1.0173282018015735,0.18483303087382444,6.4401690648605197,0.20432195752024682,1.0234594121901142,0.37056551002964294,1.6012483317748387,-124.99199202595237,55.008007974047629,null,1000000000,1035230625,null,16.022462800366739,-20.655593423563698,null,35.586909308326398,-103.21976535703264,null,0,0]
[32359,32.359000000000002,10.131287108071055,1.4719312072026942,1.0008264193889609,4.0641128163430226E-2,1,0,88491.227052283459,1.5707850262396514,7.4776868915405705,1.4366632809728423,1.0262999397709471,0.22687521104380287,1.0175252471635361,0.18586593044069633,6.4416709577321098,0.20545850043826011,1.0237373722360572,0.37268209563572025,1.5461990602693256,-125.16616569527845,54.833834304721549,null,1000000000,1047104881,null,16.019079512821573,-20.683602037301092,null,35.535586499912185,-103.35999208601953,null,0,0]
[32547.5,32.547499999999999,10.189731288827717,1.4725000963161612,1.0008360716358411,4.0877610937561773E-2,1,0,89006.712583271161,1.5707850916872177,7.5204696520798411,1.4374309123673161,1.0266032586033955,0.2281515578068587,1.0177282368554696,0.18692367521972997,6.4432180967116333,0.20662229181501024,1.0240239794588257,0.37485035982769738,1.4900721522108007,-125.3446705788227,54.655329421177299,null,1000000000,1059339756.25,null,16.015615674990858,-20.712753030796925,null,35.483276721245481,-103.5032699535802,null,0,0]
[32736,32.735999999999997,10.248178729722254,1.4730624966300261,1.0008457798524988,4.1114089137146176E-2,1,0,89522.19811425927,1.5707851563810653,7.5632567939792628,1.4381898588581823,1.0269082488456909,0.22942714850067403,1.0179323647513265,0.18798099695821749,6.4447738474333258,0.20778552647985973,1.0243124616939865,0.37701853562710036,1.4342136460244088,-125.52324546587293,54.476754534127068,null,1000000000,1071645696,null,16.012153730506316,-20.742358269854069,null,35.431235190094966,-103.64617123788993,null,0,0]
[32924.5,32.924500000000002,10.306629375291314,1.4736185181827135,1.0008555440373055,4.135056273586829E-2,1,0,90037.683645247729,1.5707852203341399,7.6060482432979892,1.4389402661468658,1.0272149090090592,0.23070197964945036,1.0181376301665064,0.18903789354729919,6.4463382036631831,0.2089482017490415,1.0246028224156569,0.37918662138259479,1.3786200551721481,-125.70188798863633,54.298112011363671,null,1000000000,1084022700.25,null,16.008693360393433,-20.772409207988943,null,35.379458733878799,-103.78870215057931,null,0,0]
[33113,33.113,10.36508317131962,1.4741682685463862,1.0008653641886232,4.1587031707416074E-2,1,0,90553.169176236552,1.5707852835590925,7.6488439277424636,1.4396822767129265,1.0275232375983572,0.23197604779140241,1.0183440324131472,0.19009436288361006,6.4479111591387843,0.21011031494735824,1.024895065112901,0.38135461542521526,1.3232879547659702,-125.88059582256481,54.119404177435186,null,1000000000,1096470769,null,16.005234255358403,-20.802897484103262,null,35.327944231966796,-103.93086876096216,null,0,0]
[33305.75,33.305750000000003,10.424858093725451,1.4747240385015949,1.000875463620974,4.1828827395250477E-2,1,0,91080.277060046457,1.5707853474694895,7.692608807415974,1.4404324792880232,1.0278402416044423,0.23327804901035371,1.01855626313892,0.19117420782384317,6.4495284648283508,0.211298045635995,1.0251958465887425,0.38357139337492252,1.266975208925597,-126.06339803708893,53.93660196291107,null,1000000000,1109272983.0625,null,16.001698155646142,-20.834516879369318,null,35.275535944624011,-104.07587018216,null,0,0]
[33498.5,33.4985,10.48463619944736,1.4752734711851476,1.0008856215684807,4.2070618189271762E-2,1,0,91607.384943856712,1.5707854106444068,7.7363779675349518,1.4411741936177878,1.0281589869365149,0.23457924515256973,1.0187696810719449,0.19225360159759813,6.4511547485653589,0.2124851829927695,1.0254986032865183,0.38578807184345376,1.2109288260642224,-126.24626375875438,53.753736241245619,null,1000000000,1122149502.25,null,15.998162754234313,-20.866576445629882,null,35.223395119031757,-104.22050308498122,null,0,0]
[33691.25,33.691249999999997,10.544417434345059,1.4758166740493415,1.000895838029362,4.2312404061357833E-2,1,0,92134.492827667345,1.5707854730964681,7.7801513358572931,1.4419075621510873,1.0284794719755648,0.23587963256249256,1.018984285466269,0.19333254197396407,6.4527900035627797,0.2136717241854052,1.0258033389845742,0.38800464898893344,1.1551453350998617,-126.42919063530454,53.570809364695464,null,1000000000,1135100326.5625,null,15.99462774979979,-20.899067812441309,null,35.171518579990902,-104.3647735220685,null,0,0]
[33884,33.884,10.604201745496319,1.4763537521381953,1.0009061130018255,4.2554184983390031E-2,1,0,92661.600711478328,1.5707855348380089,7.8239288417507478,1.4426327241849632,1.0288016950957681,0.23717920760004743,1.0192000755724231,0.19441102672812638,6.4544342230030409,0.21485766639111625,1.0261100574772177,0.39022112295003286,1.099621326257056,-126.61217635703527,53.387823642964733,null,1000000000,1148125456,null,15.991092850272505,-20.931982790816861,null,35.119903204337284,-104.50868740696565,null,0,0]
[34081.5,34.081499999999998,10.665462477381531,1.4768978199676979,1.0009167018740714,4.2801919026203457E-2,1,0,93201.698283736376,1.5707855973766731,7.8687893902998844,1.443367386724788,1.0291336600132051,0.23850996204280059,1.0194224125775015,0.19551561400472525,6.4561282528432979,0.21607220989816961,1.0264263952072954,0.39249210919204036,1.0429946712310998,-126.79973012093072,53.200269879069282,null,1000000000,1161548642.25,null,15.987470651871154,-20.966139924297128,null,35.067283538426103,-104.65578400943745,null,0,0]
[34279,34.279000000000003,10.726726330287233,1.4774356732551941,1.0009273521734317,4.3049647812225818E-2,1,0,93741.795855994787,1.5707856591946987,7.9136541377113474,1.4440937196327732,1.0294674462537836,0.23983985589317955,1.019645992849852,0.19661971821685403,6.4578316798081312,0.21728611856288102,1.0267448227777558,0.39476298308203794,0.98663338809478796,-126.987340888611,53.012659111388999,null,1000000000,1175049841,null,15.983847971250189,-21.000724960926714,null,35.014931590254086,-104.80251840877624,null,0,0]
[34476.5,34.476500000000001,10.787993251041605,1.477967417567263,1.0009380638979448,4.3297371311219399E-2,1,0,94281.893428253563,1.5707857203044704,7.958523012974136,1.444811863019378,1.0298030520464876,0.2411688852861546,1.0198708155718124,0.19772333699119182,6.4595444964645221,0.21849938937979541,1.027065344321896,0.39703374255384249,0.93053399976447082,-127.17500630724753,52.824993692752471,null,1000000000,1188629052.25,null,15.980224522480881,-21.035729652227335,null,34.962844162734811,-104.94889653685033,null,0,0]
[34674,34.673999999999999,10.84926318767126,1.4784931560997832,1.0009488370456392,4.3545089492950377E-2,1,0,94821.991000512659,1.5707857807180903,8.0033959466632041,1.445521953887037,1.0301404756129611,0.24249704637393443,1.0200968799218986,0.19882646796123427,6.4612666953463833,0.21971201935405096,1.0273879639901706,0.39930438551964798,0.8746930906284871,-127.36272406620611,52.637275933793887,null,1000000000,1202286276,null,15.976600028550912,-21.071145928768896,null,34.911018111317851,-105.0949241884579,null,0,0]
[34875.75,34.875749999999996,10.911854652382953,1.4790241118713523,1.0009599054385498,4.3798132797534882E-2,1,0,95373.710925592881,1.5707858417252656,8.0492386202259496,1.4462391501957033,1.0304870352055409,0.24385288762622603,1.0203290900830932,0.19995283107602285,6.4630356336474151,0.22095007911761363,1.0277196967751325,0.40162376793528765,0.8179139348467015,-127.55453300324186,52.445466996758142,null,1000000000,1216317938.0625,null,15.972896180986938,-21.107741084141477,null,34.858343472861392,-105.24373822355322,null,0,0]
[35077.5,35.077500000000001,10.97444915820954,1.4795490110091207,1.0009710379224181,4.4051170489785837E-2,1,0,95925.430850673467,1.5707859020306694,8.0950853871855699,1.4469482231386208,1.0308354878723416,0.24520781473956915,1.0205625941395162,0.2010786801963329,6.4648143464562438,0.22218746387759833,1.0280536277642929,0.403943024303489,0.76139748732788293,-127.74639181321844,52.253608186781562,null,1000000000,1230431006.25,null,15.969190685653068,-21.144749257575189,null,34.805935110123116,-105.39219833867011,null,0,0]
[35279.25,35.279249999999998,11.037046653409712,1.4800679562734127,1.0009822344951058,4.4304202537487986E-2,1,0,96477.150775754402,1.5707859616463409,8.1409361783845338,1.4476493092521723,1.0311858316942721,0.24656182366837265,1.0207973912032442,0.20220401282176223,6.4666028257084536,0.22342417047606228,1.0283897614365884,0.40626215232858282,0.7051402967058239,-127.93829816244407,52.06170183755593,null,1000000000,1244625480.5625,null,15.965483274217821,-21.182162395006053,null,34.753789833662978,-105.54031029185509,null,0,0]
[35481,35.481000000000002,{"$f":"SQRT(1+(A397/pole1)^2)","v":11.099647087406915},{"$f":"ATAN(A397/pole1)","v":1.480581048119332},{"$f":"SQRT(1+(A397/Zero1)^2)","v":1.0009934951544626},{"$f":"ATAN(A397/Zero1)","v":4.4557228908430446E-2},{"$f":"IF(VIN_nom>Vout, 1, SQRT(1+(A397/z_RHP)^2))","v":1},{"$f":"IF(VIN_nom>Vout, 0, -ATAN(A397/z_RHP))","v":0},{"$f":"SQRT(1+(A397/Pole2)^2)","v":97028.870700835672},{"$f":"ATAN(A397/Pole2)","v":1.5707860205840463},8.1867909262086016,1.4483425420455545,{"$f":"SQRT(1+(A397/pole4)^2)","v":1.031538064744439},{"$f":"ATAN(A397/pole4)","v":0.24791491038599342},{"$f":"IF(VOUT_setting=1,1,SQRT(1+(A397*zterm1)^2))","v":1.0210334803822569},{"$f":"IF(VOUT_setting=1,0,ATAN(((A397*zterm1))))","v":0.20332882645943501},6.4684010633042917,{"$f":"IF(VOUT_setting=1,0,ATAN(A397*$Q$4/(1+Afbr-$Q$5*(A397)^2)))","v":0.22466019576673663},{"$f":"SQRT((1-(Z397/pterm2))^2+(A397/pterm1)^2)","v":1.0287281022891464},{"$f":"IF((ATAN((A397/pterm1)/(1-A397^2/pterm2))>0),ATAN((A397/pterm1)/(1-A397^2/pterm2)),PI()+ATAN((A397/pterm1)/(1-A397^2/pterm2)))","v":0.40858114969117837},{"$f":"20*LOG10(((E397*K397*G397*O397)/(C397*I397*S397*M397*Q397))*Adc)","v":0.6491389725122152},{"$f":"((F397+L397+H397+P397)-(D397+J397+T397+N397+R397))*radconv","v":-128.13024975854077},{"$f":"IF(V397>0,V397,V397+180)","v":51.869750241459229},null,{"$f":"IF(U397<0,A397,1000000000)","v":1000000000},{"$f":"A397^2","v":1258901361},null,{"$f":"20*LOG10((K397/(I397*M397))*AEA)","v":15.961773686837471},{"$f":"(L397-(J397+N397))*radconv","v":-21.219972616885048},null,{"$f":"20*LOG10((E397*G397/(C397*S397))*Acs*Am)","v":34.701904506430722},{"$f":"(F397+H397-(D397+T397))*radconv","v":-105.68807970771589},null,{"$f":"SUM((U398<0)*(U397>0))*A397","v":0},0]
[35687.75,{"$f":"A398/1000","v":35.687750000000001},11.163801954425232,1.4811008859037511,1.001005101374892,4.4816520146010459E-2,1,0,97594.263982177028,1.5707860802910631,8.2337861347875538,1.449044944211747,1.0319009852543926,0.24930056988183152,1.0212767602029313,0.20448097547926056,6.4702539824820011,0.22592614353116669,1.0290771229255919,0.41095748109618752,0.59201173200318569,-128.32700310654749,51.672996893452506,null,1000000000,1273615500.0625,null,15.957969643530387,-21.25912379919993,null,34.648999762502321,-105.83916168562052,null,0,0]
[35894.5,35.894500000000001,11.227959803776857,1.4816147830003459,1.001016774893279,4.5075805353489297E-2,1,0,98159.657263518748,1.5707861393102629,8.2807853595498084,1.4497393734742359,1.0322658856727644,0.25068525238846617,1.021521395067972,0.20563257419179137,{"$f":"IF(VOUT_setting=1,1,SQRT((1+Afbr-$Q$5*(A399)^2)^2+(A399*$Q$4)^2))","v":6.472117132345633},0.22719136914699534,1.0294284711203767,0.41333367027349877,0.53514617800495423,-128.52379922585106,51.476200774148936,null,1000000000,1288415130.25,null,15.954162788695186,-21.298675778480945,null,34.596361505426167,-105.98989548363755,null,0,0]
[36101.25,36.10125,11.292120584628089,1.4821228403986564,1.0010285157072691,4.533508449621567E-2,1,0,98725.050544860802,1.5707861976534629,8.3277885324974186,1.4504259641579982,1.0326327639006398,0.25206895363460574,1.0217673840040913,0.20678361993894454,6.4739905040638073,0.22845586926656583,1.0297821517719647,0.41570971464916739,0.4785388515529867,-128.72063577742136,51.279364222578636,null,1000000000,1303300251.5625,null,15.95035286863091,-21.33862061442392,null,34.543986522958434,-106.14028674255061,null,0,0]
[36308,36.308,11.356284247291732,1.4826251568180508,1.0010403238144947,4.5594357539543134E-2,1,0,99290.443826203176,1.5707862553322112,8.3747955871533382,1.4511048476021329,1.0330016178307173,0.25345166937004021,1.0220147260335541,0.20793411007105028,6.4758740887669424,0.22971964055524524,1.030138169798315,0.41808561162291485,0.42218635479455086,-128.91751046318257,51.082489536817434,null,1000000000,1318270864,null,15.946539637820077,-21.378950538995344,null,34.491871655762282,-106.29034097156294,null,0,0]
[36519.5,36.519500000000001,11.421924976137468,1.4831331740364195,1.0010524728359089,4.5859580931825704E-2,1,0,99868.826795992689,1.570786313660347,8.422886559158858,1.4517914871427848,1.0333809881390643,0.25486512831340008,1.0222691497054908,0.20911045459874783,6.4778115064399886,0.2310116888893311,1.0305047908889446,0.42051593863652759,0.36479938024999681,-129.11894537163499,50.881054628365007,null,1000000000,1333673880.25,null,15.942635126123299,-21.420597565242328,null,34.438825378147307,-106.44349951398118,null,0,0]
[36731,36.731000000000002,11.48756861908252,1.4836353854372801,1.0010646922730935,4.612479786789675E-2,1,0,100447.20976578257,1.5707863713167669,8.4709814572443136,1.4524703300624442,1.033762421486635,0.25627754701247879,1.0225249872745212,0.21028621210578316,6.4797595928689349,0.23230296750109466,1.0308738684617507,0.42294610580809733,0.30767207561100163,-129.32041544823667,50.679584551763327,null,1000000000,1349166361,null,15.938726655115225,-21.462631664873626,null,34.386044781475377,-106.59631661919838,null,0,0]
[36942.5,36.942500000000003,11.553215126454459,1.4841318897327995,1.0010769821234697,4.6390008310682629E-2,1,0,101025.59273557276,1.5707864283130077,8.5190802149150553,1.453141507789343,1.0341459155906418,0.25768892098611085,1.0227822376796341,0.21146137978314322,6.481718338435897,0.23359347286328974,1.0312454078438804,0.42537611026818417,0.25080099278767304,-129.52191835897,50.478081641030002,null,1000000000,1364748306.25,null,15.93481398682343,-21.505045051515381,null,34.333526648066069,-106.7487977807225,null,0,0]
[37154,37.154000000000003,11.618864449701304,1.4846227834155574,1.0010893423844447,4.6655212223115208E-2,1,0,101603.97570536326,1.5707864846603437,8.5671827671644447,1.4538051488279506,1.0345314681593578,0.25909924577640553,1.0230408998550282,0.21263595483114903,6.4836877334820224,0.23488320146308966,1.0316194143831847,0.42780594911834946,0.19418274458874052,-129.7234518101115,50.276548189888501,null,1000000000,1380419716,null,15.930896891109317,-21.547830107631473,null,34.281267813281559,-106.90094836322668,null,0,0]
[37370.25,37.370249999999999,11.685991028743812,1.4851189991140601,1.0011020530375601,4.6926365461182638E-2,1,0,102195.34836360093,1.5707865416137115,8.6163694939474933,1.4544760327323232,1.034927805642853,0.26054015511567802,1.0233068297989554,0.2138362935743664,6.485712359260364,0.23620108882890367,1.0320043770816352,0.43029018453698925,0.13655087796849374,-129.92954065494919,50.070459345050807,null,1000000000,1396535585.0625,null,15.926887013310251,-21.591952578406985,null,34.228100173785322,-107.0561796973188,null,0,0]
[37586.5,37.586500000000001,11.753120452359362,1.4856095465356329,1.0011148372939094,4.7197511793920954E-2,1,0,102786.72102183895,1.5707865979117288,{"$f":"SQRT(1+(A407/Zero2)^2)","v":8.6655600548049332},{"$f":"ATAN(A407/Zero2)","v":1.4551393003085933},1.0353262902161362,0.26197995826521375,1.0235742333694178,0.21503600688059377,6.4877480976827071,0.23751815676954358,1.0323919303722082,0.43277424060227748,7.9176357319687682E-2,-130.13565670209724,49.864343297902764,null,1000000000,1412744982.25,null,15.922872044363867,-21.636448015086511,null,34.175197084383491,-107.21107638252147,null,0,0]
[37802.75,37.802750000000003,11.820252672083365,1.4860945220197883,1.0011276951506727,4.746865118172594E-2,1,0,103378.09368007728,1.5707866535656425,8.7147543848122933,1.4557950799495034,1.0357269194009995,0.2634186505357346,1.0238431094117857,0.21623509178771394,6.4897949382932856,0.23883440157715477,1.032782080037276,0.43525811412181581,2.2055750471548119E-2,-130.34179762363993,49.658202376360066,null,1000000000,1429047907.5625,null,15.918851762030311,-21.681308793276315,null,34.122555326967372,-107.36564375804038,null,37802.75,49.658202376360066]
[38019,38.018999999999998,11.887387640544027,1.4865740197403183,1.0011406266050142,4.7739783584999466E-2,1,0,103969.46633831591,1.5707867085864433,8.7639524204979331,1.4564434971908657,1.0361296907097406,0.26485622726359004,1.0241134567662882,0.21743354534394027,6.4918528705925418,0.24014981955980702,1.0331748318811049,0.43774180187137063,-3.4814314172421812E-2,-130.54796113121483,49.452038868785166,null,38019,1445444361,null,15.914825951554203,-21.726527453726433,null,34.070171736495176,-107.51988703717016,null,0,0]
[38240.5,38.240499999999997,11.956155276544647,1.4870595757965284,1.0011539482986076,4.8017491111121871E-2,1,0,104575.19602062773,1.5707867642978794,8.8143486362298553,1.4571001519507032,1.0365444584347967,0.26632754335592274,1.0243918915748116,0.21866043670206092,6.4939722521094447,0.24149631152542136,1.0335798225366977,0.44028559124967603,-9.2808760965415293E-2,-130.75915082850653,49.240849171493466,null,38240.5,1462335840.25,null,15.910696456721269,-21.773207301894406,null,34.016780796944516,-107.67754427624944,null,0,{"$f":"IF(AH410>0,W410,0)","v":0}]
[38462,38.462000000000003,12.024925699143536,1.4875395781849536,1.0011673472006071,4.8295191225385788E-2,1,0,105180.92570293986,1.5707868193676389,8.864748609453919,1.4577493402487693,1.0369614682434174,0.26779767926115106,1.0246718675225774,0.21988665944645619,6.4961032479700789,0.24284192824294559,1.033987555649782,0.44282917877846789,-0.15054732452097186,-130.97035948458125,49.029640515418748,null,38462,1479325444,null,15.906560728993169,-21.820247290304703,null,33.963654155670973,-107.83487217314645,null,0,0]
[38683.5,38.683500000000002,12.093698860802988,1.4880141214285214,1.0011808233079125,4.8572883885258683E-2,1,0,105786.65538525229,1.5707868738067445,8.9151522764435072,1.4583911881727583,1.0373807174317617,0.26926663005155937,1.0249533833466546,0.22111221043900653,6.4982458467501827,0.24418666579719775,1.0343980375279083,0.44537256088887528,-0.20803343942771585,-131.18158476263861,48.818415237361393,null,38683.5,1496413172.25,null,15.902418560428451,-21.867639912958865,null,33.910788577142213,-107.99187594158167,null,0,0]
[38905,38.905000000000001,12.162474715058652,1.4884832979221057,1.0011943766174067,4.8850569048214873E-2,1,0,106392.38506756506,1.5707869276259676,8.9655595749004426,1.4590258189992438,1.0378022032858498,0.27073439082783174,1.0252364377785566,0.2223370865531013,6.5004000369783981,0.24553052029069708,1.0348112745018849,0.44791573397687046,-0.26527047958586936,-131.39282436496794,48.607175635032064,null,38905,1513599025,null,15.898269750287213,-21.915377826536481,null,33.858180879289101,-108.14856067133242,null,0,0]
[39131.5,39.131500000000003,12.23280580880332,1.4889576095701325,1.0012083157033427,4.9134514702301152E-2,1,0,107011.78810613802,1.5707869820300093,9.0171084275259688,1.4596674378480901,1.0382355136242789,0.27223404821550401,1.0255274714707561,0.22358891109355411,6.5026148294128374,0.24690379287168371,1.0352366953299057,0.45051609509019186,-0.32354543350852083,-131.60884481444268,48.391155185557324,null,39131.5,1531274292.25,null,15.894020217539666,-21.96454293064895,null,33.80464906638538,-108.30845755653398,null,0,0]
[39358,39.357999999999997,12.303139623116701,1.4894264982926848,1.0012223355095824,4.9418452427273343E-2,1,0,107631.19114471128,1.5707870358078753,9.0686609500649915,1.460301762147616,1.0386711569743483,0.27373245098684712,1.0258201113174887,0.22484002336756476,6.5048417181073468,0.24827613388862554,1.035665010503857,0.45311622990309292,-0.38156688815404433,-131.82487550338547,48.175124496614529,null,39358,1549052164,null,15.8897633374735,-22.014054061553505,null,33.751380344328396,-108.46803121923867,null,0,0]
[39584.5,39.584499999999998,12.373476111605694,1.4898900563609618,1.0012364360327348,4.970238217768299E-2,1,0,108250.59418328485,1.5707870889703142,9.1202170802843607,1.4609289150901461,1.0391091304017341,0.27522959399562957,1.0261143559445667,0.22609042006952715,6.5070806906451191,0.24964753923179431,1.0360962268670635,0.45571613444774733,-0.43933826325613345,-132.04091409509647,47.959085904903532,null,39584.5,1566932640.25,null,15.885498917291629,-22.063903866608406,null,33.698371476581215,-108.62728672146106,null,0,0]
[39811,39.811,12.443815228924368,1.490348373969181,1.0012506172693898,4.9986303908089384E-2,1,0,108869.99722185872,1.5707871415278301,9.171776757345901,1.4615490171207315,1.039549430961376,0.27672547212685883,1.0264102039718452,0.22734009790656579,6.5093317345590958,0.25101800481099545,1.0365303512873281,0.45831580471780808,-0.49686291814267625,-132.25695829123853,47.743041708761467,null,39811,1584915721,null,15.881226771080055,-22.114085152354914,null,33.645619280105379,-108.78622900400595,null,0,0]
[40042.75,40.042749999999998,12.515787397840423,1.4908119827218083,1.0012652107480773,5.0276798257369901E-2,1,0,109503.75728450582,1.570787194688156,9.2245351353385203,1.4621763172496534,1.0400023427477789,0.27825470843284494,1.0267145675362546,0.2286179943133177,6.5116474362507848,0.25241925921265396,1.0369775553291163,0.46097548554377066,-0.55546900343875238,-132.47801357703096,47.521986422969036,null,40042.75,1603421827.5625,null,15.876847417953703,-22.165765334612217,null,33.591906749695376,-108.94853621505563,null,0,0]
[40274.5,40.274500000000003,12.587762226051321,1.4912702898893493,1.0012798887180319,5.0567284114328981E-2,1,0,110137.5173471532,1.5707872472366853,9.2772971019499018,1.4627964824411488,1.0404576845251721,0.27978260981149405,1.0270206067499292,0.22989513121053698,6.5139757488387104,0.25381952117977918,1.0374278184247343,0.46363491249966399,-0.6138237261743078,-132.69906998069027,47.300930019309732,null,40274.5,1622035350.25,null,15.872459603808014,-22.217777797915801,null,33.538456351772339,-109.11052560854543,null,0,0]
[40506.25,40.506250000000001,12.659739668200141,1.4917233857047176,1.0012946511755381,5.0857761430317595E-2,1,0,110771.2774098009,1.5707872991839185,9.3300625962985926,1.4634096332674558,1.0409154531046036,0.28130917088565144,1.0273283201153505,0.23117150511264073,6.5163166588073995,0.2552187863948937,1.0378811480086696,0.46629408116876397,-0.67193049735620292,-132.92012515847827,47.079874841521729,null,40506.25,1640756289.0625,null,15.868063150422962,-22.270115326498658,null,33.485264843163932,-109.27220210416823,null,0,0]
[40738,40.738,12.731719679954006,1.492171358368934,1.0013094981168587,5.1148230156695361E-2,1,0,111405.03747244889,1.5707873505401178,9.3828315588686131,1.4640158876097931,1.0413756452857479,0.28283438631257951,1.0276377061286068,0.23244711254815356,6.518670152587724,0.25661705056211465,1.0383375515411521,0.4689529870920976,-0.72979266771440487,-133.14117680438812,46.858823195611876,null,40738,1659584644,null,15.863657886172973,-22.322770860736114,null,33.432329034355554,-109.43357050277682,null,0,0]
[40975.25,40.975250000000003,12.805410571763206,1.4926247455739863,1.001324784923971,5.1445583474920981E-2,1,0,112053.83822698312,1.5707874025133564,9.436856391194544,1.4646295062623025,1.041849266172278,0.28439439939786865,1.0279561657223442,0.23375219572200626,6.5210925216890363,0.25804745756389269,1.0388079787155202,0.47167471854833659,-0.78877810970937667,-133.36746852424611,46.632531475753893,null,40975.25,1678971112.5625,null,15.859138774624794,-22.376998245398248,null,33.378398527449903,-109.5984543115519,null,0,0]
[41212.5,41.212499999999999,12.879104065729303,1.4930729443591848,1.0013401602645076,5.1742927687857536E-2,1,0,112702.63898151764,1.5707874538882012,9.4908847363068443,1.4652361389008457,1.0423254202379262,0.28595299098606569,1.0282763750880617,0.23505646829998642,6.5235280500295438,0.25947680639753817,1.039281643378634,0.47439616504680698,-0.84751412223401945,-133.5937517685621,46.4062482314379,null,41212.5,1698470156.25,null,15.854610085280774,-22.43154441910723,null,33.324729403659077,-109.76302504058383,null,0,0]
[41449.75,41.449750000000002,12.952800117438269,1.4935160431027652,1.0013556241343899,5.2040262743347131E-2,1,0,113351.43973605243,1.5707875046749276,9.5449165345538578,1.465835903714243,1.0428041040126732,0.28751015545729636,1.028598332591613,0.2363599266037392,6.5259767228785241,0.26090509252461069,1.0397585536165932,0.47711732166590143,-0.90600411294940286,-133.82002417963096,46.179975820369037,null,41449.75,1718081775.0625,null,15.850071654087539,-22.486402288736112,null,33.27131840812897,-109.92728747457359,null,0,0]
[41687,41.686999999999998,13.026498683479611,1.4939541281910478,1.0013711765295172,5.2337588589241556E-2,1,0,114000.24049058756,1.5707875548835768,9.5989517276232519,1.4664289162500621,1.0432853140144493,0.28906588722965615,1.0289220365919816,0.23766256697056873,6.5284385254479096,0.262332311430577,1.0402387175425349,0.47983818343764045,-0.96425142923131635,-134.04628343692889,45.953716563071112,null,41687,1737805969,null,15.845523323322885,-22.541564914652678,null,33.218162339934551,-110.09124628143637,null,0,0]
[41929.75,41.929749999999999,13.101908309763077,1.4943972678268618,1.0013871810879476,5.2641797544545635E-2,1,0,114664.0819370089,1.570787605668079,9.6542430349231534,1.4670288051136799,1.0437802906764866,0.29065619575225016,1.0292550507736928,0.2389945551304021,6.5309709725858216,0.26379150724678008,1.0407333889658756,0.48262181062561615,-1.0236013035083538,-134.27777190641589,45.722228093584107,null,41929.75,1758103935.0625,null,15.84085914724027,-22.59831469086129,null,33.164034569148008,-110.25869651287469,null,0,0]
[42172.5,42.172499999999999,13.177320479456547,1.4948353354816044,1.001403278314873,5.2945996747883563E-2,1,0,115327.92338343055,1.5707876558679374,9.709537776894047,1.4676218615874586,1.044277904637259,0.2922449926785069,1.029589889868785,0.24032567928293358,6.5335171337501725,0.26524957630177665,1.0412314839512571,0.4854051184661865,-1.0827040241046713,-134.5092418051056,45.490758194894397,null,42172.5,1778519756.25,null,15.836184292614437,-22.655369292583948,null,33.110167070340509,-110.42583840269147,null,0,0]
[42415.25,42.41525,13.252735149141646,1.4952684175719932,1.0014194682058251,5.3250186143427497E-2,1,0,115991.76482985249,1.5707877054931907,9.7648358951880319,1.4682082013258,1.0447781521284358,0.29383227215291363,1.0299265520973668,0.24165593555594878,6.5360769929166658,0.26670651383773208,1.0417330112750611,0.48818810148719421,-1.1415629896118,-134.74069076180598,45.259309238194021,null,42415.25,1799053432.5625,null,15.831498609742612,-22.712721758390533,null,33.056556582471828,-110.5926765918671,null,0,0]
[42658,42.658000000000001,13.328152276381276,1.4956965985663733,1.0014357507563096,5.3554365675360482E-2,1,0,116655.60627627469,1.5707877545536479,9.8201373327679224,1.4687879373966204,1.0452810293689752,0.29541802836172248,1.0302650356721896,0.24298532009456719,6.5386505339999594,0.26816231512320504,1.0422379797418997,0.49097075416577318,-1.2001815384501207,-134.972116441879,45.027883558121005,null,42658,1819704964,null,15.8268019549868,-22.770365277425448,null,33.003199898583006,-110.7592156068424,null,0,0]
[42906.5,42.906500000000001,13.405358305392674,1.4961299314366878,1.0014525149633127,5.3865740008648279E-2,1,0,117335.17208239618,1.5707878042011827,9.876752071058732,1.4693746808799018,1.0457985381853474,0.29703976241136781,1.0306134215773746,0.24434528670112102,6.5412991893690355,0.26965141800581921,1.0427584829514747,0.49381897132637032,-1.2599429775436943,-135.20899737351888,44.791002626481117,null,42906.5,1840967742.25,null,15.821982542346277,-22.829668713375931,null,32.948838959600522,-110.92939413892306,null,0,0]
[43155,43.155000000000001,13.482566822797761,1.4965583013868393,1.0014693762618621,5.4177103887178342E-2,1,0,118014.73788851795,1.5707878532769453,9.9333701708386144,1.469954735934565,1.0463187947491974,0.29865988798285686,1.030963712321231,0.24570433166757699,6.5439621481903156,0.27113932022287618,1.0432826110159197,0.49666683043469684,-1.3194593681414579,-135.44584907488908,44.554150925110918,null,43155,1862354025,null,15.817151345888282,-22.889263176288196,null,32.894737358241038,-111.09926840075347,null,0,0]
[43403.5,43.403500000000001,13.559777786090269,1.4969817930366036,1.0014863346470542,5.4488457251108374E-2,1,0,118694.30369464,1.5707879017907567,9.9899915749540344,1.4705282158932063,1.0468417949638209,0.30027839897564906,1.0313159059627992,0.24706245091529866,6.5466393930123443,0.27262601678492276,1.0438103734700093,0.49951432540122698,-1.3787341045550878,-135.68266915423237,44.317330845767628,null,43403.5,1883863812.25,null,15.812308229990071,-22.949141823710303,null,32.840891822675403,-111.26884289521431,null,0,0]
[43652,43.652000000000001,13.636991153725257,1.4974004890963601,1.0015033901139565,5.479980004060829E-2,1,0,119373.86950076232,1.5707879497522139,10.046616227536594,1.4710952315508887,1.0473675347191143,0.30189528933519316,1.0316700005532342,0.2484196403848635,6.549330906318656,0.27411150273168011,1.0443417798779187,0.502361450080967,-1.4377705209130438,-135.91945525579507,44.080544744204929,null,43652,1905497104,null,15.807453064849247,-23.009297961202353,null,32.787299135412418,-111.438122012607,null,0,0]
[43906,43.905999999999999,13.715915911615328,1.4978235802611559,1.0015209233894016,5.5118022726440272E-2,1,0,120068.47599877094,1.5707879982141288,10.104497442301646,1.471668229119925,1.0479077374350025,0.30354628491153779,1.0320338947346341,0.2498059031733996,6.5520967177199214,0.27562861040035574,1.0448887236058424,0.50527120046659479,-1.4978706973256197,-136.16144456606156,43.838555433938438,null,43906,1927736836,null,15.802477859863462,-23.071065474078406,null,32.732778302687507,-111.61084695058599,null,0,0]
[44160,44.16,13.794843096643856,1.4982418300685081,1.0015385580809848,5.5436234238218883E-2,1,0,120763.08249677983,1.5707880461185564,10.162381936846108,1.4722346993337052,1.0484507935755747,0.30519557467849817,1.0323997708005386,0.2511911860566568,6.5548773989865099,0.27714444288628542,1.0454394946722225,0.50818055083397606,-1.5577287448934742,-136.4033935119831,43.596606488016903,null,44160,1950105600,null,15.797489809926134,-23.133109209242289,null,32.678515005822327,-111.78327222008485,null,0,0]
[44414,44.414000000000001,13.873772667387239,1.498655321000026,1.0015562941833491,5.5754434512092783E-2,1,0,121457.68899478899,1.5707880934750609,10.220269655442966,1.4727947527385916,1.048996698709254,0.30684315231965842,1.0327676266445951,0.25257548476217734,6.5576729312057536,0.27865899498727287,1.0459941033830036,0.51108949444182272,-1.6173480379996619,-136.64529968835271,43.354700311647292,null,44414,1972603396,null,15.792488794050767,-23.195422471498006,null,32.624505977285224,-111.95540216436272,null,0,0]
[44668,44.667999999999999,13.952704583357967,1.4990641336774848,1.0015741316911073,5.6072623484224246E-2,1,0,122152.29549279842,1.5707881402929895,10.278160543617579,1.4733484974066835,1.0495454483904589,0.30848901156889008,1.033137460152062,0.2539587950386597,6.5604832953963044,0.28017226153315095,1.0465525600744161,0.51399802448865206,-1.6767318911861138,-136.88716072520987,43.112839274790133,null,44668,1995230224,null,15.787474696802315,-23.257998710283236,null,32.570748003809939,-112.12724101666848,null,0,0]
[44928.25,44.928249999999998,14.033581112787425,1.4994782357858447,1.001592513287163,5.6398630120363231E-2,1,0,122863.99368613317,1.5707881877138687,10.337479144148558,1.47390943466544,1.0501106465064625,0.31017358048653904,1.0335184429298623,0.255375113827705,6.5633781762295476,0.28172142520222226,1.0471287603308459,0.51697768656989063,-1.737336164650038,-137.13492380562906,42.865076194370943,null,44928.25,2018547648.0625,null,15.782323537951298,-23.322380779154866,null,32.515924338586601,-112.30301057725194,null,0,0]
[45188.5,45.188499999999998,14.114460021124374,1.4998875921744619,1.0016110013288841,5.6724624756087874E-2,1,0,123575.6918794682,1.5707882345885347,10.396800960256769,1.4744639709324683,1.0506788213865135,0.31185633224875903,1.033901497372864,0.25679038597836473,6.5662885873714139,0.28326922838655899,1.0477090223316914,0.51995689983767701,-1.7977001272698847,-137.38263456989964,42.617365430100364,null,45188.5,2042000532.25,null,15.777158417767028,-23.387025451205005,null,32.461357575366733,-112.47848320057953,null,0,0]
[45448.75,45.448749999999997,14.195341267706862,1.5002922838244701,1.0016295958103771,5.7050607322776101E-2,1,0,124287.39007280348,1.5707882809263702,10.456125937212418,1.4750122148158025,1.0512499682040073,0.31353726027974582,1.0342866211793047,0.25820460698712044,6.5692145081840438,0.28481566562976923,1.0482933572910156,0.52293565678008203,-1.8578271577401171,-137.63029057782299,42.36970942217701,null,45448.75,2065588876.5625,null,15.771979229035644,-23.45192612742343,null,32.40704442736471,-112.65366310005837,null,0,0]
[45709,45.709000000000003,14.276224812793243,1.5006923898879649,1.0016482967257139,5.7376577751821145E-2,1,0,124999.08826613904,1.5707883267365452,10.515454021517897,1.4755542724877424,1.0518240821176044,0.31521635805916426,1.0346738120384245,0.25961777237395928,6.5721559179564446,0.28636073151093833,1.0488817764542011,0.52591394981934803,-1.9177205746678816,-137.87788942404066,42.12211057595934,null,45709,2089312681,null,15.766785869888507,-23.51707635152319,null,32.352981662513464,-112.82855438052687,null,0,0]
[45975.25,45.975250000000003,14.35897544629591,1.5010970555897454,1.0016675389226952,5.7710050717117704E-2,1,0,125727.1944869869,1.570788373066158,10.576153061377404,1.4761025336119282,1.0524144975161775,0.31693226625337151,1.0350720661540325,0.26106242088745041,6.5751811482545772,0.28793999374072171,1.0494879997658073,0.52896041863492071,-1.978756464246785,-138.13113497458548,41.868865025414522,null,45975.25,2113723612.5625,null,15.76145801408413,-23.583980255163965,null,32.297928288061215,-113.00718322961401,null,0,0]
[46241.5,46.241500000000002,14.441728404196507,1.5014970837835573,1.0016868925050457,5.804351083343965E-2,1,0,126455.30070783506,1.5707884188622563,10.636855244042129,1.4766445372872943,1.0530080081017048,0.31864624520271806,1.0354724788103911,0.26250595513321323,6.5782225458483001,0.28951780928227239,1.0500985216819756,0.53200638565489544,-2.0395546844987305,-138.38431571187797,41.615684288122026,null,46241.5,2138276322.25,null,15.756115127616837,-23.651132116056615,null,32.243130301491739,-113.18551835448886,null,0,0]
[46507.75,46.507750000000001,14.5244836467654,1.5018925536087844,1.0017063574663094,5.8376958027375241E-2,1,0,127183.40692868346,1.5707884641340026,10.697560516011512,1.4771803897197797,1.053604608643496,0.32035828810566064,1.035875047504379,0.26394837039084623,6.5812800883275369,0.29109417244656194,1.0507133543422602,0.53505184255234306,-2.1001186025156486,-138.63742916755396,41.362570832446039,null,46507.75,2162970810.0625,null,15.750757117643486,-23.718525459874314,null,32.188584412071812,-113.36356381661237,null,0,0]
[46774,46.774000000000001,14.607241135172202,1.5022835424171279,1.0017259337999933,5.871039222552997E-2,1,0,127911.51314953213,1.5707885088903517,10.758268824989853,1.477710194732381,1.0542042938955016,0.32206838822141043,1.0362797697232966,0.2653896619658882,6.5843537532049874,0.29266907758358901,1.0513325099181925,0.53809678092893587,-2.1604515254132495,-138.89047290748243,41.109527092517567,null,46774,2187807076,null,15.745383896434751,-23.786153952291869,null,32.134287383908472,-113.54132357092701,null,0,0]
[47046.25,47.046250000000001,14.691865863849143,1.5026787873818579,1.0017460664490911,5.9051326918963122E-2,1,0,128656.02739789314,1.5707885541314603,10.820348295720249,1.4782457913760685,1.0548206774653781,0.32381500989329776,1.0366958366821273,0.26686226653594181,6.587513331736317,0.29427796001231282,1.0519701011493514,0.54120979263098667,-2.2219085854576979,-139.14914445047785,40.850855549522151,null,47046.25,2213349639.0625,null,15.739873773050789,-23.855543167496304,null,32.07902078236139,-113.72279775256625,null,0,0]
[47318.5,47.3185,14.776492861379847,1.503069505162999,1.0017663155329228,5.9392247869136931E-2,1,0,129400.54164625441,1.5707885988519739,10.882430835002465,1.4787752771826557,1.0554402751989598,0.32555958616861191,1.0371141499758056,0.26833368636364074,6.5906897196984033,0.2958853061363001,1.0526122381662659,0.54432224419121511,-2.2831309295880189,-139.40773805834436,40.592261941655636,null,47318.5,2239040442.25,null,15.734347575247176,-23.925165285457169,null,32.024007712081982,-113.90398123936082,null,0,0]
[47590.75,47.59075,14.861122089004194,1.5034557729827143,1.0017866810444276,5.9733154997638697E-2,1,0,130145.05589461593,1.5707886430608267,10.944516390617611,1.4792987558485367,1.0560630814389471,0.32730211003746496,1.0375347068872993,0.26980391651437341,6.5938828928034647,0.29749111004171624,1.0532589340818475,0.54743412640040678,-2.3441219078562519,-139.66625123383338,40.333748766166622,null,47590.75,2264879485.5625,null,15.728805224731149,-23.995013963683636,null,31.96924488359717,-114.08487793265839,null,0,0]
[47863,47.863,14.945753508838962,1.5038376663194422,1.0018071629765051,6.0074048226074907E-2,1,0,130889.57014297771,1.5707886867667498,11.00660491152251,1.4798163287436306,1.0566890905121162,0.32904257455630753,1.0379575046894187,0.27127295208207691,6.5970928266825215,0.29909536585753521,1.0539102020413365,0.55054542997224609,-2.4048848105582894,-139.92468151327307,40.075318486726928,null,47863,2290866769,null,15.723246648091003,-24.065082996771334,null,31.914729062288686,-114.26549162947983,null,0,0]
[48141.75,48.141750000000002,15.032407746212929,1.5042242220568012,1.0018282545326902,6.0423065835794036E-2,1,0,131651.85975447786,1.5707887310039836,11.070178823214542,1.4803402432847221,1.0573333581305102,0.33082245199575333,1.0383927157604695,0.27277581824429858,6.6003967383664675,0.30073631340669432,1.0545817699436133,0.55373040697035092,-2.4668655008319611,-140.18919341830596,39.810806581694038,null,48141.75,2317628093.0625,null,15.717538476235163,-24.137046904761085,null,31.859164271361369,-114.45012814581305,null,0,0]
[48420.5,48.420499999999997,15.119064204061065,1.50460634668348,1.0018494681197256,6.0772068707530026E-2,1,0,132414.14936597829,1.5707887747318823,11.133755738819076,1.4808581745642002,1.0579809712568811,0.33260015605790955,1.0388302701840653,0.27427742178378645,6.6037181687490145,0.30237562574343335,1.0552581588029128,0.55691475742222063,-2.5286138896964334,-140.45361329866037,39.546386701339628,null,48420.5,2344544820.25,null,15.711813153432608,-24.209229073860506,null,31.803851731319142,-114.63447572417472,null,0,0]
[48699.25,48.699249999999999,15.20572284442034,1.5049841158466901,1.0018708037298603,6.1121056757202585E-2,1,0,133176.43897747892,1.570788817959192,11.197335607168712,1.4813702242229154,1.0586319237514323,0.33437567950586472,1.0392701650004048,0.27577775752793304,6.6070570914145383,0.30401329670576921,1.0559393828296051,0.56009847111096411,-2.5901333228810208,-140.7179386136128,39.282061386387198,null,48699.25,2371616950.5625,null,15.706070615748544,-24.281623266334492,null,31.74878814127316,-114.81853811826345,null,0,0]
[48978,48.978000000000002,15.292383630187294,1.5053576034839313,1.0018922613552983,6.1470029900752995E-2,1,0,133938.72858897981,1.57078886069446,11.260918378249292,1.4818764916186278,1.0592862094578392,0.33614901517544515,1.0397123972388784,0.27727682033569218,6.6104134798618102,0.30564932017888008,1.0566254562666069,0.56328153773621192,-2.6514270862550058,-140.98216685555781,39.017833144442193,null,48978,2398844484,null,15.700310803929362,-24.354223379415508,null,31.693970255495586,-115.00231897903448,null,0,0]
[49263.25,49.263249999999999,15.381067388776275,1.5057354431976608,1.0019143456460182,6.1827125015416137E-2,1,0,134718.79356361911,1.5707889039255734,11.325986750953843,1.4823886795988801,1.059959196316463,0.33796142987560912,1.0401673583237452,0.27880951573094936,6.6138661875727722,0.30732178118589543,1.0573325630709012,0.56653814763087551,-2.7139198634520012,-141.25245339642183,38.747546603578172,null,49263.25,2426867800.5625,null,15.694398742486083,-24.428723359922046,null,31.638125140682337,-115.19009755970799,null,0,0]
[49548.5,49.548499999999997,15.469753318033755,1.5061089507598788,1.0019365576921289,6.2184204342646397E-2,1,0,135498.85853825865,1.5707889466589251,11.391058060933378,1.4828950159728462,1.0606356605537561,0.33977153863060527,1.0406247607831884,0.28034086734067554,6.6173371286892717,0.308992504169669,1.0580447783619173,0.56979405784282688,-2.7761830995199572,-141.52263307371584,38.477366926284162,null,49548.5,2455053852.25,null,15.688468480703735,-24.503426463326853,null,31.582530617346293,-115.37758874207022,null,0,0]
[49833.75,49.833750000000002,15.558441380840121,1.506478200149393,1.0019588974851337,6.2541267792437516E-2,1,0,136278.92351289841,1.5707889889030624,11.456132258136357,1.483395600195192,1.0613155955204554,0.3415793339994973,1.0410846013993411,0.28187086975865022,6.62082627454022,0.31066148273107852,1.0587621175032282,0.57304925706502596,-2.8382201297049177,-141.7927033023584,38.207296697641596,null,49833.75,2483402639.0625,null,15.682519969307695,-24.57832656545277,null,31.527183378984564,-115.56479612210596,null,0,0]
[50119,50.119,15.647131540916458,1.5068432636724263,1.0019813650164882,6.2898315274807451E-2,1,0,137058.98848753842,1.5707890306663388,11.521209293639858,1.4838905294852038,1.0619989945502546,0.34338480862083914,1.0415468769428811,0.28339951761344145,6.624333596364723,0.31232871052279743,1.0594845958907315,0.57630373390050338,-2.9000342294100765,-142.06266152987766,37.937338470122342,null,50119,2511914161,null,15.676553163500175,-24.653417674743835,null,31.472080174445548,-115.75172319481395,null,0,0]
[50410.75,50.41075,15.737844818778786,1.5072123895408442,1.002004476644853,6.3263482197380219E-2,1,0,137856.82882531686,1.5707890728923621,11.58777212764317,1.4843909861079072,1.0627015426136714,0.34522901638053194,1.0420222017814806,0.28496159203442389,6.627939611519742,0.31403211185443769,1.0602288697369271,0.57963161135507901,-2.9630296331994215,-142.33865281771583,37.661347182284175,null,50410.75,2541243715.5625,null,15.670431425283621,-24.730411363070143,null,31.415970438059176,-115.94262335880424,null,0,0]
[50702.5,50.702500000000001,15.828560216405384,1.5075772844482984,1.0020277218812161,6.3628632226214413E-2,1,0,138654.66916309553,1.5707891146324353,11.654337830730956,1.4848857259696504,1.0634077002508402,0.34707078109893119,1.0425000669117521,0.28652223820141831,6.631564579297117,0.31573366845243467,1.0609785523920836,0.5829587087234176,-3.0257985759264301,-142.61452164158899,37.385478358411007,null,50702.5,2570743506.25,null,15.664290468306488,-24.807592593873959,null,31.360109276381834,-116.13323737887859,null,0,0]
[50994.25,50.994250000000001,15.919277697558059,1.5079380206283495,1.0020511007162789,6.3993765265114896E-2,1,0,139452.50950087441,1.5707891558948992,11.720906354020656,1.4853748462306524,1.0641174602757266,0.34891009515729127,1.0429804688420188,0.28808145048055755,6.6352084686398483,0.31743337369380142,1.0617336604280729,0.58628501352255125,-3.0883443765296348,-142.89026537087875,37.109734629121249,null,50994.25,2600413533.0625,null,15.658130258209377,-24.884955364240756,null,31.304493382811458,-116.32356868400537,null,0,0]
[51286,51.286000000000001,{"$f":"SQRT(1+(A461/pole1)^2)","v":16.009997226819149},{"$f":"ATAN(A461/pole1)","v":1.5082946686817182},{"$f":"SQRT(1+(A461/Zero1)^2)","v":1.0020746131406908},{"$f":"ATAN(A461/Zero1)","v":6.4358881217913597E-2},{"$f":"IF(VIN_nom>Vout, 1, SQRT(1+(A461/z_RHP)^2))","v":1},{"$f":"IF(VIN_nom>Vout, 0, -ATAN(A461/z_RHP))","v":0},{"$f":"SQRT(1+(A461/Pole2)^2)","v":140250.34983865355},{"$f":"ATAN(A461/Pole2)","v":1.5707891966879046},11.787477649731905,1.4858584418671283,{"$f":"SQRT(1+(A461/pole4)^2)","v":1.0648308154848465},{"$f":"ATAN(A461/pole4)","v":0.35074695102345366},{"$f":"IF(VOUT_setting=1,1,SQRT(1+(A461*zterm1)^2))","v":1.0434634040685153},{"$f":"IF(VOUT_setting=1,0,ATAN(((A461*zterm1))))","v":0.28963922327620983},6.6388712483971908,{"$f":"IF(VOUT_setting=1,0,ATAN(A461*$Q$4/(1+Afbr-$Q$5*(A461)^2)))","v":0.31913122101226371},{"$f":"SQRT((1-(Z461/pterm2))^2+(A461/pterm1)^2)","v":1.0624942104483508},{"$f":"IF((ATAN((A461/pterm1)/(1-A461^2/pterm2))>0),ATAN((A461/pterm1)/(1-A461^2/pterm2)),PI()+ATAN((A461/pterm1)/(1-A461^2/pterm2)))","v":0.58961051317313784},{"$f":"20*LOG10(((E461*K461*G461*O461)/(C461*I461*S461*M461*Q461))*Adc)","v":-3.1506702942335485},{"$f":"((F461+L461+H461+P461)-(D461+J461+T461+N461+R461))*radconv","v":-143.16588140703112},{"$f":"IF(V461>0,V461,V461+180)","v":36.834118592968878},null,{"$f":"IF(U461<0,A461,1000000000)","v":51286},{"$f":"A461^2","v":2630253796},null,{"$f":"20*LOG10((K461/(I461*M461))*AEA)","v":15.651950764902205},{"$f":"(L461-(J461+N461))*radconv","v":-24.962493801340347},null,{"$f":"20*LOG10((E461*G461/(C461*S461))*Acs*Am)","v":31.249119506179891},{"$f":"(F461+H461-(D461+T461))*radconv","v":-116.51362060407467},null,{"$f":"SUM((U462<0)*(U461>0))*A461","v":0},0]
[51584.75,{"$f":"A462/1000","v":51.58475},16.102895489134006,1.5086557094891704,1.0020988281279277,6.4732739644273368E-2,1,0,141067.33287519714,1.5707892379814936,11.855649024395886,1.4863480124174759,1.065565004394992,0.35262532369205773,1.0439605479553593,0.2912328744309276,6.6426414528360098,0.32086787290420354,1.0632786652371333,0.59301495442042418,-3.2142670901491863,-143.44797533156981,36.552024668430192,null,51584.75,2660986432.5625,null,15.645602996262237,-25.042068667334568,null,31.192664493744747,-116.70794632389968,null,0,0]
[51883.5,51.883499999999998,16.195795826388867,1.5090126084267204,1.0021231831718609,6.510657995078864E-2,1,0,141884.31591174094,1.5707892787995379,11.923823208121711,1.4868319848660958,1.066302947735968,0.35450110308617416,1.0444603406859312,0.29282500444551907,{"$f":"IF(VOUT_setting=1,1,SQRT((1+Afbr-$Q$5*(A463)^2)^2+(A463*$Q$4)^2))","v":6.6464313986380628},0.32260256289558925,1.0640688616181799,0.59641852441539367,-3.2776400561561725,-143.72992994651366,36.270070053486336,null,51883.5,2691897572.25,null,15.639234957222198,-25.121815670001304,null,31.136456524098879,-116.90198585116963,null,0,0]
[52182.25,52.182250000000003,16.288698203081339,1.509365436271962,1.0021476782622787,6.5480402034291021E-2,1,0,142701.29894828502,1.5707893191502054,11.992000153001072,1.4873104544633311,1.0670446377183425,0.35637428139983984,1.0449627784595032,0.29441560743671169,6.6502410520580986,0.3243352841209291,1.0648648175155804,0.59982120934089067,-3.3407925058488463,-144.01174256086597,35.988257439134031,null,52182.25,2722987215.0625,null,15.632846628463415,-25.201728905117132,null,31.080492279282087,-117.09574245538836,null,0,0]
[52481,52.481000000000002,16.381602584513601,1.5097142622010029,1.0021723133889122,6.5854205791642598E-2,1,0,143518.28198482929,1.5707893590414774,12.060179812207048,1.4877835143158238,1.0677900665348319,0.35824485092173786,1.04546785746256,0.29600467756342014,6.6540703792528779,0.32606602977705756,1.0656665508838687,0.60322299527635381,-3.4037276929430984,-144.2934105153364,35.706589484663596,null,52481,2754255361,null,15.626437994753832,-25.281802596695812,null,31.024768497119965,-117.28921930837484,null,0,0]
[52786.5,52.786499999999997,16.476608098617394,1.5100669014315147,1.0021976499322984,6.6236436264909895E-2,1,0,144353.72405232498,1.5707893993671038,12.12990269165422,1.4882617629093655,1.0685561960250813,0.36015497854906192,1.0459870757238852,0.29762806011845555,6.6580065370117998,0.32783383009567985,1.0664923922192213,0.60670069734787013,-3.4678634941078084,-144.58129017768422,35.418709822315776,null,52786.5,2786414582.25,null,15.619863553433895,-25.363845532686749,null,30.968031015699239,-117.48678150638193,null,0,0]
[53092,53.091999999999999,16.571615638166953,1.5104154972385475,1.0022231328894804,6.6618647356502539E-2,1,0,145189.16611982093,1.5707894392286494,12.199628313761211,1.4887345448564633,1.0693262186413206,0.36206236215862214,1.0465090478095966,0.29924982754007962,6.6619631957255931,0.32959955037452132,1.0673243131158754,0.61017742957631527,-3.5317787998822419,-144.86901304287483,35.130986957125174,null,53092,2818760464,null,15.613267859520413,-25.446044437220554,null,30.911538259551538,-117.68405757586197,null,0,0]
[53397.5,53.397500000000001,16.666625168524316,1.5107601186862962,1.0022487622492906,6.7000838956232336E-2,1,0,146024.60818731715,1.5707894786340804,12.269356631769174,1.4892019531468859,1.0701001259793035,0.36396699381050934,1.0470337696011471,0.3008699737193275,6.6659403188953066,0.33136318354085498,1.0681623328647296,0.61365317674518949,-3.5954769040078411,-145.15657636485977,34.843423635140226,null,53397.5,2851293006.25,null,15.606650909092306,-25.528393527909071,null,30.855286913513638,-117.88105060837393,null,0,0]
[53703,53.703000000000003,16.76163665583616,1.5111008332768505,1.0022745380004974,6.7383010953945083E-2,1,0,146860.05025481354,1.5707895175911801,12.339087599974413,1.489664078677891,1.0708779096167402,0.36586886566757298,1.0475612369665661,0.30248849259348654,6.669937869920493,0.33312472259000464,1.0690064707851719,0.61712792352807677,-3.6589610404976418,-145.44397742880676,34.556022571193239,null,53703,2884012209,null,15.600012702114082,-25.610887148133347,null,30.799273718264971,-118.07776359967505,null,0,0]
[54015.75,54.015749999999997,16.858904909201915,1.5114456554171001,1.0023010770831793,6.7774232079594598E-2,1,0,147715.3186888874,1.5707895570163193,12.410476093399996,1.4901317916493115,1.0716781578597316,0.36781300507485759,1.0481040617241724,0.30414372951758462,6.6740514116452143,0.33492588926341577,1.0698769993233985,0.62068407917323232,-3.7237334269963167,-145.73802809403637,34.261971905963634,null,54015.75,2917701248.0625,null,15.593194944634901,-25.695482410660642,null,30.742174590762854,-118.27885784362678,null,0,0]
[54328.5,54.328499999999998,16.956175144132096,1.5117865214068653,1.0023277695638817,6.8165432428294884E-2,1,0,148570.5871229615,1.5707895959875453,{"$f":"SQRT(1+(A471/Zero2)^2)","v":12.481867270629593},{"$f":"ATAN(A471/Zero2)","v":1.4905941544669965},1.0724824506473689,0.36975423585145295,1.0486497551094964,0.3057972482730979,6.6781862843545117,0.33672484660875329,1.0707539809279281,0.62423915353208626,-3.788288242875137,-146.03190304742293,33.968096952577071,null,54328.5,2951585912.25,null,15.58635492155908,-25.780217536146932,null,30.685318312890391,-118.47966465414225,null,0,0]
[54641.25,54.641249999999999,17.05344732671908,1.5121234988634236,1.0023546154303502,6.8556611881973734E-2,1,0,149425.85555703586,1.5707896345126522,12.55326108587432,1.4910512582148974,1.0732907788870609,0.37169254992219908,1.0491983126465747,0.30744904250613719,6.6823424484586402,0.33852158733208654,1.0716374364112795,0.62779312980861723,-3.85262877207933,-146.32559947276252,33.674400527237481,null,54641.25,2985666201.5625,null,15.579492644644624,-25.865086843640178,null,30.628701561763791,-118.68018694983007,null,0,0]
[54954,54.954000000000001,17.150721423823843,1.5124566538736057,1.0023816146702607,6.8947770322597232E-2,1,0,150281.12399111039,1.5707896725992567,12.624657494379385,1.4915031919254378,1.0741031334680351,0.37362793932384891,1.0497497298453311,0.30909910591370121,6.6865198642626966,0.34031610421403524,1.0725273866118625,0.63134599108995781,-3.9167582386958069,-146.61911458476777,33.380885415232228,null,54954,3019942116,null,15.5726081293548,-25.950084776134229,null,30.572321070659175,-118.88042755491354,null,0,0]
[55274,55.274000000000001,17.25025242383969,1.512793642884263,1.002409398526686,6.9347974512500923E-2,1,0,151156.21879176245,1.5707897111226603,12.697711614007444,1.491960341689345,1.0749384775162998,0.3756051585266067,1.0503168848657334,0.31078562219564104,6.6908160735085884,0.34214991138935963,1.073444711211607,0.63498004103676775,-3.9821591627155719,-146.91924326382372,33.080756736176284,null,55274,3055215076,null,15.56554102323692,-26.037180546875149,null,30.514874786837581,-119.08502131666731,null,0,{"$f":"IF(AH474>0,W474,0)","v":0}]
[55594,55.594000000000001,17.349785360345447,1.5131267654285558,1.0024373429234879,6.9748156453950133E-2,1,0,152031.31359241469,1.5707897492025811,12.770768356918071,1.4924122611844839,1.0757780173886491,0.37757929938336549,1.0508870241119272,0.3124703132888883,6.6951344467584208,0.34398137537206491,1.0743688793470167,0.63861288750206169,-4.0473457679706346,-147.21917632225021,32.780823677749794,null,55594,3090692836,null,15.558450679836305,-26.124399588299038,null,30.457669099376634,-119.28932586654739,null,0,0]
[55914,55.914000000000001,17.449320200203228,1.5134560875974876,1.0024654478472406,7.0148316020636009E-2,1,0,152906.40839306716,1.5707897868466334,12.843827678346925,1.4928590394784089,1.0766217432694862,0.37955035372619894,1.051460142729451,0.31415317260736719,6.6994749411607817,0.34581048867089254,1.0752999134147534,0.64224451199634303,-4.1123213221094703,-147.5189108720399,32.481089127960104,null,55914,3126375396,null,15.551337126933891,-26.211736329659477,null,30.400700683772882,-119.49334393915613,null,0,0]
[56234,56.234000000000002,17.548856911026334,1.5137816739859347,1.0024937132844429,7.0548453086292609E-2,1,0,153781.50319371987,1.5707898240622582,12.916889534540877,1.4933007636318198,1.0774696453250947,0.3815183135086308,1.0520362358490818,0.31583419362081661,6.7038375137560182,0.34763724387598521,1.0762378358338034,0.64587489590677916,-4.1770890329075598,-147.81844405579398,32.181555944206025,null,56234,3162262756,null,15.544200395829526,-26.299185322143035,null,30.343966271892103,-119.6970781763052,null,0,0]
[56561.5,56.561500000000002,17.650728417734683,1.5141110890427951,1.0025228073792487,7.0957944934448347E-2,1,0,154677.10802876306,1.5707898617141052,12.991666357937724,1.4937476962840528,1.0783417339453434,0.38352918487544951,1.0526289059461813,0.31755270337055047,6.7083251496487399,0.3495043643660688,1.077204896637894,0.64958906285025386,-4.2431628154623162,-148.12478609750107,31.875213902498928,null,56561.5,3199203282.25,null,15.536872434387368,-26.388794567300234,null,30.286141089436537,-119.90529620463303,null,0,0]
[56889,56.889000000000003,17.752601817816842,1.5144367234345379,1.0025520695708885,7.1367412947009254E-2,1,0,155572.71286380652,1.5707898989324418,13.066445746701783,1.4941895134243683,1.0792181758948582,0.38553679825897719,1.0532246812427046,0.31926927397373805,6.7128358193893156,0.35136899948774136,1.0781792200484352,0.6533018905378023,-4.3090255100839041,-148.43091126252455,31.569088737475454,null,56889,3236358321,null,15.529520272626549,-26.478510216169852,null,30.228554257310275,-120.1132222487723,null,0,0]
[57216.5,57.216500000000003,17.854477078863383,1.5147586418074162,1.002581499844643,7.1776856988762308E-2,1,0,156468.31769885015,1.5707899357247126,13.141227657038838,1.4946263022103004,1.0800989605761646,0.38754114542657575,1.0538235564721126,0.32098389861170962,6.7173694765855503,0.35323114156205754,1.0791608301605875,0.65701335862401444,-4.3746803692972067,-148.73681658254478,31.263183417455224,null,57216.5,3273727872.25,null,15.522143954750099,-26.568326803724169,null,30.171202447696675,-120.32085885472142,null,0,0]
[57544,57.543999999999997,17.956354169199798,1.5150769073436974,1.0026110981857113,7.2186276924542436E-2,1,0,157363.92253389399,1.5707899720981917,13.216012046144435,1.4950581478343914,1.080984077373903,0.38954221827734575,1.0544255263524585,0.32269657052701428,6.7219260747343075,0.35509078299893598,1.0801497510872291,0.66072344663388982,-4.4401305856646376,-149.04249911964246,30.957500880357543,null,57544,3311311936,null,15.514743528298386,-26.658238985059469,null,30.114082389429122,-120.52820847717099,null,0,0]
[57879,57.878999999999998,18.060566183009165,1.5153987465067531,1.002641548220556,7.2605047808163903E-2,1,0,158280.03740332837,1.5707900088787752,13.292511575799335,1.4954948556034158,1.0818939350026828,0.39158572126439661,1.0550444780473791,0.32444643664304218,6.7266107088808402,0.35699041663166597,1.0811689080791156,0.66451704916619514,-4.5068712025543025,-149.35494849428341,30.645051505716594,null,57879,3349978641,null,15.507148736311231,-26.750303677071592,null,30.055890659145543,-120.74001211317487,null,0,0]
[58214,58.213999999999999,18.164780046075133,1.5157168928305955,1.0026721740770017,7.3023793183142463E-2,1,0,159196.15227276296,1.5707900452360415,13.369013611505649,1.4959265654736884,1.0828083029136339,0.39362578152247563,1.0556666565276136,0.32619424546774767,6.7313192479657022,0.35888741800132667,1.0821957656531358,0.66830916394254858,-4.573404267413598,-149.66715864117955,30.332841358820446,null,58214,3388869796,null,15.499528829697365,-26.842457449494329,null,29.997934668756912,-120.95152038447769,null,0,0]
[58549,58.548999999999999,18.268995726750955,1.5160314094477858,1.0027029757389383,7.3442512904970142E-2,1,0,160112.26714219776,1.5707900811772568,13.445518110486743,1.4963533625964767,1.0837271696904407,0.39566239080644416,1.0562920560912266,0.32793998996742252,6.7360516418696976,0.36078177927208804,1.0832303496633606,0.67209976863797372,-4.6397330111173121,-149.97912650995099,30.020873490049013,null,58549,3427985401,null,15.491883869407118,-26.93469495152414,null,29.940211093285175,-121.16273563746149,null,0,0]
[58884,58.884,18.373213194107336,1.5163423580613797,1.0027339531901642,7.3861206829192672E-2,1,0,161028.38201163273,1.5707901167095222,13.522025030932694,1.4967753302031743,1.0846505238993971,0.39769554101354498,1.0569206710202936,0.32968366317529368,6.740807840360822,0.36267349270480681,1.0842726859757095,0.67588884079248579,-4.7058606045976141,-150.2908490804287,29.7091509195713,null,58884,3467325456,null,15.484213919540199,-27.02701095050649,null,29.882716664581793,-121.37366012886521,null,0,0]
[59227,59.226999999999997,18.47992125642542,1.5166570984638532,1.002765852520749,7.4289872534433088E-2,1,0,161966.37425108431,1.5707901526738506,13.600361448531677,1.4972024557201615,1.0856005658551355,0.39977365177790852,1.0575676231206184,0.33146682305693681,6.745702231211661,0.36460762996169715,1.0853479731321292,0.67976678678119107,-4.7733622015428088,-150.60975849381825,29.390241506181752,null,59227,3507837529,null,15.476334984969014,-27.121607497931834,null,29.824083300257801,-121.58932262841587,null,0,0]
[59570,59.57,18.586631128372563,1.5169682249113154,1.0027979361021155,7.4718510888917428E-2,1,0,162904.36649053611,1.5707901882240187,13.678700318909659,1.4976246889582177,1.0865552878148781,0.40184811954672117,1.0582179338076481,0.33324779697165224,6.7506214702303478,0.36653897529633295,1.0864314421804089,0.68364307807988833,-4.8406594673363648,-150.92840443941958,29.07159556058042,null,59570,3548584900,null,15.468429998657932,-27.216275600292736,null,29.765683400987296,-121.80468482392571,null,0,0]
[59913,59.912999999999997,18.693342778958268,1.5172757992342054,1.0028302039165791,7.5147121737770203E-2,1,0,163842.35872998807,1.5707902233671398,13.757041600164909,1.4980421133446651,1.0875146774529902,0.40391893608343654,1.0588715968933102,0.33502657765941524,6.7555655031461974,0.36846752071569921,1.0875231209102709,0.68751769015287734,-4.9077556188755631,-151.24678376939519,28.753216230604806,null,59913,3589567569,null,15.460499038926315,-27.311010006043915,null,29.707513636139986,-122.01974886109954,null,0,0]
[60256,60.256,18.800056177895158,1.5175798818618309,1.0028626559463563,7.5575704926176254E-2,1,0,164780.35096944025,1.5707902581101649,13.835385251343478,1.4984548104239699,1.0884787224271397,0.40598609330573554,1.0595286061729419,0.33680315793358662,6.7605342755741518,0.3703932583322454,1.0886230371160275,0.69139059832431127,-4.9746538128889242,-151.56489336614018,28.435106633859817,null,60256,3630785536,null,15.452542187066047,-27.405805580347121,null,29.649570732331391,-122.23451679733012,null,0,0]
[60607,60.606999999999999,18.909260298192788,1.517887503609709,1.0028960555663997,7.60142554267942E-2,1,0,165740.22057890904,1.5707902932564077,13.915558571412127,1.4988723222669098,1.0894700589927102,0.40809766750405252,1.0602043969657871,0.33861888906696647,6.7656444926437231,0.37236099619447494,1.0897571642526629,0.69535204684951035,-5.0429106093455207,-151.89013996376232,28.109860036237677,null,60607,3673208449,null,15.444373035449805,-27.502870217384512,null,29.590507893744089,-122.45398941388422,null,0,0]
[60958,60.957999999999998,19.018466187345638,1.5181915925978848,1.0029296480571046,7.6452776633806535E-2,1,0,166700.09018837797,1.5707903279979021,13.995734289396086,1.4992850506790678,1.0904662443833268,0.41020539306760129,1.0608836786649605,0.34043230095455151,6.7707805011253326,0.37432577737532224,1.0908999764981173,0.69931165834048947,-5.1109666076916298,-152.21509758756252,27.784902412437475,null,60958,3715877764,null,15.436176951118036,-27.59998839109787,null,29.531675864717553,-122.67315604230936,null,0,0]
[61309,61.308999999999997,19.127673815056848,1.5184922092794959,1.0029634333990911,7.6891268381509156E-2,1,0,167659.95979784711,1.5707903623415995,14.075912364320125,1.4996930772595922,1.0914672653223785,0.4123092618328868,1.0615664445691138,0.34224338613330907,6.7759422423829134,0.37628759376390114,1.0920515036382399,0.70326940591274179,-5.1788250036814514,-152.53976299063424,27.460237009365756,null,61309,3758793481,null,15.427954030130568,-27.697154958864868,null,29.473071315717906,-122.89201861544049,null,0,0]
[61660,61.66,19.236883151717088,1.5187894127374333,1.0029974115728715,7.7329730504265573E-2,1,0,168619.82940731649,1.5707903962942935,14.156092756136134,1.5000964817652591,1.0924731085175883,0.41440926580283072,1.0622526879597993,0.3440521372203979,6.7811296576656019,0.37824643736395774,1.0932117754545432,0.70722526253785978,-5.2464889327890916,-152.86413295637206,27.13586704362794,null,61660,3801955600,null,15.419704371334069,-27.794364893149243,null,29.41469097476935,-123.1105789793546,null,0,0]
[62019,62.018999999999998,19.348583327724342,1.5190899194484875,1.003032363631956,7.7778155247684846E-2,1,0,169601.57638680245,1.5707904306232849,14.23810297717564,1.5005043806346943,1.0935068514156081,0.41655312702047442,1.0629581624833637,0.3458996912963464,6.7864618017197724,0.3802468435628486,1.0944075691577753,0.71126929673124495,-5.3154971002268514,-153.19558703365649,26.804412966343506,null,62019,3846356361,null,15.411239133094378,-27.893830176115191,null,29.355208607916982,-123.33380999212883,null,0,0]
[62378,62.378,19.460285230933245,1.5193869763732071,1.0030675173714731,7.8226548650066438E-2,1,0,170583.32336628859,1.5707904645571333,14.320115540037994,1.5009076074250827,1.0945456107183162,0.41869292886970438,1.0636672605476925,0.34774478830473704,6.7918206787861193,0.38224412336259705,1.0956125736927282,0.71531129515495318,-5.384308282685625,-153.52672534066048,26.473274659339523,null,62378,3891014884,null,15.402746141962654,-27.993330542174487,null,29.295954041299701,-123.55672850140415,null,0,0]
[62737,62.737000000000002,19.571988831771169,1.5196806425258143,1.0031028727702196,7.8674910534409961E-2,1,0,171565.07034577493,1.5707904981026226,14.402130404716853,1.501306241821512,1.0955893721571273,0.42082866332961055,1.0643799749106935,0.34958742060607845,6.7972062256491039,0.38423826857792759,1.0968268208945582,0.71935122843979038,-5.4529256478751078,-153.85754452999424,26.142455470005757,null,62737,3935931169,null,15.394225512049681,-28.09286096653231,null,29.236923953035358,-123.77933621585694,null,0,0]
[63096,63.095999999999997,19.683694101336336,1.5199709755832744,1.0031384298068728,7.9123240723790636E-2,1,0,172546.81732526145,1.5707905312663815,14.484147532110882,1.5017003617101035,1.0966381214491978,0.42296032255816757,1.0650962983127756,0.35142758064822222,6.8026183789792718,0.38622927114772715,1.0980503425833128,0.72338906707063244,-5.5213523032194836,-154.188041284707,25.811958715293002,null,63096,3981105216,null,15.385677360059148,-28.192416537707452,null,29.178115079016518,-124.00163475917888,null,0,0]
[63463.25,63.463250000000002,19.797968111243293,1.5202645905452614,1.0031750125814598,7.9581840785438659E-2,1,0,173551.12534257761,1.5707905648040248,14.568051755678187,1.5020989467283865,1.0977161177248405,0.42513674361100701,1.0658328099968186,0.35330746257527684,6.8081823707966613,0.38826276787497738,1.0993116112072923,0.7275174989222335,-5.5911572814762742,-154.52579595903762,25.474204040962377,null,63463.25,4027584100.5625,null,15.376904413488822,-28.294280960835621,null,29.118180301600628,-124.22872353064935,null,0,0]
[63830.5,63.830500000000001,19.912243808337973,1.5205548354392604,1.0032118063224,8.0040407304342559E-2,1,0,174555.43335989397,1.5707905979557493,14.651958267164847,1.5024929667016997,1.0987993034548211,0.42730888394633404,1.0665730830774336,0.35518474160122993,6.8137740715695729,0.39029295918862655,1.100582652785135,0.73164367580236711,-5.6607690750124009,-154.8632062818557,25.136793718144304,null,63830.5,4074332730.25,null,15.368102920287264,-28.396161652615611,null,29.058470292142115,-124.45549193295676,null,0,0]
[64197.75,64.197749999999999,20.026521163737993,1.5208417679078121,1.0032488110064821,8.0498940091345797E-2,1,0,175559.74137721051,1.5707906307281778,14.735867027488394,1.5028824994892804,1.0998876633071848,0.42947673574447381,1.0673171097280978,0.3570594099241457,6.8193934131505269,0.39231983685998173,1.1018635013153433,0.73576756565980372,-5.7301908231946594,-155.20026879716113,24.799731202838871,null,64197.75,4121351105.0625,null,15.35927301313887,-28.498053704386798,null,28.998981736074811,-124.68194144321308,null,0,0]
[64565,64.564999999999998,20.140800149216059,1.5211254442874111,1.0032860266103651,8.0957438957376393E-2,1,0,176564.04939452722,1.570790663127783,14.819777998450464,1.5032676211924985,1.1009811819375079,0.43164029137783139,1.0680648821044669,0.35893145983717234,6.8250403272801794,0.39434339279473418,1.1031541907684383,0.73988913629706121,-5.7994256050339379,-155.53698007970553,24.463019920294471,null,64565,4168639225,null,15.350414827125547,-28.599952319203723,null,28.939711376892788,-124.90807345531485,null,0,0]
[64941,64.941000000000003,20.257803575141132,1.5214125635793871,1.0033243473963793,8.1426826554177462E-2,1,0,177592.28578529961,1.5707906959196838,14.905690460985886,1.5036574263940645,1.1021060830234117,0.43385093661994584,1.0688343431509404,0.36084539202977911,6.8308502776562792,0.39641171172505485,1.1044858627004368,0.7441064698346006,-5.8701194081527506,-155.88134632480663,24.118653675193372,null,64941,4217333481,null,15.341316434279911,-28.70428064765229,null,28.879251573985218,-125.13926566347352,null,0,0]
[65317,65.316999999999993,20.374808651888408,1.5216963852522998,1.0033628892226318,8.1896178193539906E-2,1,0,178620.52217607218,1.570790728334049,14.991605162453533,1.5040427638201717,1.1032363590505201,0.43605706297124386,1.0696077138418769,0.36275656351031393,6.8366889849537147,0.39847653200589994,1.1058279220393719,0.74832130356256876,-5.940623573292811,-156.22533723089987,23.774662769100132,null,65317,4266310489,null,15.332188692815269,-28.808606025775433,null,28.819013762043987,-125.37012776364851,null,0,0]
[65693,65.692999999999998,20.491815351180069,1.5219769657474853,1.0034016520636511,8.2365493672831372E-2,1,0,179648.75856684492,1.5707907603773605,15.077522064579773,1.5044237097321567,1.1043719935157876,0.43825866286500659,1.0703849857029306,0.364664966316529,6.8425563755736469,0.40053784538548354,1.1071804051322829,0.75253360247369594,-6.0109412167898153,-156.56894921846489,23.431050781535106,null,65693,4315570249,null,15.323031754856318,-28.912923650950688,null,28.758994627442057,-125.60066099553136,null,0,0]
[66069,66.069000000000003,20.608823645380106,1.5222543602265457,1.0034406358938239,8.2834772789514385E-2,1,0,180676.99495761786,1.5707907920559541,15.163441129957441,1.5048003386680737,1.1055129699059023,0.44045572894105128,1.0711661502416661,0.36657059258989644,6.8484523758085265,0.40259564375772328,1.1085433482828435,0.75674333141592687,-6.0810753943350218,-156.91217873932476,23.087821260675241,null,66069,4365112761,null,15.313845774732197,-29.017228831117773,null,28.699190915116958,-125.83086651718912,null,0,0]
[66453.75,66.453749999999999,20.728556494796287,1.5225349681766351,1.003480755663664,8.331493477737284E-2,1,0,181729.15972184649,1.570790824100659,15.251361842880042,1.5051813394042266,1.1066860108779193,0.44269922277977131,1.0719695142115844,0.36851768292503173,6.8545151225282179,0.40469768276388385,1.1099488747022173,0.7610483289318315,-6.1526548893584678,-157.2629960591189,22.737003940881095,null,66453.75,4416100889.0625,null,15.304416124528119,-29.123943661415378,null,28.638215158841902,-126.06609110178458,null,0,0]
[66838.5,66.838499999999996,20.848290957648533,1.5228123530120108,1.0035211067730163,8.3795058261745881E-2,1,0,182781.32448607526,1.5707908557764387,15.33928474433484,1.5055579724954189,1.1078646102812397,0.44493795439441858,1.0727769360945159,0.37046184967986323,6.8606076694356206,0.40679602455366276,1.1113654304397018,0.76535056055682571,-6.2240485649343302,-157.61340548531624,22.386594514683765,null,66838.5,4467385082.25,null,15.29495639833125,-29.230635862857298,null,28.577458254367375,-126.30097474772111,null,0,0]
[67223.25,67.223249999999993,20.968027006297056,1.5230865699055451,1.0035616891939756,8.4275143025936625E-2,1,0,183833.48925030424,1.5707908870896281,15.427209796903126,1.5059303125120727,1.1090487503948288,0.44717191656276284,1.0735884067348631,0.37240308477023182,6.8667299372264035,0.40889066091212828,1.1127930542312821,0.76964998818363672,-6.2952595064797841,-157.96340331461579,22.036596685384211,null,67223.25,4518965340.5625,null,15.285466768029641,-29.337300749432714,null,28.516916896553077,-126.53551844520136,null,0,0]
[67608,67.608000000000004,21.087764613729469,1.5233576727789413,1.0036025028984812,8.4755188853354507E-2,1,0,184885.65401453344,1.5707909180464172,15.515136964013498,1.5062984323390154,1.1102384134901231,0.44940110228373081,1.074403916958848,0.37434138022472074,6.8728818464926462,0.410981583781727,1.1142317847515402,0.77394657356479268,-6.3662907385920908,-158.31298587578928,21.68701412421072,null,67608,4570841664,null,15.275947407510859,-29.4439337443713,null,28.45658783922914,-126.76972310470239,null,0,0]
[68001.75,68.001750000000001,21.210304687226589,1.5236319480918186,1.0036445107421181,8.5246423283420331E-2,1,0,185962.43082003127,1.5707909493646512,15.605123058982079,1.5066708680662229,1.1114616047379577,0.45167748027663274,1.0752426762830998,0.37632196413890801,6.8792082667444374,0.41311756408210537,1.1157157095503236,0.77834068106514687,-6.4388005493417042,-158.67031205669664,21.329687943303355,null,68001.75,4624238003.0625,null,15.266174773812837,-29.553023395159446,null,28.395064057024957,-127.00905607773116,null,0,0]
[68395.5,68.395499999999998,21.332846337979387,1.5239030724014406,1.0036867607561744,8.5737616475157971E-2,1,0,187039.20762552929,1.5707909803222897,15.695111293691163,1.5070390331086201,1.1126905427848002,0.45394884161615501,1.0760856468904785,0.37829945274966353,6.8855655628328263,0.41524963855806774,1.1172113485140167,0.78273173031250509,-6.5111283650885943,-159.02719563526577,20.97280436473423,null,68395.5,4677944420.25,null,15.256371377240281,-29.662070284436279,null,28.333755928386879,-127.24803564936458,null,0,0]
[68789.25,68.789249999999996,21.45538953896255,1.5241710996587947,1.0037292529100694,8.6228768196768904E-2,1,0,188115.98443102752,1.5707910109255248,15.785101631545841,1.5074030004066321,1.1139252086101818,0.45621517950873564,1.0769328188918217,0.38027383787796692,6.8919536493344857,0.41737779908109907,1.1187187428728738,0.78711967988763076,-6.5832772384271756,-159.38363277762159,20.616367222378415,null,68789.25,4731960915.5625,null,15.246537410057115,-29.771069844135614,null,28.272660157855498,-127.48666255090012,null,0,0]
[69183,69.183000000000007,21.577934263764348,1.5244360825910852,1.0037719871730517,8.6719878216573773E-2,1,0,189192.7612365259,1.5707910411804076,15.875094036780125,1.5077628412512587,1.1151655831894147,0.4584764873972425,1.0777841823798489,0.38224511146723278,6.8983724407295588,0.4195020376924663,1.1202379337746364,0.79150448823900643,-6.6552501609089001,-159.73961968294194,20.260380317058065,null,69183,4786287489,null,15.236673066314751,-29.880017614234749,null,28.211773509405557,-127.72493743593179,null,0,0]
[69586,69.585999999999999,21.703359368019367,1.5247041918569217,1.0038159760271401,8.7222481999679982E-2,1,0,190294.83375110602,1.5707910717914879,15.96720265363196,1.5081269352177153,1.1164409883637705,0.46078570283777637,1.0786598761382744,0.3842594640186171,6.9049737287803366,0.42167210972912084,1.1218050719433843,0.79598900850816301,-6.7287347356521483,-160.10349929604726,19.896500703952739,null,69586,4842211396,null,15.226545737723519,-29.991466619352693,null,28.149669740691298,-127.96844597461509,null,0,0]
[69989,69.989000000000004,21.828786014439597,1.5249692200682163,1.0038602184334866,8.7725041607941714E-2,1,0,191396.90626568632,1.5707911020500482,16.059313362885952,1.5084868525953889,1.1177223333278112,0.46308963602065129,1.0795399395734737,0.38627054043483977,6.9116069997462395,0.42383805709364808,1.1233846543546877,0.80047014975586706,-6.8020411465203967,-160.46689931714948,19.533100682850517,null,69989,4898460121,null,15.216387005254564,-30.102852254112545,null,28.087778360950836,-128.21158690924028,null,0,0]
[70392,70.391999999999996,21.95421417659341,1.5252312199951823,1.0039047143585689,8.8227556793357156E-2,1,0,192498.9787802668,1.570791131962143,16.151426128743534,1.5088426647483999,1.1190095976771022,0.46538828067456445,1.080424362007441,0.38827833247427934,6.918272161651295,0.4259998718006735,1.1249767248317584,0.80494786703896004,-6.8751724108450105,-160.82981577576186,19.170184224238142,null,70392,4955033664,null,15.20619708217405,-30.214170070679081,null,28.026096086130003,-128.45436070247405,null,0,0]
[70795,70.795000000000002,22.079643828649452,1.525490243210613,1.0039494637686783,8.8730027308058027E-2,1,0,193601.05129484742,1.5707911615336889,16.243540916217359,1.5091944414262979,1.1203027610069443,0.46768163078051556,1.0813131327443022,0.39028283202813152,6.9249691224323087,0.42815754604773298,1.1265813270907448,0.80942211529395847,-6.9481314846495392,-161.19224473571512,18.807755264284879,null,70795,5011932025,null,15.195976183314727,-30.325415728173155,null,27.964619692126696,-128.69676774147419,null,0,0]
[71207.25,71.207250000000002,22.207953964416554,1.5257521843165041,1.0039955025492133,8.9243984476169116E-2,1,0,194728.41951850979,1.5707911914376516,16.337772057022331,1.5095501879824047,1.1216316884842039,0.47002213557274869,1.0822267912931973,0.39232992554051244,6.9318526035659218,0.43036045302815057,1.1282357715559705,0.81399542383302637,-7.0225900322174386,-161.56248399486765,18.437516005132352,null,71207.25,5070472452.5625,null,15.18548886078117,-30.439135711957803,null,27.901941962910215,-128.9443595627221,null,0,0]
[71619.5,71.619500000000002,22.336265606434736,1.5260111159760104,1.0040418065127767,8.9757894375113612E-2,1,0,195855.78774217234,1.5707912209973527,16.432005241749714,1.5099018543586096,1.1229667456560686,0.47235708803655663,1.0831449773507378,0.39437355694716159,6.9387691649315446,0.43255901136176567,1.1299034218670223,0.8185650065160448,-7.096874460877352,-161.93220489525655,18.067795104743453,null,71619.5,5129352780.25,null,15.174969583589938,-30.552771328120436,null,27.839473035795159,-129.19156818789011,null,0,0]
[72031.75,72.031750000000002,22.4645787288941,1.5262670897221546,1.0040883756226813,9.0271756739999195E-2,1,0,196983.15596583503,1.5707912502187036,16.526240435435962,1.5102495102646407,1.1243079106864582,0.47468648253632184,1.0840676794127657,0.39641371799668013,6.9457187077270399,0.43475321328467326,1.1315843244454604,0.82313081475587369,-7.1709877443646004,-162.3014033321453,17.698596667854702,null,72031.75,5188573008.0625,null,15.164418586212662,-30.666318260029431,null,27.777209646285076,-129.43839380094207,null,0,0]
[72444,72.444000000000003,22.592893306570776,1.5265201559188191,1.0041352098420366,9.0785571306082946E-2,1,0,198110.52418949793,1.5707912791074803,16.620477603909748,1.5105932238331539,1.1256551617436963,0.47701031370448543,1.0849948859577707,0.39845040058122433,6.9527011330751236,0.43694305122924554,1.1332785255777287,0.82769279986207778,-7.2449327949534066,-162.67007523661491,17.329924763385094,null,72444,5248133136,null,15.153836104452763,-30.779772296763579,null,27.715148590258856,-129.68483651292806,null,0,0]
[72865.75,72.865750000000006,22.724166280124241,1.5267760963430625,1.0041833976267946,9.131117661373693E-2,1,0,199263.87179005553,1.5707913083237055,16.716888407814931,1.5109408478130517,1.1270397344720999,0.47938193343237734,1.085948108650806,0.40053040909635995,6.959878388047283,0.43917882871831554,1.1350255782253533,0.83235590540656113,-7.3204107362351429,-163.04669383733031,16.953306162669691,null,72865.75,5309417523.0625,null,15.142977423284234,-30.895740384974982,null,27.651863484510798,-129.93656212063635,null,0,0]
[73287.5,73.287499999999994,22.85544072513612,1.5270290967015274,1.0042318628015332,9.1836731334155958E-2,1,0,200417.21939061338,1.5707913372036677,16.813301208661997,1.5112844850618059,1.1284306307489522,0.48174771995336824,1.0869060213755175,0.40260676027260711,6.9670898489650526,0.44141002338330615,1.1367866469527914,0.83701490618983887,-7.3957185767520528,-163.42275285669675,16.577247143303254,null,73287.5,5371057656.25,null,15.132086293114105,-31.011602658651938,null,27.588783548838222,-130.18788698792562,null,0,0]
[73709.25,73.709249999999997,22.986716616396428,1.5272792073332124,1.0042806053260929,9.2362235184360361E-2,1,0,201570.56699117136,1.5707913657531387,16.909715972293526,1.5116242036914411,1.1298278272200752,0.48410766837731112,1.0878686117426115,0.40467944589170329,6.9743354097455779,0.44363662775210361,1.1385617808529245,0.84166974978947351,-7.4708592436820807,-163.79824805192109,16.201751948078908,null,73709.25,5433053535.5625,null,15.121162970185162,-31.127354935408814,null,27.525905540635552,-130.43881101163723,null,0,0]
[74131,74.131,{"$f":"SQRT(1+(A525/pole1)^2)","v":23.117993929267538},{"$f":"ATAN(A525/pole1)","v":1.5275264774351662},{"$f":"SQRT(1+(A525/Zero1)^2)","v":1.0043296251600924},{"$f":"ATAN(A525/Zero1)","v":9.2887687881537659E-2},{"$f":"IF(VIN_nom>Vout, 1, SQRT(1+(A525/z_RHP)^2))","v":1},{"$f":"IF(VIN_nom>Vout, 0, -ATAN(A525/z_RHP))","v":0},{"$f":"SQRT(1+(A525/Pole2)^2)","v":202723.9145917295},{"$f":"ATAN(A525/Pole2)","v":1.5707913939777596},17.006132665326017,1.5119600702729961,{"$f":"SQRT(1+(A525/pole4)^2)","v":1.1312313005411476},{"$f":"ATAN(A525/pole4)","v":0.48646177409827768},{"$f":"IF(VOUT_setting=1,1,SQRT(1+(A525*zterm1)^2))","v":1.0888358673462146},{"$f":"IF(VOUT_setting=1,0,ATAN(((A525*zterm1))))","v":0.40674845789035469},6.9816149642458223,{"$f":"IF(VOUT_setting=1,0,ATAN(A525*$Q$4/(1+Afbr-$Q$5*(A525)^2)))","v":0.44585863456288449},{"$f":"SQRT((1-(Z525/pterm2))^2+(A525/pterm1)^2)","v":1.1403510288513727},{"$f":"IF((ATAN((A525/pterm1)/(1-A525^2/pterm2))>0),ATAN((A525/pterm1)/(1-A525^2/pterm2)),PI()+ATAN((A525/pterm1)/(1-A525^2/pterm2)))","v":0.84632038370233631},{"$f":"20*LOG10(((E525*K525*G525*O525)/(C525*I525*S525*M525*Q525))*Adc)","v":-7.5458356025504214},{"$f":"((F525+L525+H525+P525)-(D525+J525+T525+N525+R525))*radconv","v":-164.17317521788706},{"$f":"IF(V525>0,V525,V525+180)","v":15.826824782112936},null,{"$f":"IF(U525<0,A525,1000000000)","v":74131},{"$f":"A525^2","v":5495405161},null,{"$f":"20*LOG10((K525/(I525*M525))*AEA)","v":15.110207711826277},{"$f":"(L525-(J525+N525))*radconv","v":-31.242993137429007},null,{"$f":"20*LOG10((E525*G525/(C525*S525))*Acs*Am)","v":27.463226278149051},{"$f":"(F525+H525-(D525+T525))*radconv","v":-130.68933401855062},null,{"$f":"SUM((U526<0)*(U525>0))*A525","v":0},0]
[74562.75,{"$f":"A526/1000","v":74.562749999999994},23.252385370374842,1.5277767183348188,1.0043800944979091,9.3425546163466183E-2,1,0,203904.60890480844,1.5707914225408663,17.104837432949076,1.5122999782926136,1.1326745287347297,0.48886564072200511,1.0898308767886222,0.40886271410635566,6.989102223715606,0.44812855704562815,1.1421973721728913,0.85107687205278104,-7.6224224358750536,-164.55639943773724,15.443600562262759,null,74562.75,5559603687.5625,null,15.098959885788519,-31.361250891214809,null,27.399263455575426,-130.94538146450779,null,0,0]
[74994.5,74.994500000000002,23.386778250823678,1.5280240832149061,1.0044308543651332,9.3963350238605567E-2,1,0,205085.30321788756,1.5707914507750926,17.203544154144165,1.5126359858513636,1.1341242854924245,0.49126337542227366,1.0908307489614455,0.41097310382232771,{"$f":"IF(VOUT_setting=1,1,SQRT((1+Afbr-$Q$5*(A527)^2)^2+(A527*$Q$4)^2))","v":6.9966248827686428},0.45039364663157672,1.1440586100436347,0.85582883714748659,-7.6988429620686887,-164.93901957347236,15.060980426527635,null,74994.5,5624175030.25,null,15.087679140807769,-31.479380772768387,null,27.335502357382392,-131.20100806903835,null,0,0]
[75426.25,75.426249999999996,23.521172545942154,1.5282686213435357,1.0044819047177205,9.4501099804095615E-2,1,0,206265.99753096685,1.5707914786860857,17.3022527954768,1.5129681596286253,1.1355805458098502,0.49365497416740622,1.0918354705052298,0.41307961888837158,7.0041828273711397,0.4526538962067525,1.1459347943769655,0.86057622245116716,-7.7751000632005427,-165.32103123429886,14.678968765701143,null,75426.25,5689119189.0625,null,15.076365755938122,-31.597378730968181,null,27.271939760210024,-131.45621343311623,null,0,0]
[75858,75.858000000000004,23.655568231618794,1.5285103808705462,1.0045332455113833,9.5038794557263648E-2,1,0,207446.69184404626,1.5707915062793651,17.400963324270482,1.5132965647941963,1.1370432846988399,0.49604043322710029,1.0928450280449753,0.4151822513220324,7.0117759434472626,0.45490929888261322,1.1478259768818748,0.86531897137684743,-7.851196559322223,-165.70243006945424,14.297569930545762,null,75858,5754436164,null,15.065020011063186,-31.71524081844553,null,27.208572502215617,-131.71099709067099,null,0,0]
[76299.75,76.299750000000003,23.79307814459947,1.5287549131218265,1.0045860760006324,9.5588886108500498E-2,1,0,208654.73286964651,1.5707915341885357,17.50196206232555,1.5136287422134356,1.1385465822360807,0.49847478500373305,1.0938829598451156,0.41732955726945042,7.0195812117022989,0.457211916642704,1.1497765390871095,0.87016671196275974,-7.9288922181745018,-166.09202391629958,13.907976083700419,null,76299.75,5821651850.0625,null,15.053378280883944,-31.835688136140114,null,27.143936503708559,-131.97124490843694,null,0,0]
[76741.5,76.741500000000002,23.930589463960924,1.5289966350970576,1.0046392104463209,9.6138919638488807E-2,1,0,209862.77389524697,1.570791561776397,17.602962709418268,1.5139571077949761,1.140056609061463,0.50090270244553514,1.09492592587909,0.41947278227309154,7.0274230578328511,0.45950944650669023,1.1517429111126862,0.8750094789374816,-8.006425525846101,-166.48096713308419,13.519032866915808,null,76741.5,5889257822.25,null,15.041703269408423,-31.955985177407424,null,27.079498493046614,-132.231050066688,null,0,0]
[77183.25,77.183250000000001,24.068102165597406,1.5292355949371441,1.0046926488002237,9.6688894823649812E-2,1,0,211070.81492084751,1.5707915890484661,17.703965232875607,1.5142817267079005,1.1415733384713003,0.50332418251849698,1.0959739117746539,0.42161191832237838,7.0353013595537313,0.46180188181956455,1.1537251476471755,0.87984721158398727,-8.0837993099683345,-166.86925518802425,13.130744811975745,null,77183.25,5957254080.5625,null,15.029995278579788,-32.076128034814211,null,27.015255275440133,-132.49041186340523,null,0,0]
[77625,77.625,24.205616225950685,1.5294718396902984,1.0047463910138497,9.7238811340614614E-2,1,0,212278.85594644822,1.5707916160101341,17.804969600765329,1.5146026626457227,1.1430967437854183,0.50573922250664161,1.09702690314544,0.42374695758695391,7.043215994559703,0.46408921616696247,1.1557233031331706,0.88467984917029796,-8.1610163359144714,-167.2568835920811,12.743116407918905,null,77625,6025640625,null,15.018254610897184,-32.196112903685808,null,26.951203718178412,-132.7493295330942,null,0,0]
[78077,78.076999999999998,24.346322430672998,1.5297108037158136,1.0048016946835774,9.78014266005761E-2,1,0,213514.9273523828,1.570791643281606,17.908319466665695,1.5149272980958988,1.1446623791820163,0.50820363060966678,1.0981094932699984,0.42592728807422281,7.051351754229441,0.46642433760382834,1.1577843559752341,0.8896192821473532,-8.2398656058817501,-167.65281877832336,12.347181221676635,null,78077,6096017929,null,15.006208015583379,-32.318714408491914,null,26.885861140558536,-133.01379434640143,null,0,0]
[78529,78.528999999999996,24.48703000968554,1.5299470214804785,1.0048573163740766,9.8363979753902181E-2,1,0,214750.99875831755,1.5707916702391378,{"$f":"SQRT(1+(A535/Zero2)^2)","v":18.011671198232357},{"$f":"ATAN(A535/Zero2)","v":1.5152482080356695},1.1462349474493265,0.51066129155309103,1.0991972933353291,0.42810331344228753,7.0595252937389557,0.468754105789352,1.1598621895873138,0.89455325223415527,-8.3185564224262194,-168.04805397401984,11.951946025980163,null,78529,6166803841,null,14.994127851592046,-32.441142767564287,null,26.820712778705374,-133.27779236844461,null,0,0]
[78981,78.980999999999995,24.627738939432806,1.530180540029433,1.0049132560325404,9.8926470454877388E-2,1,0,215987.07016425242,1.570791696888119,18.115024763532716,1.5155654561650109,1.1478144200921176,0.51311220344088926,1.1002902878890357,0.43027502588317862,7.0677364820470521,0.47107851462364153,1.1619568614557971,0.89948169439303127,-8.3970915541911122,-168.4425845078828,11.557415492117201,null,78981,6237998361,null,14.982014444255988,-32.563394222837729,null,26.755755470435041,-133.54132258813553,null,0,0]
[79433,79.433000000000007,24.768449196894313,1.5304114053399511,1.0049695136058716,9.948889835802105E-2,1,0,217223.14157018746,1.5707917232338175,18.218380131358263,1.5158791047413711,1.1494007686470229,0.51555636471176436,1.1013884614664182,0.43244241778257553,7.0759851881186275,0.47339755826315488,1.1640684287742069,0.90440454361670997,-8.4754737073063229,-168.83640575458355,11.163594245416448,null,79433,6309601489,null,14.969868119174492,-32.685465118069317,null,26.690986116239564,-133.80438393493034,null,0,0]
[79895.5,79.895499999999998,24.912429516957864,1.5306449341369155,1.0050274070703509,0.10006432614801916,1,0,218487.92702426939,1.5707917498829655,18.32413828752928,1.5161963769227009,1.151031055922674,0.5180503151195982,1.1025174904542527,0.43465567838987806,7.0844642108871403,0.47576491406968352,1.1662465960681934,0.90943589396594815,-8.5555210929693395,-169.23863653316488,10.761363466835121,null,79895.5,6383290920.25,null,14.957405900074576,-32.810181120832233,null,26.624903549518756,-134.07306970617975,null,0,{"$f":"IF(AH538>0,W538,0)","v":0}]
[80358,80.358000000000004,25.056411180024238,1.5308757790931571,1.0050856332782314,0.10063968745761837,1,0,219752.71247835146,1.5707917762253554,18.429898267068552,1.5165100078021883,1.1526684820909987,0.52053719538347698,1.1036519090836454,0.4368643998779515,7.092982237221797,0.47812664095345675,1.16844257308622,0.91446125095504971,-8.6354138478179667,-169.64011503690423,10.359884963095766,null,80358,6457408164,null,14.944909906341815,-32.93470064783731,null,26.559011400449677,-134.34126211948765,null,0,0]
[80820.5,80.820499999999996,25.200394163073817,1.5311039861864006,1.005144192171687,0.10121498191746928,1,0,221017.49793243367,1.5707918022662537,18.535660038764988,1.5168200596478092,1.154313016771825,0.52301700489592362,1.1047917007520742,0.43906857471230476,7.1015391268067356,0.48048273347505716,1.1706564201121625,0.91948054511654675,-8.7151546764500978,-170.04083645894309,9.9591635410569097,null,80820.5,6531953220.25,null,14.932380487156871,-33.05902009688819,null,26.493306544059671,-134.6089598501531,null,0,0]
[81283,81.283000000000001,25.344378443609884,1.5313296003506665,1.0052030836925756,0.10179020915848527,1,0,222282.28338651606,1.5707918280108066,18.641423572115272,1.5171265933172011,1.1559646296263475,0.5254897434007576,1.1059368488469852,0.4412681955661476,7.1101347393629544,0.48283318646754358,1.1728881970844978,0.92449370706848666,-8.7947462206900084,-170.44079604214656,9.5592039578534411,null,81283,6606926089,null,14.919817991659976,-33.183135966715902,null,26.427785918676129,-134.87616151855974,null,0,0]
[81756.25,81.756249999999994,25.491710705940829,1.5315578202974163,1.0052636882967192,0.10237873658087908,1,0,223576.46655655833,1.5707918540522354,18.749647185448946,1.5174366720819206,1.1576619265824215,0.52801263701792733,1.1071141411829946,0.44351422133166568,7.1189700790488581,0.48523242883041906,1.1751904698632569,0.92961697122583731,-8.876035892456164,-170.8492584668119,9.1507415331880964,null,81756.25,6684084414.0625,null,14.906929628660805,-33.309922410814004,null,26.36092995668918,-135.14905883473702,null,0,0]
[82229.5,82.229500000000002,25.63904428073155,1.5317834173451972,1.0053246410464944,0.10296719284233491,1,0,224870.64972660074,1.5707918797939153,18.857872580847641,1.5177431917896425,1.1593665704455247,0.53052812766771196,1.1082970066203892,0.44575546409765976,7.1278456657054035,0.48762575637415329,1.1775116416156675,0.93473366814842396,-8.9571746604263343,-171.25691330731806,8.7430866926819419,null,82229.5,6761690670.25,null,14.89400737303701,-33.436488597895476,null,26.294260601165533,-135.42143367225901,null,0,0]
[82702.75,82.702749999999995,25.786379145485359,1.5320064364299857,1.0053859418785807,0.10355557754829046,1,0,226164.83289664332,1.570791905240992,18.966099727804597,1.5180462133099135,1.1610785288564514,0.53303621619187935,1.1094854273340711,0.44799191668194294,7.1367613492110618,0.49001316443460302,1.179851775396493,0.93984372386690984,-9.0381651596098962,-171.6637556280125,8.3362443719875046,null,82702.75,6839744857.5625,null,14.881051598221873,-33.562831088916759,null,26.227774769511587,-135.69328439024355,null,0,0]
[83176,83.176000000000002,25.933715278216599,1.5322269214676261,1.0054475907293117,0.1041438903044776,1,0,227459.01606668599,1.5707919303984939,19.074328596504966,1.5183457961333739,1.162797769508118,0.53553690379975361,1.1106793854916968,0.45022357212466779,7.1457169795170676,0.49239464863655408,1.1822109338565727,0.94494706456353317,-9.1190099619882385,-172.06978054733466,7.9302194526653409,null,83176,6918246976,null,14.868062677282543,-33.688946544892509,null,26.161469443075678,-135.9646092980268,null,0,0]
[83660.5,83.660499999999999,26.084555145787728,1.5324500675216004,1.0055110655433024,0.10474611336141046,1,0,228783.96428831469,1.5707919558591839,19.185132012429765,1.5186489990023424,1.1645653898781625,0.53808937196745088,1.1119074440076084,0.45250330142673301,7.1549267271025538,0.49482660395186362,1.184645947154906,0.95016468754402306,-9.2016282776876714,-172.48460558680466,7.5153944131953381,null,83660.5,6999079260.25,null,14.854731038103029,-33.81782141245224,null,26.093771826785989,-136.24183756183612,null,0,0]
[84145,84.144999999999996,26.235396297281845,1.5326706476173826,1.0055749049825005,0.1053482601718224,1,0,230108.91250994348,1.5707919810266728,19.295937171825869,1.5189487196689568,1.1663405744747428,0.54063408689681569,1.1131412685225439,0.454777988748294,7.1641780252706448,0.49725234205623886,1.187101031952428,0.95537511642357098,-9.2840991462871951,-172.89856371980289,7.101436280197106,null,84145,7080381025,null,14.841365448015731,-33.946451550876802,null,26.026257196414551,-136.51851098405248,null,0,0]
[84629.5,84.629499999999993,26.386238710679699,1.5328887057398195,1.005639108977465,0.10595033031362222,1,0,231433.86073157244,1.5707920059059963,19.406744044829605,1.5192450177259935,1.1681232888120345,0.54317105105357411,1.1143808398844395,0.45704762733632304,7.1734707133042095,0.49967185917961521,1.1895762541200614,0.96057827258247397,-9.3664251311232967,-173.31164988414307,6.6883501158569345,null,84629.5,7162152270.25,null,14.827966305662827,-34.074833687315838,null,25.958922512810751,-136.79462760442885,null,0,0]
[85114,85.114000000000004,26.53708236446251,1.5331042848746463,1.0057036774583767,0.10655232336504848,1,0,232758.80895320154,1.5707920305020753,19.517552602254998,1.5195379514153418,1.1699134984685782,0.54570026728753573,1.1156261389373434,0.45931221067579303,7.1828046306006952,0.50208515185814651,1.19207167905902,0.96577407763129941,-9.4486087321393271,-173.72385907687735,6.2761409231226537,null,85114,7244392996,null,14.814534008973023,-34.202964648318876,null,25.891764801546397,-137.07018541864792,null,0,0]
[85609.5,85.609499999999997,26.69135200619386,1.5333222382084968,1.0057700888099139,0.10716790378257558,1,0,234113.83855860357,1.5707920553686274,19.630878649536257,1.5198341153276769,1.1717520694268413,0.5482788959738818,1.1169056152954395,0.46162297345062342,7.1923929402001985,0.50454679417636039,1.1946447233293489,0.97108016250734552,-9.5325134855143752,-174.14451477701616,5.8554852229838446,null,85609.5,7328986490.25,null,14.80076286975687,-34.333741671654934,null,25.823262365357461,-137.35141933439016,null,0,0]
[86105,86.105000000000004,26.845622901289456,1.5335376865738493,1.0058368812368019,0.10778340267828797,1,0,235468.86816400575,1.5707920799489854,19.744206398935681,1.5201268794235925,1.1735984073042751,0.55084942816611804,1.1181910418435457,0.46392843579605691,7.2020240330717584,0.50700191984390142,1.1972390349771089,0.97637839365276213,-9.6162744081843829,-174.56424283771548,5.4357571622845171,null,86105,7414071025,null,14.78695789292053,-34.464249578783523,null,25.754938937561512,-137.63206441124638,null,0,0]
[86600.5,86.600499999999997,26.999895028265037,1.5337506728892314,1.0059040546631302,0.10839881960212165,1,0,236823.89776940807,1.5707921042480615,19.857535821311103,1.5204163018619916,1.1754524755012967,0.55341186812664878,1.1194823980850497,0.46622859150496537,7.2116977378506473,0.50945052613069564,1.1998546823958252,0.98166868806758756,-9.6998939774284505,-174.98303809972504,5.0169619002749641,null,86600.5,7499646600.25,null,14.773119501344345,-34.59448528194428,null,25.686791538127686,-137.91211837850634,null,0,0]
[87096,87.096000000000004,27.154168366124402,1.5339612390987287,1.0059716090125754,0.10901415410438096,1,0,238178.9273748105,1.5707921282706567,19.970866888181426,1.52070243948388,1.1773142374961205,0.55596622051615707,1.1207796635234699,0.46852343462336793,7.2214138833342645,0.51189261062899016,1.2024917334389427,0.98695096307321351,-9.7833746070613152,-175.40089546864107,4.5991045313589325,null,87096,7585713216,null,14.759248116829696,-34.724445791699978,null,25.618817252254821,-138.19157892801951,null,0,0]
[87603.25,87.603250000000003,27.312101285433382,1.5341743344804235,1.0060411598063213,0.10964399444701148,1,0,239566.08936742498,1.5707921525814148,20.086887096720108,1.5209920178254395,1.1792280798203498,0.55857277309621889,1.1221137912145269,0.47086718731624061,7.2314042155606302,0.51438584752285488,1.2052135592230582,0.99235010600929241,-9.8686933821512266,-175.8276848967902,4.1723151032097974,null,87603.25,7674329410.5625,null,14.745014057731057,-34.857200029862234,null,25.549407407388923,-138.47704930417595,null,0,0]
[88110.5,88.110500000000002,27.470035430714177,1.5343849795626325,1.0061111096401756,0.11027374746018716,1,0,240953.25136003958,1.5707921766122601,20.202908970310844,1.5212782701923453,1.1811499079622452,0.56117086112896597,1.1234540682154635,0.47320536064916202,7.2414386626534073,0.51687224556752076,1.2079579579189297,0.99774067044985004,-9.9538714715362389,-176.2534808271582,3.7465191728418006,null,88110.5,7763460210.25,null,14.730746313203431,-34.989659833460109,null,25.480173005621097,-138.76189278053383,null,0,0]
[88617.75,88.617750000000001,27.627970780942132,1.5345932163479259,1.0061814584309143,0.11090341266266775,1,0,242340.41335265434,1.570792200367999,20.318932480431116,1.5215612535124072,1.1830796830046417,0.56376049087552182,1.1248004725443044,0.47553794904662205,7.2515170415260304,0.51935180320833763,1.2107250005238714,1.0031225688528185,-10.038911267178484,-176.67827800576339,3.3217219942366114,null,88617.75,7853105615.0625,null,14.716445331821186,-35.121822299781748,null,25.411111123714253,-139.04610677544517,null,0,0]
[89125,89.125,27.785907315570455,1.5347990858847411,1.0062522060948624,0.11153298957362567,1,0,243727.5753452692,1.5707922238533292,20.434957599205749,1.5218410234226625,1.1850173661234755,0.56634166901009064,1.1261529822239453,0.47786494720281097,7.2616391693090696,0.52182451923030082,1.2135147574158851,1.0084957141043587,-10.123815097296653,-177.10207125009342,2.8979287499065833,null,89125,7943265625,null,14.702111560687785,-35.253684623732596,null,25.342218904410338,-139.32968867710628,null,0,0]
[89644,89.644000000000005,27.947503516007931,1.5350073159130606,1.006325005318002,0.11217705819578525,1,0,245146.86972509607,1.5707922476075868,20.553671974350902,1.5221240047451186,1.1870080785464867,0.56897389771282358,1.1275431178109447,0.4802400569902126,7.2720408575364592,0.52434743145426277,1.2163927189363946,1.0139841735087816,-10.210547286626815,-177.53463687527145,2.4653631247285546,null,89644,8036046736,null,14.687412287209199,-35.388287944827148,null,25.271903548361916,-139.61918252536344,null,0,0]
[90163,90.162999999999997,28.109100914309014,1.5352131517483611,1.0063982219288037,0.11282103337160525,1,0,246566.16410492311,1.5707922710883742,20.672387976497998,1.5224037359174711,1.1890069877342284,0.57159729415404992,1.128939598348442,0.48260930416845421,7.282487958382144,0.52686317992788001,1.2192946062928454,1.0194632864939375,-10.297141871261372,-177.96614077000496,2.0338592299950449,null,90163,8129366569,null,14.672679629256809,-35.522571418828448,null,25.201759960254385,-139.9080090401678,null,0,0]
[90682,90.682000000000002,28.270699489932483,1.5354166344294993,1.006471855836178,0.11346491458741954,1,0,247985.45848475024,1.5707922943003862,20.791105577776786,1.5226802725708168,1.1910140524161852,0.57421186678538116,1.1303424003198466,0.48497268391701531,7.292980276739673,0.52937176442986489,1.2222204928161002,1.0249329612636238,-10.383601146904201,-178.39657761614339,1.6034223838566106,null,90682,8223225124,null,14.657914060532246,-35.656532342820164,null,25.131785285418854,-140.19616534276858,null,0,0]
[91201,91.200999999999993,28.432299222803945,1.5356178040631159,1.0065459069485427,0.11410870133002347,1,0,249404.75286457757,1.5707923172482119,20.909824750949578,1.5229536690748109,1.1930292314317459,0.57681762448422491,1.1317515002189737,0.48733019170140263,7.3035176177817931,0.53187318509499026,1.2251704511328219,1.030393106571649,-10.469927345432431,-178.82594217428914,1.1740578257108609,null,91201,8317622401,null,14.643116052853669,-35.790168110551406,null,25.06197673574318,-140.48364853248987,null,0,0]
[91732,91.731999999999999,28.59763654291681,1.5358212720087663,1.0066221019153723,0.11476727500549261,1,0,250856.86329942988,1.5707923404578801,21.031290475171829,1.5232301924073888,1.1950993592961028,0.57947451760510205,1.1331996739960017,0.48973612671893052,7.3143449900796362,0.53442502837729366,1.2282136046653946,1.0359695409382474,-10.558114059591574,-179.26411909131059,0.73588090868940981,null,91732,8414759824,null,14.627942812063974,-35.926554583073276,null,24.990723207265031,-140.77707904921209,null,0,0]
[92263,92.263000000000005,28.762975033338087,1.5360224007691035,1.0066987334074213,0.1154257487031889,1,0,252308.97373428234,1.5707923634003917,21.152757789085737,1.5235035399528825,1.1971778942533788,0.58212220359012545,1.1346543905595587,0.49213590640052102,7.325219079445902,0.5369693741263214,1.2312821075304652,1.0415358086902415,-10.646165999759127,-179.7011627187014,0.29883728129860287,null,92263,8512461169,null,14.61273660780863,-36.062595469458536,null,24.919637877772548,-141.06979876468327,null,0,0]
[92794,92.793999999999997,28.928314674001243,1.5362212304365206,1.0067758013250103,0.11608412187499544,1,0,253761.08416913496,1.5707923860803332,21.2742266654618,1.5237737660682065,1.1992647925907018,0.5847606932866718,1.1361156247769038,0.49452952680336787,7.3361396781968571,0.53950622361680056,1.2343760351839306,1.0470918140206087,-10.734085358027336,-180.13706770194594,-0.13706770194593787,null,92794,8610726436,null,14.597497938881743,-36.198288277057081,null,24.848717968731385,-141.361804518095,null,0,0]
[93325,93.325000000000003,29.093655445295749,1.5364178001927586,1.0068533055679232,0.11674239397331121,1,0,255213.19460398768,1.5707924085021863,21.395697077688517,1.5240409238777139,1.2013600107236591,0.58738999797906399,1.1375833515321141,0.49691698428718889,7.3471065789979955,0.54203557849548445,1.2374954622859222,1.0526374618105538,-10.821874262664382,-180.57182877338664,-0.57182877338664184,null,93325,8709555625,null,14.582227301758133,-36.333630608868582,null,24.777960768683744,-141.65309313586539,null,0,0]
[93868.5,93.868499999999997,29.262889570169794,1.5366166969264123,1.0069330860466903,0.11741605687766957,1,0,256699.4884294915,1.5707924311891588,21.52002852625996,1.5243112474019878,1.2035131218435462,0.59007169814152138,1.1390923266921016,0.49935425796061367,7.358379379832475,0.54461671640234954,1.2407148062300808,1.0583028321898826,-10.91159682074033,-181.01563430562189,-1.0156343056218873,null,93868.5,8811295292.25,null,14.56656459616662,-36.471793613078574,null,24.705703647915847,-141.95049285048222,null,0,0]
[94412,94.412000000000006,29.432124839368328,1.5368133063478804,1.0070133234210237,0.11808961273467765,1,0,258185.78225499546,1.570792453614928,21.644361529336674,1.5245784652743599,1.2056748570980445,0.59274380106327618,1.1406080504784804,0.50178506838520542,7.3697002499520909,0.54719000735570678,1.2439610199902369,1.0639571522982672,-11.00118702420389,-181.45823054795051,-1.4582305479505067,null,94412,8913625744,null,14.550869444374106,-36.609584661681708,null,24.633611447974427,-142.24713451123733,null,0,0]
[94955.5,94.955500000000001,29.601361233264541,1.5370076676727769,1.0070940175817178,0.11876306095884065,1,0,259672.07608049954,1.5707924757839788,21.76869606028275,1.5248426306712537,1.2078451701821404,0.59540632021824458,1.1421304960229024,0.50420941262384478,7.3810689682374235,0.54975545430217043,1.2472341809999696,1.0696003225150628,-11.090646956851645,-181.89961213554943,-1.8996121355494324,null,94955.5,9016546980.25,null,14.53514237083364,-36.747001480148775,null,24.56168147066737,-142.54301469072377,null,0,0]
[95499,95.498999999999995,29.77059873267779,1.5371998192256846,1.0071751684189802,0.11943640096524137,1,0,261158.36990600373,1.5707924977006946,21.893032093067042,1.5251037955628093,1.2100240149399517,0.59805926952737931,1.1436596364812519,0.50662728805905299,7.3924853139976587,0.5523130605763894,1.2505343657973986,1.0752322440647701,-11.17997863865045,-182.33977379957471,-2.339773799574715,null,95499,9120059001,null,14.519383897214569,-36.884041888673138,null,24.489911085442202,-142.8381299588724,null,0,0]
[96611.5,96.611500000000007,30.117017406406116,1.5375864034263347,1.0073427011718954,0.12081433290418955,1,0,264200.69167394051,1.5707925417934507,22.147542348873095,1.5256292343823579,1.2145103435424323,0.60345985786086676,1.1468104264054153,0.51155629948220993,7.4160012343413948,0.5575238369450185,1.2573741619243961,1.0867248376676542,-11.362441508107416,-183.23692282843294,-3.2369228284329381,null,96611.5,9333781932.25,null,14.487031853447146,-37.163369906965102,null,24.343489938635226,-143.4398070272299,null,0,0]
[97724,97.724000000000004,30.463440478677079,1.5379641953933683,1.0075121459246008,0.12219180397290079,1,0,267243.01344187779,1.5707925848822939,22.402058580366749,1.526142734017861,1.2190318336548245,0.6088205391246192,1.1499889251967439,0.51645818248155129,7.4397139024787151,0.5627018146684043,1.2643281370637478,1.0981690635840939,-11.544391160028765,-184.12889586193933,-4.128895861939327,null,97724,9549980176,null,14.454554829564369,-37.441095425923322,null,24.197705635439487,-144.0382354793264,null,0,0]
[98862,98.861999999999995,30.817808431137067,1.5383418590297477,1.0076874518143584,0.12360036649292579,1,0,270355.06932674354,1.5707926279554316,22.662414639866384,1.5266560700407377,1.2236929357245685,0.61426294663089342,1.1532687094353569,0.52144434428729736,7.4641717065739552,0.56796458879061995,1.2715602885452895,1.1098247171480073,-11.72999596076026,-185.03591564363796,-5.0359156436379635,null,98862,9773695044,null,14.421208622933513,-37.723512887072005,null,24.049217753579235,-144.64698908156319,null,0,0]
[100000,100,31.172180679197538,1.5387109359901925,1.0078647563069434,0.12500843621459273,1,0,273467.12521160982,1.5707926700482246,22.922776535569401,1.5271577450282927,1.2283900076441887,0.61966389214775275,1.1565770029902722,0.52640210375433727,7.488831422421967,0.57319314178504244,1.2789132098699729,1.1214280608055174,-11.915094407799735,-185.93743362632048,-5.9374336263204839,null,100000,10000000000,null,14.387740809934545,-38.004222823154123,null,23.901354905323554,-145.2522818019074,null,0,0]
[101165,101.16500000000001,31.534965003161467,1.5390801770564722,1.0080483366886206,0.12644939753436873,1,0,276653.01722028269,1.5707927121587359,23.18932157490411,1.5276596531808624,1.2332353524837292,0.62515019798356608,1.1599930658368298,0.53144806947022594,7.5142832900657401,0.57851036031358483,1.2865663441295714,1.1332516497903,-12.104074536465575,-186.85459933231519,-6.854599332315189,null,101165,10234357225,null,14.353357723880452,-38.289810186899665,null,23.750611244459485,-145.8683185027927,null,0,0]
[102330,102.33,31.897753528771375,1.5394410190577781,1.0082340093863882,0.127889831119742,1,0,279838.90922895609,1.5707927533104131,23.455872323135964,1.5281501541625579,1.2381175259705313,0.63059339913132917,1.1634384902800019,0.53646427588111067,7.5399425602143531,0.5837918483103417,1.2943473620262986,1.1450186768176198,-12.292552585171478,-187.76591496785323,-7.7659149678532344,null,102330,10471428900,null,14.318856769318176,-38.573581361750747,null,23.600482929079121,-146.4806634482093,null,0,0]
[103520,103.52,32.268331406378074,1.539801227563347,1.0084258254220919,0.12936062454362693,1,0,283093.16801893193,1.5707927943889153,23.728148738429077,1.5286398034242332,1.2431420385278624,0.63610909980726205,1.1669878939167857,0.54155741493519016,7.5663643913259477,0.58914986518146828,1.3024280452835566,1.1569789390477256,-12.484570318830865,-188.69070595623535,-8.6907059562353481,null,103520,10716390400,null,14.28349869191333,-38.861555249357338,null,23.447749116327387,-147.10230416796406,null,0,0]
[104710,104.71,32.638913375732649,1.5401532565045739,1.0086198220856391,0.13083085536584821,1,0,286347.42680890829,1.5707928345337259,24.000430713618073,1.5291183427755235,1.2482040659889517,0.64158022853018926,1.1705673852590071,0.54661953589925949,7.5929981854440518,0.59447077319635411,1.3106434797585444,1.168878424911191,-12.676090449105338,-189.60931203298193,-9.6093120329819328,null,104710,10964184100,null,14.248027559224617,-39.147611849649103,null,23.295619610451492,-147.72002623859746,null,0,0]
[105930,105.93,33.018841851229304,1.5405059568713155,1.0088209718858381,0.13233756046329484,1,0,289683.72573644749,1.5707928747542359,24.27958251637514,1.5295978036432869,1.2534321772087664,0.64714323786964645,1.1742680628612239,0.55177709911954487,7.6205211395647217,0.59988739968424265,1.3192065804245452,1.1810139131620048,-12.87193455566835,-190.54461610124957,-10.544616101249574,null,105930,11221164900,null,14.211549959871917,-39.438880026825629,null,23.140264028018834,-148.34921889781111,null,0,0]
[107150,107.15,33.398774340739593,1.5408506328941387,1.0090244109551749,0.13384366141621684,1,0,293020.02466398716,1.5707929140588519,24.558739773702552,1.530066364629024,1.2586987555531564,0.65265986387031816,1.1779997797934869,0.55690212126297012,7.648262164139914,0.60526523712254132,1.3279126405047252,1.1930837401103576,-13.067279681661532,-191.47334182063332,-11.473341820633323,null,107150,11481122500,null,14.174963879097948,-39.728115099208118,null,22.985507662607155,-148.97422429540325,null,0,0]
[108400,108.4,33.788053454141675,1.5411957447816151,1.0092352255783565,0.13538616426671921,1,0,296438.36372908979,1.5707929534123579,24.844767018899564,1.530535526374498,1.2641342347775868,0.65826429377200391,1.1818551463945901,0.5621194595427611,7.6769090536618867,0.61073520981558871,1.3369817260021619,1.2053813668208482,-13.26692200066072,-192.41804481409085,-12.418044814090848,null,108400,11750560000,null,14.137370965492265,-40.022346546353006,null,22.827550020311417,-149.61022095605995,null,0,0]
[109650,109.65,34.17733650010365,1.5415329949954168,1.0094484404837842,0.1369280191720183,1,0,299856.70279419282,1.5707929918686112,25.130799608262382,1.5309940084514493,1.2696090792920338,0.6638205617807349,1.1857424741122984,0.56730272919525826,7.705779864536658,0.61616472363503194,1.3462022168411873,1.2176082752977981,-13.46606217873944,-193.35576887620871,-13.355768876208714,null,109650,12023122500,null,14.099674929015631,-40.31443036881992,null,22.670187403767443,-150.24175244419908,null,0,0]
[110925,110.925,34.57440912055079,1.5418691664329225,1.0096683908810091,0.13850003648780504,1,0,303343.40864059835,1.5707930302010973,25.422558167901823,1.5314510316161742,1.275233448995565,0.66943862866080284,1.1897401498135562,0.57255462570307458,7.7354561760344867,0.62166129563856987,1.3557637525901565,1.2300059831134356,-13.668677709373338,-194.30502355012806,-14.305023550128055,null,110925,12304355625,null,14.061124230469497,-40.610138588219151,null,22.51027439093302,-150.88128002544809,null,0,0]
[112200,112.2,34.971485559566055,1.5421977039299091,1.0098908353191183,0.14007136516191915,1,0,306830.11448700435,1.5707930676623905,25.714321917058303,1.5318976837809928,1.2808977142710385,0.67500718263750481,1.1937704211111353,0.57777120358529255,7.7653602074004606,0.62711608295690635,1.3654841151503958,1.2423283600242572,-13.870789810177001,-195.24695095110351,-15.246950951103514,null,112200,12588840000,null,14.022477275558785,-40.903604091829813,null,22.350948841716857,-151.51609352746746,null,0,0]
[113510,113.51,35.379465978225525,1.5425275790401867,1.0101219820195397,0.1416851034169048,1,0,310412.53382723371,1.5707931052754958,26.014100088799932,1.5323461616296308,1.2867584687469105,0.68067735535005836,1.1979449315451685,0.58309427326594065,7.7963195626940562,0.63267726408571312,1.3756373867858749,1.2549096659024366,-14.077934325842534,-196.20707275383219,-16.207072753832193,null,113510,12884520100,null,13.982674855848229,-41.20278732485135,null,22.187846458764852,-152.16338931612577,null,0,0]
[114820,114.82,35.78745015901427,1.5428499328987277,1.0103557580226896,0.14329809909760685,1,0,313994.95316746342,1.5707931420303329,26.313883373602469,1.5327844209162362,1.2926602177045563,0.68629593203595263,1.2021531495329281,0.58838022432773263,7.8275137276675792,0.63819470003613832,1.3859596166253474,1.2674097169062215,-14.284563925482985,-197.15940012841688,-17.159400128416877,null,114820,13183632400,null,13.942782288877648,-41.499599754605001,null,22.025334659574142,-152.8056411538019,null,0,0]
[116155,116.155,36.203224036274605,1.5431709638225246,1.0105966985584904,0.14494110501896534,1,0,317645.73928899574,1.5707931786336706,26.619392794962266,1.5332208882639433,1.2987161922624031,0.69196901464045035,1.2064759904252396,0.59372896235288053,7.8595418814623459,0.64377262839964755,1.396653292356969,1.2800638819927141,-14.494614316062801,-198.12185648371027,-18.121856483710275,null,116155,13491984025,null,13.902041502098371,-41.799637805312535,null,21.860315246887968,-153.45492781927953,null,0,0]
[117490,117.49,36.619001559942951,1.5434847047134992,1.0108403658633984,0.14658332326474749,1,0,321296.52541052841,1.5707932144051853,26.924907172334954,1.5336474505838829,1.3048135757602262,0.69758925618410961,1.2108331003594295,0.59903935717364698,7.8918080573568341,0.64930554514366456,1.4075236834322693,1.2926320053047631,-14.704143672713643,-199.07616827764409,-19.076168277644086,null,117490,13803900100,null,13.861218781941977,-42.097215754873304,null,21.695882216359955,-154.09891209658662,null,0,0]
[118860,118.86,37.045683280237981,1.5437993491561137,1.0110932543207496,0.14826776831039359,1,0,325043.0250258845,1.5707932502791033,27.238436267658919,1.5340752476132136,1.3111132614512693,0.70330231116472719,1.2153396835551131,0.60444923173122311,7.9251645792903949,0.6549369559616206,1.4188634017474488,1.3054393734320249,-14.918630473246941,-200.04701074818743,-20.047010748187432,null,118860,14127699600,null,13.819246605929399,-42.400040784890123,null,21.527735227838718,-154.7542364443697,null,0,0]
[120230,120.23,{"$f":"SQRT(1+(A589/pole1)^2)","v":37.472368584575179},{"$f":"ATAN(A589/pole1)","v":1.5441068281269286},{"$f":"SQRT(1+(A589/Zero1)^2)","v":1.0113490101692615},{"$f":"ATAN(A589/Zero1)","v":0.14995136618638599},{"$f":"IF(VIN_nom>Vout, 1, SQRT(1+(A589/z_RHP)^2))","v":1},{"$f":"IF(VIN_nom>Vout, 0, -ATAN(A589/z_RHP))","v":0},{"$f":"SQRT(1+(A589/Pole2)^2)","v":328789.52464124095},{"$f":"ATAN(A589/Pole2)","v":1.5707932853354671},27.551970234444514,1.5344933082887118,{"$f":"SQRT(1+(A589/pole4)^2)","v":1.3174553305029455},{"$f":"ATAN(A589/pole4)","v":0.70896054545220744},{"$f":"IF(VOUT_setting=1,1,SQRT(1+(A589*zterm1)^2))","v":1.2198815723761207},{"$f":"IF(VOUT_setting=1,0,ATAN(((A589*zterm1))))","v":0.60981897815512776},7.9587655946453628,{"$f":"IF(VOUT_setting=1,0,ATAN(A589*$Q$4/(1+Afbr-$Q$5*(A589)^2)))","v":0.66052144678672486},{"$f":"SQRT((1-(Z589/pterm2))^2+(A589/pterm1)^2)","v":1.4303904305064867},{"$f":"IF((ATAN((A589/pterm1)/(1-A589^2/pterm2))>0),ATAN((A589/pterm1)/(1-A589^2/pterm2)),PI()+ATAN((A589/pterm1)/(1-A589^2/pterm2)))","v":1.3181545503365066},{"$f":"20*LOG10(((E589*K589*G589*O589)/(C589*I589*S589*M589*Q589))*Adc)","v":-15.132579617871201},{"$f":"((F589+L589+H589+P589)-(D589+J589+T589+N589+R589))*radconv","v":-201.00923670462802},{"$f":"IF(V589>0,V589,V589+180)","v":-21.009236704628023},null,{"$f":"IF(U589<0,A589,1000000000)","v":120230},{"$f":"A589^2","v":14455252900},null,{"$f":"20*LOG10((K589/(I589*M589))*AEA)","v":13.777200186482483},{"$f":"(L589-(J589+N589))*radconv","v":-42.700282625697284},null,{"$f":"20*LOG10((E589*G589/(C589*S589))*Acs*Am)","v":21.360181141786722},{"$f":"(F589+H589-(D589+T589))*radconv","v":-155.40391661212627},null,{"$f":"SUM((U590<0)*(U589>0))*A589","v":0},0]
[126030,{"$f":"A590/1000","v":126.03},39.278810539326798,1.5453345563203489,1.0124634877134366,0.15706941726980814,1,0,344650.61790333834,1.5707934253058289,28.87939062831169,1.536162633989566,1.3447606264455534,0.73231774386926773,1.2394921455286623,0.63211097568950991,8.1036562646363794,0.68365002792087737,1.481278383173201,1.3709482961357979,-16.032478711163691,-204.98716918903614,-24.987169189036138,null,126030,15883560900,null,13.598503978042711,-43.942914220083715,null,20.657162039127762,-158.09128479261656,null,0,0]
[131830,131.83000000000001,41.085306493316338,1.5464543211552468,1.0136291490740494,0.16417145616730736,1,0,360511.71116544178,1.5707935529599031,30.206884425775197,1.537685240815988,1.3727701551443527,0.75473361913964454,1.2596993106450489,0.65369823593238052,{"$f":"IF(VOUT_setting=1,1,SQRT((1+Afbr-$Q$5*(A591)^2)^2+(A591*$Q$4)^2))","v":8.2526466985514944},0.70596305774535084,1.5355689091391482,1.4220338689620695,-16.922988471816648,-208.81008480471741,-28.810084804717405,null,131830,17379148900,null,13.418998958168034,-45.140017637563773,null,19.96393988409984,-160.67551345684538,null,0,0]
[144540,144.54,45.044181433141638,1.5485940771467885,1.0163616612401605,0.17967551642641647,1,0,395269.3827794831,1.5707937968746863,33.116140416926349,1.5405949801460976,1.4364094335053634,0.8007335093442447,1.3059305350734873,0.69860906362239361,8.5924272195861899,0.75211882574536548,1.666554552871401,1.5278952590961103,-18.841449866114026,-216.65000503557067,-36.650005035570672,null,144540,20891811600,null,13.024590223809939,-47.6089153993628,null,18.477275709130069,-165.97520610030929,null,0,0]
[158490,158.49,49.389485558992256,1.5505477186892427,1.0196403587885059,0.19659197670148859,1,0,433418.04674613621,1.5707940195536372,36.309494763269882,1.5432518382934179,1.5094421200414427,0.84664974326383846,1.3594840534865722,0.74428395261377089,8.9843149276507734,0.79869741891392598,1.8294245002512033,1.634467852146307,-20.893022292404169,-224.42922932496967,-44.429229324969668,null,158490,25119080100,null,12.593159415123079,-50.087507816880816,null,16.895435361450524,-171.22405953685015,null,0,0]
[173780,173.78,54.152368190093966,1.5523288640248838,1.0235668617490215,0.21500303063774104,1,0,475231.17019061028,1.5707942225558174,39.809839172376321,1.5456742661471043,1.5927896394014482,0.89203511064891605,1.4211781111454627,0.79028677965398197,9.4337844979696257,0.84525116989214544,2.0308872959090554,1.7401015285838484,-23.072649157840139,-232.02194194973717,-52.021941949737169,null,173780,30199488400,null,12.125766059121014,-52.549114561486256,null,15.221733694731125,-176.32359980049557,null,0,0]
[190550,190.55,59.376439750978292,1.5539538336440535,1.0282691049281227,0.23502694339444388,1,0,521091.60708819807,1.570794407746525,43.649223891397746,1.5478844074324385,1.687581981060579,0.93655841684615837,1.491997834655534,0.83626115467578432,9.9474733068297958,0.89143145682509117,2.2792205074009511,1.843440880767911,-25.375515423204199,-239.32484316796223,-59.324843167962229,null,190550,36309302500,null,11.623175764422724,-54.973490942195859,null,13.459600690808029,-181.19032675453758,null,0,0]
[208930,208.93,65.102196899208863,1.5554352579556443,1.0338917121320348,0.25675434041019762,1,0,571354.86470167153,1.5707945765691407,47.857411578754608,1.5498994008858471,1.7948873732864332,0.97986095062916445,1.57289225895781,0.88178876485254898,10.531712953968359,0.93684434860110222,2.5838405624244571,1.9431722536328644,-27.790306134275067,-246.23805973797334,-66.238059737973344,null,208930,43651744900,null,11.08734587599236,-57.339102425084441,null,11.617748850103045,-185.74450472186325,null,0,0]
[229090,229.09,71.382598205777512,1.5567868519819512,1.0406135750220429,0.28030353138870584,1,0,626485.83714388649,1.5707947305896184,52.473324534284309,1.5517378709242622,1.9159961039804223,1.0216940007938797,1.6649832749302218,0.9265367099954146,11.19405666924321,0.9811966789999329,2.9563394905236127,2.0383916201932903,-30.306742666307628,-252.69076137068635,-72.690761370686346,null,229090,52482228100,null,10.519878429677652,-59.630631897061015,null,9.7043315081661969,-189.92834393777193,null,0,0]
[251190,251.19,78.267488153386935,1.5580192819078666,1.0486361935092925,0.30575628071423661,1,0,686922.07181517791,1.5707948710256892,57.533597034367268,1.5534143029146577,2.0521310116379237,1.0618031241705572,1.769344222639085,0.97014350685090234,11.941693142622141,1.0241791123835988,3.4100138385174739,2.1283521068574638,-32.909846728524712,-258.62366117254822,-78.623661172548225,null,251190,63096416100,null,9.9234038537423945,-61.832670957734109,null,7.7312210026531503,-193.69497807081922,null,0,0]
[275420,275.42,85.81605805717092,1.5591432323107905,1.0582000151756785,0.33319887615448673,1,0,753183.15625344391,1.5707949990965915,{"$f":"SQRT(1+(A599/Zero2)^2)","v":63.08173362764613},{"$f":"ATAN(A599/Zero2)","v":1.5549432132137206},2.2046858042517266,1.100018795291368,1.8871773283120832,1.0123232207328621,12.782738288129249,1.0655660089793377,3.9609859962246077,2.212655553075102,-35.585880325541964,-264.00252437482038,-84.002524374820382,null,275420,75856176400,null,9.3003507072684908,-63.934674857150249,null,5.7093927906680797,-197.01726245815257,null,0,0]
[302000,302,94.096846378631255,1.560168778020772,1.0695903812387109,0.36271386644447046,1,0,825870.71813414537,1.5707951159516278,69.168109562590033,1.5563382933703098,2.3752378230465201,1.1362372798814091,2.0198239493630856,1.0528548572168501,13.726309751293831,1.1052004573690526,4.6288758189109229,2.2911703369743242,-38.322433789212347,-268.81260089840094,-88.812600898400945,null,302000,91204000000,null,8.6529591538459414,-65.929915657044475,null,3.6488126970739891,-199.88350327312887,null,0,0]
[331130,331.13,103.17216153031454,1.5611036379593144,1.0831194408939908,0.39431690222805177,1,0,905531.69170770142,1.5707952224713162,75.838521498617553,1.5576100335952394,2.565229108766113,1.1703507274541967,2.1685148916128973,1.0915110606223981,14.780759314634658,1.1429211045004253,5.4361401641981582,2.3638388621260455,-41.103723127817005,-273.0471375567451,-93.047137556745099,null,331130,109647076900,null,7.9844252798592787,-67.811612985359261,null,1.5619384041245863,-202.28994602922674,null,0,0]
[363080,363.08,113.1261207260668,1.5619565202374268,1.0991692273089033,0.42804735489158985,1,0,992904.43821217795,1.570795319648628,83.154796089343535,1.5587702723546553,2.776550781831288,1.2023579056884328,2.334825480189918,1.1281884045335886,15.956910844644728,1.1786865247842637,6.4111507414055966,2.4308773057238113,-43.919790518152695,-276.71956705605714,-96.719567056057144,null,363080,131827086400,null,7.2967090012869908,-69.579017998031333,null,-0.54321154535710181,-204.24721989101184,null,0,{"$f":"IF(AH602>0,W602,0)","v":0}]
[398110,398.11,124.03972647970893,1.562734306173287,1.1181591381522686,0.46387140791656895,1,0,1088699.9721731201,1.5707954082681899,91.176471135151132,1.5598283650258644,3.0110300465475395,1.2322542629420099,2.5202759138143027,1.1627879785436381,17.265222603924407,1.2124563857314143,7.5869788492909036,2.4925076977124192,-46.758514211566371,-279.84750208828785,-99.847502088287854,null,398110,158491572100,null,6.5924139665003709,-71.231333926497555,null,-2.6570462262552019,-205.77037805154163,null,0,0]
[436520,436.52,136.00644386453936,1.5634436677450161,1.1405718043923219,0.50172714049044975,1,0,1193738.694966157,1.5707954890906284,99.972244959989581,1.5607933837073096,3.2707606574556136,1.2600815363267903,2.7265910958834718,1.1952741902939821,18.717628540195829,1.2442475327595375,9.0038668201114902,2.5490416771713127,-49.610207213482695,-282.45760440911329,-102.45760440911329,null,436520,190549710400,null,5.8736525559318986,-72.770432381747383,null,-4.7718434399782925,-206.88120619223443,null,0,0]
[478630,478.63,149.1259695515748,1.5640905363973521,1.1669443770391834,0.54149541957113911,1,0,1308895.7013919591,1.570795562792082,109.6153965820274,1.5616733942267258,3.557974620585755,1.285899145879837,2.955601149361748,1.2256433401581843,20.326832702158114,1.274102728967071,10.709883597004245,2.6008067922595028,-52.465662576986333,-284.58141134916497,-104.58141134916497,null,478630,229086676900,null,5.1424978433958071,-74.199255781978849,null,-6.8802826137683981,-207.60563710748073,null,0,0]
[524810,524.80999999999995,163.51357840770984,1.5646805886190573,1.1978875457773248,0.5830216406872536,1,0,1435182.8198138024,1.5707956300195547,120.1906556695513,1.5624761164410015,3.875250007295798,1.3097952356143789,3.2094086836574052,1.2539368937359228,22.107482909363817,1.3021037997697507,12.763676997108123,2.6481615383540791,-55.31798282385207,-286.25556705204139,-106.25556705204139,null,524810,275425536100,null,4.4004994346427173,-75.522412128996976,null,-8.9767966797400618,-207.97339449194942,null,0,0]
[575440,575.44000000000005,179.28766132942306,1.5652186692045873,1.23405892100653,0.6260743033983176,1,0,1573639.2253074842,1.5707956913252261,131.78504255181423,1.563208139414406,4.225240532039666,1.3318562838118706,3.4901746463989309,1.2802052056390434,24.074665529480594,1.3283364419926968,15.234659322653178,2.6914322793452992,-58.159717689806278,-287.51891468202416,-107.51891468202416,null,575440,331131193600,null,3.6494146286529396,-76.74447876941791,null,-11.055470175610662,-208.01671920364413,null,0,0]
[630960,630.96,196.58530297938933,1.5657094545945403,1.2761939255222194,0.67038911487122643,1,0,1725468.1732239269,1.5707957472420451,144.49931824474251,1.56387582367821,4.6110212471384848,1.3521875753537729,3.8003963566919818,1.3045307579546745,26.24585701180531,1.3529140261987889,18.207452923808674,2.7309547277133102,-60.98577504603378,-288.41353770919415,-108.41353770919415,null,630960,398110521600,null,2.8904588336869406,-77.871123681540766,null,-13.112196485534584,-207.77025695504867,null,0,0]
[691830,691.83,215.54981955254232,1.5661570114417558,1.3250736671346663,0.71563766593023515,1,0,1891927.6123390952,1.5707957982334477,158.43882436972694,1.5644847005666251,5.0358145113793427,1.370889914238355,4.1426892689194013,1.3269993088747731,28.639397306991871,1.3759498203193319,21.782623453508112,2.7670305414957368,-63.790940169747408,-288.9828042678476,-108.9828042678476,null,691830,478628748900,null,2.1249718118905041,-78.907805613478246,null,-15.142881594880635,-207.27034094038459,null,0,0]
[758580,758.58,236.34633662504106,1.5665652352621262,1.381558588610466,0.76147336746394667,1,0,2074466.9184166011,1.5707958447433434,173.72493333215198,1.5650400688803985,5.5033392706494775,1.3880733807697745,4.520069195517066,1.3477150923578112,31.276471182955746,1.3975734625858771,26.08263851134469,2.7999573273888689,-66.572188821331238,-289.27130637659531,-109.27130637659531,null,758580,575443616400,null,1.3538114624313791,-79.860528128587731,null,-17.145146918421975,-206.55410405727443,null,0,0]
[831760,831.76,259.14621126530199,1.5669374917500403,1.4465426956497862,0.80750486318184189,1,0,2274590.160645098,1.5707958871552563,190.48359808850921,1.5655465068445982,6.0174633590330586,1.4038387739000451,4.9356731795795925,1.3667773222053212,34.179166869598106,1.4179079153509166,31.252728374764445,2.8299962344230778,-69.326213733779113,-289.32349643183801,-109.32349643183801,null,831760,691824697600,null,0.57804390695863161,-80.734804290405535,null,-19.116556000538061,-205.65912494684173,null,0,0]
[912010,912.01,284.14884111941365,1.5672770371849278,1.5210083101306304,0.85335538040201864,1,0,2494047.5286259279,1.5707959258402282,208.86138252808334,1.56600844399654,6.5826950943410871,1.4182924101005274,5.3931573150418828,1.384296924680849,37.373271551437291,1.4370880391754906,37.470163885245931,2.8574035774590683,-72.05206557887125,-289.18304329574681,-109.18304329574681,null,912010,831762240100,null,-0.20178192777231624,-81.536471811505805,null,-21.05652300712455,-204.62186342445,null,0,0]
[1000000,1000,311.56297088976032,1.5675866972484203,1.6059690845609214,0.89863709249959889,1,0,2734671.2520979973,1.5707959611202293,229.01172111917137,1.5664297241904981,7.2037629811098727,1.431530246156391,5.8963578914950547,1.4003763891572458,40.885926778398073,1.4552401909734276,44.945716763597694,2.8824034497640074,-74.748576925876066,-288.89181450520761,-108.89181450520761,null,1000000,1000000000000,null,-0.98491219353962967,-82.270808392520905,null,-22.964464435776858,-203.47754181698542,null,0,0]
[]
[]
["Pole/Zero Locations for Chart"]
[{"$f":"U4*1000","v":37802.75},null,{"$f":"SQRT(1+(A617/pole1)^2)","v":11.820252672083365},{"$f":"ATAN(A617/pole1)","v":1.4860945220197883},{"$f":"SQRT(1+(A617/Zero1)^2)","v":1.0011276951506727},{"$f":"ATAN(A617/Zero1)","v":4.746865118172594E-2},{"$f":"IF(VIN_nom>Vout, 1, SQRT(1+(A617/z_RHP)^2))","v":1},{"$f":"IF(VIN_nom>Vout, 0, -ATAN(A617/z_RHP))","v":0},{"$f":"SQRT(1+(A617/Pole2)^2)","v":103378.09368007728},{"$f":"ATAN(A617/Pole2)","v":1.5707866535656425},{"$f":"SQRT(1+(A617/Zero2)^2)","v":8.7147543848122933},{"$f":"ATAN(A617/Zero2)","v":1.4557950799495034},{"$f":"SQRT(1+(A617/pole4)^2)","v":1.0357269194009995},{"$f":"ATAN(A617/pole4)","v":0.2634186505357346},{"$f":"IF(VOUT_setting=1,1,SQRT(1+(A617*zterm1)^2))","v":1.0238431094117857},{"$f":"IF(VOUT_setting=1,0,ATAN(((A617*zterm1))))","v":0.21623509178771394},{"$f":"IF(VOUT_setting=1,1,SQRT((1+Afbr-$Q$5*(A617)^2)^2+(A617*$Q$4)^2))","v":6.4897949382932856},{"$f":"IF(VOUT_setting=1,0,ATAN(A617*$Q$4/(1+Afbr-$Q$5*(A617)^2)))","v":0.23883440157715477},{"$f":"SQRT((1-(A617^2/(pole3^2)))^2+(A617/(Q*pole3))^2)","v":1.032782080037276},{"$f":"ATAN((A617/(Q*pole3))/(1-A617^2/pole3^2))","v":0.43525811412181581},{"$f":"20*LOG10(((E617*K617*G617*O617)/(C617*I617*S617*M617*Q617))*Adc)","v":2.2055750471548119E-2},{"$f":"((F617+L617+H617+P617)-(D617+J617+T617+N617+R617))*radconv","v":-130.34179762363993},{"$f":"IF(V617>0,V617,V617+180)","v":49.658202376360066},"crossover",null,null,null,{"$f":"20*LOG10((K617/(I617*M617))*AEA)","v":15.918851762030311},{"$f":"(L617-(J617+N617))*radconv","v":-21.681308793276315},null,{"$f":"20*LOG10((E617*G617/(C617*S617))*Acs*Am)","v":34.122555326967372},{"$f":"(F617+H617-(D617+T617))*radconv","v":-107.36564375804038}]
[{"$f":"A617","v":37802.75},null,null,null,null,null,null,null,null,null,null,null,null,null,null,null,null,null,null,null,null,-180]
[{"$f":"A618","v":37802.75}]
[1000000,null,null,null,null,null,null,null,null,null,null,null,null,null,null,null,null,null,null,null,null,{"$f":"V617","v":-130.34179762363993}]
[]
[{"$f":"pole1","v":3209.6405680919383},null,1.4142135623730951,0.78539816339744828,1.000008133936289,4.0333314159092006E-3,{"$f":"IF(VIN_nom>Vout, 1, SQRT(1+(A622/z_RHP)^2))","v":1},{"$f":"IF(VIN_nom>Vout, 0, -ATAN(A622/z_RHP))","v":0},8777.3118480929716,1.5706823966965395,1.2410807012234442,0.63385665690001458,1.0002621163989702,{"$f":"ATAN(A622/pole4)","v":2.289363045047399E-2},{"$f":"IF(VOUT_setting=1,1,SQRT(1+(A622*zterm1)^2))","v":1.0001739153790963},{"$f":"IF(VOUT_setting=1,0,ATAN(((A622*zterm1))))","v":1.8648870066071875E-2},{"$f":"IF(VOUT_setting=1,1,SQRT((1+Afbr-$Q$5*(A622)^2)^2+(A622*$Q$4)^2))","v":6.3091859714233856},{"$f":"IF(VOUT_setting=1,0,ATAN(A622*$Q$4/(1+Afbr-$Q$5*(A622)^2)))","v":2.0662445927000721E-2},{"$f":"SQRT((1-(A622^2/(pole3^2)))^2+(A622/(Q*pole3))^2)","v":1.0002257339932286},{"$f":"ATAN((A622/(Q*pole3))/(1-A622^2/pole3^2))","v":3.6973369551148445E-2},{"$f":"20*LOG10(((E622*K622*G622*O622)/(C622*I622*S622*M622*Q622))*Adc)","v":23.5696467770406},{"$f":"((F622+L622+H622+P622)-(D622+J622+T622+N622+R622))*radconv","v":-101.99056410935731},78.009435890642692,"p1",null,null,null,{"$f":"20*LOG10((K622/(I622*M622))*AEA)","v":20.713717860236578},{"$f":"(L622-(J622+N622))*radconv","v":-54.987869494939076},null,{"$f":"20*LOG10((E622*G622/(C622*S622))*Acs*Am)","v":52.833285104812703},{"$f":"(F622+H622-(D622+T622))*radconv","v":-46.887325215725767}]
[{"$f":"Zero1","v":795774.71636878187},null,247.93467438713859,1.5667629953789874,1.4142135623730951,0.78539816339744828,1,0,2176182.2400002298,1.5707958672745579,182.24274361411486,1.5653091123333496,5.7644713041141689,1.3964377789230289,{"$f":"IF(VOUT_setting=1,1,SQRT(1+(A623*zterm1)^2))","v":4.7310913793753757},{"$f":"IF(VOUT_setting=1,0,ATAN(((A623*zterm1))))","v":1.3578222420710051},{"$f":"IF(VOUT_setting=1,1,SQRT((1+Afbr-$Q$5*(A623)^2)^2+(A623*$Q$4)^2))","v":32.750463703508252},{"$f":"IF(VOUT_setting=1,0,ATAN(A623*$Q$4/(1+Afbr-$Q$5*(A623)^2)))","v":1.4082948881779489},28.650838020215975,-0.32567857437103476,-68.007105099446193,-109.32512805716654,70.674871942833462,"z1",null,null,null,{"$f":"20*LOG10((K623/(I623*M623))*AEA)","v":0.95113443503521633},{"$f":"(L623-(J623+N623))*radconv","v":-80.324359078050009},null,-18.173717107068732,-26.108899373026865]
[{"$f":"Pole2","v":0.36567466719551112},null,1.0000000064900336,1.139300983570058E-4,1.0000000000001057,4.5952033870101324E-7,1,0,1.4142135623730951,0.78539816339744828,1.0000000035064438,8.374298632911849E-5,1.0000000000034026,2.6087293571215143E-6,1.0000000000022577,2.1249139502181768E-6,6.3078556263442334,2.3544034495599777E-6,1.000000000002929,4.2123706324254713E-6,100.56536432835588,-45.002107285982063,134.99789271401795,"p2",null,null,{"$f":"Pole2","v":0.36567466719551112},{"$f":"20*LOG10((K624/(I624*M624))*AEA)","v":94.696924474417457},{"$f":"(L624-(J624+N624))*radconv","v":-44.995351400916256},null,55.845474834158331,-6.7427362860463282E-3]
[{"$f":"Zero2","v":4366.6303575986713},null,1.6884571811770865,0.93693966989488198,1.0000150549501474,5.4872144615470695E-3,1,0,11941.298549334178,1.5707125838085676,1.4142135623730951,0.78539816339744828,1.0004850939309795,3.1141545091743016E-2,1.0003218740178283,2.5368788138146726E-2,6.3103177248222009,2.8107365672608773E-2,1.0004179331591423,5.0301371038031339E-2,20.486826734118011,-103.18674081172311,76.813259188276888,"z2",null,null,{"$f":"Zero2","v":4366.6303575986713},{"$f":"20*LOG10((K625/(I625*M625))*AEA)","v":19.172280777479894},{"$f":"(L625-(J625+N625))*radconv","v":-46.779481035046089},null,51.292175261890627,-56.250350841903675]
[{"$f":"pole3","v":150000},null,46.74490248858379,1.5494019877948664,1.017610227819435,0.18630952386316746,1,0,410200.68781589111,1.570793888963782,34.365983024267116,1.5416936768299798,1.464622656003997,0.81924952813954355,1.3265588259302374,0.71692448044705093,8.7435834926186846,0.77084007080691663,1.727917330751205,{"$error":"#DIV/0!"},-19.651342082255432,{"$error":"#DIV/0!"},{"$error":"#DIV/0!"},"p3",null,null,null,{"$f":"20*LOG10((K626/(I626*M626))*AEA)","v":12.855357182636087},{"$f":"(L626-(J626+N626))*radconv","v":-48.606859724223703},null,17.851959782844247,{"$error":"#DIV/0!"}]
[{"$f":"Fp2_u","v":140173.47801773081},null,{"$f":"SQRT(1+(A627/pole1)^2)","v":43.684087613701834},{"$f":"ATAN(A627/pole1)","v":1.5479026963444227},{"$f":"SQRT(1+(A627/Zero1)^2)","v":1.0153954065268747},{"$f":"ATAN(A627/Zero1)","v":0.17435854787186783},1,0,{"$f":"SQRT(1+(A627/Pole2)^2)","v":383328.38064295775},{"$f":"ATAN(A627/Pole2)","v":1.5707937180655396},{"$f":"SQRT(1+(A627/Zero2)^2)","v":32.116635445717939},{"$f":"ATAN(A627/Zero2)","v":1.5396547817031536},{"$f":"SQRT(1+(A627/pole4)^2)","v":1.4142135623730951},0.78539816339744828,1.2897577773111351,0.68354402256945945,8.4737289333097419,0.73667590316396914,1.6196866250069559,1.492473536867382,-18.187529056220583,-214.03907977215647,{"$f":"IF(V627>0,V627,V627+180)","v":-34.03907977215647},"p4",null,null,null,null,null,null,18.983093471211973,-164.21071756746969]
[{"$f":"z_RHP","v":0},null,{"$f":"SQRT(1+(A628/pole1)^2)","v":1},{"$f":"ATAN(A628/pole1)","v":0},{"$f":"SQRT(1+(A628/Zero1)^2)","v":1},{"$f":"ATAN(A628/Zero1)","v":0},1,0,{"$f":"SQRT(1+(A628/Pole2)^2)","v":1},{"$f":"ATAN(A628/Pole2)","v":0},{"$f":"SQRT(1+(A628/Zero2)^2)","v":1},{"$f":"ATAN(A628/Zero2)","v":0},{"$f":"SQRT(1+(A628/pole4)^2)","v":1},0,1,0,6.3078556263269636,0,1,0,103.57566431096907,0,{"$f":"IF(V628>0,V628,V628+180)","v":180},"z_RHP",null,null,null,null,null,null,55.84547489055457,0]
[{"$f":"Fp2_u","v":140173.47801773081},null,null,null,null,null,null,null,null,null,null,null,null,null,null,null,null,null,null,null,-25]
[]
[null,null,null,"System","Plant"]
["p1","p-dom",{"$f":"pole1","v":3209.6405680919383},{"$f":"U622","v":23.5696467770406},{"$f":"AE622","v":52.833285104812703}]
["z1","ESR zero",{"$f":"Zero1","v":795774.71636878187},{"$f":"U623","v":-68.007105099446193},{"$f":"AE623","v":-18.173717107068732}]
["p2","EA pole",{"$f":"Pole2","v":0.36567466719551112},{"$f":"U624","v":100.56536432835588},{"$f":"AE624","v":55.845474834158331}]
["z2","EA zero",{"$f":"Zero2","v":4366.6303575986713},{"$f":"U625","v":20.486826734118011},{"$f":"AE625","v":51.292175261890627}]
["p3","p_sampling",{"$f":"pole3","v":150000},{"$f":"U626","v":-19.651342082255432},{"$f":"AE626","v":17.851959782844247}]
[]
[]
[{"$f":"U4*1000","v":37802.75}]
[{"$f":"U4*1000","v":37802.75}]
[]
[]
[]
[]
[]
[]
[]
[]
[]
[]
[]
[]
[]
[]
[]
[]
[]
[]
[]
[]
[]
[]
[]
[]
[]
[]
[]
[]
[]
[]
[]
[]
[]
[]
[]
[]
[]
[]
[]
[]
[]
[]
[]
[]
[]
[]
[null,null,null,null,null,null,null,null,null,null,null,null,null,null,null,null,null,null,null,null,null,null,null,null,null,null,null,null,null,null,null,null,null,"phase margin",{"$f":"SUM(AI689:AI1306)","v":0}]

{"sheet":"Bode Plot Management","index":7,"n_rows":6,"n_cols":14,"rows_kept":6,"cut":false,"hidden":true,"merged":[]}
[null,null,null,null,null,null,null,null,null,"Single or dual output (MODE)",null,null,null,"3.3V or 5V fixed (FB1/2)"]
[{"$f":"CHOOSE(BODE_PLOT_TYPE, \"BODE_PLOT_Ch1\", \"BODE_PLOT_Ch2\")","v":"BODE_PLOT_Ch1"},null,null,null,null,null,null,null,null,"With/without dither (DITH)",null,null,null,"With/without VOUT connected to VCCX"]
[null,null,null,null,null,null,null,null,null,"FPWM or DEM (DEMB)"]
[null,null,null,null,null,null,null,null,null,"Shunt or inductor DCR current sensing"]
[]
[null,null,null,null,null,{"$f":"INDIRECT(A2)","v":0}]

{"sheet":"Efficiency Calculations","index":8,"n_rows":109,"n_cols":57,"rows_kept":109,"cut":false,"hidden":true,"merged":[[6,24,6,26],[0,0,3,3],[5,0,6,3],[6,6,6,13],[6,17,6,20],[6,21,6,23],[6,51,6,56],[6,27,6,32],[6,33,6,36],[6,40,6,44],[6,45,6,49]]}
["BUCK CONTROLLER POWER DESIGN TOOL"]
[null,null,null,null,null,null,null,{"$f":"AV19","v":0.93766339966981738},"10% load"]
[null,null,null,null,null,null,null,{"$f":"AV59","v":0.94457946961988837},"50% load",null,null,null,null,null,null,null,null,null,null,null,null,null,null,null,null,null,null,null,null,null,null,null,null,null,null,null,null,null,null,null,null,{"$f":"IF(MODE=1, (Qg_Q1+Qg_Q2)*Fsw*Vin, (Qg_Q1+Qg_Q2+Qg_Q3+Qg_Q4)*Fsw*Vin)","v":0.47519999999999996}]
[null,null,null,null,null,null,null,{"$f":"AV109","v":0.93333490294999921},"100% load",null,null,null,null,null,null,null,null,null,null,null,null,null,null,null,null,null,null,null,null,null,null,null,null,null,null,null,null,null,null,null,"I_VCC",{"$f":"(Qg_Q1+Qg_Q2)*Fsw*1000","v":9.8999999999999986},"mA",{"$f":"AP4*5/1000","v":4.9499999999999995E-2}]
[]
["Enter the values of your design and MOSFET datasheet specifications below. Note that thermal resistance (θJA) will change when components are placed on the PCB"]
[null,null,null,null,null,null,"Operating Point Condtions",null,null,null,null,null,null,null,null,null,null,"Filter Inductor",null,null,null,"Cout",null,null,"Cin",null,null,"High-side BUCK \"Control\" MOSFET Losses ",null,null,null,null,null,"Low-side BUCK \"Sync\" MOSFET Losses ",null,null,null,"External Diode","Diode/FET","Sense Rs","Controller IC Losses",null,null,null,null,"RESULTS",null,null,null,null,null,"Consolidated Buck/Boost Efficiency & Losses"]
["Input Parameters",null,null,null,null,null,"Step","Vin","Mode","Iout","Iout/ phase","Iin","Duty Cycle BUCK Leg","Ripple Current pk-pk","Peak Inductor Current","Valley Inductor Current","SW node voltage at Q1 turn-on","Irms Lf","DCR    Loss","Core Loss","Total Inductor Loss","Irms Cout","Cout ESR Loss","Total Cout Loss","Irms Cin","Cin ESR Loss","Total Cin Loss","Irms","RDS(on) Loss","Transition Loss (not including capacitive loss)","MOSFET Output Capacitance Loss","Dead Time Loss ","Total Control MOSFET Loss","Irms","RDS(on) Loss","Deadtime Loss","Total Sync MOSFET Loss","Deadtime Loss","Reverse Recovery Loss","Isense Shunt Loss","IQ Loss","Switching Current Loss","Switching Current Diss","LDO Loss Saved from Gate Drive Current (ext VCC)","Total IC Loss","Total Loss","Pout","EFF, h",{"$f":"IF(Vin>Vout, \"Buck ''CONTROL'' MOSFET Temp Rise\", \"Boost ''CONTROL'' MOSFET Temp Rise\")","v":"Buck ''CONTROL'' MOSFET Temp Rise"},{"$f":"IF(Vin>Vout, \"Buck ''SYNC'' MOSFET Temp Rise\", \"Boost ''SYNC'' MOSFET Temp Rise\")","v":"Buck ''SYNC'' MOSFET Temp Rise"},null,"h","Inductor Cu & Core Loss","Total MOSFET Loss","Control MOSFET Loss","SYNC MOSFET Loss","Shunt Loss"]
["Design","Input Value","Units","Description",null,null,0,{"$f":"Vin","v":48},{"$f":"MODE","v":1},0,{"$f":"Iout*G9/100/Number_of_Phases","v":0},{"$f":"Vout*K9/(Vin*Efficiency)","v":0},{"$f":"(Vout+(Rdson2+Rs+Rdcr)*K9)/(Vin+(Rs+Rdson2-Rdson1)*K9)","v":0.10416666666666667},{"$f":"(Vin-(Rdson1+Rdcr)*K9-Vout)*M9/(Fsw*Lf)","v":6.7866161616161618},{"$f":"K9+N9/2","v":3.3933080808080809},{"$f":"K9-N9/2","v":-3.3933080808080809},{"$f":"IF(MIN(Vin, -P9/(Coss_Q1+Coss_Q2)*0.00000002)<0, 0, MIN(Vin, -P9/(Coss_Q1+Coss_Q2)*0.00000002))","v":48},{"$f":"SQRT(K9^2+(N9^2)/12)","v":1.9591273338978781},{"$f":"R9^2*Rdcr","v":1.3433629686490327E-2},{"$f":"Core_Loss_Ch1","v":0.2},{"$f":"(T9+S9*(1+Ltc*(Ta-25)))/(1-S9*Ltc*ThetaCa)","v":0.21366325152637969},{"$f":"N9/SQRT(12)","v":1.9591273338978781},{"$f":"RCoutEsr*V9^2","v":3.8381799104258078E-3},{"$f":"W9","v":3.8381799104258078E-3},{"$f":"SQRT(M9*(1-M9))*SQRT(K9^2+(N9^2)/12)","v":0.59846761809239613},{"$f":"RCinEsr*Y9^2","v":3.5816348990518613E-4},{"$f":"Z9","v":3.5816348990518613E-4},{"$f":"SQRT(M9)*SQRT(K9^2+(N9^2)/12)","v":0.63230562810718494},{"$f":"Rdson1*AB9^2","v":4.7977248880322594E-3},{"$f":"(Vin*K9/2)*Fsw*(Tr_buck+Tf_buck)","v":0},{"$f":"(0.5*Coss_Q1*(Vin-Q9)^2-0.5*Coss_Q2*(Vin-Q9)^2+(Qoss_Q2*(Vin-Q9)/Vin)*Vin)*Fsw","v":0},{"$f":"IF(K9>N9/2,0,ABS(K9-N9/2)*Vsd_Q1*Deadtime*Fsw)","v":9.9763257575757568E-3},{"$f":"(AF9+AE9+AD9+AC9*(1+RdsonTopTc*Ta-RdsonTopTc*25))/(1-AC9*RdsonTopTc*ThetaJA_Q1)","v":1.4785968399049753E-2},{"$f":"SQRT((1-M9))*SQRT(K9^2+(N9^2)/12)","v":1.8542840944930166},{"$f":"Rdson2*AH9^2","v":1.4097314962668124E-2},{"$f":"IF(K9<N9/2,Deadtime*Fsw*IF(VfdSky_Q2>0,0,Vsd_Q2)*(K9+N9/2),2*Deadtime*Fsw*IF(VfdSky_Q2>0,0,Vsd_Q2)*K9)","v":9.9763257575757568E-3},{"$f":"(AJ9+AI9*(1+RdsonBotTc*Ta-RdsonBotTc*25))/(1-AI9*RdsonBotTc*ThetaJA_Q2)","v":2.4129017850765284E-2},{"$f":"2*Deadtime*Fsw*IF(VfdSky_Q2>0,VfdSky_Q2,Vsd_Q2)*K9","v":0},{"$f":"IF(QrrSky_Q2>0,QrrSky_Q2,Qrr_Q2*K9/(Iout/Number_of_Phases))*Fsw*Vin","v":0},{"$f":"Rs*R9^2","v":7.6763598208516156E-3},{"$f":"Iq*Vin","v":1.0560000000000001E-4},{"$f":"IF(Ext_VCC=1,  (Qg_Q1+Qg_Q2)*Fsw*VCC, (Qg_Q1+Qg_Q2)*Fsw*Vin)","v":4.9499999999999995E-2},{"$f":"(Vin-VCC)*Fsw*(Qg_Q1+Qg_Q2)+(RdsonDRT+RdsonDRT2)*Fsw*Qg_Q1*VCC/(RdsonDRT+2*Rgate1+RdsonDRT2)+(RdsonDRB+RdsonDRB2)*Fsw*Qg_Q2*VCC/(RdsonDRB+2*Rgate2+RdsonDRB2)","v":0.44473846153846153},{"$f":"(Qg_Q1+Qg_Q2)*Fsw*(Vin-VCC)","v":0.42569999999999997},{"$f":"SUM(AO9:AP9)","v":4.9605599999999993E-2},{"$f":" SUM(U9,X9,AA9,AG9,AK9,AL9,AM9,AS9,AN9)","v":0.31405654099737734},{"$f":"Vout*K9","v":0},{"$f":"AU9/(AU9+AT9)","v":0},{"$f":"ThetaJA_Q1*BC9","v":0.62101067276008959},{"$f":"ThetaJA_Q2*BD9","v":0.98205102652614706},null,{"$f":"AV9*100","v":0},{"$f":"U9","v":0.21366325152637969},{"$f":"AG9+AK9+AM9","v":3.8914986249815035E-2},{"$f":"AG9+AM9*0.66","v":1.4785968399049753E-2},{"$f":"AK9+AM9*0.33","v":2.4129017850765284E-2},{"$f":"AN9","v":7.6763598208516156E-3}]
[null,null,null,null,null,null,1,48,1,{"$f":"Iout*G10/100","v":0.16},0.16,1.8518518518518517E-2,0.10420071594741362,6.7884429817624783,{"$f":"K10+N10/2","v":3.5542214908812393},{"$f":"K10-N10/2","v":-3.234221490881239},48,{"$f":"SQRT(K10^2+(N10^2)/12)","v":1.9661756050058248},1.3530462784020075E-2,0.2,0.21376184652073946,{"$f":"N10/SQRT(12)","v":1.9596546914494963},3.8402465097200204E-3,{"$f":"W10","v":3.8402465097200204E-3},{"$f":"SQRT(M10*(1-M10))*SQRT(K10^2+(N10^2)/12)","v":0.60070743923998193},3.6084942755825659E-4,{"$f":"Z10","v":3.6084942755825659E-4},{"$f":"SQRT(M10)*SQRT(K10^2+(N10^2)/12)","v":0.63468415298921421},4.8338876886676353E-3,9.5790481210523918E-3,0,9.5086111831908428E-3,2.3940989305892196E-2,1.8609198090364842,1.4198392396223976E-2,1.0449411183190841E-2,2.470490893397527E-2,9.4079999999999988E-4,8.4960000000000001E-3,7.7316930194400429E-3,1.0560000000000001E-4,4.9499999999999995E-2,0.44473846153846153,0.42569999999999997,4.9605599999999993E-2,0.33338293371732525,0.8,{"$f":"AU10/(AU10+AT10)","v":0.70585146132042109},1.2410306708474721,1.1195995696127936,null,{"$f":"AV10*100","v":70.585146132042112},0.21376184652073946,5.714189823986747E-2,2.9548349305892195E-2,2.7508588933975269E-2,7.7316930194400429E-3]
["Vin",{"$f":"Vin","v":48},"V","Vin",null,null,2,48,1,0.32,0.32,3.7037037037037035E-2,0.104234766567485,6.7902696332722421,3.7151348166361209,-3.0751348166361212,48,1.986130276285587,1.3806497160323918E-2,0.2,0.21404291178862769,1.9601820003199353,3.8423134743782628E-3,3.8423134743782628E-3,0.60689160791789787,3.683174237611715E-4,3.683174237611715E-4,0.64123029262304099,4.9341154581291694E-3,1.9158096242104784E-2,0,9.0408963609101972E-3,3.3160595920244534E-2,1.8797705142385948,1.4487502463423407E-2,1.0922496360910193E-2,2.5470071654099102E-2,1.8815999999999998E-3,1.6992E-2,7.8894269487565245E-3,1.0560000000000001E-4,4.9499999999999995E-2,0.44473846153846153,0.42569999999999997,4.9605599999999993E-2,0.35325283720986728,1.6,0.81914638469719414,1.8637632686502703,1.2648514683218337,null,81.914638469719421,0.21404291178862769,7.5622667574343633E-2,4.4375315920244532E-2,3.1077431654099104E-2,7.8894269487565245E-3]
["Vout",{"$f":"Vout","v":5},"V","Vout",null,null,3,48,1,0.48,0.48,5.5555555555555552E-2,0.10426881852695975,6.7920961161354967,3.8760480580677483,-2.9160480580677484,48,2.0186086307739899,1.4261732814823349E-2,0.2,0.21450647153354832,1.9607092605063206,3.8443808042352427E-3,3.8443808042352427E-3,0.61690486969267366,3.8057161825053466E-4,3.8057161825053466E-4,0.65182250667949759,5.0984709625673244E-3,2.8737144363157177E-2,0,8.5731812907191788E-3,4.2445152720056029E-2,1.9104732984319093,1.4964623718487325E-2,1.1395581290719178E-2,2.642458165159978E-2,2.8223999999999992E-3,2.5488E-2,8.1495616084704854E-3,1.0560000000000001E-4,4.9499999999999995E-2,0.44473846153846153,0.42569999999999997,4.9605599999999993E-2,0.37366671993616035,2.4,0.86528059869256357,2.4892237742423533,1.417809801220111,null,86.528059869256353,0.21450647153354832,9.4357734371655802E-2,5.9267232720056032E-2,3.4835621651599778E-2,8.1495616084704854E-3]
["Fsw",{"$f":"Fsw/1000","v":300},"kHz","Switching Frequency",null,null,4,48,1,0.64,0.64,7.407407407407407E-2,0.10430287182591698,6.793922430342298,4.0369612151711491,-2.7569612151711489,48,2.0630192677543473,1.4896169746939893E-2,0.2,0.21515256567812638,1.9612364720057813,3.8464484991256841E-3,3.8464484991256841E-3,0.63056811715796368,3.9761615037613943E-4,3.9761615037613943E-4,0.66627177719695774,5.3270169730703105E-3,3.8316192484209567E-2,0,8.1054659726031777E-3,5.1795028813481546E-2,1.9524677764399827,1.5629734713949607E-2,1.1868665972603176E-2,2.7568549434329397E-2,3.7631999999999995E-3,3.3984E-2,8.5120969982513672E-3,1.0560000000000001E-4,4.9499999999999995E-2,0.44473846153846153,0.42569999999999997,4.9605599999999993E-2,0.39462510557369057,3.2,0.89021800772442172,3.1174276901662248,1.5784790659772068,null,89.021800772442177,0.21515256567812638,0.11334757824781094,7.4224468813481548E-2,3.8783269434329401E-2,8.5120969982513672E-3]
["Iout",{"$f":"Iout","v":16},"A","Max Output Current",null,null,5,48,1,0.8,0.8,9.2592592592592587E-2,0.10433692646443567,6.7957485758826879,4.1978742879413442,-2.5978742879413437,48,2.1186119415514248,1.5709807956095043E-2,0.2,0.21598124987270448,1.961763634815443,3.8485165588842988E-3,3.8485165588842988E-3,0.64765357954762814,4.1945515910085592E-4,4.1945515910085592E-4,0.68433765214162579,5.6198162656645543E-3,4.7895240605261971E-2,0,7.6377504065475495E-3,6.1210597986258705E-2,2.0050432755293799,1.6482814000656893E-2,1.2341750406547549E-2,2.8902120418387606E-2,4.7039999999999998E-3,4.2479999999999997E-2,8.9770331177685958E-3,1.0560000000000001E-4,4.9499999999999995E-2,0.44473846153846153,0.42569999999999997,4.9605599999999993E-2,0.41612857311310447,4,0.90577072967335315,3.7483907154228655,1.7468651810283757,null,90.577072967335312,0.21598124987270448,0.13259271840464631,8.9247397986258706E-2,4.2920520418387606E-2,8.9770331177685958E-3]
["Ta",{"$f":"Ta","v":25},"°C","Ambient Temperature",null,null,6,48,1,0.96,0.96,0.1111111111111111,0.10437098244259491,6.7975745527467204,4.3587872763733602,-2.4387872763733602,48,2.1845331270882147,1.670264744171035E-2,0.2,0.216992595507328,1.9622907489324346,3.8505849833458151E-3,3.8505849833458151E-3,0.66790177646157489,4.4609278300052757E-4,4.4609278300052757E-4,0.70574615486703229,5.9769316213152133E-3,5.7474288726314354E-2,0,7.1700345925376783E-3,7.0692238749931136E-2,2.0673914356590077,1.7523840127768472E-2,1.2814834592537676E-2,3.0425474985064555E-2,5.6447999999999984E-3,5.0976E-2,9.5443699666916283E-3,1.0560000000000001E-4,4.9499999999999995E-2,0.44473846153846153,0.42569999999999997,4.9605599999999993E-2,0.4381777569753616,4.8,0.91634920056085012,4.3821287474971076,1.9229754878921275,null,91.634920056085008,0.216992595507328,0.15209371373499569,0.10433639874993114,4.7247554985064555E-2,9.5443699666916283E-3]
["Vcc",{"$f":"VCC","v":5},"V","Subregulated VCC Voltage",null,null,7,48,1,1.1200000000000001,1.1200000000000001,0.12962962962962962,0.10440503976047369,6.7994003609244347,4.5197001804622179,-2.2797001804622172,48,2.2598791499425239,1.7874688203207308E-2,0.2,0.21818668972712432,1.9628178143538806,3.8526537723449451E-3,3.8526537723449451E-3,0.69103774156254205,4.775331602638587E-4,4.775331602638587E-4,0.73020692420748179,6.3984258259266119E-3,6.7053336847366751E-2,0,6.7023185305589176E-3,8.0240334390930743E-2,2.1386564988759633,1.8752791642756009E-2,1.3287918530558919E-2,3.2138828553912577E-2,6.5855999999999996E-3,5.9472000000000004E-2,1.021410754468989E-2,1.0560000000000001E-4,4.9499999999999995E-2,0.44473846153846153,0.42569999999999997,4.9605599999999993E-2,0.46077334714926638,5.6000000000000005,0.92397449619758598,5.018657884419091,2.1068187541442422,null,92.397449619758603,0.21818668972712432,0.17185116294484332,0.11949185439093074,5.1764588553912583E-2,1.021410754468989E-2]
["Components","Input Value","Units","Description",null,null,8,48,1,1.28,1.28,0.14814814814814814,0.10443909841815112,6.8012260004058804,4.68061300020294,-2.1206130002029404,48,2.3437412241364051,1.922593024000745E-2,0.2,0.21956363545108146,1.9633448310769086,3.8547229257164151E-3,3.8547229257164151E-3,0.71678478547769764,5.13780428692309E-4,5.13780428692309E-4,0.75742775619982328,6.8843616703427877E-3,7.6632384968419134E-2,0,6.2346022205966439E-3,8.9855273020531964E-2,2.2179779349340958,2.0169647091403512E-2,1.3761002220596641E-2,3.4042431672005651E-2,7.5263999999999991E-3,6.7968000000000001E-2,1.0986245851432829E-2,1.0560000000000001E-4,4.9499999999999995E-2,0.44473846153846153,0.42569999999999997,4.9605599999999993E-2,0.48391608934946057,6.4,0.92970337187895735,5.6579944268623423,2.2984051770506304,null,92.970337187895737,0.21956363545108146,0.19186570469253761,0.13471415302053197,5.6471871672005652E-2,1.0986245851432829E-2]
["L",{"$f":"Lf*1000000","v":2.2000000000000002},"uH","Filter Inductance",null,null,9,48,1,1.44,1.44,0.16666666666666663,0.10447315841570624,6.8030514711811056,4.8415257355905528,-1.9615257355905529,48,2.435239709616889,2.0756373551532325E-2,0.2,0.22112355139423473,1.9638717990986456,3.856792443294951E-3,3.856792443294951E-3,0.74487497320019114,5.5483872569998555E-4,5.5483872569998555E-4,0.78712567560438562,7.4348019503479267E-3,8.6211433089471531E-2,0,5.7668856626362248E-3,9.9537447625692027E-2,2.3045228603985008,2.1774385017807079E-2,1.4234085662636222E-2,3.6136570119458762E-2,8.4671999999999976E-3,7.6464000000000004E-2,1.18607848865899E-2,1.0560000000000001E-4,4.9499999999999995E-2,0.44473846153846153,0.42569999999999997,4.9605599999999993E-2,0.50760678519497027,7.1999999999999993,0.93414210151846377,6.3001548802790648,2.4977463878619721,null,93.414210151846376,0.22112355139423473,0.21213801774515079,0.15000368762569202,6.1369690119458767E-2,1.18607848865899E-2]
["Rdcr",{"$f":"Rdcr*1000","v":3.5},"mW","Inductor DCR at 25°C",null,null,10,48,1,1.6,1.6,0.18518518518518517,0.10450721975321814,6.8048767732401512,5.0024383866200761,-1.8024383866200755,48,2.5335473796468211,2.2466018137203458E-2,0.2,0.22286657209326935,1.9643987184162168,3.858862324915275E-3,3.858862324915275E-3,0.77505624848363897,6.007121883135324E-4,6.007121883135324E-4,0.81903446542595093,8.0498094666668785E-3,9.5790481210523942E-2,0,5.2991688566630217E-3,0.10928725612079025,2.397508054076086,2.3566983964374771E-2,1.4707168856663021E-2,3.8421565031293924E-2,9.4079999999999997E-3,8.4959999999999994E-2,1.2837724649830547E-2,1.0560000000000001E-4,4.9499999999999995E-2,0.44473846153846153,0.42569999999999997,4.9605599999999993E-2,0.53184629240841286,8,0.93766339966981738,6.9451559570731911,2.7048554567736631,null,93.766339966981732,0.22286657209326935,0.23266882115208415,0.16536085612079027,6.6458365031293931E-2,1.2837724649830547E-2]
["LTc",{"$f":"Ltc*1000000","v":4000},"ppm","Inductor Series Resistance Temp Co",null,null,11,48,1,1.76,1.76,0.20370370370370372,0.10454128243076587,6.8067019065730623,5.1633509532865309,-1.6433509532865311,48,2.6379030631189071,2.4354863996442395E-2,0.2,0.22479284793554988,1.9649255890267483,3.8609325704121135E-3,3.8609325704121135E-3,0.80709661947750966,6.5140495317202412E-4,6.5140495317202412E-4,0.8529090917249833,8.7294470249656315E-3,0.10536952933157633,0,4.8314518026624014E-3,0.11910510140028127,2.4962128618499215,2.5547422471826398E-2,1.5180251802662399E-2,4.0897773035753524E-2,1.0348799999999998E-2,9.3455999999999997E-2,1.3917065140824227E-2,1.0560000000000001E-4,4.9499999999999995E-2,0.44473846153846153,0.42569999999999997,4.9605599999999993E-2,0.55663552503599312,8.8000000000000007,0.94050900844148766,7.5930145788118137,2.9197468985551689,null,94.050900844148771,0.22479284793554988,0.25345887443603476,0.18078606140028128,7.1738253035753527E-2,1.3917065140824227E-2]
["ThetaCa",{"$f":"ThetaCa","v":20},"°C/W","Core to Ambient Thermal Resistance",null,null,12,48,1,1.92,1.92,0.22222222222222221,0.10457534644842849,6.8085268711698781,5.324263435584939,-1.4842634355849391,48,2.7476177280728464,2.6422911128670668E-2,0.2,0.22690254519158801,1.965452410927365,3.8630031796201918E-3,3.8630031796201918E-3,0.84078603492616177,7.0692115652685691E-4,7.0692115652685691E-4,0.88852768836297336,9.4737774358517879E-3,0.11494857745262871,0,4.3637345006197212E-3,0.12899139139227636,2.5999849473857615,2.7715679079193416E-2,1.5653334500619717E-2,4.3565586409176384E-2,1.1289599999999997E-2,0.101952,1.5098806359240382E-2,1.0560000000000001E-4,4.9499999999999995E-2,0.44473846153846153,0.42569999999999997,4.9605599999999993E-2,0.58197545368842829,9.6,0.9428425793859474,8.243747878475606,3.1424366788534792,null,94.284257938594735,0.22690254519158801,0.27450897780145272,0.19627971139227635,7.7209746409176383E-2,1.5098806359240382E-2]
["Cin",{"$f":"Cin*1000000","v":30},"μF","Input Capacitance",null,null,13,48,1,2.08,2.08,0.24074074074074073,0.10460941180628515,6.8103516670206456,5.4851758335103229,-1.3251758335103228,48,2.8620751479257565,2.8670159533309841E-2,0.2,0.2291958460509621,1.9659791841151932,3.8650741523742409E-3,3.8650741523742409E-3,0.87593660400832751,7.6726493424164155E-4,7.6726493424164155E-4,0.92569179153012771,1.0282863514875088E-2,0.12452762557368111,0,3.8960169505203486E-3,0.13894653911306729,2.7082409160685801,3.0071732323818722E-2,1.6126416950520348E-2,4.6425433247565762E-2,1.2230399999999999E-2,0.110448,1.6382948304748481E-2,1.0560000000000001E-4,4.9499999999999995E-2,0.44473846153846153,0.42569999999999997,4.9605599999999993E-2,0.60786710580295955,10.4,0.94477884771314924,8.8973732027488257,3.372942221175927,null,94.477884771314919,0.2291958460509621,0.29581997236063307,0.21184221911306728,8.2873273247565771E-2,1.6382948304748481E-2]
["RCinEsr",{"$f":"RCinEsr*1000","v":1},"mW","Input Capacitor ESR",null,null,14,48,1,2.2400000000000002,2.2400000000000002,0.25925925925925924,0.10464347850441488,6.812176294115404,5.6460881470577018,-1.1660881470577018,48,2.9807290196374763,3.1096609209781467E-2,0.2,0.23167294866170232,1.966505908587358,3.8671454885089904E-3,3.8671454885089904E-3,0.9123817303037649,8.3244042179209197E-4,8.3244042179209197E-4,0.96422542672550782,1.1156768082527852E-2,0.1341066736947335,0,3.428299152349643E-3,0.14897096272260835,2.8204635815704133,3.2615560741356513E-2,1.659949915234964E-2,4.9477777654993629E-2,1.3171199999999999E-2,0.11894400000000001,1.7769490977017979E-2,1.0560000000000001E-4,4.9499999999999995E-2,0.44473846153846153,0.42569999999999997,4.9605599999999993E-2,0.63431156592662341,11.200000000000001,0.94640063662402341,9.5539081143495519,3.6112824145582407,null,94.640063662402341,0.23167294866170232,0.31739274037760196,0.22747400272260837,8.8729297654993627E-2,1.7769490977017979E-2]
["Cout",{"$f":"Cout*1000000","v":200},"μF","Output Capcitance",null,null,15,48,1,2.4,2.4,0.27777777777777773,0.10467754654289681,6.8140007524441923,5.8070003762220956,-1.0070003762220963,41.784247976020595,3.1030979984298224,3.3702260157507095E-2,0.2,0.23433406717315805,1.9670325843409835,3.8692171878591682E-3,3.8692171878591682E-3,0.94997460716901339,9.0245175426592128E-4,9.0245175426592128E-4,1.0039735207433462,1.2095553964245482E-2,0.1436857218157859,5.4492934219929491E-2,2.9605811060929629E-3,0.21366897780751523,2.936197261340828,3.5347142865772049E-2,1.7072581106092957E-2,5.2723119949000523E-2,1.4111999999999996E-2,0.12744,1.9258434375718343E-2,1.0560000000000001E-4,4.9499999999999995E-2,0.44473846153846153,0.42569999999999997,4.9605599999999993E-2,0.71591386824751735,12,0.94369937735775311,12.50673386791564,3.8574776219243212,null,94.369937735775309,0.23433406717315805,0.39383209775651573,0.29777937780751523,9.4778319949000517E-2,1.9258434375718343E-2]
["RCoutEsr",{"$f":"Cout_ESR*1000","v":1},"mW","Output Capacitor ESR",null,null,16,48,1,2.56,2.56,0.29629629629629628,0.10471161592181005,6.8158250419970532,5.9679125209985262,-0.84791252099852654,35.183092157615206,3.2287597077298136,3.6487112375908293E-2,0.2,0.23717943178236409,1.9675592113731957,3.8712892502595119E-3,3.8712892502595119E-3,0.98858639802635839,9.7730306636272944E-4,9.7730306636272944E-4,1.0447999804750097,1.3099283990406968E-2,0.15326476993683827,0.10919192833245617,2.4928628117356676E-3,0.27866209108133411,3.055042102992843,3.8266457229341619E-2,1.7545662811735665E-2,5.6161996883164936E-2,1.5052799999999998E-2,0.135936,2.0849778500519021E-2,1.0560000000000001E-4,4.9499999999999995E-2,0.44473846153846153,0.42569999999999997,4.9605599999999993E-2,0.79829629056400453,12.8,0.94129438912741226,15.471953745416032,4.1115496891448133,null,94.129438912741222,0.23717943178236409,0.47076008796449903,0.36837985108133409,0.10102087688316494,2.0849778500519021E-2]
["Top Driver","Input Value","Units","Description",null,null,17,48,1,2.72,2.72,0.31481481481481483,0.10474568664123372,6.817649162764023,6.1288245813820117,-0.6888245813820113,28.581932837427853,3.3573444380260944,3.9451165864406633E-2,0.2,0.24020928878392553,1.9680857896811179,3.8733616755447496E-3,3.8733616755447496E-3,1.028104319801205,1.0569984923938984E-3,1.0569984923938984E-3,1.086585669131191,1.4168020996335339E-2,0.16284381805789067,0.16062280450076821,2.0251442692631131E-3,0.34047018432925147,3.1766481169911587,4.1373482362652238E-2,1.8018744269263112E-2,5.9794981887031605E-2,1.5993599999999997E-2,0.144432,2.2543523351089504E-2,1.0560000000000001E-4,4.9499999999999995E-2,0.44473846153846153,0.42569999999999997,4.9605599999999993E-2,0.87797953851923694,13.600000000000001,0.93935759225357818,18.303402781828563,4.3735219548021869,null,93.935759225357813,0.24020928878392553,0.54469716621628306,0.43579530432925151,0.1074575418870316,2.2543523351089504E-2]
["RdsonDRT",0.7,"W","Drain to Source Resistance of pullup Top FET Driver",null,null,18,48,1,2.88,2.88,0.33333333333333326,0.10477975870124691,6.8194731147351408,6.2897365573675703,-0.52973655736757053,21.980770015251888,3.4885289827590102,4.2594420622423648E-2,0.2,0.2434239006234401,1.9686123192618747,3.8754344635496176E-3,3.8754344635496176E-3,1.0684297666587534,1.1415421662824784E-3,1.1415421662824784E-3,1.129226424825795,1.5301827822298164E-2,0.17242286617894306,0.2087855575252624,1.5574254786606574E-3,0.39909362982259589,3.3007093396760596,4.4668196794601552E-2,1.8491825478660653E-2,6.36226853236041E-2,1.6934399999999995E-2,0.15292800000000001,2.4339668927099229E-2,1.0560000000000001E-4,4.9499999999999995E-2,0.44473846153846153,0.42569999999999997,4.9605599999999993E-2,0.95496486132657143,14.399999999999999,0.9378074212509746,21.001096612549027,4.6434192606706874,null,93.780742125097461,0.2434239006234401,0.61564431514619999,0.50002610982259588,0.1140889253236041,2.4339668927099229E-2]
["RdsonDRT2",{"$f":"RdsonDRT2","v":0.5},"W","Drain to Source Resistance of pulldown Top FET Driver",null,null,19,48,1,3.04,3.04,0.3518518518518518,0.10481383210192875,6.8212968979004449,6.450648448950222,-0.37064844895022242,15.3796036908806,3.6220308687404712,4.5916876649380982E-2,0.2,0.24682354595448139,1.9691388001125907,3.8775076141088533E-3,3.8775076141088533E-3,1.1094765529577846,1.2309382215630878E-3,1.2309382215630878E-3,1.1726312049371448,1.650076731350808E-2,0.18200191429999549,0.2536801822059242,1.0897064399136539E-3,0.45453259320088601,3.4269583702339474,4.8150579052397696E-2,1.8964906439913651E-2,6.7645754764622423E-2,1.7875199999999997E-2,0.16142399999999998,2.6238215228217704E-2,1.0560000000000001E-4,4.9499999999999995E-2,0.44473846153846153,0.42569999999999997,4.9605599999999993E-2,1.0292533549838794,15.2,0.93658036309675308,23.565042194437215,4.9212679629201332,null,93.65803630967531,0.24682354595448139,0.68360234796550845,0.56107243320088607,0.12091567476462242,2.6238215228217704E-2]
["Bottom Driver","Input Value","Units","Description",null,null,20,48,1,3.2,3.2,0.37037037037037035,0.10484790684335839,6.8231205122499698,6.6115602561249851,-0.21156025612498475,8.7784338641072512,3.7576031093048123,4.941853394470018E-2,0.2,0.25040851969916383,1.9696652322303887,3.8795811270571912E-3,3.8795811270571912E-3,1.1511693148194131,1.3251907913817971E-3,1.3251907913817971E-3,1.2167203979045202,1.7764902320123208E-2,0.19158096242104788,0.29530667334232685,6.2198715300745507E-4,0.50678703295561578,3.5551614028592651,5.1820607661559048E-2,1.9437987153007454E-2,7.186487528386247E-2,1.8815999999999999E-2,0.16991999999999999,2.8239162254114387E-2,1.0560000000000001E-4,4.9499999999999995E-2,0.44473846153846153,0.42569999999999997,4.9605599999999993E-2,1.1008459621111955,16,0.93562622781643434,25.995237784135863,5.2070959440532034,null,93.562622781643441,0.25040851969916383,0.74857190823947817,0.61893423295561578,0.12793847528386249,2.8239162254114387E-2]
["RdsonDRB",0.7,"W","Drain to Source Resistance of pullup Bottom FET Driver",null,null,21,48,1,3.36,3.36,0.3888888888888889,0.10488198292561494,6.824943957773753,6.7724719788868768,-5.2471978886876602E-2,2.1772605347251703,3.8950295252063714,5.3099392507802802E-2,0.2,0.25417913311231671,1.9701916156123931,3.8816550022293715E-3,3.8816550022293715E-3,1.1934420842655178,1.4243040084960233E-3,1.4243040084960233E-3,1.2614243172319024,1.9094295697247656E-2,0.20116001054210025,0.33366502573363138,1.5426761792741722E-4,0.55585669987929565,3.6851137966317133,5.5678261145914142E-2,1.9911067617927415E-2,7.6280769768711412E-2,1.9756799999999995E-2,0.17841599999999999,3.0342510004458742E-2,1.0560000000000001E-4,4.9499999999999995E-2,0.44473846153846153,0.42569999999999997,4.9605599999999993E-2,1.169743471775508,16.8,0.93490483191299945,28.291672914930416,5.5009326255865547,null,93.490483191299944,0.25417913311231671,0.81055346964800712,0.6736112598792956,0.1351580497687114,3.0342510004458742E-2]
["RdsonDRB2",0.5,"W","Drain to Source Resistance of pulldown Bottom FET Driver",null,null,22,48,1,3.52,3.52,0.40740740740740744,0.10491606034877757,6.8267672344618262,6.9333836172309127,0.10661638276908691,0,4.0341206277775248,5.6959452338110457E-2,0.2,0.25813571384929151,1.9707179502557264,3.8837292394601317E-3,3.8837292394601317E-3,1.2362370344211595,1.528282005274423E-3,1.528282005274423E-3,1.306681876131679,2.0489010304932054E-2,0.21073905866315265,0.34559999999999991,0,0.57882045796718784,3.8166361778468123,5.9723518027601397E-2,2.0697599999999997E-2,8.1210729031123502E-2,2.0697599999999997E-2,0.18691199999999999,3.2548258478920261E-2,1.0560000000000001E-4,4.9499999999999995E-2,0.44473846153846153,0.42569999999999997,4.9605599999999993E-2,1.2133423705712578,17.600000000000001,0.93550628343057074,29.491659874621888,5.8156917435667275,null,93.55062834305707,0.25813571384929151,0.84694318699831128,0.70218237796718785,0.14289168903112351,3.2548258478920261E-2]
["Deadtime","Input Value","Units","Description",null,null,23,48,1,3.68,3.68,0.42592592592592593,0.10495013911292542,6.8285903423042296,7.0942951711521154,0.26570482884788538,0,4.174710030479269,6.0998713435044774E-2,0.2,0.26227860603743042,1.9712442361575129,3.8858038385842166E-3,3.8858038385842166E-3,1.2795033855745683,1.6371289136967824E-3,1.6371289136967824E-3,1.3524394320441246,2.1949109008174015E-2,0.22031810678420508,0.34559999999999991,0,0.59004296992673899,3.9495710426875963,6.3956356827069183E-2,2.1638399999999999E-2,8.6495354667536939E-2,2.1638399999999999E-2,0.195408,3.4856407677168445E-2,1.0560000000000001E-4,4.9499999999999995E-2,0.44473846153846153,0.42569999999999997,4.9605599999999993E-2,1.2458482710611556,18.400000000000002,0.93658465372063759,30.198514496923035,6.1448857829687533,null,93.658465372063759,0.26227860603743042,0.87194632459427601,0.71901224992673896,0.15097999466753692,3.4856407677168445E-2]
["Deadtime",{"$f":"Deadtime*1000000000","v":14},"ns","Total Deadtime",null,null,24,48,1,3.84,3.84,0.44444444444444442,0.10498421921813761,6.8304132812909906,7.2552066406454951,0.42479335935450457,0,4.3166513409628484,6.5217175798027258E-2,0.2,0.26660817035122619,1.9717704733148744,3.8878787994363639E-3,3.8878787994363639E-3,1.3231964575806212,1.7508488653539048E-3,1.7508488653539048E-3,1.3986497857135454,2.3474654676918557E-2,0.22989715490525742,0.34559999999999991,0,0.60134335260969773,4.083779814872468,6.8376756063075209E-2,2.2579199999999994E-2,9.1979851476645016E-2,2.2579199999999994E-2,0.203904,3.7266957598872719E-2,1.0560000000000001E-4,4.9499999999999995E-2,0.44473846153846153,0.42569999999999997,4.9605599999999993E-2,1.2789258597012321,19.2,0.93754917281975592,30.908639689607305,6.4822145790994528,null,93.754917281975594,0.26660817035122619,0.89722720408634271,0.73591999260969776,0.15926817147664502,3.7266957598872719E-2]
["IQ","Input Value","Units","Description",null,null,25,48,1,4,4,0.46296296296296291,0.10501830066449339,6.8322360514121474,7.4161180257060737,0.5838819742939263,0,4.4598154806955099,6.9614839426479627E-2,0.2,0.27112478409120344,1.9722966617249347,3.8899541218513213E-3,3.8899541218513213E-3,1.3672768525238457,1.8694459914475141E-3,1.8694459914475141E-3,1.4452713178402046,2.5065710186058743E-2,0.23947620302630981,0.34559999999999991,0,0.61272211010489708,4.2191403081291057,7.2984694252687027E-2,2.3519999999999996E-2,9.7665142512740236E-2,2.3519999999999996E-2,0.21240000000000001,3.9779908243702644E-2,1.0560000000000001E-4,4.9499999999999995E-2,0.44473846153846153,0.42569999999999997,4.9605599999999993E-2,1.3125769450658424,20,0.9384130343107232,31.622056624405676,6.827715700268528,null,93.841303431072319,0.27112478409120344,0.92278725261763739,0.75290611010489705,0.16775714251274024,3.9779908243702644E-2]
["IQ ",{"$f":"Iq*1000","v":2.2000000000000001E-3},"mA","Quiescent Current Of Controller (Not Switching!)",null,null,26,48,1,4.16,4.16,0.48148148148148145,0.10505238345207182,6.8340586526577241,7.5770293263288622,0.74297067367113812,0,4.6040883794366749,7.4191704319823387E-2,0.2,0.27582884126655366,1.9728228013848141,3.892029805663826E-3,3.892029805663826E-3,1.4117097516097739,1.9929244227901294E-3,1.9929244227901294E-3,1.4922672463803737,2.6722338415435955E-2,0.24905525114736221,0.34559999999999991,0,0.62417975271693782,4.3555445435724982,7.7780149911281043E-2,2.4460799999999998E-2,0.10355219075231512,2.4460799999999998E-2,0.22089600000000001,4.2395259611327653E-2,1.0560000000000001E-4,4.9499999999999995E-2,0.44473846153846153,0.42569999999999997,4.9605599999999993E-2,1.3468033985755883,20.8,0.93918745859900443,32.338786734111387,7.1814283396192256,null,93.91874585990044,0.27582884126655366,0.94862794346925294,0.76997111271693786,0.17644787075231511,4.2395259611327653E-2]
["High-side FET","Input Value","Units","Description",null,null,27,48,1,4.32,4.32,0.5,0.10508646758095215,6.8358810850177596,7.7379405425088805,0.90205945749112049,0,4.7493689950043505,7.8947770477480222E-2,0.2,0.28072075268155772,1.9733488922916373,3.8941058507086321E-3,3.8941058507086321E-3,1.45646431120195,2.1212882898049706E-3,2.1212882898049706E-3,1.5396049885668892,2.8444602249840613E-2,0.25863429926841464,0.34559999999999991,0,0.63571679703939021,4.4928968750560685,8.2763101552543197E-2,2.5401599999999996E-2,0.10964199953671398,2.5401599999999996E-2,0.22939200000000001,4.5113011701417273E-2,1.0560000000000001E-4,4.9499999999999995E-2,0.44473846153846153,0.42569999999999997,4.9605599999999993E-2,1.3816071550995928,21.6,0.93988204803191855,33.058851715654392,7.5433933331442597,null,93.988204803191849,0.28072075268155772,0.97475079657610419,0.7871155170393902,0.18534135953671399,4.5113011701417273E-2]
["RdsonTop",{"$f":"Rdson1*1000","v":12},"mW","Drain-Source Resistance of Top FET ",null,null,28,48,1,4.4800000000000004,4.4800000000000004,0.51851851851851849,0.10512055305121354,6.8377033484822807,7.8988516742411408,1.0611483257588601,0,4.8955676133437773,8.3883037898871707E-2,0.2,0.28580094602583317,1.9738749344425253,3.8961822568204835E-3,3.8961822568204835E-3,1.5015131443067171,2.2545417225258444E-3,2.2545417225258444E-3,1.5872556131840805,3.0232564579012456E-2,0.26821334738946701,0.34559999999999991,0,0.6473337660292694,4.6311123798970932,8.7933527688468072E-2,2.6342399999999998E-2,0.11593561303552735,2.6342399999999998E-2,0.23788800000000002,4.7933164513640977E-2,1.0560000000000001E-4,4.9499999999999995E-2,0.44473846153846153,0.42569999999999997,4.9605599999999993E-2,1.4169902135836174,22.400000000000002,0.94050506798396971,33.782273533229315,7.9136531785459647,null,94.050506798396967,0.28580094602583317,1.0011573790647967,0.80433984602926945,0.19443865303552738,4.7933164513640977E-2]
["RdsonTopTc",{"$f":"RdsonTopTc*1000000","v":4000},"ppm","Drain to Source Resistance Temp Co",null,null,29,48,1,4.6399999999999997,4.6399999999999997,0.53703703703703698,0.10515463986293516,6.8395254430413166,8.0597627215206575,1.2202372784793414,0,5.0426043889873142,8.8997506583419442E-2,0.2,0.29106986596844037,1.9744009278345993,3.8982590238341268E-3,3.8982590238341268E-3,1.5468318753494295,2.3926888505970329E-3,2.3926888505970329E-3,1.6351933702583201,3.2086288297641166E-2,0.27779239551051937,0.34559999999999991,0,0.65903118908280856,4.7701154771868319,9.3291406829359144E-2,2.7283199999999994E-2,0.12243411673114299,2.7283199999999994E-2,0.24638399999999999,5.0855718047668245E-2,1.0560000000000001E-4,4.9499999999999995E-2,0.44473846153846153,0.42569999999999997,4.9605599999999993E-2,1.4529546377044913,23.2,0.94106367131011848,34.509074421477962,8.2922520549575207,null,94.106367131011851,0.29106986596844037,1.0278493058139515,0.82164462908280855,0.20374083673114299,5.0855718047668245E-2]
["QgTop",{"$f":"Qg_Q1*1000000000","v":8},"nC","Gate Charge Of Top FET",null,null,30,48,1,4.8,4.8,0.55555555555555547,0.10518872801619622,6.8413473686848976,8.2206736843424491,1.379326315657551,0,5.1904080910448949,9.4291176530545084E-2,0.2,0.29652797425588967,1.9749268724649818,3.9003361515843145E-3,3.9003361515843145E-3,1.5923987576210898,2.5357338032731907E-3,2.5357338032731907E-3,1.6833952869465629,3.4005836305366813E-2,0.2873714436315718,0.34559999999999991,0,0.6708096021125517,4.9098387406788024,9.8836717483828662E-2,2.8223999999999992E-2,0.12913863792488511,2.8223999999999992E-2,0.25488,5.388067230316862E-2,1.0560000000000001E-4,4.9499999999999995E-2,0.44473846153846153,0.42569999999999997,4.9605599999999993E-2,1.4895025565513527,24,0.94156407904600237,35.239276888727169,8.6792358435428252,null,94.156407904600243,0.29652797425588967,1.0548282400374367,0.83903040211255164,0.21324903792488512,5.388067230316862E-2]
["QgdTop",{"$f":"Qgd_Q1*1000000000","v":2.9},"nC","Gate to Drain Charge",null,null,31,48,1,4.96,4.96,0.57407407407407407,0.10522281751107591,6.8431691254030484,8.3815845627015246,1.5384154372984757,0,5.3389150246005785,9.9764047739670292E-2,0.2,0.30217574981408818,1.975452768330793,3.9024136399057937E-3,3.9024136399057937E-3,1.6381943442153719,2.6836807094192325E-3,2.6836807094192325E-3,1.7318408199268853,3.5991271506780317E-2,0.29695049175262417,0.34559999999999991,0,0.68266954762579024,5.0502218777337671,0.10456943815879717,2.9164799999999994E-2,0.13605034626519572,2.9164799999999994E-2,0.263376,5.7008027279811593E-2,1.0560000000000001E-4,4.9499999999999995E-2,0.44473846153846153,0.42569999999999997,4.9605599999999993E-2,1.5266361653342109,24.8,0.94201172699213209,35.972903720283192,9.0746521489934668,null,94.201172699213203,0.30217574981408818,1.0820958938909859,0.85649770762579025,0.22296442626519572,5.7008027279811593E-2]
["QgsTop",{"$f":"Qgs_Q1*1000000000","v":3.1},"nC",null,null,null,32,{"$f":"Vin","v":48},{"$f":"MODE","v":1},5.12,{"$f":"Iout*G41/100/Number_of_Phases","v":5.12},{"$f":"Vout*K41/(Vin*Efficiency)","v":0.59259259259259256},{"$f":"(Vout+(Rdson2+Rs+Rdcr)*K41)/(Vin+(Rs+Rdson2-Rdson1)*K41)","v":0.10525690834765347},{"$f":"(Vin-(Rdson1+Rdcr)*K41-Vout)*M41/(Fsw*Lf)","v":6.8449907131858021},8.5424953565929016,1.6975046434070991,{"$f":"IF(MIN(Vin, -P41/(Coss_Q1+Coss_Q2)*0.00000002)<0, 0, MIN(Vin, -P41/(Coss_Q1+Coss_Q2)*0.00000002))","v":0},5.4880681016759736,{"$f":"R41^2*Rdcr","v":0.10541612021021664},{"$f":"Core_Loss_Ch1","v":0.2},{"$f":"(T41+S41*(1+Ltc*(Ta-25)))/(1-S41*Ltc*ThetaCa)","v":0.30801368885426894},1.9759786154291556,3.904491488633323E-3,3.904491488633323E-3,1.6842012045804455,2.8365336975102236E-3,2.8365336975102236E-3,1.7805115559726081,{"$f":"Rdson1*AB41^2","v":3.8042656811423978E-2},{"$f":"(Vin*K41/2)*Fsw*(Tr_buck+Tf_buck)","v":0.30652953987367654},{"$f":"(0.5*Coss_Q1*(Vin-Q41)^2-0.5*Coss_Q2*(Vin-Q41)^2+(Qoss_Q2*(Vin-Q41)/Vin)*Vin)*Fsw","v":0.34559999999999991},{"$f":"IF(K41>N41/2,0,ABS(K41-N41/2)*Vsd_Q1*Deadtime*Fsw)","v":0},{"$f":"(AF41+AE41+AD41+AC41*(1+RdsonTopTc*Ta-RdsonTopTc*25))/(1-AC41*RdsonTopTc*ThetaJA_Q1)","v":0.69461157480436453},{"$f":"SQRT((1-M41))*SQRT(K41^2+(N41^2)/12)","v":5.1912108498577982},{"$f":"Rdson2*AH41^2","v":0.11048954735949341},{"$f":"IF(K41<N41/2,Deadtime*Fsw*IF(VfdSky_Q2>0,0,Vsd_Q2)*(K41+N41/2),2*Deadtime*Fsw*IF(VfdSky_Q2>0,0,Vsd_Q2)*K41)","v":3.0105599999999996E-2},{"$f":"(AJ41+AI41*(1+RdsonBotTc*Ta-RdsonBotTc*25))/(1-AI41*RdsonBotTc*ThetaJA_Q2)","v":0.14317045429833547},{"$f":"2*Deadtime*Fsw*IF(VfdSky_Q2>0,VfdSky_Q2,Vsd_Q2)*K41","v":3.0105599999999996E-2},{"$f":"IF(QrrSky_Q2>0,QrrSky_Q2,Qrr_Q2*K41/(Iout/Number_of_Phases))*Fsw*Vin","v":0.271872},{"$f":"Rs*R41^2","v":6.0237782977266646E-2},{"$f":"Iq*Vin","v":1.0560000000000001E-4},{"$f":"IF(Ext_VCC=1,  (Qg_Q1+Qg_Q2)*Fsw*VCC, (Qg_Q1+Qg_Q2)*Fsw*Vin)","v":4.9499999999999995E-2},0.44473846153846153,{"$f":"(Qg_Q1+Qg_Q2)*Fsw*(Vin-VCC)","v":0.42569999999999997},{"$f":"SUM(AO41:AP41)","v":4.9605599999999993E-2},{"$f":" SUM(U41,X41,AA41,AG41,AK41,AL41,AM41,AS41,AN41)","v":1.5643577261203789},{"$f":"Vout*K41","v":25.6},0.94241138546720948,{"$f":"ThetaJA_Q1*BC41","v":36.709977981783311},{"$f":"ThetaJA_Q2*BD41","v":9.4785503219422544},null,94.241138546720947,{"$f":"U41","v":0.30801368885426894},{"$f":"AG41+AK41+AM41","v":1.1096540291027002},{"$f":"AG41+AM41*0.66","v":0.8740470948043646},{"$f":"AK41+AM41*0.33","v":0.23288821429833548},{"$f":"AN41","v":6.0237782977266646E-2}]
["RGateTop",{"$f":"Rgate1","v":1.2},"W","Gate Resistance",null,null,33,48,1,{"$f":"Iout*G42/100","v":5.28},5.28,0.61111111111111116,0.10529100052600804,6.8468121320231781,8.7034060660115884,1.8565939339884112,0,5.6378160397091399,0.11124739394160578,0.2,0.31404230498294722,1.9765044137571888,3.9065696976016487E-3,3.9065696976016487E-3,1.7304036799635152,2.9942968956312758E-3,2.9942968956312758E-3,1.8293909536097865,4.0160055133791887E-2,0.31610858799472896,0.34559999999999991,0,0.70663623958585964,5.332757113956375,0.11659702358945452,3.1046399999999995E-2,0.15050021804210337,3.1046399999999995E-2,{"$f":"IF(QrrSky_Q2>0,QrrSky_Q2,Qrr_Q2*K42/(Iout/Number_of_Phases))*Fsw*Vin","v":0.28036800000000006},6.3569939395203306E-2,1.0560000000000001E-4,4.9499999999999995E-2,0.44473846153846153,0.42569999999999997,4.9605599999999993E-2,1.6026695685993466,26.400000000000002,0.94276725779043258,37.450523022606106,9.8909814823136095,null,94.276725779043261,0.31404230498294722,1.1375044576279629,0.89167911958585966,0.24302165804210341,6.3569939395203306E-2]
["GfsTop",{"$f":"Gfs_Q1","v":55},"S","Transconductance of Top FET",null,null,34,48,1,5.44,5.44,0.62962962962962965,0.10532509404621891,6.8486333819052065,8.8643166909526041,2.0156833090473971,0,5.7881126687933033,0.11725786893325939,0.2,0.32026212931594872,1.9770301633120142,3.9086482666455293E-3,3.9086482666455293E-3,1.7767876720299005,3.1569744314774335E-3,3.1569744314774335E-3,1.8784641198181602,4.2343529393330588E-2,0.32568763611578133,0.34559999999999991,0,0.71874410474621342,5.4748169665479516,0.12289184535052537,3.1987199999999993E-2,0.15804093758309706,3.1987199999999993E-2,0.28886400000000001,6.7004496533291075E-2,1.0560000000000001E-4,4.9499999999999995E-2,0.44473846153846153,0.42569999999999997,4.9605599999999993E-2,1.6415740908766732,27.200000000000003,0.9430830617738043,38.194562479340959,10.31199854363205,null,94.30830617738043,0.32026212931594872,1.1656490423293104,0.90939434474621339,0.25336605758309705,6.7004496533291075E-2]
["VthTop",{"$f":"Vth_Q1","v":3.1},"V","Threshold Voltage of Top FET",null,null,35,48,1,5.6,5.6,0.64814814814814814,0.10535918890836525,6.8504544628219088,9.0252272314109536,2.1747727685890452,0,5.9389163317561318,0.12344754518459899,0.2,0.32667371059655814,1.9775558640907511,3.9107271955997171E-3,3.9107271955997171E-3,1.8233404598027125,3.3245704323535672E-3,3.3245704323535672E-3,1.9277176166484047,4.4593142514439264E-2,0.3352666842368337,0.34559999999999991,0,0.73093573998376771,5.6173509758660352,0.12937399114285869,3.2927999999999992E-2,0.16579395769806302,3.2927999999999992E-2,0.29736000000000001,7.0541454391199424E-2,1.0560000000000001E-4,4.9499999999999995E-2,0.44473846153846153,0.42569999999999997,4.9605599999999993E-2,1.6810737602975419,28,0.9433620975482967,38.942120279318246,10.741656238311165,null,94.336209754829667,0.32667371059655814,1.1940896976818307,0.92719333998376774,0.263922757698063,7.0541454391199424E-2]
["VspTop",{"$f":"Vsp_Q1","v":3.3909090909090911},"V",null,null,null,36,48,1,5.76,5.76,0.66666666666666652,0.10539328511252634,6.8522753747633116,9.186137687381656,2.333862312618344,0,6.0901893635829563,0.12981642269504642,0.2,0.33327761531783823,1.978081516090521,3.9128064842989738E-3,3.9128064842989738E-3,1.8700505408074588,3.4970890251742695E-3,3.4970890251742695E-3,1.9771392934083367,4.6908957426470603E-2,0.34484573235788613,0.34559999999999991,0,0.74321172200478791,5.7603234890724462,0.13604343946491501,3.3868799999999991E-2,0.17376066849990918,3.3868799999999991E-2,0.30585600000000002,7.4180812968597951E-2,1.0560000000000001E-4,4.9499999999999995E-2,0.44473846153846153,0.42569999999999997,4.9605599999999993E-2,1.7211711143006063,28.799999999999997,0.94360730432476236,39.693220644201091,11.180011143946304,null,94.360730432476231,0.33327761531783823,1.2228283905046973,0.94507668200478789,0.27469314849990917,7.4180812968597951E-2]
["VsdTop",{"$f":"Vsd_Q1","v":0.7},"V",null,null,null,37,48,1,5.92,5.92,0.68518518518518512,0.10542738265878138,6.8540961177194379,9.3470480588597198,2.492951941140281,0,6.2418976387456127,0.13636450146402318,0.2,0.34007442784916836,1.9786071193084434,3.9148861325780564E-3,3.9148861325780564E-3,1.9169074929332752,3.6745343364637346E-3,3.6745343364637346E-3,2.0267181407333332,4.9291037063730954E-2,0.35442478047893844,0.34559999999999991,0,0.75557263461047275,5.9037022037532072,0.14290016881346193,3.4809599999999996E-2,0.18194250610897716,3.4809599999999996E-2,0.31435200000000002,7.7922572265156101E-2,1.0560000000000001E-4,4.9499999999999995E-2,0.44473846153846153,0.42569999999999997,4.9605599999999993E-2,1.7618687613028163,29.6,0.9438213081397504,40.447888093639854,11.627121710635372,null,94.382130813975039,0.34007442784916836,1.2518671407194499,0.96304495461047279,0.28567866610897719,7.7922572265156101E-2]
["θJATop",{"$f":"ThetaJA_Q1","v":42},"°C/W","Junction to Ambient Resistance",null,null,38,48,1,6.08,6.08,0.70370370370370361,0.10546148154720961,6.8559166916803091,9.5079583458401551,2.6520416541598455,0,6.3940101767413324,0.14309178149095103,0.2,0.34706475056705927,1.9791326737416377,3.9169661402717239E-3,3.9169661402717239E-3,1.9639018540537252,3.8569104923556596E-3,3.8569104923556596E-3,2.0764441634173747,5.1739444365480974E-2,0.36400382859999098,0.34559999999999991,0,0.76801906878548909,6.0474577945184249,0.14994415768357475,3.5750399999999995E-2,0.19034095335020412,3.5750399999999995E-2,0.32284799999999997,8.1766732280543458E-2,1.0560000000000001E-4,4.9499999999999995E-2,0.44473846153846153,0.42569999999999997,4.9605599999999993E-2,1.8031693816159233,30.4,0.94400646221345796,41.206147448990542,12.083048289353309,null,94.400646221345795,0.34706475056705927,1.2812080221356932,0.98109874878548908,0.29688079335020412,8.1766732280543458E-2]
["Low-side FET","Input Value","Units","Description",null,null,39,48,1,6.24,6.24,0.72222222222222221,0.10549558177789033,6.8577370966359492,9.6688685483179739,2.8111314516820256,0,6.5464987976180629,0.14999826277525161,0.2,0.35424920399029641,1.9796581793872241,3.9190465072147388E-3,3.9190465072147388E-3,2.0110250168988788,4.0442216185931365E-3,4.0442216185931365E-3,2.1263082693551305,5.4254242275936129E-2,0.37358287672104329,0.34559999999999991,0,0.78055162278805112,6.1915635869210561,0.15717538456863558,3.6691199999999993E-2,0.19895754047682393,3.6691199999999993E-2,0.33134399999999997,8.5713293014429481E-2,1.0560000000000001E-4,4.9499999999999995E-2,0.44473846153846153,0.42569999999999997,4.9605599999999993E-2,1.8450757283954087,31.200000000000003,0.94416488121980768,41.968023837098151,12.547853161406735,null,94.416488121980763,0.35424920399029641,1.310853163264875,0.99923866278805118,0.30830106047682393,8.5713293014429481E-2]
["RdsonBot",{"$f":"Rdson2*1000","v":4.0999999999999996},"mW","Drain-Source Resistance of Low-side FET",null,null,40,48,1,6.4,6.4,0.7407407407407407,0.10552968335090271,6.8595573325763732,9.8297786662881865,2.9702213337118137,0,6.6993378205044909,0.15708394531634653,0.2,0.36162842691947095,1.9801836362423202,3.9211272332418581E-3,3.9211272332418581E-3,2.0582691370490229,4.2364718405285291E-3,4.2364718405285291E-3,2.1763021723454647,5.6835493744267072E-2,0.38316192484209577,0.34559999999999991,0,0.79317090224158038,6.3359952720852206,0.16459382796033367,3.7631999999999999E-2,0.20779384592129438,3.7631999999999999E-2,0.33983999999999998,8.9762254466483726E-2,1.0560000000000001E-4,4.9499999999999995E-2,0.44473846153846153,0.42569999999999997,4.9605599999999993E-2,1.8875906286225999,32,0.94429847051361993,42.733542694146372,13.02160056899668,null,94.429847051361989,0.36162842691947095,1.3408047481628746,1.0174653022415803,0.31994104592129435,8.9762254466483726E-2]
["RdsonBotTc",{"$f":"RdsonBotTc*1000000","v":4000},"ppm","Drain To Source Resitance Temp Co",null,null,41,48,1,6.56,6.56,0.75925925925925919,0.10556378626632608,6.861377399491607,9.9906886997458031,3.1293113002541961,0,6.8525037992100266,0.16434882911365747,0.2,0.36920307658095675,1.9807090443040469,3.9232083181878511E-3,3.9232083181878511E-3,2.1056270522396381,4.4336652831233874E-3,4.4336652831233874E-3,2.226418306843982,5.9483261724600285E-2,0.39274097296314808,0.34559999999999991,0,0.80587752022796855,6.4807306564258491,0.17219946634866501,3.857279999999999E-2,0.2168514970741624,3.857279999999999E-2,0.34833599999999992,9.3913616636375694E-2,1.0560000000000001E-4,4.9499999999999995E-2,0.44473846153846153,0.42569999999999997,4.9605599999999993E-2,1.9307169841207747,32.799999999999997,0.94440895115976098,43.502729769574685,13.504356746918409,null,94.440895115976105,0.36920307658095675,1.3710650173021308,1.0357792802279686,0.33180237707416238,9.3913616636375694E-2]
["QgBot",{"$f":"Qg_Q2*1000000000","v":25},"nC","Gate Charge Of Top FET",null,null,42,48,1,6.72,6.72,0.77777777777777779,0.10559789052423968,6.8631972973716682,10.151598648685834,3.2884013513141657,0,7.0059752898427696,0.17179291416660616,0.2,0.3769738287753957,1.9812344035695224,3.9252897618874813E-3,3.9252897618874813E-3,2.1530922114364537,4.6358060709483194E-3,4.6358060709483194E-3,2.2766497530365837,6.2197609176018451E-2,0.40232002108420051,0.34559999999999991,0,0.81867209738247837,6.6257494416772165,0.17999227822193237,3.9513599999999989E-2,0.22613217109161185,3.9513599999999989E-2,0.35683199999999998,9.8167379523774953E-2,1.0560000000000001E-4,4.9499999999999995E-2,0.44473846153846153,0.42569999999999997,4.9605599999999993E-2,1.9744577726060968,33.6,0.94449788145115421,44.275611130064085,13.996189955428603,null,94.44978814511542,0.3769738287753957,1.4016362684740902,1.0541812173824783,0.34388673109161183,9.8167379523774953E-2]
["RGateBot",{"$f":"Rgate2","v":1.2},"W","Gate Resistance",null,null,43,48,1,6.88,6.88,0.79629629629629617,0.10563199612472281,6.8650170262065764,10.312508513103289,3.4474914868967117,0,7.1597326461380879,0.17941620047461426,0.2,0.38494137803075346,1.9817597140358656,3.927371564175516E-3,3.927371564175516E-3,2.2006586123665075,4.8428983281828828E-3,4.8428983281828828E-3,2.326990170845896,6.4978599062560941E-2,0.41189906920525288,0.34559999999999991,0,0.8315552619903086,6.7710330311527862,0.18797224206674454,4.0454399999999995E-2,0.23563759573247064,4.0454399999999995E-2,0.36532799999999999,0.10252354312835101,1.0560000000000001E-4,4.9499999999999995E-2,0.44473846153846153,0.42569999999999997,4.9605599999999993E-2,2.0188160487742421,34.4,0.94456667547702478,45.052213163592967,14.497170514311557,null,94.45666754770248,0.38494137803075346,1.4325208577227793,1.0726717419903087,0.35619583573247066,0.10252354312835101]
["VsdBot",{"$f":"Vsd_Q2","v":0.7},"V","Diode Forward Voltage of Bottom FET Body Diode",null,null,44,48,1,7.04,7.04,0.81481481481481488,0.10566610306785472,6.8668365859863467,10.473418292993173,3.6065817070068267,0,7.3137578388190239,0.18721868803710351,0.2,0.39310643776001303,1.9822849757001941,3.9294537248867195E-3,3.9294537248867195E-3,2.248320746382841,5.0549461786154951E-3,5.0549461786154951E-3,2.377433741684936,6.7826294353224431E-2,0.4214781173263053,0.34559999999999991,0,0.8445276500848572,6.9165643587538961,0.19613933636801723,4.1395199999999993E-2,0.24536955022548987,4.1395199999999993E-2,0.37382399999999999,0.10698210744977343,1.0560000000000001E-4,4.9499999999999995E-2,0.44473846153846153,0.42569999999999997,4.9605599999999993E-2,2.063794945423636,35.200000000000003,0.94461661920246554,45.832562583563998,15.007370838177438,null,94.461661920246556,0.39310643776001303,1.463721200310347,1.0912514900848571,0.36873147022548985,0.10698210744977343]
["QrrBot",{"$f":"Qrr_Q2*1000000000","v":59},"nC","Reverse Recovery Charge of Body Diode",null,null,45,48,1,7.2,7.2,0.83333333333333326,0.1057002113537147,6.8686559767009951,10.634327988350497,3.7656720116495026,0,7.4680342958408987,0.19520037685349556,0.2,0.40146974042357209,1.9828101885596259,3.9315362438558593E-3,3.9315362438558593E-3,2.29607354970247,5.2719537456433008E-3,5.2719537456433008E-3,2.4279751169435251,7.0740758021963099E-2,0.43105716544735767,0.34559999999999991,0,0.85758990554771264,7.0623277377475864,0.20449353960897165,4.2335999999999992E-2,0.25532986616773723,4.2335999999999992E-2,0.38231999999999999,0.11154307248771174,1.0560000000000001E-4,4.9499999999999995E-2,0.44473846153846153,0.42569999999999997,4.9605599999999993E-2,2.1093976746162326,36,0.94464888443982797,46.616686433003935,15.526865473026906,null,94.464888443982801,0.40146974042357209,1.49523977171545,1.1099211055477127,0.38149546616773722,0.11154307248771174]
["TrrBot",{"$f":"Trr_Q2*1000000000","v":40},"ns","Reverse Recovery Time of Body Diode",null,null,46,48,1,7.36,7.36,0.85185185185185186,0.10573432098238206,6.8704751983405421,10.795237599170271,3.9247624008297293,0,7.6225467608219839,0.20336126692321202,0.2,0.410032037696416,1.9833353526112798,3.9336191209177092E-3,3.9336191209177092E-3,2.3439123601943987,5.4939251522720771E-3,5.4939251522720771E-3,2.478609372337802,7.3722053047689515E-2,0.44063621356841015,0.34559999999999991,0,0.8707426802104079,7.2083087267594834,0.21303483027113537,4.3276799999999997E-2,0.26552042845499024,4.3276799999999997E-2,0.390816,0.11620643824183545,1.0560000000000001E-4,4.9499999999999995E-2,0.44473846153846153,0.42569999999999997,4.9605599999999993E-2,2.1556275288768392,36.800000000000004,0.94466454102737973,47.404612088837126,16.055731134118101,null,94.46645410273797,0.410032037696416,1.5270791086653981,1.1286812402104078,0.39448970845499021,0.11620643824183545]
["θJABot",{"$f":"ThetaJA_Q2","v":40.700000000000003},"°C/W","Junction to Ambient Resistance",null,null,47,48,1,7.52,7.52,0.87037037037037013,0.10576843195393609,6.8722942508950018,10.956147125447501,4.0838528745524982,0,7.7772811673429318,0.21170135824567463,0.2,0.41879410064013811,1.9838604678522735,3.9357023559070418E-3,3.9357023559070418E-3,2.3918328790105963,5.7208645211161181E-3,5.7208645211161181E-3,2.5293319673758856,7.6770242414274825E-2,0.45021526168946246,0.34559999999999991,0,0.88398663395796573,7.3544940107880619,0.2217631868343416,4.4217599999999989E-2,0.27594317624504627,4.4217599999999989E-2,0.399312,0.12097220471181408,1.0560000000000001E-4,4.9499999999999995E-2,0.44473846153846153,0.42569999999999997,4.9605599999999993E-2,2.202487882431988,37.599999999999994,0.94466456747785044,48.19636726623456,16.594046745173383,null,94.466456747785045,0.41879410064013811,1.5592418102030119,1.1475325539579657,0.40771613624504627,0.12097220471181408]
["Bottom Schottky","Input Value","Units","Std Units",null,null,48,48,1,7.68,7.68,0.88888888888888884,0.10580254426845609,6.8741131343543866,11.117056567177194,4.2429434328228064,0,7.9322245271209146,0.22022065082030517,0.2,0.42775671987988167,1.9843855342797236,3.9377859486586248E-3,3.9377859486586248E-3,2.4398311364514824,5.9527759743981321E-3,5.9527759743981321E-3,2.5801387092969326,7.9885389110549293E-2,0.45979430981051483,0.34559999999999991,0,0.89732243483427676,7.5008712953527059,0.23067858777672931,4.5158399999999987E-2,0.28660010395491003,4.5158399999999987E-2,0.407808,0.12584037189731725,1.0560000000000001E-4,4.9499999999999995E-2,0.44473846153846153,0.42569999999999997,4.9605599999999993E-2,2.2499821924894423,38.4,0.94464986031641729,48.991980023039623,17.141893478964839,null,94.464986031641729,0.42775671987988167,1.5917305387891867,1.1664757148342768,0.42117674395491,0.12584037189731725]
["VfdSky",{"$f":"VfdSky_Q2","v":0},"V","Diode Forward Voltage",null,null,49,48,1,7.84,7.84,0.90740740740740744,0.10583665792602137,6.8759318487087109,11.277965924354355,4.4020340756456449,0,8.0873648303391903,0.22891914464652535,0.2,0.4369207057862815,1.9849105518907477,3.9398698990072327E-3,3.9398698990072327E-3,2.4879034615412894,6.1896636339491299E-3,6.1896636339491299E-3,2.631025720929371,8.3067556130303005E-2,0.46937335793156726,0.34559999999999991,0,0.91075075914933767,7.6474292121480492,0.23978101157474283,4.6099199999999993E-2,0.29749326229285694,4.6099199999999993E-2,0.41630400000000001,0.1308109397980145,1.0560000000000001E-4,4.9499999999999995E-2,0.44473846153846153,0.42569999999999997,4.9605599999999993E-2,2.2981140005594467,39.200000000000003,0.94462124229239763,49.791478764272178,17.699354799319277,null,94.462124229239762,0.4369207057862815,1.6245480214421946,1.1855113991493376,0.43487358229285694,0.1308109397980145]
["QrrSky",{"$f":"QrrSky_Q2*1000000000","v":0},"nC","Diode Reverse Recovery Charge",null,null,50,48,1,8,8,0.92592592592592582,0.10587077292671127,6.8777503939479878,11.438875196973994,4.5611248030260061,0,8.2426909566468431,0.23779683972375681,0.2,0.44628688866248378,1.9854355206824628,3.9419542067876418E-3,3.9419542067876418E-3,2.5360464548600659,6.4315316212083086E-3,6.4315316212083086E-3,2.6819894119895085,8.6316806472285956E-2,0.47895240605261963,0.34559999999999991,0,0.9242722915883882,7.7941572347986297,0.24907043670313164,4.7039999999999992E-2,0.30862475932641625,4.7039999999999992E-2,0.42480000000000001,0.13588390841357531,1.0560000000000001E-4,4.9499999999999995E-2,0.44473846153846153,0.42569999999999997,4.9605599999999993E-2,2.3468869338188592,40,0.94457946961988837,50.594892246712305,18.266516504585145,null,94.457946961988839,0.44628688866248378,1.6576970509148046,1.2046402915883883,0.44880875932641628,0.13588390841357531]
["Ireverse",{"$f":"Ireverse","v":0},"mA","Reverse Leakage Current",null,null,51,48,1,8.16,8.16,0.94444444444444431,0.10590488927060508,6.8795687700622308,11.599784385031116,4.7202156149688843,0,8.3981925955430814,0.24685373605142122,0.2,0.45585611893632788,1.985960440651986,3.9440388718346301E-3,3.9440388718346301E-3,2.5842569642400028,6.6783840572229554E-3,6.6783840572229554E-3,2.7330264534060791,8.9633203140208936E-2,0.48853145417367205,0.34559999999999991,0,0.93788772532298692,7.941045603496887,0.25854684163495062,4.798079999999999E-2,0.31999676158735957,4.798079999999999E-2,0.43329600000000001,0.14105927774366928,1.0560000000000001E-4,4.9499999999999995E-2,0.44473846153846153,0.42569999999999997,4.9605599999999993E-2,2.396304706519401,40.799999999999997,0.9445252383786028,51.402249583565457,18.843466772605534,null,94.452523837860284,0.45585611893632788,1.6911804869103464,1.223863085322987,0.46298444158735957,0.14105927774366928]
["Controller","Input Value","Units","Std Units",null,null,52,48,1,8.32,8.32,0.96296296296296291,0.10593900695778215,6.8813869770414486,11.760693488520724,4.8793065114792764,0,8.5538601750310939,0.25608983362894044,0.2,0.46562926735777388,1.986485311796433,3.9461238939829711E-3,3.9461238939829711E-3,2.6325320629858107,6.9302250626483283E-3,6.9302250626483283E-3,2.7841337543112599,9.3016809142743725E-2,0.49811050229472442,0.34559999999999991,0,0.951597762124054,8.0880852574690181,0.26821020484155939,4.8921599999999996E-2,0.33161149521482725,4.8921599999999996E-2,0.44179200000000002,0.14633704778796597,1.0560000000000001E-4,4.9499999999999995E-2,0.44473846153846153,0.42569999999999997,4.9605599999999993E-2,2.4463711214412522,41.6,0.9444591901862629,52.213580249210267,19.430296207243472,null,94.445919018626284,0.46562926735777388,1.7250012573388811,1.243180482124054,0.47740285521482728,0.14633704778796597]
["θJA",30,"°C/W","Junction to Ambient Resistance",null,null,53,48,1,8.48,8.48,0.98148148148148151,0.10597312598832183,6.8832050148756565,11.921602507437829,5.0383974925621722,0,8.7096847975726117,0.26550513245573615,0.2,0.47560722520166193,1.9870101341129212,3.9482092730674491E-3,3.9482092730674491E-3,2.6808690303234792,7.1870587577475527E-3,7.1870587577475527E-3,2.8353084413858149,9.6467687493523926E-2,0.50768955041577679,0.34559999999999991,0,0.96540311247693023,8.2352677743515912,0.27806050479262262,4.9862399999999994E-2,0.34347124713777405,4.9862399999999994E-2,0.45028800000000002,0.15171721854613496,1.0560000000000001E-4,4.9499999999999995E-2,0.44473846153846153,0.42569999999999997,4.9605599999999993E-2,2.4970900713933162,42.400000000000006,0.94438191723734088,53.028914084031072,20.027097886507406,null,94.438191723734093,0.47560722520166193,1.7591623596147044,1.2625931924769302,0.49206628713777406,0.15171721854613496]
["Theta Ja",2,"°C/W","Junction to Ambient Resistance",null,null,54,48,1,8.64,8.64,1,0.10600724636230344,6.8850228835548597,12.082511441777431,5.1974885582225703,0,8.8656581824996419,0.27509963253122999,0.2,0.48579090447589662,1.987534907598566,3.9502950089228403E-3,3.9502950089228403E-3,2.7292653338199835,7.4488892623915063E-3,7.4488892623915063E-3,2.886547840286398,9.9985901211144812E-2,0.51726859853682927,0.34559999999999991,0,0.97930449569848044,8.3825853156804069,0.28809771995610917,5.0803199999999993E-2,0.3555783662979643,5.0803199999999993E-2,0.45878400000000003,0.15719979001784573,1.0560000000000001E-4,4.9499999999999995E-2,0.44473846153846153,0.42569999999999997,4.9605599999999993E-2,2.5484655407615016,43.2,0.94429396678909727,53.848281299336179,20.633967412327149,null,94.429396678909725,0.48579090447589662,1.7936668619964449,1.2821019356984804,0.50697708629796434,0.15719979001784573]
[null,null,null,null,null,null,55,48,1,8.8000000000000007,8.8000000000000007,1.0185185185185184,0.10604136807980633,6.8868405830690698,12.243420291534536,5.3565797084654658,0,9.0217726141476167,0.2848733338548437,0.2,0.49618123813514636,1.9880596322504835,3.9523811013839278E-3,3.9523811013839278E-3,2.7777186135493843,7.7157206960587138E-3,7.7157206960587138E-3,2.9378494589178197,0.1035715133191647,0.52684764665788164,0.34559999999999991,0,0.99330264005629099,8.5300305777951468,0.29832182879829283,5.1743999999999998E-2,0.36793526491480016,5.1743999999999998E-2,0.46728000000000003,0.16278476220276783,1.0560000000000001E-4,4.9499999999999995E-2,0.44473846153846153,0.42569999999999997,4.9605599999999993E-2,2.6005016071064482,44,0.94419584516425281,54.671712482364221,21.25100296203237,null,94.419584516425275,0.49618123813514636,1.8285179049710911,1.3017074400562909,0.52213766491480018,0.16278476220276783]
[null,null,null,null,null,null,56,48,1,8.9600000000000009,8.9600000000000009,1.037037037037037,0.10607549114090985,6.8886581134082929,12.404329056704148,5.5156709432958539,0,9.1780208950669486,0.29482623642599931,0.2,0.50677918030015512,1.9885843080657888,3.9544675502854922E-3,3.9544675502854922E-3,2.8262266678090864,7.9875571778352528E-3,7.9875571778352528E-3,2.989210972342935,0.10722458684610474,0.53642669477893401,0.34559999999999991,0,1.0073982828899941,8.6775967475511404,0.30873280978375151,5.2684799999999997E-2,0.38054441979331938,5.2684799999999997E-2,0.47577600000000003,0.16847213510057102,1.0560000000000001E-4,4.9499999999999995E-2,0.44473846153846153,0.42569999999999997,4.9605599999999993E-2,2.6532024428121606,44.800000000000004,0.94408802132986402,55.499238601379759,21.878305341588099,null,94.408802132986409,0.50677918030015512,1.8637187026833135,1.3214104428899942,0.53755049979331937,0.16847213510057102]
["Outputs",null,null,null,null,null,57,48,1,9.1199999999999992,9.1199999999999992,1.0555555555555554,0.10610961554569337,6.8904754745625389,12.565237737281269,5.6747622627187297,0,9.3343963037500348,0.30495834024411811,0.2,0.51758570648276314,1.9891089350415982,3.9565543554623212E-3,3.9565543554623212E-3,2.874787440214424,8.2644028264146022E-3,8.2644028264146022E-3,3.0406302091486666,0.11094518482544957,0.54600574289998638,0.34559999999999991,0,1.0215921707347673,8.8252774623053547,0.31933064137536682,5.3625599999999989E-2,0.39340837367675724,5.3625599999999989E-2,0.48427199999999992,0.17426190871092462,1.0560000000000001E-4,4.9499999999999995E-2,0.44473846153846153,0.42569999999999997,4.9605599999999993E-2,2.706572316787089,45.599999999999994,0.94397093010371746,56.330891010860228,22.515978040644018,null,94.397093010371748,0.51758570648276314,1.8992725444115246,1.3412116907347673,0.55321813367675721,0.17426190871092462]
["Design","Value","Units",null,null,null,58,48,1,9.2799999999999994,9.2799999999999994,1.074074074074074,0.1061437412942363,6.8922926665218149,12.726146333260907,5.8338536667390919,0,9.4908925563799951,0.31526964530862223,0.2,0.52860181381674221,1.9896335131750269,3.9586415167492004E-3,3.9586415167492004E-3,2.9233990080209007,8.5462617600975867E-3,8.5462617600975867E-3,3.0921051391089547,0.11473337029564809,0.55558479102103875,0.34559999999999991,0,1.0358850594470437,8.9730667737092649,0.33011530203432526,5.4566399999999987E-2,0.40652973664512776,5.4566399999999987E-2,0.49276799999999998,0.18015408303349842,1.0560000000000001E-4,4.9499999999999995E-2,0.44473846153846153,0.42569999999999997,4.9605599999999993E-2,2.7606155962192584,46.4,0.94384497503258347,57.166701456775833,23.164127289456705,null,94.384497503258345,0.52860181381674221,1.9351827960921715,1.3611119394470437,0.56914317664512781,0.18015408303349842]
["Dmax",{"$f":"D1_Vinmin","v":0.20833333333333334},"index",null,null,null,59,48,1,9.44,9.44,1.0925925925925923,0.10617786838661794,6.8941096892761227,12.887054844638062,5.9929451553619382,0,9.6475037721672283,0.32576015161893318,0.2,0.53982852129454395,1.9901580424631884,3.9607290339809097E-3,3.9607290339809097E-3,2.9720595715416303,8.8331380967922191E-3,8.8331380967922191E-3,3.1436338620047337,0.11858920630011356,0.56516383914209112,0.34559999999999991,0,1.0502777143324855,9.1209591148978468,0.34108677022011619,5.5507199999999986E-2,0.41991118756133528,5.5507199999999986E-2,0.50126399999999993,0.1861486580679618,1.0560000000000001E-4,4.9499999999999995E-2,0.44473846153846153,0.42569999999999997,4.9605599999999993E-2,2.8153367483870997,47.199999999999996,0.94371053098072188,58.006702081964391,23.822862117746347,null,94.371053098072196,0.53982852129454395,1.9714529018938207,1.3811119543324855,0.58532830756133525,0.1861486580679618]
["Dprime",{"$f":"1-B68","v":0.79166666666666663},"index",null,null,null,60,48,1,9.6,9.6,1.1111111111111109,0.10621199682291771,6.8959265428154719,13.047963271407735,6.1520367285922637,0,9.8042244418919875,0.33642985917447288,0.2,0.55126687001007635,1.9906825229031992,3.9628169069922461E-3,3.9628169069922461E-3,3.0207674445434609,9.1250359540136321E-3,9.1250359540136321E-3,3.1952145974778223,0.12251275588722435,0.5747428872631436,0.34559999999999991,0,1.0647709102762588,9.2689492707133141,0.35224502439053312,5.6447999999999984E-2,0.4335554755664025,5.6447999999999984E-2,0.50975999999999999,0.19224563381398452,1.0560000000000001E-4,4.9499999999999995E-2,0.44473846153846153,0.42569999999999997,4.9605599999999993E-2,2.870740342527728,48,0.94356794646199005,58.850925431602867,24.492294415552582,null,94.356794646199006,0.55126687001007635,2.0080863858426614,1.4012125102762587,0.60177627556640245,0.19224563381398452]
["Ipp",{"$f":"Iripple_Vinnom","v":6.9014596329719575},"A",null,null,null,61,48,1,9.76,9.76,1.1296296296296295,0.10624612660321497,6.8977432271298627,13.208871613564931,6.3111283864350689,0,9.9610493993162184,0.34727876797466301,0.2,0.56291792340761104,1.9912069544921722,3.9649051356179911E-3,3.9649051356179911E-3,3.0695210455189805,9.4219594488839358E-3,9.4219594488839358E-3,3.2468456758101421,0.12650408211032421,0.58432193538419597,0.34559999999999991,0,1.0793654318756554,9.4170323506448135,0.36359004300167297,5.738879999999999E-2,0.44746542162545638,5.738879999999999E-2,0.51825599999999994,0.19844501027123598,1.0560000000000001E-4,4.9499999999999995E-2,0.44473846153846153,0.42569999999999997,4.9605599999999993E-2,2.9268310517644607,48.8,0.94341754574457692,59.699404458777529,25.172538996156074,null,94.341754574457696,0.56291792340761104,2.0450868535011115,1.4214143918756554,0.61848990162545636,0.19844501027123598]
["Top FET","Value","Units",null,null,null,62,48,1,9.92,9.92,1.1481481481481481,0.10628025772758919,6.8995597422093038,13.369779871104651,6.470220128895348,0,10.117973795167337,0.35830687801892525,0.2,0.57478276753694457,1.9917313372272234,3.9669937196929435E-3,3.9669937196929435E-3,3.1183188897436596,9.7239126981321297E-3,9.7239126981321297E-3,3.2985255295323883,0.13056324802772307,0.59390098350524834,0.34559999999999991,0,1.0940620735751168,9.5652037642026215,0.37512180450793553,5.8329599999999988E-2,0.46164392012619432,5.8329599999999988E-2,0.526752,0.20474678743938585,1.0560000000000001E-4,4.9499999999999995E-2,0.44473846153846153,0.42569999999999997,4.9605599999999993E-2,2.9836136550954664,49.6,0.94325963075368924,60.552172530154905,25.863713661136114,null,94.325963075368918,0.57478276753694457,2.0824579937013112,1.4417183935751168,0.63547208012619438,0.20474678743938585]
["Tr",{"$f":"(Qgd_Q1+Qgs_Q1/2)*(RdsonDRT+Rgate1)/(VCC-Vsp_Q1)*1000000000","v":6.0841807909604526},"ns","Turn on of MOSFET -> Rise time of current",null,null,63,48,1,10.08,10.08,1.1666666666666665,0.10631439019611966,6.9013760880437927,13.530688044021897,6.6293119559781033,0,10.274993073430847,0.36951418930668162,0.2,0.58686251131492295,1.9922556711054651,3.9690826590518874E-3,3.9690826590518874E-3,3.1671595820378209,1.0030899818093984E-2,1.0030899818093984E-2,3.3502526857773143,0.13469031670269729,0.60348003162630071,0.34559999999999991,0,1.1088616398036961,9.7134591984778407,0.38684028736202442,5.9270399999999987E-2,0.47609394053162224,5.9270399999999987E-2,0.53524800000000006,0.21115096531810379,1.0560000000000001E-4,4.9499999999999995E-2,0.44473846153846153,0.42569999999999997,4.9605599999999993E-2,3.0410930394454909,50.4,0.94309448279433905,61.409263431755242,26.565939267637027,null,94.309448279433909,0.58686251131492295,2.1202035803353185,1.4621253198036963,0.65272578053162222,0.21115096531810379]
["Tf",{"$f":"(Qgd_Q1+Qgs_Q1/2)*(RdsonDRT2+Rgate1)/(Vsp_Q1)*1000000000","v":2.2309651474530829},"ns","Turn off of MOSFET -> Fall time of current",null,null,64,{"$f":"Vin","v":48},{"$f":"MODE","v":1},10.24,{"$f":"Iout*G73/100/Number_of_Phases","v":10.24},{"$f":"Vout*K73/(Vin*Efficiency)","v":1.1851851851851851},{"$f":"(Vout+(Rdson2+Rs+Rdcr)*K73)/(Vin+(Rs+Rdson2-Rdson1)*K73)","v":0.10634852400888584},{"$f":"(Vin-(Rdson1+Rdcr)*K73-Vout)*M73/(Fsw*Lf)","v":6.9031922646233337},13.691596132311666,6.7884038676883334,{"$f":"IF(MIN(Vin, -P73/(Coss_Q1+Coss_Q2)*0.00000002)<0, 0, MIN(Vin, -P73/(Coss_Q1+Coss_Q2)*0.00000002))","v":0},10.432102949718701,{"$f":"R73^2*Rdcr","v":0.38090070183735364},{"$f":"Core_Loss_Ch1","v":0.2},{"$f":"(T73+S73*(1+Ltc*(Ta-25)))/(1-S73*Ltc*ThetaCa)","v":0.59915828679345717},1.992779956124012,3.9711719535296197E-3,3.9711719535296197E-3,3.2160418101622885,1.034292492471193E-2,1.034292492471193E-2,3.4020257593024641,{"$f":"Rdson1*AB73^2","v":0.13888535120349008},{"$f":"(Vin*K73/2)*Fsw*(Tr_buck+Tf_buck)","v":0.61305907974735308},{"$f":"(0.5*Coss_Q1*(Vin-Q73)^2-0.5*Coss_Q2*(Vin-Q73)^2+(Qoss_Q2*(Vin-Q73)/Vin)*Vin)*Fsw","v":0.34559999999999991},{"$f":"IF(K73>N73/2,0,ABS(K73-N73/2)*Vsd_Q1*Deadtime*Fsw)","v":0},{"$f":"(AF73+AE73+AD73+AC73*(1+RdsonTopTc*Ta-RdsonTopTc*25))/(1-AC73*RdsonTopTc*ThetaJA_Q1)","v":1.123764945115018},{"$f":"SQRT((1-M73))*SQRT(K73^2+(N73^2)/12)","v":9.8617945976669024},{"$f":"Rdson2*AH73^2","v":0.39874547001494554},{"$f":"IF(K73<N73/2,Deadtime*Fsw*IF(VfdSky_Q2>0,0,Vsd_Q2)*(K73+N73/2),2*Deadtime*Fsw*IF(VfdSky_Q2>0,0,Vsd_Q2)*K73)","v":6.0211199999999993E-2},{"$f":"(AJ73+AI73*(1+RdsonBotTc*Ta-RdsonBotTc*25))/(1-AI73*RdsonBotTc*ThetaJA_Q2)","v":0.49081852908892915},{"$f":"2*Deadtime*Fsw*IF(VfdSky_Q2>0,VfdSky_Q2,Vsd_Q2)*K73","v":6.0211199999999993E-2},{"$f":"IF(QrrSky_Q2>0,QrrSky_Q2,Qrr_Q2*K73/(Iout/Number_of_Phases))*Fsw*Vin","v":0.54374400000000001},{"$f":"Rs*R73^2","v":0.21765754390705921},{"$f":"Iq*Vin","v":1.0560000000000001E-4},{"$f":"IF(Ext_VCC=1,  (Qg_Q1+Qg_Q2)*Fsw*VCC, (Qg_Q1+Qg_Q2)*Fsw*Vin)","v":4.9499999999999995E-2},{"$f":"(Vin-VCC)*Fsw*(Qg_Q1+Qg_Q2)+(RdsonDRT+RdsonDRT2)*Fsw*Qg_Q1*VCC/(RdsonDRT+2*Rgate1+RdsonDRT2)+(RdsonDRB+RdsonDRB2)*Fsw*Qg_Q2*VCC/(RdsonDRB+2*Rgate2+RdsonDRB2)","v":0.44473846153846153},{"$f":"(Qg_Q1+Qg_Q2)*Fsw*(Vin-VCC)","v":0.42569999999999997},4.9605599999999993E-2,{"$f":" SUM(U73,X73,AA73,AG73,AK73,AL73,AM73,AS73,AN73)","v":3.0992742017827055},{"$f":"Vout*K73","v":51.2},0.94292236411364494,{"$f":"ThetaJA_Q1*BC73","v":62.270711374830761},{"$f":"ThetaJA_Q2*BD73","v":27.27933979791942},null,94.292236411364499,{"$f":"U73","v":0.59915828679345717},2.1583274742039471,1.4826359851150182,0.67025404908892916,0.21765754390705921]
["Part Power","Value","Units",null,null,null,65,48,1,{"$f":"Iout*G74/100","v":10.4},10.4,1.2037037037037037,0.10638265916596717,6.9050082719379313,{"$f":"K74+N74/2","v":13.852504135968966},{"$f":"K74-N74/2","v":6.9474958640310351},0,{"$f":"SQRT(K74^2+(N74^2)/12)","v":10.589299391506549},0.39246641561036338,0.2,0.61167124943415008,{"$f":"N74/SQRT(12)","v":1.9933041922799788},{"$f":"RCoutEsr*V74^2","v":3.9732616029609386E-3},{"$f":"W74","v":3.9732616029609386E-3},{"$f":"SQRT(M74*(1-M74))*SQRT(K74^2+(N74^2)/12)","v":3.2649643387845706},{"$f":"RCinEsr*Y74^2","v":1.065999213353497E-2},{"$f":"Z74","v":1.065999213353497E-2},{"$f":"SQRT(M74)*SQRT(K74^2+(N74^2)/12)","v":3.4538434461156498},0.14314841460331232,0.62263812786840556,0.34559999999999991,0,1.1387728143297806,10.010206144365107,0.41083733091600821,6.1151999999999991E-2,0.50582081059645556,6.1151999999999991E-2,0.55224000000000006,0.22426652320592191,1.0560000000000001E-4,4.9499999999999995E-2,0.44473846153846153,0.42569999999999997,4.9605599999999993E-2,3.1581622513028043,52,{"$f":"AU74/(AU74+AT74)","v":0.9427435193196958},63.13655100185079,28.004042431275746,null,{"$f":"AV74*100","v":94.274351931969576},0.61167124943415008,{"$f":"AG74+AK74+AM74","v":2.1968336249262359},{"$f":"AG74+AM74*0.66","v":1.5032512143297807},{"$f":"AK74+AM74*0.33","v":0.68806001059645561},{"$f":"AN74","v":0.22426652320592191}]
["Power Dis",{"$f":"AS9","v":4.9605599999999993E-2},"W",null,null,null,66,48,1,10.56,10.56,1.2222222222222223,0.106416795667443,6.9068241099775785,14.013412054988789,7.1065879450112117,0,10.746578600055956,0.40421133062513226,0.2,0.62440257838966418,1.9938283795704763,3.9753516071806315E-3,3.9753516071806315E-3,3.3139260039594296,1.0982105559718514E-2,1.0982105559718514E-2,3.5057045176438577,0.14747956998034265,0.63221717598945792,0.34559999999999991,0,1.153886082680853,10.158690242455082,0.42311584851282352,6.209279999999999E-2,0.5211039902307818,6.209279999999999E-2,0.56073600000000012,0.23097790321436129,1.0560000000000001E-4,4.9499999999999995E-2,0.44473846153846153,0.42569999999999997,{"$f":"SUM(AO75:AP75)","v":4.9605599999999993E-2},3.2177624116825592,52.800000000000004,0.9425581766719856,64.006817392595835,28.740177618392821,null,94.255817667198556,0.62440257838966418,2.2357260729116346,1.5239718426808531,0.70614687023078182,0.23097790321436129]
["Temp rise",{"$f":"B75*B62","v":1.4881679999999997},"°C",null,null,null,67,48,1,10.72,10.72,1.2407407407407407,0.10645093351339281,6.9086397787322813,14.174319889366142,7.26568011063386,0,10.903936993857931,0.41613544688108234,0.2,0.6373534767919653,1.9943525179926198,3.9774419660235025E-3,3.9774419660235025E-3,3.362925708073901,1.1309269318024348E-2,1.1309269318024348E-2,3.5576078153928141,0.15187888041772837,0.6417962241105104,0.34559999999999991,0,1.1691055959610217,10.307243501435265,0.43558100125130583,6.3033599999999995E-2,0.53667135543606626,6.3033599999999995E-2,0.56923200000000007,0.23779168393204705,1.0560000000000001E-4,4.9499999999999995E-2,0.44473846153846153,0.42569999999999997,4.9605599999999993E-2,3.2780800234051477,53.6,0.94236654925665164,64.881546070362916,29.4878791582479,null,94.236654925665164,0.6373534767919653,2.2750089513970879,1.5447987159610217,0.72451791543606625,0.23779168393204705]
["Current (switching)",{"$f":"(Qg_Q1+Qg_Q2)*Fsw+Iq","v":9.9021999999999999E-3},"A",null,null,null,68,48,1,10.88,10.88,1.2592592592592593,0.106485072703896,6.9104552781920336,14.335227639096018,7.424772360903984,0,11.061371193451759,0.42823876437763536,0.2,0.65052517204757143,1.9948766075435205,3.9795326793243451E-3,3.9795326793243451E-3,3.4119624152121708,1.164148752282047E-2,1.164148752282047E-2,3.6095522460501184,0.15634640900358546,0.65137527223156266,0.34559999999999991,0,1.1844322106734391,10.455862722050195,0.44823276757567149,6.3974399999999987E-2,0.55252627787784281,6.3974399999999987E-2,0.57772800000000002,0.24470786535864877,1.0560000000000001E-4,4.9499999999999995E-2,0.44473846153846153,0.42569999999999997,4.9605599999999993E-2,3.3391205461596467,54.400000000000006,0.94216883605821145,65.760773008284445,30.247284277628207,null,94.216883605821138,0.65052517204757143,2.3146864885512821,1.565732690673439,0.74317651787784289,0.24470786535864877]
["Qrr Current",{"$f":"Qrr_Q2*Fsw","v":1.77E-2},"A",null,null,null,69,48,1,11.04,11.04,1.2777777777777777,0.10651921323903205,6.9122706083468399,14.49613530417342,7.5838646958265787,0,11.218878007488893,0.44052128311421285,0.2,0.66391891613995446,1.9954006482202933,3.9816237469179668E-3,3.9816237469179668E-3,3.4610351469005578,1.1978764288080965E-2,1.1978764288080965E-2,3.6615367769899509,0.16088221883099948,0.66095432035261514,0.34559999999999991,0,1.1998667941848302,10.604544883099321,0.46107112592843869,6.4915199999999978E-2,0.56867221546359192,6.4915199999999978E-2,0.58622399999999997,0.25172644749383594,1.0560000000000001E-4,4.9499999999999995E-2,0.44473846153846153,0.42569999999999997,4.9605599999999993E-2,3.4008895613172117,55.199999999999996,0.94196522293814866,66.644534635762867,31.018533713368196,null,94.196522293814866,0.66391891613995446,2.3547630096484222,1.5867746341848301,0.76212613546359198,0.25172644749383594]
["Diode Current",{"$f":"Deadtime*Fsw*(Iripple_Vinnom/2)*(Vsd_Q2)/Vin","v":2.1135720125976617E-4},null,null,null,null,70,48,1,11.2,11.2,1.2962962962962963,0.10655335511888032,6.9140857691866904,14.657042884593345,7.7429571154066537,0,11.376454419925356,0.45298300309023704,0.2,0.67753598593923381,1.9959246400200483,3.9837151686391596E-3,3.9837151686391596E-3,3.5101429781970399,1.2321103727385985E-2,1.2321103727385985E-2,3.7135604321417506,0.1654863729980259,0.6705333684736674,0.34559999999999991,0,1.2154102248815131,10.753287129314009,0.47409605475042826,6.5855999999999984E-2,0.58511271443250135,6.5855999999999984E-2,0.59472000000000003,0.25884743033727831,1.0560000000000001E-4,4.9499999999999995E-2,0.44473846153846153,0.42569999999999997,4.9605599999999993E-2,3.463392774486552,56,0.9417558835295291,67.532867845023546,31.801771797402807,null,94.175588352952914,0.67753598593923381,2.3952429393140147,1.6079254248815131,0.78137031443250138,0.25884743033727831]
["Total",{"$f":"SUM(B77:B79)","v":2.7813557201259765E-2},"A",null,null,null,71,48,1,11.36,11.36,1.3148148148148147,0.10658749834352034,6.9159007607015877,14.817950380350794,7.9020496196492056,0,11.534097578238306,0.46562392430512972,0.2,0.69137768351930984,1.9964485829398997,3.9858069443227334E-3,3.9858069443227334E-3,3.5592850340934379,1.2668509953921525E-2,1.2668509953921525E-2,3.7656222881892387,0.17015893460769069,0.68011241659471988,0.34559999999999991,0,1.2310633923282932,10.902086760203995,0.48730753248076236,6.679679999999999E-2,0.60185141151692878,6.679679999999999E-2,0.60321599999999997,0.26607081388864556,1.0560000000000001E-4,4.9499999999999995E-2,0.44473846153846153,0.42569999999999997,4.9605599999999993E-2,3.526636018151422,56.8,0.94154098005580311,68.425809997788321,32.597146544739005,null,94.154098005580309,0.69137768351930984,2.4361308038452218,1.6291859523282932,0.80091269151692879,0.26607081388864556]
[null,null,null,null,null,null,72,48,1,11.52,11.52,1.333333333333333,0.10662164291303151,6.917715582881522,14.97885779144076,8.0611422085592395,0,11.691804782573282,0.47844404675831215,0.2,0.70544533648259311,1.9969724769769579,3.9878990738034864E-3,3.9878990738034864E-3,3.6084604862017517,1.3020987080479383E-2,1.3020987080479383E-2,3.8177214710696039,0.17489996676799033,0.68969146471577225,0.34559999999999991,0,1.2468271974302876,11.050941219784749,0.5007055375568642,6.7737599999999981E-2,0.61889203617820754,6.7737599999999981E-2,0.61171200000000003,0.27339659814760692,1.0560000000000001E-4,4.9499999999999995E-2,0.44473846153846153,0.42569999999999997,4.9605599999999993E-2,3.5906252543929784,57.599999999999994,0.94132066408105219,69.323398932072081,33.404809744453047,null,94.132066408105217,0.70544533648259311,2.4774312336084954,1.6505571174302875,0.82075699617820752,0.27339659814760692]
[null,null,null,null,null,null,73,48,1,11.68,11.68,1.3518518518518516,0.10665578882749334,6.9195302357164898,15.139765117858245,8.2202348821417548,0,11.849573475738113,0.49144337044920677,0.2,0.71974029829248487,1.9974963221283351,3.9899915569162258E-3,3.9899915569162258E-3,3.657668549698982,1.3378539219457055E-2,1.3378539219457055E-2,3.8698571527457921,0.17970953259189323,0.69927051283682462,0.34559999999999991,0,1.2627025525977462,11.199848087106291,0.51429004841445958,6.8678399999999987E-2,0.63623841291953798,6.8678399999999987E-2,0.62020799999999998,0.28082478311383247,1.0560000000000001E-4,4.9499999999999995E-2,0.44473846153846153,0.42569999999999997,4.9605599999999993E-2,3.6553665776999749,58.4,0.94109507719814911,70.225672969105332,34.224917053825195,null,94.109507719814914,0.71974029829248487,2.5191489655172843,1.6720398325977461,0.84090705291953793,0.28082478311383247]
[null,null,null,null,null,null,74,48,1,11.84,11.84,1.3703703703703702,0.10668993608698527,6.9213447191964894,15.300672359598245,8.3793276404017547,0,12.007401233967979,0.50462189537723512,0.2,0.73426394861376743,1.9980201183911441,3.9920843934957619E-3,3.9920843934957619E-3,3.706908480507388,1.3741170482857593E-2,1.3741170482857593E-2,3.9220285482275106,0.18458769519733914,0.70884956095787688,0.34559999999999991,0,1.2786903819139233,11.348805067511917,0.52806104348757499,6.9619199999999992E-2,0.65389446367883253,6.9619199999999992E-2,0.62870400000000004,0.28835536878699153,1.0560000000000001E-4,4.9499999999999995E-2,0.44473846153846153,0.42569999999999997,4.9605599999999993E-2,3.7208662178698679,59.2,0.94086435166060822,71.132670920384783,35.057628095728489,null,94.086435166060824,0.73426394861376743,2.5612888455927556,1.6936350219139233,0.86136678367883257,0.28835536878699153]
[null,null,null,null,null,null,75,48,1,12,12,1.3888888888888888,0.10672408469158674,6.9231590333115074,15.461579516655753,8.5384204833442467,0,12.165285758393713,0.5179796215418192,0.2,0.74901769366107451,1.9985438657624941,3.9941775833768943E-3,3.9941775833768943E-3,3.7561795726894491,1.4108884982289493E-2,1.4108884982289493E-2,3.9742349128190755,0.18953451770724053,0.71842860907892947,0.34559999999999991,0,1.2947916213060746,11.497809984562576,0.54201850120853812,7.0559999999999984E-2,0.67186421030452226,7.0559999999999984E-2,0.63719999999999999,0.29598835516675381,1.0560000000000001E-4,4.9499999999999995E-2,0.44473846153846153,0.42569999999999997,4.9605599999999993E-2,3.7871305430040914,60,0.9406286109632902,72.044432094855139,35.903106559394061,null,94.062861096329016,0.74901769366107451,2.6038558316105966,1.7153436213060747,0.88214021030452228,0.29598835516675381]
[null,null,null,null,null,null,76,48,1,12.16,12.16,1.4074074074074072,0.10675823464137732,6.924973178051542,15.622486589025771,8.6975134109742296,0,12.323224867152041,0.53151654894238043,0.2,0.76400296655561084,1.9990675642394982,3.9962711263944401E-3,3.9962711263944401E-3,3.8054811560388302,1.4481686828966632E-2,1.4481686828966632E-2,4.0264755395743084,0.1945500632494826,0.72800765719998195,0.34559999999999991,0,1.3110072187196333,11.646860772568898,0.55616240000797701,7.1500799999999989E-2,0.6901517771174509,7.1500799999999989E-2,0.64569599999999994,0.30372374225278886,1.0560000000000001E-4,4.9499999999999995E-2,0.44473846153846153,0.42569999999999997,4.9605599999999993E-2,3.8541660626008452,60.8,0.94038797037658672,72.960996306224601,36.761520304680253,null,94.038797037658668,0.76400296655561084,2.6468549958370842,1.7371665787196333,0.9032314571174509,0.30372374225278886]
[null,null,null,null,null,null,77,48,1,12.32,12.32,1.4259259259259258,0.10679238593643642,6.9267871534065826,15.783393576703292,8.856606423296709,0,12.481216488082531,0.54523267757834137,0.2,0.77922122769029845,1.9995912138192662,3.9983650223832058E-3,3.9983650223832058E-3,3.8548125938504585,1.4859580133708101E-2,1.4859580133708101E-2,4.078749756940681,0.19963439495692398,0.73758670532103421,0.34559999999999991,0,1.327338134295643,11.795955469678562,0.57049271831482229,7.2441599999999995E-2,0.70876139356214063,7.2441599999999995E-2,0.65419199999999988,0.3115615300447665,1.0560000000000001E-4,4.9499999999999995E-2,0.44473846153846153,0.42569999999999997,4.9605599999999993E-2,3.9219794307489395,61.6,0.94014253743823273,73.882403880417002,37.633041469979126,null,94.014253743823275,0.77922122769029845,2.6902915278577835,1.7591048542956429,0.9246447535621406,0.3115615300447665]
[null,null,null,null,null,null,78,48,1,12.48,12.48,1.4444444444444444,0.10682653857684354,6.9286009593666167,15.944300479683308,9.0156995203166925,0,12.639258651961278,0.55912800744912317,0.2,0.79467396510352539,2.0001148144989078,4.0004592711780007E-3,4.0004592711780007E-3,3.9041732808544909,1.5242569006938119E-2,1.5242569006938119E-2,4.131056926576588,0.20478757596739686,0.74716575344208658,0.34559999999999991,0,1.3437853405515106,11.945092211471689,0.58500943455630239,7.3382399999999987E-2,0.72769739695084246,7.3382399999999987E-2,0.66268799999999994,0.31950171854235604,1.0560000000000001E-4,4.9499999999999995E-2,0.44473846153846153,0.42569999999999997,4.9605599999999993E-2,3.99057744942635,62.400000000000006,0.93989241240647114,74.808695663163448,38.517846583899292,null,93.989241240647118,0.79467396510352539,2.7341707375023532,1.7811594205515107,0.94638443695084251,0.31950171854235604]
[null,null,null,null,null,null,79,48,1,12.64,12.64,1.462962962962963,0.1068606925626782,6.9304145959216399,16.105207297960821,9.1747927020391806,0,12.797349486226187,0.57320253855414771,0.2,0.81036269486169177,2.0006383662755352,4.0025538726136426E-3,4.0025538726136426E-3,3.9535626413003691,1.5630657558685951E-2,1.5630657558685951E-2,4.18339644132719,0.21000966942370797,0.75674480156313906,0.34559999999999991,0,1.360349822565148,12.094269225021604,0.59971252715794898,7.4323199999999992E-2,0.74696423530397105,7.4323199999999992E-2,0.671184,0.3275443077452273,1.0560000000000001E-4,4.9499999999999995E-2,0.44473846153846153,0.42569999999999997,4.9605599999999993E-2,4.0599670719073382,63.2,0.93963768867791975,75.739913027736222,39.416116680871625,null,93.96376886779197,0.81036269486169177,2.7784980578691192,1.8033312625651481,0.96845495530397108,0.3275443077452273]
[null,null,null,null,null,null,80,48,1,12.8,12.8,1.4814814814814814,0.10689484789401993,6.9322280630616406,16.266114031530822,9.3338859684691808,0,12.955487209152922,0.58745627089283747,0.2,0.82628896145073871,2.0011618691462583,4.0046488265249461E-3,4.0046488265249461E-3,4.0029801271784704,1.6023849898585761E-2,1.6023849898585761E-2,4.2357677233456243,0.2153007384736389,0.76632384968419154,0.34559999999999991,0,1.3770325781625818,12.243484823382124,0.61460197454359233,7.5263999999999998E-2,0.76656647029064595,7.5263999999999998E-2,0.67967999999999995,0.33568929765304995,1.0560000000000001E-4,4.9499999999999995E-2,0.44473846153846153,0.42569999999999997,4.9605599999999993E-2,4.1301554062821273,64,0.93937845317315549,76.676097882828444,40.32803742082929,null,93.937845317315549,0.82628896145073871,2.8232790484532275,1.8256213781625819,0.99086087029064596,0.33568929765304995]
[null,null,null,null,null,null,81,48,1,12.96,12.96,1.5000000000000002,0.10692900457094819,6.9340413607766065,16.427020680388303,9.4929793196116972,0,13.113670124444443,0.60188920446461369,0.2,0.84245433817685622,2.0016853231081866,4.0067441327467255E-3,4.0067441327467255E-3,4.0524252165680368,1.6422150135876501E-2,1.6422150135876501E-2,4.288170222347623,0.22066084626994636,0.7759028978052438,0.34559999999999991,0,1.3938346181090966,12.392737400466366,0.62967775513536328,7.6204799999999989E-2,0.78650878027327908,7.6204799999999989E-2,0.68817600000000001,0.34393668826549351,1.0560000000000001E-4,4.9499999999999995E-2,0.44473846153846153,0.42569999999999997,4.9605599999999993E-2,4.2011497190933493,64.800000000000011,0.93911478669273751,77.617292680582054,41.253799213122463,null,93.911478669273748,0.84245433817685622,2.8685193983823756,1.8480307781090966,1.0136068602732791,0.34393668826549351]
[null,null,null,null,null,null,82,48,1,13.12,13.12,1.5185185185185184,0.10696316259354251,6.9358544890565215,16.58792724452826,9.6520727554717389,0,13.271896616200481,0.61650133926889827,0.2,0.85886042757657988,2.0022087281584287,4.0088397911137927E-3,4.0088397911137927E-3,4.1018974121011151,1.6825562379401828E-2,1.6825562379401828E-2,4.3406034139886875,0.22609005597036302,0.78548194592629617,0.34559999999999991,0,1.4107569663039972,12.542025426285162,0.64493984735369225,7.7145599999999981E-2,0.80679596346029214,7.7145599999999981E-2,0.69667199999999985,0.35228647958222759,1.0560000000000001E-4,4.9499999999999995E-2,0.44473846153846153,0.42569999999999997,4.9605599999999993E-2,4.2729574390936129,65.599999999999994,0.93884676424612146,78.563540424767879,42.19359734483389,null,93.884676424612152,0.85886042757657988,2.914224929764289,1.8705604863039971,1.0366977234602921,0.35228647958222759]
[null,null,null,null,null,null,83,48,1,13.28,13.28,1.5370370370370368,0.10699732196188244,6.9376674478913802,16.74883372394569,9.8111662760543084,0,13.43016514423635,0.63129267530511346,0.2,0.87550886183648047,2.0027320842940961,4.010935801460975E-3,4.010935801460975E-3,4.1513962395331507,1.7234090737609987E-2,1.7234090737609987E-2,4.3930667983539484,0.23158843073759774,0.79506099404734842,0.34559999999999991,0,1.4278006599790565,12.691347442516147,0.66038822961731058,7.8086399999999986E-2,0.82743294117126431,7.8086399999999986E-2,0.70516800000000002,0.36073867160292195,1.0560000000000001E-4,4.9499999999999995E-2,0.44473846153846153,0.42569999999999997,4.9605599999999993E-2,4.3455861611287947,66.399999999999991,0.93857445535568296,79.514884679120371,43.147632113670461,null,93.857445535568303,0.87550886183648047,2.9604016011503207,1.8932115399790566,1.0601383811712644,0.36073867160292195]
[null,null,null,null,null,null,84,48,1,13.44,13.44,1.5555555555555556,0.10703148267604751,6.9394802372711641,16.909740118635582,9.9702598813644165,0,13.588474239723276,0.64626321257268071,0.2,0.89240130322265865,2.0032553915122975,4.0130321636230887E-3,4.0130321636230887E-3,4.2009212464117534,1.7647739318553679E-2,1.7647739318553679E-2,4.4455598985517382,0.23715603373933608,0.80464004216840102,0.34559999999999991,0,1.444966749900739,12.840702058377172,0.67602288034324798,7.9027199999999978E-2,0.84842476121898958,7.9027199999999978E-2,0.71366399999999997,0.36929326432724613,1.0560000000000001E-4,4.9499999999999995E-2,0.44473846153846153,0.42569999999999997,4.9605599999999993E-2,4.41904365015181,67.2,0.93829792433785952,80.471369575831034,44.116108965612881,null,93.829792433785954,0.89240130322265865,3.0070555111197286,1.9159849899007391,1.0839338812189896,0.36929326432724613]
[null,null,null,null,null,null,85,48,1,13.6,13.6,1.574074074074074,0.10706564473611721,6.9412928571858572,17.07064642859293,10.129353571407071,0,13.746822501124939,0.66141295107102216,0.2,0.90953944452027446,2.0037786498101409,4.0151288774349508E-3,4.0151288774349508E-3,4.250472000835904,1.8066512229889975E-2,1.8066512229889975E-2,4.4980822594027119,0.24279292814824086,0.81421909028945338,0.34559999999999991,0,1.4622563005762759,12.990087946780095,0.69184377794683405,7.9967999999999984E-2,0.86977660141316027,7.9967999999999984E-2,0.72215999999999991,0.37795025775486984,1.0560000000000001E-4,4.9499999999999995E-2,0.44473846153846153,0.42569999999999997,4.9605599999999993E-2,4.4933378453719053,68,0.93801723056322517,81.43303982420359,45.099238637515619,null,93.801723056322516,0.90953944452027446,3.0541929019894356,1.9388819005762759,1.1080894014131601,0.37795025775486984]
[null,null,null,null,null,null,86,48,1,13.76,13.76,1.5925925925925923,0.10709980814217113,6.9431053076254488,17.231552653812724,10.288447346187276,0,13.905208590407099,0.67674189079955993,0.2,0.92692500948333179,2.0043018591847361,4.0172259427313896E-3,4.0172259427313896E-3,4.3000480902985503,1.8490413578880208E-2,1.8490413578880208E-2,4.5506334462170672,0.24849917714195308,0.82379813841050575,0.34559999999999991,0,1.4796703904636768,13.139503840743073,0.70785090084169788,8.0908799999999989E-2,0.89149377319058687,8.0908799999999989E-2,0.73065599999999997,0.3867096518854628,1.0560000000000001E-4,4.9499999999999995E-2,0.44473846153846153,0.42569999999999997,4.9605599999999993E-2,4.5684768645446692,68.8,0.93773242869714823,82.399940719474415,46.09723730485689,null,93.773242869714821,0.92692500948333179,3.1018201636542635,1.9619033504636767,1.1326102531905868,0.3867096518854628]
[null,null,null,null,null,null,87,48,1,13.92,13.92,1.6111111111111109,0.1071339728942888,6.9449175885799184,17.392458794289958,10.44754120571004,0,14.063631229499272,0.69225003175771527,0.2,0.94455975329495478,2.0048250196331914,4.0193233593472264E-3,4.0193233593472264E-3,4.3496491206061476,1.8919447472389835E-2,1.8919447472389835E-2,4.6032130436530529,0.25427484390309124,0.83337718653155812,0.34559999999999991,0,1.4972101121857648,13.288948530041404,0.72404422743976715,8.1849599999999981E-2,0.91358172537712035,8.1849599999999981E-2,0.73915200000000003,0.39557144671869443,1.0560000000000001E-4,4.9499999999999995E-2,0.44473846153846153,0.42569999999999997,4.9605599999999993E-2,4.6444690084082714,69.599999999999994,0.93744356892252434,83.372118151802127,47.110326734848805,null,93.744356892252441,0.94455975329495478,3.1499438375628852,1.9850504321857649,1.1575018853771204,0.39557144671869443]
[null,null,null,null,null,null,88,48,1,14.08,14.08,1.6296296296296298,0.10716813899254977,6.9467297000392518,17.553364850019626,10.606635149980374,0,14.222089196989213,0.70793737394491052,0.2,0.9624454630383984,2.0053481311526151,4.0214211271172862E-3,4.0214211271172862E-3,4.399274714869299,1.9353618016888351E-2,1.9353618016888351E-2,4.6558206546505954,0.2601199916192532,0.8429562346526106,0.34559999999999991,0,1.5148765727483231,13.438420858078755,0.74042373615126922,8.2790399999999986E-2,0.93604604808667946,8.2790399999999986E-2,0.74764799999999998,0.40453564225423461,1.0560000000000001E-4,4.9499999999999995E-2,0.44473846153846153,0.42569999999999997,4.9605599999999993E-2,4.7213227652716414,70.400000000000006,0.93715069714594679,84.349618615429577,48.138734445127859,null,93.715069714594676,0.9624454630383984,3.1985706208350022,2.0083242527483232,1.1827698880866795,0.40453564225423461]
[null,null,null,null,null,null,89,48,1,14.24,14.24,1.6481481481481481,0.10720230643703361,6.9485416419934287,17.714270820996713,10.765729179003285,0,14.380581325032601,0.72380391736056748,0.2,0.98058395817904109,2.0058711937401155,4.0235192458763962E-3,4.0235192458763962E-3,4.4489245125590955,1.9792929318449188E-2,1.9792929318449188E-2,4.7084558994343331,0.26603468348301573,0.85253528277366297,0.34559999999999991,0,1.53267089376244,13.587919718962075,0.75698940538472936,8.3731199999999992E-2,0.95889247676304468,8.3731199999999992E-2,0.75614399999999993,0.41360223849175282,1.0560000000000001E-4,4.9499999999999995E-2,0.44473846153846153,0.42569999999999997,4.9605599999999993E-2,4.7990468157606037,71.2,0.93685385518854447,85.332489218022488,49.182693868255924,null,93.685385518854446,0.98058395817904109,3.2477073705254846,2.03172593376244,1.2084199967630447,0.41360223849175282]
[null,null,null,null,null,null,90,48,1,14.4,14.4,1.6666666666666665,0.10723647522781991,6.9503534144324348,17.87517670721622,10.924823292783783,0,14.539106496461859,0.73984966200410807,0.2,0.9989770910576139,2.0063942073928005,4.025617715459384E-3,4.025617715459384E-3,4.4985981686242624,2.0237385482749566E-2,2.0237385482749566E-2,4.7611184145808929,0.27201898269193531,0.86211433089471534,0.34559999999999991,0,1.5505942116711513,13.737444054764998,0.77374121354697245,8.4671999999999983E-2,0.98212689637036166,8.4671999999999983E-2,0.76463999999999999,0.42277123543091888,1.0560000000000001E-4,4.9499999999999995E-2,0.44473846153846153,0.42569999999999997,4.9605599999999993E-2,4.8776500377282543,72,0.9365530809626138,86.320777690188365,50.242444522273729,null,93.655308096261379,0.9989770910576139,3.2973611080415131,2.0552566116711515,1.2344580963703617,0.42277123543091888]
[null,null,null,null,null,null,91,48,1,14.56,14.56,1.6851851851851851,0.10727064536498822,6.952165017346247,18.036082508673125,11.083917491326877,0,14.697663642079345,0.75607460787495373,0.2,1.0176267473949288,2.0069171721077774,4.0277165357010779E-3,4.0277165357010779E-3,4.5482953526646037,2.0686990615070431E-2,2.0686990615070431E-2,4.8138078521456436,0.27807295244854863,0.87169337901576771,0.34559999999999991,0,1.5686476779804714,13.886992852965758,0.79067913904312026,8.5612799999999989E-2,1.0057553457385733,8.5612799999999989E-2,0.77313600000000005,0.43204263307140212,1.0560000000000001E-4,4.9499999999999995E-2,0.44473846153846153,0.42569999999999997,4.9605599999999993E-2,4.9571415113361468,72.8,0.93624840863506475,87.31453239517981,51.318232187559936,null,93.624840863506478,1.0176267473949288,3.3475390237190448,2.0789174379804716,1.2608902257385732,0.43204263307140212]
[null,null,null,null,null,null,92,48,1,14.72,14.72,1.7037037037037037,0.1073048168486181,6.953976450724844,18.196988225362421,11.243011774637578,0,14.85625173812144,0.77247875497252705,0.2,1.0365348468083813,2.0074400878821534,4.0298157064363078E-3,4.0298157064363078E-3,4.5980157481566239,2.1141748820296319E-2,2.1141748820296319E-2,4.8665238788445748,0.28419665596037336,0.8812724271368203,0.34559999999999991,0,1.5868324594949086,14.036565144046882,0.8078031602765946,8.6553599999999994E-2,1.0297840220703203,8.6553599999999994E-2,0.78163199999999999,0.44141643141287262,1.0560000000000001E-4,4.9499999999999995E-2,0.44473846153846153,0.42569999999999997,4.9605599999999993E-2,5.0375305243132145,73.600000000000009,0.93593986877861446,88.313802338786161,52.410309090262032,null,93.59398687786144,1.0365348468083813,3.3982484815652292,2.1027095794949084,1.2877225820703202,0.44141643141287262]
[null,null,null,null,null,null,93,48,1,14.88,14.88,1.7222222222222223,0.10733898967878917,6.955787714558209,18.357893857279105,11.402106142720896,0,15.014869803881083,0.78906210329624993,0.2,1.055703343340501,2.0079629547130371,4.03191522749991E-3,4.03191522749991E-3,4.647759051727534,2.1601664202915229E-2,2.1601664202915229E-2,4.9192661752872926,0.29039015643990801,0.89085147525787256,0.34559999999999991,0,1.6051497385575677,14.186159999244838,0.82511325564911453,8.7494399999999986E-2,1.0542192856161505,8.7494399999999986E-2,0.79012799999999994,0.45089263045499994,1.0560000000000001E-4,4.9499999999999995E-2,0.44473846153846153,0.42569999999999997,4.9605599999999993E-2,5.1188265773996342,74.400000000000006,0.93562748851157629,89.318637179417848,53.518934092577325,null,93.562748851157636,1.055703343340501,3.4494970241737182,2.1266342185575677,1.3149615256161504,0.45089263045499994]
[null,null,null,null,null,null,94,48,1,15.04,15.04,1.7407407407407403,0.107373163855581,6.9575988088363179,18.518799404418157,11.561200595581841,0,15.173516899477415,0.8058246528455435,0.2,1.075134225999838,2.0084857725975338,4.0340150987267127E-3,4.0340150987267127E-3,4.6975249724741799,2.2066740867018545E-2,2.2066740867018545E-2,4.972034435257469,0.29665351710463272,0.90043052337892493,0.34559999999999991,0,1.6236007132949435,14.335776528438933,0.84260940356069647,8.8435199999999978E-2,1.0790676645252355,8.8435199999999978E-2,0.798624,0.4604712301974534,1.0560000000000001E-4,4.9499999999999995E-2,0.44473846153846153,0.42569999999999997,4.9605599999999993E-2,5.2010393899832152,75.199999999999989,0.93531129162701865,90.329087238387629,54.644372890177081,null,93.531129162701859,1.075134225999838,3.501292377820179,2.1506925532949435,1.3426135845252354,0.4604712301974534]
[null,null,null,null,null,null,95,48,1,15.2,15.2,1.7592592592592591,0.10740733937907325,6.959409733549152,18.679704866774575,11.720295133225424,0,15.332192123762066,0.82276640361983044,0.2,1.0948295193144872,2.0090085415327525,4.0361153199515573E-3,4.0361153199515573E-3,4.7473132313236874,2.2536982916300949E-2,2.2536982916300949E-2,5.0248283650373766,0.30298680117701038,0.91000957149997719,0.34559999999999991,0,1.6421865978665071,14.485413878169561,0.86029158240965597,8.9375999999999983E-2,1.1043358598791406,8.9375999999999983E-2,0.80712000000000006,0.47015223063990313,1.0560000000000001E-4,4.9499999999999995E-2,0.44473846153846153,0.42569999999999997,4.9605599999999993E-2,5.2841789059362902,76,0.93499129871200093,91.345203510393304,55.786898217081031,null,93.499129871200097,1.0948295193144872,3.5536424577456476,2.1748857978665073,1.3706854598791407,0.47015223063990313]
[null,null,null,null,null,null,96,48,1,15.36,15.36,{"$f":"Vout*K105/(Vin*Efficiency)","v":1.7777777777777777},0.10744151624934543,{"$f":"(Vin-(Rdson1+Rdcr)*K105-Vout)*M105/(Fsw*Lf)","v":6.9612204886866813},18.840610244343338,11.879389755656659,{"$f":"IF(MIN(Vin, -P105/(Coss_Q1+Coss_Q2)*0.00000002)<0, 0, MIN(Vin, -P105/(Coss_Q1+Coss_Q2)*0.00000002))","v":0},15.49089461235242,{"$f":"R105^2*Rdcr","v":0.83988735561853245},0.2,{"$f":"(T105+S105*(1+Ltc*(Ta-25)))/(1-S105*Ltc*ThetaCa)","v":1.1147912838985432},2.009531261515797,4.0382158910092702E-3,4.0382158910092702E-3,4.7971235604328779,2.3012394454060212E-2,2.3012394454060212E-2,5.0776476827733728,{"$f":"Rdson1*AB105^2","v":0.30939007188448564},0.91958861962102967,0.34559999999999991,0,{"$f":"(AF105+AE105+AD105+AC105*(1+RdsonTopTc*Ta-RdsonTopTc*25))/(1-AC105*RdsonTopTc*ThetaJA_Q1)","v":1.6609086227191932},14.635071229776623,{"$f":"Rdson2*AH105^2","v":0.87815977059260508},9.0316799999999975E-2,{"$f":"(AJ105+AI105*(1+RdsonBotTc*Ta-RdsonBotTc*25))/(1-AI105*RdsonBotTc*ThetaJA_Q2)","v":1.130030750916567},9.0316799999999975E-2,0.81561600000000001,0.47993563178201853,1.0560000000000001E-4,4.9499999999999995E-2,0.44473846153846153,0.42569999999999997,4.9605599999999993E-2,{"$f":" SUM(U105,X105,AA105,AG105,AK105,AL105,AM105,AS105,AN105)","v":5.3682552996613913},76.8,0.93466752725753066,92.367037674206117,56.946790058304281,null,93.466752725753068,1.1147912838985432,3.6065553736357603,2.1992151827191933,1.3991840309165671,0.47993563178201853]
[null,null,null,null,null,null,97,48,1,15.52,15.52,{"$f":"Vout*K106/(Vin*Efficiency)","v":1.7962962962962961},0.10747569446647721,{"$f":"(Vin-(Rdson1+Rdcr)*K106-Vout)*M106/(Fsw*Lf)","v":6.9630310742388852},19.001515537119442,12.038484462880557,{"$f":"IF(MIN(Vin, -P106/(Coss_Q1+Coss_Q2)*0.00000002)<0, 0, MIN(Vin, -P106/(Coss_Q1+Coss_Q2)*0.00000002))","v":0},15.649623535783046,{"$f":"R106^2*Rdcr","v":0.85718750884107131},0.2,{"$f":"(T106+S106*(1+Ltc*(Ta-25)))/(1-S106*Ltc*ThetaCa)","v":1.1350216170318126},2.0100539325437747,4.0403168117346937E-3,4.0403168117346937E-3,4.8469557026237799,2.3492979583197179E-2,2.3492979583197179E-2,5.1304921178795242,{"$f":"Rdson1*AB106^2","v":0.31586339245948714},0.92916766774208204,0.34559999999999991,0,{"$f":"(AF106+AE106+AD106+AC106*(1+RdsonTopTc*Ta-RdsonTopTc*25))/(1-AC106*RdsonTopTc*ThetaJA_Q1)","v":1.6797680348469028},14.784747797649803,{"$f":"Rdson2*AH106^2","v":0.89621394650445374},9.125759999999998E-2,{"$f":"(AJ106+AI106*(1+RdsonBotTc*Ta-RdsonBotTc*25))/(1-AI106*RdsonBotTc*ThetaJA_Q2)","v":1.1561594004573996},9.125759999999998E-2,0.82411199999999996,0.4898214336234693,1.0560000000000001E-4,4.9499999999999995E-2,0.44473846153846153,0.42569999999999997,4.9605599999999993E-2,{"$f":" SUM(U106,X106,AA106,AG106,AK106,AL106,AM106,AS106,AN106)","v":5.453278982354516},77.599999999999994,0.93433999175983018,93.394642103569922,58.124335870616171,null,93.433999175983018,1.1350216170318126,3.6600394353043026,2.2236819548469029,1.4281163604573996,0.4898214336234693]
[null,null,null,null,null,null,98,48,1,15.68,15.68,{"$f":"Vout*K107/(Vin*Efficiency)","v":1.8148148148148149},0.10750987403054819,{"$f":"(Vin-(Rdson1+Rdcr)*K107-Vout)*M107/(Fsw*Lf)","v":6.9648414901957389},19.162420745097869,12.197579254902131,{"$f":"IF(MIN(Vin, -P107/(Coss_Q1+Coss_Q2)*0.00000002)<0, 0, MIN(Vin, -P107/(Coss_Q1+Coss_Q2)*0.00000002))","v":0},15.808378097767102,{"$f":"R107^2*Rdcr","v":0.87466686328686916},0.2,{"$f":"(T107+S107*(1+Ltc*(Ta-25)))/(1-S107*Ltc*ThetaCa)","v":1.1555226532530936},2.0105765546137921,4.0424180819626674E-3,4.0424180819626674E-3,4.8968094108527085,2.3978742406215649E-2,2.3978742406215649E-2,5.183361410476687,{"$f":"Rdson1*AB107^2","v":0.32240682613942645},0.93874671586313452,0.34559999999999991,0,{"$f":"(AF107+AE107+AD107+AC107*(1+RdsonTopTc*Ta-RdsonTopTc*25))/(1-AC107*RdsonTopTc*ThetaJA_Q1)","v":1.6987660980551325},14.934442827582949,{"$f":"Rdson2*AH107^2","v":0.91445408853840937},9.2198399999999986E-2,{"$f":"(AJ107+AI107*(1+RdsonBotTc*Ta-RdsonBotTc*25))/(1-AI107*RdsonBotTc*ThetaJA_Q2)","v":1.1827290605347973},9.2198399999999986E-2,0.83260800000000001,0.49980963616392526,1.0560000000000001E-4,4.9499999999999995E-2,0.44473846153846153,0.42569999999999997,4.9605599999999993E-2,{"$f":" SUM(U107,X107,AA107,AG107,AK107,AL107,AM107,AS107,AN107)","v":5.5392606084951259},78.400000000000006,0.93400870381345102,94.428069878315569,59.319830811766252,null,93.400870381345101,1.1555226532530936,3.7141031585899298,2.2482873780551325,1.4574897005347973,0.49980963616392526]
[null,null,null,null,null,null,99,48,1,15.84,15.84,{"$f":"Vout*K108/(Vin*Efficiency)","v":1.8333333333333333},0.10754405494163805,{"$f":"(Vin-(Rdson1+Rdcr)*K108-Vout)*M108/(Fsw*Lf)","v":6.9666517365472194},19.32332586827361,12.35667413172639,{"$f":"IF(MIN(Vin, -P108/(Coss_Q1+Coss_Q2)*0.00000002)<0, 0, MIN(Vin, -P108/(Coss_Q1+Coss_Q2)*0.00000002))","v":0},15.967157533560194,{"$f":"R108^2*Rdcr","v":0.89232541895534823},0.2,{"$f":"(T108+S108*(1+Ltc*(Ta-25)))/(1-S108*Ltc*ThetaCa)","v":1.1762965649673676},2.0110991277229555,4.0445197015280326E-3,4.0445197015280326E-3,4.9466844477106306,2.4469687025222227E-2,2.4469687025222227E-2,5.2362553108646566,{"$f":"Rdson1*AB108^2","v":0.32902043616669985},0.94832576398418678,0.34559999999999991,0,{"$f":"(AF108+AE108+AD108+AC108*(1+RdsonTopTc*Ta-RdsonTopTc*25))/(1-AC108*RdsonTopTc*ThetaJA_Q1)","v":1.7179040932308451},15.084155595225399,{"$f":"Rdson2*AH108^2","v":0.93288017508597565},9.3139199999999978E-2,{"$f":"(AJ108+AI108*(1+RdsonBotTc*Ta-RdsonBotTc*25))/(1-AI108*RdsonBotTc*ThetaJA_Q2)","v":1.2097471782445188},9.3139199999999978E-2,0.84110400000000007,0.50990023940305607,1.0560000000000001E-4,4.9499999999999995E-2,0.44473846153846153,0.42569999999999997,4.9605599999999993E-2,{"$f":" SUM(U108,X108,AA108,AG108,AK108,AL108,AM108,AS108,AN108)","v":5.6262110825725369},79.2,0.93367367219672459,95.467374795695491,60.533577978551918,null,93.36736721967246,1.1762965649673676,3.768755271475364,2.2730327332308451,1.4873114982445188,0.50990023940305607]
[null,null,null,null,null,null,100,48,1,16,16,{"$f":"Vout*K109/(Vin*Efficiency)","v":1.8518518518518516},0.10757823719982633,{"$f":"(Vin-(Rdson1+Rdcr)*K109-Vout)*M109/(Fsw*Lf)","v":6.9684618132832954},19.484230906641649,12.515769093358353,{"$f":"IF(MIN(Vin, -P109/(Coss_Q1+Coss_Q2)*0.00000002)<0, 0, MIN(Vin, -P109/(Coss_Q1+Coss_Q2)*0.00000002))","v":0},16.125961108419727,{"$f":"R109^2*Rdcr","v":0.91016317584592965},0.2,{"$f":"(T109+S109*(1+Ltc*(Ta-25)))/(1-S109*Ltc*ThetaCa)","v":1.1973455630672341},2.0116216518683694,4.0466216702656271E-3,4.0466216702656271E-3,4.9965805849526914,2.4965817541926182E-2,2.4965817541926182E-2,5.2891735790251131,{"$f":"Rdson1*AB109^2","v":0.33570428578868788},0.95790481210523926,0.34559999999999991,0,{"$f":"(AF109+AE109+AD109+AC109*(1+RdsonTopTc*Ta-RdsonTopTc*25))/(1-AC109*RdsonTopTc*ThetaJA_Q1)","v":1.7371833186177044},15.233885404623743,{"$f":"Rdson2*AH109^2","v":0.95149218453695394},9.4079999999999983E-2,{"$f":"(AJ109+AI109*(1+RdsonBotTc*Ta-RdsonBotTc*25))/(1-AI109*RdsonBotTc*ThetaJA_Q2)","v":1.2372214018211518},9.4079999999999983E-2,0.84960000000000002,0.5200932433405312,1.0560000000000001E-4,4.9499999999999995E-2,0.44473846153846153,0.42569999999999997,4.9605599999999993E-2,{"$f":" SUM(U109,X109,AA109,AG109,AK109,AL109,AM109,AS109,AN109)","v":5.7141415660588128},80,0.93333490294999921,96.512611381943586,61.765888654120879,null,93.333490294999919,1.1973455630672341,3.8240047204388561,2.2979193186177045,1.5175894018211518,0.5200932433405312]

{"sheet":"Efficiency Plot Management","index":9,"n_rows":2,"n_cols":1,"rows_kept":2,"cut":false,"hidden":true,"merged":[]}
[]
[{"$f":"IF(PLOT_TYPE=1, \"EFF_Ch1\", \"EFF_Ch2\")","v":"EFF_Ch1"}]

{"sheet":"Input Filter Calculations","index":10,"n_rows":97,"n_cols":40,"rows_kept":97,"cut":false,"hidden":true,"merged":[[10,29,10,30],[10,31,10,34],[9,0,11,0],[9,1,10,1],[10,8,10,9],[10,11,10,14],[10,16,10,19],[11,17,11,19]]}
[]
[null,null,null,null,null,null,null,null,null,null,null,null,null,null,null,null,null,null,null,null,null,null,null,null,null,null,null,null,null,"AEF comparison Values"]
[null,null,null,{"$f":"L_infilter*0.000001","v":6.8000000000000005E-7},null,null,null,null,null,null,null,"Lfilter Passive",{"$f":"'EMI Filter Design'!O3*0.000001","v":6.8000000000000005E-7},null,null,null,null,null,null,null,null,null,null,null,null,null,null,null,null,"Lfilter",{"$f":"'EMI Filter Design'!G3*0.000001","v":9.9999999999999995E-7}]
[null,null,null,null,null,null,null,null,null,null,null,"Cfilter Passive",{"$f":"'EMI Filter Design'!O4*0.000001","v":4.6999999999999995E-7},null,null,null,null,null,null,null,null,null,null,null,null,null,null,null,null,"Cinj",{"$f":"'EMI Filter Design'!G4*0.000001","v":9.9999999999999995E-7}]
[null,null,null,null,null,null,null,null,null,null,null,"Cdamp passive",{"$f":"'EMI Filter Design'!O5*0.000001","v":9.9999999999999991E-6},null,null,null,null,null,null,null,null,null,null,null,null,null,null,null,null,"Cdamp",{"$f":"'EMI Filter Design'!G5*0.000001","v":9.9999999999999995E-7}]
[null,null,null,null,null,null,null,null,null,null,null,"Rdamp passive",{"$f":"'EMI Filter Design'!O6","v":0.35},null,null,null,null,null,null,null,null,null,null,null,null,null,null,null,null,"Rdamp",{"$f":"'EMI Filter Design'!G6","v":10}]
[]
[]
[]
["Freq (Hz)","(kHz)",null,null,null,null,null,null,null,null,null,null,null,null,null,null,null,null,null,null,null,null,"AEF",null,null,null,"Passive",null,null,"AEFCompare"]
[null,null,null,null,null,null,null,null,"AEF Numerator",null,null,"AEF Denominator",null,null,null,null,"Passive",null,null,null,null,null,"Magnitude","Phase",null,null,"Magnitude","Phase",null,"AEF Numerator",null,"AEF Denominator"]
[null,null,"jω","-ω^2","-jω^3",null,"Gop",null,null,null,null,null,null,null,null,null,"Numerator","Denominator",null,null,null,null,null,null,null,null,null,null,null,null,null,null,null,null,null,null,null,null,"Magnitude","Phase"]
[1,{"$f":"A13/1000","v":1E-3},{"$f":"COMPLEX(0,2*Pi*A13)","v":"6.2831853i"},{"$f":"COMPLEX(-POWER(2*Pi*A13,2),0)","v":"-39.4784175141361"},{"$f":"COMPLEX(0,-POWER(2*Pi*A13,3))","v":"-248.050212592082i"},null,{"$f":"IMSUM(IMPRODUCT(C13,Rcomp_AEF*Csen_AEF),Csen_AEF/Ccomp_AEF)","v":"100+0.00062831853i"},null,{"$f":"IMPRODUCT((RdampSel*CdampSel+RdampSel*CinjSel),C13)","v":"0.00002011059118971i"},{"$f":"IMSUM(1,I13)","v":"1+0.00002011059118971i"},null,{"$f":"IMPRODUCT(G13,L_infilterStd*RdampSel*CinjSel*CdampSel,E13)","v":"0"},{"$f":"IMPRODUCT(G13,L_infilterStd*CinjSel,D13)","v":"-1.26173022375179E-09-7.92768479444296E-15i"},{"$f":"J13","v":"1+0.00002011059118971i"},{"$f":"IMSUM(L13:N13)","v":"0.99999999873827+0.0000201105911817823i"},0,{"$f":"IMSUM(IMPRODUCT(C13,RdampPssv*CdampPssv),1)","v":"1+0.00002199114855i"},{"$f":"IMPRODUCT(RdampPssv*CdampPssv*CfilterPssv*LinfilterPssv,E13)","v":"-2.77468967805503E-16i"},{"$f":"IMPRODUCT(D13,LinfilterPssv*(CfilterPssv+CdampPssv))","v":"-2.81070541333643E-10"},{"$f":"IMSUM(S13,R13,Q13)","v":"0.999999999718929+0.0000219911485497225i"},1,{"$f":"CHOOSE(INFILTER_TYPE,U13,IMDIV(J13,O13))","v":"1.00000000126173-1.74464358853754E-14i"},{"$f":"20*LOG10(IMABS(V13))","v":1.0959247993160874E-8},{"$f":"IMARGUMENT(V13)*180/Pi","v":-9.9960714365857936E-13},null,{"$f":"IMDIV(Q13,T13)","v":"1.00000000028107-5.90357569567796E-15i"},{"$f":"20*LOG10(IMABS(Z13))","v":2.4413434876664009E-9},{"$f":"IMARGUMENT(Z13)*180/Pi","v":-3.3824997168979094E-13},null,{"$f":"IMPRODUCT((RdampCom*CdampCom+RdampCom*CinjCom),C13)","v":"0.000125663706i"},{"$f":"IMSUM(1,AD13)","v":"1+0.000125663706i"},{"$f":"IMPRODUCT(G13,L_infilterStd*RdampSel*CinjSel*CdampSel,E13)","v":"0"},{"$f":"IMPRODUCT(G13,LAEFCom*CinjCom,D13)","v":"-3.94784175141361E-09-2.48050212592082E-14i"},{"$f":"AE13","v":"1+0.000125663706i"},{"$f":"IMSUM(AF13:AH13)","v":"0.999999996052158+0.000125663705975195i"},null,{"$f":"IMDIV(AE13,AI13)","v":"1.00000000394784-4.71295468853202E-13i"},null,{"$f":"20*LOG10(IMABS(AK13))","v":3.429050295758723E-8},{"$f":"IMARGUMENT(AK13)*180/Pi","v":-2.7003241193179047E-11}]
[2,{"$f":"A14/1000","v":2E-3},"12.5663706i","-157.913670056544","-1984.40170073666i",null,"100+0.00125663706i",null,"0.00004022118237942i",{"$f":"IMSUM(1,I14)","v":"1+0.00004022118237942i"},null,"0","-5.04692089500715E-09-6.34214783555435E-14i",{"$f":"J14","v":"1+0.00004022118237942i"},{"$f":"IMSUM(L14:N14)","v":"0.999999994953079+0.0000402211823159985i"},0,"1+0.0000439822971i","-2.21975174244403E-15i","-1.12428216533457E-09",{"$f":"IMSUM(S14,R14,Q14)","v":"0.999999998875718+0.0000439822970977802i"},1,{"$f":"CHOOSE(INFILTER_TYPE,U14,IMDIV(J14,O14),IMDIV(Q14,T14))","v":"1.00000000504692-1.39571636519764E-13i"},{"$f":"20*LOG10(IMABS(V14))","v":4.38369899610229E-8},-7.9968656810946772E-12,null,"1.00000000112428-4.72287071806802E-14i",{"$f":"20*LOG10(IMABS(Z14))","v":9.7653720178935441E-9},-2.7060055933619345E-12,null,"0.000251327412i",{"$f":"IMSUM(1,AD14)","v":"1+0.000251327412i"},"0","-1.57913670056544E-08-1.98440170073665E-13i",{"$f":"AE14","v":"1+0.000251327412i"},{"$f":"IMSUM(AF14:AH14)","v":"0.999999984208633+0.00025132741180156i"},null,{"$f":"IMDIV(AE14,AI14)","v":"1.00000001579137-3.77036329160179E-12i"},null,{"$f":"20*LOG10(IMABS(AK14))","v":1.371620958789241E-7},-2.1602590067533612E-10]
[3,3.0000000000000001E-3,"18.8495559i","-355.305757627225","-6697.35573998623i",null,"100+0.00188495559i",null,"0.00006033177356913i","1+0.00006033177356913i",null,"0","-1.13555720137661E-08-2.1404748944996E-13i","1+0.00006033177356913i","0.999999988644428+0.0000603317733550825i",0,"1+0.00006597344565i","-7.4916621307486E-15i","-2.52963487200279E-09","0.999999997470365+0.0000659734456425083i",1,"1.00000001135557-4.71054310848749E-13i",9.8633227583344004E-8,-2.6989423657436493E-11,null,"1.00000000252963-1.59397031416008E-13i",2.1972087506984967E-8,-9.1327771543846233E-12,null,"0.000376991118i","1+0.000376991118i","0","-3.55305757627225E-08-6.69735573998623E-13i","1+0.000376991118i","0.999999964469424+0.000376991117330264i",null,"1.00000003553057-1.27249747186445E-11i",null,3.0861460467700118E-7,-7.2908732071721767E-10]
[4,4.0000000000000001E-3,"25.1327412i","-631.654680226178","-15875.2136058933i",null,"100+0.00251327412i",null,"0.00008044236475884i","1+0.00008044236475884i",null,"0","-2.01876835800286E-08-5.0737182684435E-13i","1+0.00008044236475884i","0.999999979812316+0.0000804423642514682i",0,"1+0.0000879645942i","-1.77580139395522E-14i","-4.4971286613383E-09","0.999999995502871+0.000087964594182242i",1,"1.00000002018768-1.11657327982775E-12i",1.7534795851664091E-7,-6.3974935232806441E-11,null,"1.00000000449713-3.77830130865583E-13i",3.9061574795171693E-8,-2.1648071798855818E-11,null,"0.000502654824i","1+0.000502654824i","0","-6.31654680226178E-08-1.58752136058933E-12i","1+0.000502654824i","0.999999936834532+0.000502654822412479i",null,"1.00000006316546-3.01629023712536E-11i",null,5.486481969408996E-7,-1.728206896549755E-9]
[5,5.0000000000000001E-3,"31.4159265i","-986.960437853402","-31006.2765740103i",null,"100+0.00314159265i",null,"0.00010055295594855i","1+0.00010055295594855i",null,"0","-3.15432555937947E-08-9.90960599305369E-13i","1+0.00010055295594855i","0.999999968456744+0.000100552954957589i",0,"1+0.00010995574275i","-3.46836209756879E-14i","-7.02676353334108E-09","0.999999992973236+0.000109955742715316i",1,"1.00000003154326-2.18080674299223E-12i",2.739812708982782E-7,-1.2495101850854092E-10,null,"1.00000000702676-7.37949045461784E-13i",6.1033662203345327E-8,-4.228136555188043E-11,null,"0.00062831853i","1+0.00062831853i","0","-9.86960437853402E-08-3.10062765740103E-12i","1+0.00062831853i","0.999999901303956+0.000628318526899372i",null,"1.00000009869602-5.89119136628583E-11i",null,8.5726269533465554E-7,-3.3754036866389222E-9]
[6,6.0000000000000001E-3,"37.6991118i","-1421.2230305089","-53578.8459198898i",null,"100+0.00376991118i",null,"0.00012066354713826i","1+0.00012066354713826i",null,"0","-4.54222880550644E-08-1.71237991559968E-12i","1+0.00012066354713826i","0.999999954577712+0.00012066354542588i",0,"1+0.0001319468913i","-5.99332970459887E-14i","-1.01185394880112E-08","0.999999989881461+0.000131946891240067i",1,"1.00000004542229-3.76843468243797E-12i",3.9453298847397022E-7,-2.1591539311376604E-10,null,"1.00000001011854-1.27517675935069E-12i",8.7888521344739653E-8,-7.3062245788166498E-11,null,"0.000753982236i","1+0.000753982236i","0","-1.4212230305089E-07-5.35788459198898E-12i","1+0.000753982236i","0.999999857877697+0.000753982230642115i",null,"1.00000014212225-1.01799777989694E-10i",null,1.2344580906194608E-6,-5.8326968118870736E-9]
[7,7.0000000000000001E-3,"43.9822971i","-1934.44245819267","-85081.2229190843i",null,"100+0.00439822971i",null,"0.00014077413832797i","1+0.00014077413832797i",null,"0","-6.18247809638377E-08-2.71919588449394E-12i","1+0.00014077413832797i","0.999999938175219+0.000140774135608774i",0,"1+0.00015393803985i","-9.51718559572877E-14i","-1.37724565253485E-08","0.999999986227543+0.000153938039754828i",1,"1.00000006182478-5.98413490727791E-12i",5.3700319904921999E-7,-3.4286565341812203E-10,null,"1.00000001377246-2.02493304401202E-12i",1.1962606731324945E-7,-1.1602011575315721E-10,null,"0.000879645942i","1+0.000879645942i","0","-1.93444245819267E-07-8.50812229190843E-12i","1+0.000879645942i","0.999999806555754+0.000879645933491878i",null,"1.00000019344414-1.61654261344709E-10i",null,1.6802342889998863E-6,-9.2621051342401712E-9]
[8,8.0000000000000002E-3,"50.2654824i","-2526.61872090471","-127001.708847146i",null,"100+0.00502654824i",null,"0.00016088472951768i","1+0.00016088472951768i",null,"0","-8.07507343201145E-08-4.05897461475479E-12i","1+0.00016088472951768i","0.999999919249266+0.000160884725458705i",0,"1+0.0001759291884i","-1.42064111516417E-13i","-1.79885146453532E-08","0.999999982011485+0.000175929188257936i",1,"1.00000008075074-8.93258619962326E-12i",7.0139198833493887E-7,-5.1179944863184819E-10,null,"1.00000001798851-3.0226408820135E-12i",1.5624621133722648E-7,-1.7318456260563417E-10,null,"0.001005309648i","1+0.001005309648i","0","-2.52661872090471E-07-1.27001708847146E-11i","1+0.001005309648i","0.999999747338128+0.00100530963529983i",null,"1.00000025266169-2.41303125593538E-10i",null,2.1945912779881903E-6,-1.3825647202411687E-8]
[9,8.9999999999999993E-3,"56.5486677i","-3197.75181864502","-180828.604979628i",null,"100+0.00565486677i",null,"0.00018099532070739i","1+0.00018099532070739i",null,"0","-1.02200148123895E-07-5.77928221514891E-12i","1+0.00018099532070739i","0.999999897799852+0.000180995314928108i",0,"1+0.00019792033695i","-2.02274877530212E-13i","-2.27667138480251E-08","0.999999977233286+0.000197920336747725i",1,"1.00000010220016-1.27184687365068E-11i",8.8769926443986375E-7,-7.287145068288629E-10,null,"1.00000002276671-4.30372072059592E-12i",1.9774912886250993E-7,-2.4658502816098219E-10,null,"0.001130973354i","1+0.001130973354i","0","-3.19775181864502E-07-1.80828604979628E-11i","1+0.001130973354i","0.999999680224818+0.00113097333591714i",null,"1.0000003197749-3.43574130298358E-10i",null,2.777529045400815E-6,-1.9685341343589465E-8]
[10,0.01,"62.831853i","-3947.84175141361","-248050.212592082i",null,"100+0.0062831853i",null,"0.0002011059118971i","1+0.0002011059118971i",null,"0","-1.26173022375179E-07-7.92768479444296E-12i","1+0.0002011059118971i","0.999999873826978+0.000201105903969415i",0,"1+0.0002199114855i","-2.77468967805503E-13i","-2.81070541333643E-08","0.999999971892946+0.000219911485222531i",1,"1.00000012617303-1.74464593753979E-11i",1.0959249449500815E-6,-9.9960836467534906E-10,null,"1.00000002810705-5.90359506583625E-12i",2.4413473110098264E-7,-3.3825107210594291E-10,null,"0.00125663706i","1+0.00125663706i","0","-3.94784175141361E-07-2.48050212592082E-11i","1+0.00125663706i","0.999999605215825+0.00125663703519498i",null,"1.00000039478374-4.71295032915428E-10i",null,3.4290473189900757E-6,-2.7003205661962389E-8]
[20,0.02,"125.663706i","-15791.3670056544","-1984401.70073666i",null,"100+0.0125663706i",null,"0.0004022118237942i","1+0.0004022118237942i",null,"0","-5.04692089500715E-07-6.34214783555435E-11i","1+0.0004022118237942i","0.999999495307911+0.000402211760372722i",0,"1+0.000439822971i","-2.21975174244403E-12i","-1.12428216533457E-07","0.999999887571783+0.000439822968780248i",1,"1.00000050469229-1.39571765922673E-10i",4.383700425563876E-6,-7.9968690997365893E-9,null,"1.00000011242821-4.72287618853625E-11i",9.765389700219534E-7,-2.7060084265199776E-9,null,"0.00251327412i","1+0.00251327412i","0","-1.57913670056544E-06-1.98440170073665E-10i","1+0.00251327412i","0.999998420863299+0.00251327392155983i",null,"1.00000157912972-3.77035132439892E-09i",null,1.3716135643178051E-5,-2.1602487728515923E-7]
[30,0.03,"188.495559i","-35530.5757627225","-6697355.73998623i",null,"100+0.0188495559i",null,"0.0006033177356913i","1+0.0006033177356913i",null,"0","-1.13555720137661E-06-2.1404748944996E-10i","1+0.0006033177356913i","0.999998864442799+0.000603317521643811i",0,"1+0.0006597344565i","-7.4916621307486E-12i","-2.52963487200279E-07","0.999999747036513+0.000659734449008338i",1,"1.00000113555821-4.71055208644975E-10i",9.8633276886708608E-6,-2.6989444755765875E-8,null,"1.00000025296345-1.59397078002735E-10i",2.1972123309515767E-6,-9.1327775364510967E-9,null,"0.00376991118i","1+0.00376991118i","0","-3.55305757627225E-06-6.69735573998623E-10i","1+0.00376991118i","0.999996446942424+0.00376991051026443i",null,"1.00000355302223-1.27248854845565E-08i",null,3.0861104146180268E-5,-7.2907964344928818E-7]
[40,0.04,"251.327412i","-63165.4680226178","-15875213.6058933i",null,"100+0.0251327412i",null,"0.0008044236475884i","1+0.0008044236475884i",null,"0","-2.01876835800286E-06-5.07371826844349E-10i","1+0.0008044236475884i","0.999997981231642+0.000804423140216573i",0,"1+0.000879645942i","-1.77580139395522E-11i","-4.4971286613383E-07","0.999999550287134+0.000879645924241986i",1,"1.00000201877154-1.11657696492571E-09i",1.7534809100966143E-5,-6.3975018513925741E-8,null,"1.00000044971274-3.7783013107933E-10i",3.9061543495932147E-6,-2.1648062173047461E-8,null,"0.00502654824i","1+0.00502654824i","0","-6.31654680226178E-06-1.58752136058933E-09i","1+0.00502654824i","0.999993683453198+0.00502654665247864i",null,"1.00000631643509-3.01625248040398E-08i",null,5.4863684831035115E-5,-1.7281744568030996E-6]
[50,0.05,"314.159265i","-98696.0437853402","-31006276.5740103i",null,"100+0.0314159265i",null,"0.0010055295594855i","1+0.0010055295594855i",null,"0","-3.15432555937947E-06-9.90960599305369E-10i","1+0.0010055295594855i","0.999996845674441+0.0010055285685249i",0,"1+0.0010995574275i","-3.46836209756879E-11i","-7.02676353334108E-07","0.999999297323647+0.00109955739281638i",1,"1.00000315433332-2.18081854268935E-09i",2.739814788862813E-5,-1.2495130438468582E-7,null,"1.00000070267604-7.37949528045109E-10i",6.1033643905898183E-6,-4.2281363788867989E-8,null,"0.0062831853i","1+0.0062831853i","0","-9.86960437853402E-06-3.10062765740103E-09i","1+0.0062831853i","0.999990130395621+0.00628318219937234i",null,"1.00000986933164-5.89107626360051E-08i",null,8.57235024252127E-5,-3.3753047587949084E-6]
[60,0.06,"376.991118i","-142122.30305089","-53578845.9198898i",null,"100+0.0376991118i",null,"0.0012066354713826i","1+0.0012066354713826i",null,"0","-4.54222880550644E-06-1.71237991559968E-09i","1+0.0012066354713826i","0.999995457771194+0.00120663375900268i",0,"1+0.001319468913i","-5.99332970459887E-11i","-1.01185394880112E-06","0.999998988146051+0.0013194688530667i",1,"1.00000454224489-3.76846322419288E-09i",3.9453348220231048E-5,-2.1591605749962692E-7,null,"1.00000101185329-1.27517689075155E-09i",8.7888415607349828E-6,-7.3062180127957125E-8,null,"0.00753982236i","1+0.00753982236i","0","-0.000014212230305089-5.35788459198898E-09i","1+0.00753982236i","0.999985787769695+0.00753981700211541i",null,"1.00001421166475-1.0179691371395E-07i",null,1.2344007449476715E-4,-5.8324506410981843E-6]
[70,7.0000000000000007E-2,"439.822971i","-193444.245819267","-85081222.9190843i",null,"100+0.0439822971i",null,"0.0014077413832797i","1+0.0014077413832797i",null,"0","-6.18247809638377E-06-2.71919588449394E-09i","1+0.0014077413832797i","0.999993817521904+0.00140773866408382i",0,"1+0.0015393803985i","-9.51718559572877E-11i","-1.37724565253485E-06","0.999998622754347+0.00153938030332814i",1,"1.00000618250789-5.9841965221557E-09i",5.3700415218291517E-5,-3.4286708510971333E-7,null,"1.00000137724443-2.02493388141286E-09i",1.1962584886409679E-5,-1.1602000554266718E-7,null,"0.00879645942i","1+0.00879645942i","0","-0.0000193444245819267-8.50812229190843E-09i","1+0.00879645942i","0.999980655575418+0.00879645091187771i",null,"1.00001934337684-1.61648069534687E-07i",null,1.6801281161176417E-4,-9.2615730112609531E-6]
[80,0.08,"502.654824i","-252661.872090471","-127001708.847146i",null,"100+0.0502654824i",null,"0.0016088472951768i","1+0.0016088472951768i",null,"0","-8.07507343201145E-06-4.05897461475479E-09i","1+0.0016088472951768i","0.999991924926568+0.00160884323620219i",0,"1+0.001759291884i","-1.42064111516417E-10i","-1.79885146453532E-06","0.999998201148535+0.00175929174193589i",1,"1.00000807512427-8.93270658217443E-09i",7.0139355030597125E-5,-5.1180225450534265E-7,null,"1.00000179884938-3.02264219205147E-09i",1.5624593136146875E-5,-1.7318432924808986E-7,null,"0.01005309648i","1+0.01005309648i","0","-0.0000252661872090471-1.27001708847146E-08i","1+0.01005309648i","0.999974733812791+0.0100530837798291i",null,"1.00002526439982-2.41291053691115E-07i",null,2.1944101684982364E-4,-1.3824609756094254E-5]
[90,0.09,"565.486677i","-319775.181864502","-180828604.979628i",null,"100+0.0565486677i",null,"0.0018099532070739i","1+0.0018099532070739i",null,"0","-0.0000102200148123895-5.77928221514891E-09i","1+0.0018099532070739i","0.999989779985188+0.00180994742779168i",0,"1+0.0019792033695i","-2.02274877530212E-10i","-2.27667138480251E-06","0.999997723328615+0.00197920316722512i",1,"1.00001022009624-1.2718684669172E-08i",8.8770174411655059E-5,-7.287195057505104E-7,null,"1.00000227666805-4.30372353394329E-09i",1.977486491513641E-5,-2.4658463357648596E-7,null,"0.01130973354i","1+0.01130973354i","0","-0.0000319775181864502-1.80828604979628E-08i","1+0.01130973354i","0.999968022481814+0.0113097154571395i",null,"1.00003197465518-3.43552377337812E-07i",null,2.7772388658268553E-4,-1.968347191340695E-5]
[100,0.1,"628.31853i","-394784.175141361","-248050212.592082i",null,"100+0.062831853i",null,"0.002011059118971i","1+0.002011059118971i",null,"0","-0.0000126173022375179-7.92768479444295E-09i","1+0.002011059118971i","0.999987382697762+0.00201105119128621i",0,"1+0.002199114855i","-2.77468967805503E-10i","-2.81070541333643E-06","0.999997189294587+0.00219911457753103i",1,"1.00001261742635-1.74468256329321E-08i",1.0959288140346027E-4,-9.996168632177637E-7,null,"1.00000281070033-5.90359969265688E-09i",2.4413398563007544E-5,-3.3825039598997807E-7,null,"0.0125663706i","1+0.0125663706i","0","-0.0000394784175141361-2.48050212592082E-08i","1+0.0125663706i","0.999960521582486+0.0125663457949787i",null,"1.00003947405389-4.71258194387049E-07i",null,3.4286050961765565E-4,-2.7000039829157664E-5]
[200,0.2,"1256.63706i","-1579136.70056544","-1984401700.73666i",null,"100+0.125663706i",null,"0.004022118237942i","1+0.004022118237942i",null,"0","-0.0000504692089500715-6.34214783555435E-08i","1+0.004022118237942i","0.99994953079105+0.00402205481646364i",0,"1+0.00439822971i","-2.21975174244403E-09i","-0.0000112428216533457","0.999988757178347+0.00439822749024826i",1,"1.00005047119478-1.3958347836125E-07i",4.3837616525357399E-4,-7.9971405837536666E-6,null,"1.00001124274033-4.72289088298236E-08i",9.7652652805129743E-5,-2.7059867273430012E-6,null,"0.0251327412i","1+0.0251327412i","0","-0.000157913670056544-1.98440170073665E-07i","1+0.0251327412i","0.999842086329943+0.0251325427598299i",null,"1.00015784386687-3.76917276718269E-06i",null,1.3709062776326368E-3,-2.1592360984343289E-4]
[300,0.3,"1884.95559i","-3553057.57627225","-6697355739.98623i",null,"100+0.188495559i",null,"0.006033177356913i","1+0.006033177356913i",null,"0","-0.000113555720137661-2.1404748944996E-07i","1+0.006033177356913i","0.999886444279862+0.00603296330942355i",0,"1+0.006597344565i","-7.49166213074859E-09i","-0.0000252963487200279","0.99997470365128+0.00659733707333787i",1,"1.00011356577379-4.71144158120681E-07i",9.8636377124386681E-4,-2.6991506522079193E-5,null,"1.00002529593701-1.59398193110944E-07i",2.1971493833390141E-4,-9.1326127197079888E-6,null,"0.0376991118i","1+0.0376991118i","0","-0.000355305757627225-6.69735573998623E-07i","1+0.0376991118i","0.999644694242373+0.037698442064426i",null,"1.00035495250321-0.0000127159388502096i",null,3.0825319276416713E-3,-7.2831111360382875E-4]
[400,0.4,"2513.27412i","-6316546.80226177","-15875213605.8933i",null,"100+0.251327412i",null,"0.008044236475884i","1+0.008044236475884i",null,"0","-0.000201876835800286-5.07371826844349E-07i","1+0.008044236475884i","0.9997981231642+0.00804372910405716i",0,"1+0.00879645942i","-1.77580139395522E-08i","-0.0000449712866133829","0.999955028713387+0.00879644166198606i",1,"1.00020190861201-1.11695183867607E-06i",1.7535789009263361E-3,-6.3983707487046243E-5,null,"1.00004496998537-3.77834830617806E-07i",3.9059554809765026E-4,-2.164736769036809E-5,null,"0.0502654824i","1+0.0502654824i","0","-0.000631654680226177-1.58752136058933E-06i","1+0.0502654824i","0.999368345319774+0.0502638948786394i",null,"1.00063053877112-0.0000301248416450087i",null,5.4750681759544841E-3,-1.7249386455159413E-3]
[500,0.5,"3141.59265i","-9869604.37853402","-31006276574.0103i",null,"100+0.314159265i",null,"0.010055295594855i","1+0.010055295594855i",null,"0","-0.000315432555937947-9.90960599305369E-07i","1+0.010055295594855i","0.999684567444062+0.0100543046342557i",0,"1+0.010995574275i","-3.46836209756879E-08i","-0.0000702676353334108","0.999929732364667+0.010995539591379i",1,"1.00031551013999-2.18196272543697E-06i",2.7400540416200967E-3,-1.2497782359443765E-4,null,"1.00007026445834-7.37963867515103E-07i",6.1028789246028942E-4,-4.2279244361869525E-5,null,"0.062831853i","1+0.062831853i","0","-0.000986960437853402-3.10062765740103E-06i","1+0.062831853i","0.999013039562147+0.0628287523723426i",null,"1.00098423777278-0.0000587958328047741i",null,8.5447912994648569E-3,-3.3654406788073783E-3]
[600,0.6,"3769.91118i","-14212230.305089","-53578845919.8898i",null,"100+0.376991118i",null,"0.012066354713826i","1+0.012066354713826i",null,"0","-0.000454222880550644-1.71237991559968E-06i","1+0.012066354713826i","0.999545777119449+0.0120646423339104i",0,"1+0.01319468913i","-5.99332970459887E-08i","-0.000101185394880112","0.99989881460512+0.013194629196703i",1,"1.00045438377254-3.77131079809482E-06i",3.9458309704304756E-3,-2.1598205346857549E-4,null,"1.00010117880674-1.27521257339415E-06i",8.7878349973179832E-4,-7.3056906710304996E-5,null,"0.0753982236i","1+0.0753982236i","0","-0.0014212230305089-5.35788459198898E-06i","1+0.0753982236i","0.998578776969491+0.075392865715408i",null,"1.00141558167171-0.000101511144268809i",null,1.2286936300638407E-2,-5.8079385155581347E-3]
[700,0.7,"4398.22971i","-19344424.5819267","-85081222919.0843i",null,"100+0.439822971i",null,"0.014077413832797i","1+0.014077413832797i",null,"0","-0.000618247809638377-2.71919588449394E-06i","1+0.014077413832797i","0.999381752190362+0.0140746946369125i",0,"1+0.015393803985i","-9.51718559572877E-08i","-0.000137724565253485","0.999862275434746+0.015393708813144i",1,"1.00061854591191-5.99035246685762E-06i",5.3709607609041272E-3,-3.4300974725789919E-4,null,"1.0001377123592-2.02501099524373E-06i",1.1960720165545276E-3,-1.1600860780840223E-4,null,"0.0879645942i","1+0.0879645942i","0","-0.00193444245819267-8.50812229190843E-06i","1+0.0879645942i","0.998065557541807+0.0879560860777081i",null,"1.00192400067453-0.000161030951761084i",null,1.669571367825648E-2,-9.2086763384969812E-3]
[800,0.8,"5026.54824i","-25266187.2090471","-127001708847.146i",null,"100+0.502654824i",null,"0.016088472951768i","1+0.016088472951768i",null,"0","-0.000807507343201145-4.05897461475479E-06i","1+0.016088472951768i","0.999192492656799+0.0160844139771532i",0,"1+0.01759291884i","-1.42064111516417E-07i","-0.000179885146453532","0.999820114853546+0.0175927767758885i",1,"1.00080801595157-0.0000089447113705859i",7.0155037902379213E-3,-5.1208044190366919E-4,null,"1.00017986432206-3.02279251192149E-06i",1.5621412083882604E-3,-1.7316210778910079E-4,null,"0.1005309648i","1+0.1005309648i","0","-0.00252661872090471-0.0000127001708847146i","1+0.1005309648i","0.997473381279095+0.100518264629115i",null,"1.00250882422347-0.000240089099932661i",null,2.1764329689366806E-2,-1.3721666636319331E-2]
[900,0.9,"5654.86677i","-31977518.1864502","-180828604979.628i",null,"100+0.565486677i",null,"0.018099532070739i","1+0.018099532070739i",null,"0","-0.00102200148123895-5.77928221514891E-06i","1+0.018099532070739i","0.998977998518761+0.0180937527885239i",0,"1+0.019792033695i","-2.02274877530212E-07i","-0.000227667138480251","0.99977233286152+0.0197918314201225i",1,"1.00102281628073-0.0000127403233458728i",8.8795297482055953E-3,-7.292208991373112E-4,null,"1.00022763377928-4.30399438561674E-06i",1.9769769603099029E-3,-2.4654459174692096E-4,null,"0.1130973354i","1+0.1130973354i","0","-0.00319775181864502-0.0000180828604979628i","1+0.1130973354i","0.996802248181355+0.113079252539502i",null,"1.00316928239546-0.000341388900845323i",null,2.7485009967052262E-2,-1.949834669139414E-2]
[1000,1,"6283.1853i","-39478417.5141361","-248050212592.082i",null,"100+0.62831853i",null,"0.02011059118971i","1+0.02011059118971i",null,"0","-0.00126173022375179-7.92768479444296E-06i","1+0.02011059118971i","0.998738269776248+0.0201026635049156i",0,"1+0.02199114855i","-2.77468967805503E-07i","-0.000281070541333643","0.999718929458666+0.0219908710810322i",1,"1.00126297228951-0.0000174834815948787i",1.0963117647077658E-2,-1.0004661466042823E-3,null,"1.00028101969231-5.90405831379392E-06i",2.4405632777381239E-3,-3.3818258779536037E-4,null,"0.125663706i","1+0.125663706i","0","-0.00394784175141361-0.0000248050212592082i","1+0.125663706i","0.996052158248586+0.125638900978741i",null,"1.00390450750254-0.000467599017146001i",null,3.3849026334450388E-2,-2.6687247721115491E-2]
[2000,2,"12566.3706i","-157913670.056544","-1984401700736.66i",null,"100+1.25663706i",null,"0.04022118237942i","1+0.04022118237942i",null,"0","-0.00504692089500715-0.0000634214783555435i","1+0.04022118237942i","0.994953079104993+0.0401577609010645i",0,"1+0.0439822971i","-2.21975174244403E-06i","-0.00112428216533457","0.998875717834665+0.0439800773482576i",1,"1.00506684015408-0.000140761891205962i",4.3898978918974735E-2,-8.0244038671392886E-3,null,"1.0011234674848-0.0000472435502182413i",9.7528467839847911E-3,-2.7038183857620705E-3,null,"0.251327412i","1+0.251327412i","0","-0.0157913670056544-0.000198440170073665i","1+0.251327412i","0.984208632994346+0.251128971829926i",null,"1.01511228483668-0.00365440036023725i",null,0.13033795641275839,-0.20626369726729271]
[3000,3,"18849.5559i","-355305757.627225","-6697355739986.23i",null,"100+1.88495559i",null,"0.06033177356913i","1+0.06033177356913i",null,"0","-0.0113555720137661-0.00021404748944996i","1+0.06033177356913i","0.988644427986234+0.06011772607968i",0,"1+0.06597344565i","-0.0000074916621307486i","-0.00252963487200279","0.997470365127997+0.0659659539878693i",1,"1.0114568043298-0.000480162049731479i",9.8947785789548715E-2,-2.7199635989363525E-2,null,"1.00252550130876-0.00015950894037732i",2.1908682156757765E-2,-9.1161661220754437E-3,null,"0.376991118i","1+0.376991118i","0","-0.0355305757627225-0.000669735573998623i","1+0.376991118i","0.964469424237278+0.376321382426001i",null,"1.032207105914-0.0118723173174254i",null,0.27591139401100195,-0.65897984797945142]
[4000,4,"25132.7412i","-631654680.226177","-15875213605893.3i",null,"100+2.51327412i",null,"0.08044236475884i","1+0.08044236475884i",null,"0","-0.0201876835800286-0.000507371826844349i","1+0.08044236475884i","0.979812316419971+0.0799349929319956i",0,"1+0.0879645942i","-0.0000177580139395522i","-0.00449712866133829","0.995502871338662+0.0879468361860604i",1,"1.02050936580278-0.00115536839522136i",0.17634546343701379,-6.486731708665619E-2,null,"1.00448402369769-0.000378298942672899i",3.8861289831021016E-2,-2.1578174762441685E-2,null,"0.502654824i","1+0.502654824i","0","-0.0631654680226177-0.00158752136058933i","1+0.502654824i","0.936834531977382+0.501067302639411i",null,"1.05313156008286-0.0267229326851488i",null,0.4524479795061449,-1.4535532215637728]
[5000,5,"31415.9265i","-986960437.853402","-31006276574010.3i",null,"100+3.14159265i",null,"0.10055295594855i","1+0.10055295594855i",null,"0","-0.0315432555937947-0.000990960599305369i","1+0.10055295594855i","0.968456744406205+0.0995619953492446i",0,"1+0.10995574275i","-0.0000346836209756879i","-0.00702676353334108","0.992973236466659+0.109921059129024i",1,"1.03233409979464-0.00230086362343062i",0.27642703531490459,-0.12770047675985285,null,"1.00699464087726-0.000739370091275133i",6.0545527058386339E-2,-4.2068523946837549E-2,null,"0.62831853i","1+0.62831853i","0","-0.0986960437853402-0.00310062765740103i","1+0.62831853i","0.90130395621466+0.625217902342599i",null,"1.07554039988132-0.0489608221446789i",null,0.64152495616497218,-2.6064229165320709]
[6000,6,{"$f":"COMPLEX(0,2*Pi*A45)","v":"37699.1118i"},{"$f":"COMPLEX(-POWER(2*Pi*A45,2),0)","v":"-1421223030.5089"},{"$f":"COMPLEX(0,-POWER(2*Pi*A45,3))","v":"-53578845919889.8i"},null,{"$f":"IMSUM(IMPRODUCT(C45,Rcomp_AEF*Csen_AEF),Csen_AEF/Ccomp_AEF)","v":"100+3.76991118i"},null,{"$f":"IMPRODUCT((RdampSel*CdampSel+RdampSel*CinjSel),C45)","v":"0.12066354713826i"},"1+0.12066354713826i",null,{"$f":"IMPRODUCT(G45,L_infilterStd*RdampSel*CinjSel*CdampSel,E45)","v":"0"},{"$f":"IMPRODUCT(G45,L_infilterStd*CinjSel,D45)","v":"-0.0454222880550644-0.00171237991559968i"},"1+0.12066354713826i","0.954577711944936+0.11895116722266i",0,{"$f":"IMSUM(IMPRODUCT(C45,RdampPssv*CdampPssv),1)","v":"1+0.1319468913i"},{"$f":"IMPRODUCT(RdampPssv*CdampPssv*CfilterPssv*LinfilterPssv,E45)","v":"-0.0000599332970459887i"},{"$f":"IMPRODUCT(D45,LinfilterPssv*(CfilterPssv+CdampPssv))","v":"-0.0101185394880112"},"0.989881460511989+0.131886958002954i",1,{"$f":"CHOOSE(INFILTER_TYPE,U45,IMDIV(J45,O45),IMDIV(Q45,T45))","v":"1.04707618368279-0.00407236313315565i"},0.39963132154159037,{"$f":"IMARGUMENT(V45)*180/Pi","v":-0.22283769567919781},null,{"$f":"IMDIV(Q45,T45)","v":"1.01005160573809-0.00127868078885045i"},8.6878228214213454E-2,{"$f":"IMARGUMENT(Z45)*180/Pi","v":-7.2533891412035034E-2},null,{"$f":"IMPRODUCT((RdampCom*CdampCom+RdampCom*CinjCom),C45)","v":"0.753982236i"},"1+0.753982236i",{"$f":"IMPRODUCT(G45,L_infilterStd*RdampSel*CinjSel*CdampSel,E45)","v":"0"},{"$f":"IMPRODUCT(G45,LAEFCom*CinjCom,D45)","v":"-0.14212230305089-0.00535788459198898i"},"1+0.753982236i","0.85787769694911+0.748624351408011i",null,"1.09714233215486-0.0785254483841624i",null,0.82745005273081085,{"$f":"IMARGUMENT(AK45)*180/Pi","v":-4.0938332284652752}]
[7000,7,"43982.2971i","-1934442458.19267","-85081222919084.3i",null,"100+4.39822971i",null,"0.14077413832797i","1+0.14077413832797i",null,"0","-0.0618247809638377-0.00271919588449394i","1+0.14077413832797i","0.938175219036162+0.138054942443476i",0,"1+0.15393803985i","-0.0000951718559572877i","-0.0137724565253485","0.986227543474651+0.153842867994043i",1,"1.06491971124035-0.0066547175704059i",0.54650690499803489,-0.35803851128233322,null,"1.01364774496306-0.00203242789564579i",0.11775863081919422,-0.11488151110091376,null,"0.879645942i","1+0.879645942i","0","-0.193444245819267-0.00850812229190843i","1+0.879645942i","0.806555754180733+0.871137819708092i",null,"1.11595982410557-0.114696182593257i",null,0.99860654182809094,-5.8681444123703139]
[8000,8,"50265.4824i","-2526618720.90471","-127001708847146i",null,"100+5.02654824i",null,"0.16088472951768i","1+0.16088472951768i",null,"0","-0.0807507343201145-0.00405897461475479i","1+0.16088472951768i","0.919249265679886+0.156825754902925i",0,"1+0.1759291884i","-0.000142064111516417i","-0.0179885146453532","0.982011485354647+0.175787124288484i",1,"1.08609181252912-0.0102719025498505i",0.71771924446330793,-0.54186866227153452,null,"1.01777437069521-0.00303707384639667i",0.15306887931122595,-0.17097207611728268,null,"1.005309648i","1+1.005309648i","0","-0.252661872090471-0.0127001708847146i","1+1.005309648i","0.747338127909529+0.992609477115285i",null,"1.13047787639307-0.156305963009907i",null,1.1474831668084364,-7.872111887186036]
[9000,9,"56548.6677i","-3197751818.64502","-180828604979628i",null,"100+5.65486677i",null,"0.18099532070739i","1+0.18099532070739i",null,"0","-0.102200148123895-0.00577928221514891i","1+0.18099532070739i","0.897799851876105+0.175216038492241i",0,"1+0.19792033695i","-0.000202274877530212i","-0.0227667138480251","0.977233286151975+0.19771806207247i",1,"1.11086755800172-0.015199926873128i",0.91405869623835345,-0.78392541878160016,null,"1.02242117727244-0.00432936219233828i",0.19267459752955113,-0.2426130295946817,null,"1.130973354i","1+1.130973354i","0","-0.319775181864502-0.0180828604979628i","1+1.130973354i","0.680224818135498+1.11289049350204i",null,"1.13968899635933-0.201956311993631i",null,1.2700021815613578,-10.048671571412687]
[10000,10,"62831.853i","-3947841751.41361","-248050212592082i",null,"100+6.2831853i",null,"0.2011059118971i","1+0.2011059118971i",null,"0","-0.126173022375179-0.00792768479444296i","1+0.2011059118971i","0.873826977624821+0.193178227102657i",0,"1+0.2199114855i","-0.000277468967805503i","-0.0281070541333643","0.971892945866636+0.219634016532194i",1,"1.13957553409158-0.0217837969251259i",1.1364490006429406,-1.0951162057176234,null,"1.02757612372952-0.00594631936765738i",0.23642552017665613,-0.33155227440008561,null,"1.25663706i","1+1.25663706i","0","-0.394784175141361-0.0248050212592082i","1+1.25663706i","0.605215824858639+1.23183203874079i",null,"1.14306193658665-0.250197118999478i",null,1.3646346140011791,-12.346373457561011]
[11000,11,"69115.0383i","-4776888519.21047","-330154832960062i",null,"100+6.91150383i",null,"0.22121650308681i","1+0.22121650308681i",null,"0","-0.152669357073967-0.0105517484614036i",{"$f":"J50","v":"1+0.22121650308681i"},{"$f":"IMSUM(L50:N50)","v":"0.847330642926033+0.210664754625406i"},0,"1+0.24190263405i","-0.000369311196149125i","-0.0340095355013709",{"$f":"IMSUM(S50,R50,Q50)","v":"0.965990464498629+0.241533322853851i"},1,"1.17260379513662-0.0304601136568577i",1.385955441126572,-1.488007778577473,null,"1.03322530297936-0.00792524037931887i",0.28415617320379877,-0.43947231991289282,null,"1.382300766i","1+1.382300766i","0","-0.477688851921047-0.0330154832960062i","1+1.382300766i","0.522311148078953+1.34928528270399i",null,"1.1404664032261-0.299656187441126i",null,1.4315770260471383,-14.721639743100599]
[12000,12,"75398.2236i","-5684892122.0356","-428630767359119i",null,"100+7.53982236i",null,"0.24132709427652i","1+0.24132709427652i",null,"0","-0.181689152220258-0.0136990393247974i",{"$f":"J51","v":"1+0.24132709427652i"},{"$f":"IMSUM(L51:N51)","v":"0.818310847779742+0.227628054951723i"},0,"1+0.2638937826i","-0.00047946637636791i","-0.0404741579520447",{"$f":"IMSUM(S51,R51,Q51)","v":"0.959525842047955+0.263414316223632i"},1,"1.21040555029269-0.0417875027957339i",1.663791298206271,-1.977268703961691,null,"1.0393527988422-0.0103036560235159i",0.3356865931526708,-0.56798487143821996,null,"1.507964472i","1+1.507964472i","0","-0.56848921220356-0.0428630767359119i","1+1.507964472i","0.43151078779644+1.46510139526409i",null,"1.13208078901019-0.349119131643989i",null,1.4720965707233038,-17.139088569805107]
[13000,13,"81681.4089i","-6671852559.889","-544966317064805i",null,"100+8.16814089i",null,"0.26143768546623i","1+0.26143768546623i",null,"0","-0.213232407814052-0.0174171234933912i",{"$f":"J52","v":"1+0.26143768546623i"},{"$f":"IMSUM(L52:N52)","v":"0.786767592185948+0.244020561972839i"},0,"1+0.28588493115i","-0.000609599322268691i","-0.0475009214853857",{"$f":"IMSUM(S52,R52,Q52)","v":"0.952499078514614+0.285275331827731i"},1,"1.25350330434962-0.0564879587534794i",1.9713202428249139,-2.5802352580096271,null,"1.04594053239485-0.013119279149858i",0.39082307594081567,-0.7186258556562013,null,"1.633628178i","1+1.633628178i","0","-0.6671852559889-0.0544966317064805i","1+1.633628178i","0.3328147440111+1.57913154629352i",null,"1.11830126965405-0.397568429739991i",null,1.4880568505564558,-19.570860716239107]
[15000,15,"94247.7795i","-8882643940.68062","-837169467498278i",null,"100+9.42477795i",null,"0.30165886784565i","1+0.30165886784565i",null,"0","-0.283889300344153-0.026755936181245i",{"$f":"J53","v":"1+0.30165886784565i"},{"$f":"IMSUM(L53:N53)","v":"0.716110699655847+0.274902931664405i"},0,"1+0.32986722825i","-0.000936457766343574i","-0.0632408718000698",{"$f":"IMSUM(S53,R53,Q53)","v":"0.93675912819993+0.328930770483656i"},1,"1.35801564778858-0.100073375543763i",2.6816153756535357,-4.2145589072369587,null,"1.06041260153671-0.0202134201141273i",0.51107534099999663,-1.0920309889480853,null,"1.88495559i","1+1.88495559i","0","-0.888264394068062-0.0837169467498278i","1+1.88495559i","0.111735605931938+1.80123864325017i",null,"1.07677284136923-0.48837844858316i",null,1.4549265148801958,-24.397026703211008]
[16000,16,"100530.9648i","-10106474883.6188","-1016013670777170i",null,"100+10.05309648i",null,"0.32176945903536i","1+0.32176945903536i",null,"0","-0.323002937280457-0.0324717969180382i",{"$f":"J54","v":"1+0.32176945903536i"},{"$f":"IMSUM(L54:N54)","v":"0.676997062719543+0.289297662117322i"},0,"1+0.3518583768i","-0.00113651289213134i","-0.0719540585814124",{"$f":"IMSUM(S54,R54,Q54)","v":"0.928045941418588+0.350721863907869i"},1,"1.42077198044782-0.131841861988947i",3.0877250429222842,-5.3016325265049504,null,"1.06824847269031-0.0245674461156848i",0.57574199760914424,-1.317449010464451,null,"2.010619296i","1+2.010619296i","0","-1.01064748836188-0.101601367077717i","1+2.010619296i","-0.0106474883618799+1.90901792892228i",null,"1.05026748328463-0.529687382965538i",null,1.410201299755701,-26.763440052318561]
[17500,17.5,"109955.74275i","-12090265363.7042","-1329394108110690i",null,"100+10.995574275i",null,"0.351935345819925i","1+0.351935345819925i",null,"0","-0.386404881023986-0.0424874356952178i","1+0.351935345819925i","0.613595118976014+0.309447910124707i",0,"1+0.384845099625i","-0.00148706024933262i","-0.0860778532834284","0.913922146716572+0.383358039375667i",1,"1.52988903964521-0.197989873882504i",3.7653324508545993,-7.3739223051536262,null,"1.08067313717697-0.0322124106028964i",0.67774411860678441,-1.7073514546936517,null,"2.199114855i","1+2.199114855i","0","-1.20902653637042-0.132939410811069i","1+2.199114855i","-0.20902653637042+2.06617544418893i",null,"1.00509127575334-0.585666987530125i",null,1.3136657623189221,-30.229368068378868]
[19000,19,"119380.5207i","-14251708722.6031","-1701376408169090i",null,"100+11.93805207i",null,"0.38210123260449i","1+0.38210123260449i",null,"0","-0.455484610774395-0.0543759900050841i","1+0.38210123260449i","0.544515389225605+0.327725242599406i",0,"1+0.41783182245i","-0.00190315965017794i","-0.101466465421445","0.898533534578555+0.415928662799822i",1,"1.65817828498766-0.296273808432833i",4.5291036957352651,-10.130382319955725,null,"1.09380500914327-0.0413040036219838i",0.78498657208831646,-2.1625620380911901,null,"2.387610414i","1+2.387610414i","0","-1.42517087226031-0.170137640816909i","1+2.387610414i","-0.42517087226031+2.21747277318309i",null,"0.955145637394447-0.634100278835996i",null,1.1872304101453335,-33.579313338061688]
[20000,20,"125663.706i","-15791367005.6544","-1984401700736660i",null,"100+12.5663706i",null,"0.4022118237942i","1+0.4022118237942i",null,"0","-0.504692089500715-0.0634214783555435i","1+0.4022118237942i","0.495307910499285+0.338790345438656i",0,"1+0.439822971i","-0.00221975174244403i","-0.112428216533457","0.887571783466543+0.437603219257556i",1,"1.75384036849041-0.387581858519912i",5.0868802044571337,-12.461532507267963,null,"1.10289136673883-0.0482280333530784i",0.85895139815584209,-2.503876233723882,null,"2.51327412i","1+2.51327412i","0","-1.57913670056544-0.198440170073665i","1+2.51327412i","-0.57913670056544+2.31483394992634i",null,"0.920057687958595-0.662181049220824i",null,1.0889971113148,-35.743202548086629]
[25000,25,"157079.6325i","-24674010946.3351","-3875784571751290i",null,"100+15.70796325i",null,"0.50276477974275i","1+0.50276477974275i",null,"0","-0.78858138984487-0.123870074913171i","1+0.50276477974275i","0.21141861015513+0.378894704829579i",0,"1+0.54977871375i","-0.00433545262196099i","-0.175669088333527","0.824330911666473+0.545443261128039i",1,"2.13489643163073-1.44800958315386i",8.2311637745637114,-34.147378173458947,null,"1.15063430275763-0.0944123429201175i",1.2478876702293975,-4.6907499094753602,null,"3.14159265i","1+3.14159265i","0","-2.46740109463351-0.387578457175129i","1+3.14159265i","-1.46740109463351+2.75401419282487i",null,"0.737799633925998-0.756222678833395i",null,0.47750204333977153,-45.70648831057828]
[30000,30,"188495.559i","-35530575762.7225","-6697355739986230i",null,"100+18.8495559i",null,"0.6033177356913i","1+0.6033177356913i",null,"0","-1.13555720137661-0.21404748944996i","1+0.6033177356913i","-0.13555720137661+0.38927024624134i",0,"1+0.6597344565i","-0.0074916621307486i","-0.252963487200279","0.747036512799721+0.652242794369251i",1,"0.584416155447363-2.77242308882407i",9.0460044070118037,-78.096537802351492,null,"1.19711485062497-0.162073843484299i",1.6416002678484942,-7.7102258432488213,null,"3.76991118i","1+3.76991118i","0","-3.55305757627225-0.669735573998623i","1+3.76991118i","-2.55305757627225+3.10017560600138i",null,"0.566322803257668-0.788940703467892i",null,-0.25419713919222264,-54.328200462835866]
[35000,35,"219911.4855i","-48361061454.8167","-10635152864885500i",null,"100+21.99114855i",null,"0.70387069163985i","1+0.70387069163985i",null,"0","-1.54561952409594-0.339899485561742i","1+0.70387069163985i","-0.54561952409594+0.363971206078108i",0,"1+0.76969019925i","-0.0118964819946609i","-0.344311413133713","0.655688586866287+0.757793717255339i",1,"-0.672820098609681-1.73886342497814i",5.4112135808016752,-111.15299721981248,null,"1.23379913385935-0.252063305743339i",2.00247376338032,-11.546548624466498,null,"4.39822971i","1+4.39822971i","0","-4.83610614548167-1.06351528648855i","1+4.39822971i","-3.83610614548167+3.33471442351145i",null,"0.41921044508987-0.782116677299459i",null,-1.0378038016062252,-61.808924675077051]
[40000,40,"251327.412i","-63165468022.6178","-15875213605893300i",null,"100+25.1327412i",null,"0.8044236475884i","1+0.8044236475884i",null,"0","-2.01876835800286-0.50737182684435i","1+0.8044236475884i","-1.01876835800286+0.29705182074405i",0,"1+0.879645942i","-0.0177580139395522i","-0.44971286613383","0.55028713386617+0.861887928060448i",1,"-0.692472195400057-0.991514671722638i",1.651312362122153,-124.9303842741472,null,"1.25130054768913-0.361329353698914i",2.2950572476606705,-16.106762990676589,null,"5.02654824i","1+5.02654824i","0","-6.31654680226178-1.58752136058933i","1+5.02654824i","-5.31654680226178+3.43902687941067i",null,"0.298556215795346-0.752331454537946i",null,-1.8366692340590198,-68.354776184826349]
[45000,45,"282743.3385i","-79943795466.1256","-22603575622453500i",null,"100+28.27433385i",null,"0.90497660353695i","1+0.90497660353695i",null,"0","-2.55500370309737-0.722410276893614i","1+0.90497660353695i","-1.55500370309737+0.182566326643336i",0,"1+0.98960168475i","-0.0252843596912765i","-0.569167846200628","0.430832153799372+0.964317325058723i",1,"-0.566943040383968-0.648539492109947i",-1.2957977453010483,-131.15944449364133,null,"1.24167825630055-0.4822531654545i",2.4903513176428036,-21.225581837051031,null,"5.65486677i","1+5.65486677i","0","-7.99437954661256-2.26035756224535i","1+5.65486677i","-6.99437954661256+3.39450920775465i",null,"0.201858085193628-0.710521584942778i",null,-2.6313550144756443,-74.140233708338556]
[50000,50,"314159.265i","-98696043785.3402","-31006276574010300i",null,"100+31.4159265i",null,"1.0055295594855i","1+1.0055295594855i",null,"0","-3.15432555937947-0.990960599305369i","1+1.0055295594855i","-2.15432555937947+0.0145689601801311i",0,"1+1.0995574275i","-0.0346836209756879i","-0.702676353334108","0.297323646665892+1.06487380652431i",1,"-0.461004849474272-0.469866736888135i",-3.6321108878421309,-134.45456143095515,null,"1.20113261486052-0.603709910866002i",2.5700266485355989,-26.684889155829534,null,"6.2831853i","1+6.2831853i","0","-9.86960437853402-3.10062765740103i","1+6.2831853i","-8.86960437853402+3.18255764259897i",null,"0.125306037022006-0.663433380236561i",null,-3.4118237294483897,-79.304252936556608]
[55000,55,"345575.1915i","-119422212980.262","-41269354120007700i",null,"100+34.55751915i",null,"1.10608251543405i","1+1.10608251543405i",null,"0","-3.81673392684917-1.31896855767545i","1+1.10608251543405i","-2.81673392684917-0.2128860422414i",0,"1+1.20951317025i","-0.0461638995186406i","-0.850238387534273","0.149761612465727+1.16334927073136i",1,"-0.382514687575279-0.363772547960584i",-5.5494414322193206,-136.43861490544182,null,"1.13158633969446-0.713914407322436i",2.5289219460991141,-32.247703858315745,null,"6.91150383i","1+6.91150383i","0","-11.9422212980262-4.12693541200078i","1+6.91150383i","-10.9422212980262+2.78456841799922i",null,"0.0651313254047545-0.615061696793639i",null,-4.1731976284511543,-83.955249656096086]
[60000,60,"376991.118i","-142122303050.89","-53578845919889800i",null,"100+37.6991118i",null,"1.2066354713826i","1+1.2066354713826i",null,"0","-4.54222880550644-1.71237991559968i","1+1.2066354713826i","-3.54222880550644-0.50574444421708i",0,"1+1.319468913i","-0.0599332970459887i","-1.01185394880112","-0.01185394880112+1.25953561595401i",1,"-0.324332213927251-0.294336225397841i",-7.1709434355677093,-137.7757983384839,null,"1.0400194368606-0.803731410476985i",2.3744938174899315,-37.697000895949728,null,"7.53982236i","1+7.53982236i","0","-14.212230305089-5.35788459198898i","1+7.53982236i","-13.212230305089+2.18193776801102i",null,"0.0180633657330593-0.567686836127938i",null,-4.9134286749267133,-88.177506638453309]
[65000,65,"408407.0445i","-166796313997.225","-68120789633100600i",null,"100+40.84070445i",null,"1.30718842733115i","1+1.30718842733115i",null,"0","-5.33081019535131-2.1771404366739i","1+1.30718842733115i","-4.33081019535131-0.86995200934275i",0,"1+1.42942465575i","-0.0761999152835863i","-1.18752303713464","-0.18752303713464+1.35322474046641i",1,"-0.280227340225223-0.245543914801646i",-8.5755053684547384,-138.77414880395818,null,"0.935933635026933-0.868672499581671i",2.1233776458839189,-42.865464403329042,null,"8.16814089i","1+8.16814089i","0","-16.6796313997225-6.81207896331006i","1+8.16814089i","-15.6796313997225+1.35606192668994i",null,"-0.0185842434899328-0.522546867726625i",null,-5.6320053178456675,-92.036851125435149]
[70000,70,"439822.971i","-193444245819.267","-85081222919084300i",null,"100+43.9822971i",null,"1.4077413832797i","1+1.4077413832797i",null,"0","-6.18247809638377-2.71919588449394i","1+1.4077413832797i","-5.18247809638377-1.31145450121424i",0,"1+1.5393803985i","-0.0951718559572877i","-1.37724565253485","-0.37724565253485+1.44420854254271i",1,"-0.2459468404389-0.20939659987833i",-9.8156255227100981,-139.58927039359438,null,"0.828499592840669-0.908835414596794i",1.7966476948432284,-47.647518838991182,null,"8.79645942i","1+8.79645942i","0","-19.3444245819267-8.50812229190843i","1+8.79645942i","-18.3444245819267+0.28833712809157i",null,"-0.0469638423973967-0.480254957035873i",null,-6.3292296272173934,-95.585161782986702]
[75000,75,"471238.8975i","-222066098517.016","-104646183437285000i",null,"100+47.12388975i",null,"1.50829433922825i","1+1.50829433922825i",null,"0","-7.09723250860383-3.34449202265563i","1+1.50829433922825i","-6.09723250860383-1.83619768342738i",0,"1+1.64933614125i","-0.117057220792947i","-1.58102179500175","-0.58102179500175+1.53227892045705i",1,"-0.21867387638181-0.181519381527295i",-10.927630903519169,-140.30421441511064,null,"0.724724096250984-0.927429383979835i",1.4155959618024632,-51.994750577533907,null,"9.42477795i","1+9.42477795i","0","-22.2066098517016-10.4646183437285i","1+9.42477795i","-21.2066098517016-1.0398403937285i",null,"-0.0687816475530221-0.441053807276823i",null,-7.0058123415237104,-98.863791432479545]
[80000,80,"502654.824i","-252661872090.471","-127001708847146000i",null,"100+50.2654824i",null,"1.6088472951768i","1+1.6088472951768i",null,"0","-8.07507343201145-4.05897461475479i","1+1.6088472951768i","-7.07507343201145-2.45012731957799i",0,"1+1.759291884i","-0.142064111516417i","-1.79885146453532","-0.79885146453532+1.61722777248358i",1,"-0.196521509369278-0.159340335760434i",-11.937518590414722,-140.9647385617952,null,"0.628943613443379-0.929017267865794i",0.99902617557773565,-55.90204534003675,null,"10.05309648i","1+10.05309648i","0","-25.2661872090471-12.7001708847146i","1+10.05309648i","-24.2661872090471-2.6470744047146i",null,"-0.0853856976294546-0.404969849635569i",null,-7.662647035234011,-101.90611829270394]
[90000,90,"565486.677i","-319775181864.502","-180828604979628000i",null,"100+56.5486677i",null,"1.8099532070739i","1+1.8099532070739i",null,"0","-10.2200148123895-5.77928221514891i","1+1.8099532070739i","-9.2200148123895-3.96932900807501i",0,"1+1.9792033695i","-0.202274877530212i","-2.27667138480251","-1.27667138480251+1.77692849196979i",1,"-0.162798961392712-0.126220032268226i",-13.722758101044498,-142.2131395766458,null,"0.467946692755926-0.89897492187976i",0.11625421473036618,-62.501506007112361,null,"11.30973354i","1+11.30973354i","0","-31.9775181864502-18.0828604979628i","1+11.30973354i","-30.9775181864502-6.7731269579628i",null,"-0.106993254938712-0.34170118396652i",null,-8.9208739577809553,-107.38634842152236]
[100000,100,"628318.53i","-394784175141.361","-248050212592082000i",null,"100+62.831853i",null,"2.011059118971i","1+2.011059118971i",null,"0","-12.6173022375179-7.92768479444296i","1+2.011059118971i","-11.6173022375179-5.91662567547196i",0,"1+2.199114855i","-0.277468967805503i","-2.81070541333643","-1.81070541333643+1.9216458871945i",1,"-0.13835523536079-0.102645429783891i",-15.275616320072016,-143.42836576765978,null,"0.346447280056275-0.846833423513512i",-0.7719538774600585,-67.750082407962879,null,"12.5663706i","1+12.5663706i","0","-39.4784175141361-24.8050212592082i","1+12.5663706i","-38.4784175141361-12.2386506592082i",null,"-0.117932409087248-0.289072102294643i",null,-10.111257659867539,-112.19392888840346]
[110000,110,"691150.383i","-477688851921.047","-330154832960062000i",null,"100+69.1150383i",null,"2.2121650308681i","1+2.2121650308681i",null,"0","-15.2669357073967-10.5517484614036i",{"$f":"J72","v":"1+2.2121650308681i"},{"$f":"IMSUM(L72:N72)","v":"-14.2669357073967-8.3395834305355i"},1,"1+2.4190263405i","-0.369311196149125i","-3.40095355013709",{"$f":"IMSUM(S72,R72,Q72)","v":"-2.40095355013709+2.04971514435087i"},1,"-0.119795593507346-0.0850301500674831i",-16.659262086675419,-144.63311006881031,null,"0.256610920932726-0.78845634041953i",-1.6271935993701703,-71.972008778704406,null,"13.82300766i","1+13.82300766i","0","-47.7688851921047-33.0154832960062i","1+13.82300766i","-46.7688851921047-19.1924756360062i",null,"-0.122107092549173-0.245451013298995i",null,-11.240343660971192,-116.449449539292]
[120000,120,"753982.236i","-568489212203.56","-428630767359118000i",null,"100+75.3982236i",null,"2.4132709427652i","1+2.4132709427652i",null,"0","-18.1689152220258-13.6990393247974i","1+2.4132709427652i","-17.1689152220258-11.2857683820322i",2,"1+2.638937826i","-0.479466376367909i","-4.04741579520447","-3.04741579520447+2.15947144963209i",1,"-0.105189058623212-0.0714157869011218i",-17.914255625647186,-145.82632299851332,null,"0.190056179183256-0.731280889445568i",-2.4344521320243349,-75.4314241146119,null,"15.07964472i","1+15.07964472i","0","-56.848921220356-42.8630767359119i","1+15.07964472i","-55.848921220356-27.7834320159119i",null,"-0.122027918482203-0.209301989857343i",null,-12.313756909852316,-120.2431780938296]
[130000,130,"816814.089i","-667185255988.9","-544966317064805000i",null,"100+81.6814089i",null,"2.6143768546623i","1+2.6143768546623i",null,"0","-21.3232407814052-17.4171234933912i","1+2.6143768546623i","-20.3232407814052-14.8027466387289i",3,"1+2.8588493115i","-0.609599322268691i","-4.75009214853857","-3.75009214853857+2.24924998923131i",1,"-0.0933681761585107-0.0606336072146096i",-19.067867336228275,-147.00017080939122,null,"0.140159515476207-0.678275472194924i",-3.1902819384763736,-78.324673135960879,null,"16.33628178i","1+16.33628178i","0","-66.71852559889-54.4966317064805i","1+16.33628178i","-65.71852559889-38.1603499264805i",null,"-0.11932474764744-0.179292026829703i",null,-13.336315558743205,-123.64507291847876]
[150000,150,"942477.795i","-888264394068.062","-837169467498278000i",null,"100+94.2477795i",null,"3.0165886784565i","1+3.0165886784565i",null,"0","-28.3889300344153-26.755936181245i","1+3.0165886784565i","-27.3889300344153-23.7393475027885i",4,"1+3.2986722825i","-0.936457766343574i","-6.32408718000698","-5.32408718000698+2.36221451615643i",1,"-0.0753596827189439-0.0448209908583168i",-21.14186455812105,-149.25747428057099,null,"0.0727491350158178-0.587297524253484i",-4.5567044191047339,-82.938683996890816,null,"18.8495559i","1+18.8495559i","0","-88.8264394068062-83.7169467498278i","1+18.8495559i","-87.8264394068062-64.8673908498278i",null,"-0.109933660153476-0.133427317313791i",null,-15.244993872337629,-129.48585010818474]
[160000,160,"1005309.648i","-1010647488361.88","-1016013670777170000i",null,"100+100.5309648i",null,"3.2176945903536i","1+3.2176945903536i",null,"0","-32.3002937280457-32.4717969180382i","1+3.2176945903536i","-31.3002937280457-29.2541023276846i",5,"1+3.518583768i","-1.13651289213134i","-7.19540585814124","-6.19540585814124+2.38207087586866i",1,"-0.0683357757152904-0.038932312441685i",-22.086249644619926,-150.32893578049814,null,"0.0496196838103293-0.548856078550081i",-5.1754790366918115,-84.834181786660722,null,"20.10619296i","1+20.10619296i","0","-101.064748836188-101.601367077717i","1+20.10619296i","-100.064748836188-81.495174117717i",null,"-0.104394071971608-0.115910748017805i",null,-16.13796780534383,-132.00752440008375]
[175000,175,{"$f":"COMPLEX(0,2*Pi*A77)","v":"1099557.4275i"},{"$f":"COMPLEX(-POWER(2*Pi*A77,2),0)","v":"-1209026536370.42"},{"$f":"COMPLEX(0,-POWER(2*Pi*A77,3))","v":"-1329394108110690000i"},null,"100+109.95574275i",null,{"$f":"IMPRODUCT((RdampSel*CdampSel+RdampSel*CinjSel),C77)","v":"3.51935345819925i"},"1+3.51935345819925i",null,{"$f":"IMPRODUCT(G77,L_infilterStd*RdampSel*CinjSel*CdampSel,E77)","v":"0"},{"$f":"IMPRODUCT(G77,L_infilterStd*CinjSel,D77)","v":"-38.6404881023986-42.4874356952178i"},"1+3.51935345819925i","-37.6404881023986-38.9680822370185i",6,{"$f":"IMSUM(IMPRODUCT(C77,RdampPssv*CdampPssv),1)","v":"1+3.84845099625i"},{"$f":"IMPRODUCT(RdampPssv*CdampPssv*CfilterPssv*LinfilterPssv,E77)","v":"-1.48706024933262i"},{"$f":"IMPRODUCT(D77,LinfilterPssv*(CfilterPssv+CdampPssv))","v":"-8.60778532834284"},"-7.60778532834284+2.36139074691738i",1,"-0.0595448112648908-0.0318541659922001i",-23.41009210955383,-151.85494563623831,null,{"$f":"IMDIV(Q77,T77)","v":"0.0233223767385842-0.498617874704106i"},-6.0351519684094788,{"$f":"IMARGUMENT(Z77)*180/Pi","v":-87.321996371444413},null,{"$f":"IMPRODUCT((RdampCom*CdampCom+RdampCom*CinjCom),C77)","v":"21.99114855i"},"1+21.99114855i",{"$f":"IMPRODUCT(G77,L_infilterStd*RdampSel*CinjSel*CdampSel,E77)","v":"0"},{"$f":"IMPRODUCT(G77,LAEFCom*CinjCom,D77)","v":"-120.902653637042-132.939410811069i"},"1+21.99114855i","-119.902653637042-110.948262261069i",null,"-0.0959217084374499-0.0946501294300461i",null,-17.408932160508265,{"$f":"IMARGUMENT(AK77)*180/Pi","v":-135.38229708831528}]
[190000,190,"1193805.207i","-1425170872260.31","-1701376408169090000i",null,"100+119.3805207i",null,"3.8210123260449i","1+3.8210123260449i",null,"0","-45.5484610774395-54.3759900050841i","1+3.8210123260449i","-44.5484610774395-50.5549776790392i",7,"1+4.1783182245i","-1.90315965017794i","-10.1466465421445","-9.1466465421445+2.27515857432206i",1,"-0.0523568769925945-0.0263558280116366i",-24.639629935905273,-153.27986121062406,null,"0.00404885363798583-0.455807100582667i",{"$f":"20*LOG10(IMABS(Z78))","v":-6.8240356083586704},-89.491065239612325,null,"23.87610414i",{"$f":"IMSUM(1,AD78)","v":"1+23.87610414i"},"0","-142.517087226031-170.137640816909i",{"$f":"AE78","v":"1+23.87610414i"},{"$f":"IMSUM(AF78:AH78)","v":"-141.517087226031-146.261536676909i"},null,{"$f":"IMDIV(AE78,AI78)","v":"-0.0877285033166008-0.0780456879875425i"},null,{"$f":"20*LOG10(IMABS(AK78))","v":-18.605170037005653},-138.34282945364629]
[200000,200,"1256637.06i","-1579136700565.44","-1984401700736660000i",null,"100+125.663706i",null,"4.022118237942i","1+4.022118237942i",null,"0","-50.4692089500715-63.4214783555435i","1+4.022118237942i","-49.4692089500715-59.3993601176015i",0,"1+4.39822971i","-2.21975174244403i","-11.2428216533457","-10.2428216533457+2.17847796755597i",1,"-0.0482605814568458-0.023357369261113i",-25.414149611685421,-154.17374155504416,null,"-0.00603107904151515-0.430679009369611i",-7.3160743134316677,-90.802297829124925,null,"25.1327412i","1+25.1327412i","0","-157.913670056544-198.440170073665i","1+25.1327412i","-156.913670056544-173.307428873665i",null,"-0.0825616904205737-0.0689817968431073i",null,-19.364819636227516,-140.12062877346483]
[300000,300,"1884955.59i","-3553057576272.25","-6697355739986230000i",null,"100+188.495559i",null,"6.033177356913i","1+6.033177356913i",null,"0","-113.555720137661-214.04748944996i","1+6.033177356913i","-112.555720137661-208.014312093047i",0,"1+6.597344565i","-7.4916621307486i","-25.2963487200279","-24.2963487200279-0.8943175657486i",1,"-0.0244471515768153-0.00842089533848738i",-31.748500628322866,-160.99357644834282,null,"-0.0510841451440229-0.269656119615447i",-11.23066551897832,-100.72709679842245,null,"37.6991118i","1+37.6991118i","0","-355.305757627225-669.735573998623i","1+37.6991118i","-354.305757627225-632.036462198623i",null,"-0.0460598028849817-0.0242379265652396i",null,-25.671937963299285,-152.24542915960262]
[400000,400,"2513274.12i","-6316546802261.78","-15875213605893300000i",null,"100+251.327412i",null,"8.044236475884i","1+8.044236475884i",null,"0","-201.876835800286-507.371826844349i","1+8.044236475884i","-200.876835800286-499.327590368465i",0,"1+8.79645942i","-17.7580139395522i","-44.971286613383","-43.971286613383-8.9615545195522i",1,"-0.0145594886307402-0.00385451163552385i",-36.442880787070308,-165.17157349426805,null,"-0.0609803570882482-0.187621997460974i",-14.098202737338376,-108.00504776556444,null,"50.2654824i","1+50.2654824i","0","-631.654680226178-1587.52136058933i","1+50.2654824i","-630.654680226178-1537.25587818933i",null,"-0.0282161976840051-0.0109251019078142i",null,-30.383361185005448,-158.83396742600908]
[500000,500,"3141592.65i","-9869604378534.03","-31006276574010300000i",null,"100+314.159265i",null,"10.055295594855i","1+10.055295594855i",null,"0","-315.432555937948-990.96059930537i","1+10.055295594855i","-314.432555937948-980.905303710515i",0,"1+10.995574275i","-34.6836209756879i","-70.2676353334109","-69.2676353334109-23.6880467006879i",1,"-0.00959218889686611-0.00205534261488325i",-40.166691105722208,-167.90596517553513,null,"-0.0615270356063271-0.137699503329252i",-16.430810401971719,-114.07609690762054,null,"62.831853i","1+62.831853i","0","-986.960437853403-3100.62765740103i","1+62.831853i","-985.960437853403-3037.79580440103i",null,"-0.0188088486212507-0.00577549702211999i",null,-34.121441234097951,-162.9302277217661]
[600000,600,"3769911.18i","-14212230305089","-53578845919889800000i",null,{"$f":"IMSUM(IMPRODUCT(C83,Rcomp_AEF*Csen_AEF),Csen_AEF/Ccomp_AEF)","v":"100+376.991118i"},null,"12.066354713826i","1+12.066354713826i",null,"0","-454.222880550644-1712.37991559968i","1+12.066354713826i","-453.222880550644-1700.31356088585i",0,"1+13.19468913i","-59.9332970459887i","-101.185394880112","-100.185394880112-46.7386079159887i",1,{"$f":"CHOOSE(INFILTER_TYPE,U83,IMDIV(J83,O83),IMDIV(Q83,T83))","v":"-0.00677215047278663-0.00121700702294033i"},-43.247430501595559,{"$f":"IMARGUMENT(V83)*180/Pi","v":-169.81225387411524},null,"-0.0586573085514338-0.104337844819759i",-18.438427473037287,-119.34409892462944,null,"75.3982236i","1+75.3982236i","0","-1421.2230305089-5357.88459198898i","1+75.3982236i","-1420.2230305089-5282.48636838898i",null,"-0.0133585447682531-0.00340220715788393i",null,-37.211875861380371,-165.71145151158905]
[700000,700,"4398229.71i","-19344424581926.7","-85081222919084300000i",null,"100+439.822971i",null,"14.077413832797i","1+14.077413832797i",null,"0","-618.247809638377-2719.19588449394i","1+14.077413832797i","-617.247809638377-2705.11847066114i",0,"1+15.393803985i","-95.1718559572877i","-137.724565253485","-136.724565253485-79.7780519722877i",1,"-0.00502663008530425-0.000777295498449101i",-45.871834550947277,-171.20966220535371,null,"-0.054465815272571-0.0808093799602716i",-20.224281535266382,-123.98011317947271,null,"87.9645942i","1+87.9645942i","0","-1934.44245819267-8508.12229190843i","1+87.9645942i","-1933.44245819267-8420.15769770843i",null,"-0.00994957804279849-0.00216586639867937i",null,-39.842837308671257,-167.71920050928796]
[800000,800,"5026548.24i","-25266187209047.1","-127001708847146000000i",null,"100+502.654824i",null,"16.088472951768i","1+16.088472951768i",null,"0","-807.507343201145-4058.97461475479i","1+16.088472951768i","-806.507343201145-4042.88614180302i",0,"1+17.59291884i","-142.064111516417i","-179.885146453532","-178.885146453532-124.471192676417i",1,"-0.00387460369753687-0.00052558896281708i",-48.156266695190396,-172.2749948563758,null,"-0.0498746775819195-0.0636439551451754i",-21.845526598424524,-128.08407581443436,null,"100.5309648i","1+100.5309648i","0","-2526.61872090471-12700.1708847146i","1+100.5309648i","-2525.61872090471-12599.6399199146i",null,"-0.00768595691869674-0.00146129546550187i",null,-42.131824580506304,-169.23509992014019]
[900000,900,"5654866.77i","-31977518186450.2","-180828604979628000000i",null,"100+565.486677i",null,"18.099532070739i","1+18.099532070739i",null,"0","-1022.00148123895-5779.28221514891i","1+18.099532070739i","-1021.00148123895-5761.18268307817i",0,"1+19.792033695i","-202.274877530212i","-227.667138480251","-226.667138480251-182.482843835212i",1,"-0.00307579387271769-0.000371519220579002i",-50.177950707517411,-173.11271855790628,null,"-0.0453290658822222-0.0508245567560387i",-23.336823855604468,-131.72891938740412,null,"113.0973354i","1+113.0973354i","0","-3197.75181864502-18082.8604979628i","1+113.0973354i","-3196.75181864502-17969.7631625628i",null,"-0.00611028500534033-0.00103134718780667i",null,-44.15677146419398,-170.41942019561682]
[1000000,1000,"6283185.3i","-39478417514136.1","-248050212592083000000i",null,"100+628.31853i",null,"20.11059118971i","1+20.11059118971i",null,"0","-1261.73022375179-7927.68479444296i","1+20.11059118971i","-1260.73022375179-7907.57420325325i",0,"1+21.99114855i","-277.468967805504i","-281.070541333643","-280.070541333643-255.477819255504i",1,"-0.00249982526497402-0.000272094223885485i",-51.990657173362457,-173.78807852250424,null,"-0.0410436705183489-0.0410803687419042i",-24.720893050574389,-134.97439677178232,null,"125.663706i","1+125.663706i","0","-3947.84175141361-24805.0212592082i","1+125.663706i","-3946.84175141361-24679.3575532082i",null,"-0.00497119199214965-0.00075449727849535i",null,-45.971882987428131,-171.36985914706423]
[2000000,2000,"12566370.6i","-157913670056544","-1.98440170073666E+21i",null,"100+1256.63706i",null,"40.22118237942i","1+40.22118237942i",null,"0","-5046.92089500715-63421.4783555435i","1+40.22118237942i","-5045.92089500715-63381.2571731641i",0,"1+43.9822971i","-2219.75174244403i","-1124.28216533457","-1123.28216533457-2175.76944534403i",1,"-0.000631842512878456-0.0000345248332974647i",-63.974875736419037,-176.87238213240556,null,"-0.0161479138456329-0.00787705869610126i",-34.910622019719469,-153.99657536312648,null,"251.327412i","1+251.327412i","0","-15791.3670056544-198440.170073666i","1+251.327412i","-15790.3670056544-198188.842661666i",null,"-0.00126052131053976-0.0000953842499809288i",null,-57.964199285629583,-175.67264811214119]
[3000000,3000,"18849555.9i","-355305757627225","-6.69735573998623E+21i",null,"100+1884.95559i",null,"60.33177356913i","1+60.33177356913i",null,"0","-11355.5720137661-214047.48944996i","1+60.33177356913i","-11354.5720137661-213987.157676391i",0,"1+65.97344565i","-7491.6621307486i","-2529.63487200279","-2528.63487200279-7425.6886850986i",1,"-0.000281396770996912-0.0000102582786956092i",-71.007850054187543,-177.9122153568679,null,"-0.00800240724806651-0.00259035449008639i",-41.50283020468229,-162.06339330584896,null,"376.991118i","1+376.991118i","0","-35530.5757627225-669735.573998623i","1+376.991118i","-35529.5757627225-669358.582880623i",null,"-0.000561709185605723-0.0000283215746409225i",null,-64.998742805673388,-177.11357116894575]
[4000000,4000,"25132741.2i","-631654680226178","-1.58752136058933E+22i",null,"100+2513.27412i",null,"80.44236475884i","1+80.44236475884i",null,"0","-20187.6835800286-507371.82684435i","1+80.44236475884i","-20186.6835800286-507291.384479591i",0,"1+87.9645942i","-17758.0139395522i","-4497.1286613383","-4496.1286613383-17670.0493453522i",1,"-0.000158399923960462-4.33196622557436E-06i",-76.001653625700826,-178.43344938875953,null,"-0.0046889892127191-0.00113651628241178i",-46.330489425340687,-166.3754102049304,null,"502.654824i","1+502.654824i","0","-63165.4680226178-1587521.36058933i","1+502.654824i","-63164.4680226178-1587018.70576533i",null,"-0.000316253088643544-0.0000119569845243432i",null,-69.993100827945995,-177.8347767851734]
[5000000,5000,"31415926.5i","-986960437853403","-3.10062765740103E+22i",null,"100+3141.59265i",null,"100.55295594855i","1+100.55295594855i",null,"0","-31543.2555937948-990960.59930537i","1+100.55295594855i","-31542.2555937948-990860.046349421i",0,"1+109.95574275i","-34683.6209756879i","-7026.76353334109","-7025.76353334109-34573.6652329379i",1,"-0.00010140984571046-2.21897661655364E-06i",-79.876318699201704,-178.74649558547384,null,"-0.0030598536035311-0.000592873440722829i",-50.125928255820746,-169.03431974433656,null,"628.31853i","1+628.31853i","0","-98696.0437853403-3100627.65740103i","1+628.31853i","-98695.0437853403-3099999.33887103i",null,"-0.00020248846731198-6.12406845038108E-06i",null,-73.868023454622971,-178.26767265695185]
[6000000,6000,"37699111.8i","-1421223030508900","-5.35788459198898E+22i",null,"100+3769.91118i",null,"120.66354713826i","1+120.66354713826i",null,"0","-45422.2880550644-1712379.91559968i","1+120.66354713826i","-45421.2880550644-1712259.25205254i",0,"1+131.9468913i","-59933.2970459887i","-10118.5394880112","-10117.5394880112-59801.3501546887i",1,"-0.0000704362997161155-0.0000012844477004882i",-83.042625395435309,-178.95529347432668,null,"-0.00214777160558222-0.000346650434765844i",-53.248552929521729,-170.83152599563971,null,"753.982236i","1+753.982236i","0","-142122.30305089-5357884.59198898i","1+753.982236i","-142121.30305089-5357130.60975298i",null,"-0.000140649634377957-3.54467917523894E-06i",null,-77.034470301132089,-178.55632653163246]
[7000000,7000,"43982297.1i","-1934442458192670","-8.50812229190843E+22i",null,"100+4398.22971i",null,"140.77413832797i","1+140.77413832797i",null,"0","-61824.7809638377-2719195.88449393i","1+140.77413832797i","-61823.7809638377-2719055.1103556i",0,"1+153.93803985i","-95171.8559572877i","-13772.4565253485","-13771.4565253485-95017.9179174377i",1,"-0.0000517547890943146-8.08985715816863E-07i",-85.719928145881156,-179.10447549059995,null,"-0.00158825686538334-0.000219670256202092i",-55.899291930272163,-172.12543513929091,null,"879.645942i","1+879.645942i","0","-193444.245819267-8508122.29190843i","1+879.645942i","-193443.245819267-8507242.64596643i",null,"-0.000103348890208371-2.23246774120533E-06i",null,-79.711857641141364,-178.76253079634645]
[8000000,8000,"50265482.4i","-2526618720904710","-1.27001708847146E+23i",null,"100+5026.54824i",null,"160.88472951768i","1+160.88472951768i",null,"0","-80750.7343201145-4058974.61475479i","1+160.88472951768i","-80749.7343201145-4058813.73002527i",0,"1+175.9291884i","-142064.111516417i","-17988.5146453532","-17987.5146453532-141888.182328017i",1,"-0.000039627579158672-5.42009718883644E-07i",-88.039236769859954,-179.21638097597793,null,"-0.00122118185388116-0.000147764430675824i",-58.201267869658338,-173.100685095323,null,"1005.309648i","1+1005.309648i","0","-252661.872090471-12700170.8847146i","1+1005.309648i","-252660.872090471-12699165.5750666i",null,"-0.0000791336832571841-1.49568767421883E-06i",null,-82.031221200579111,-178.91719468931896]
[9000000,9000,"56548667.7i","-3197751818645020","-1.80828604979628E+23i",null,"100+5654.86677i",null,"180.99532070739i","1+180.99532070739i",null,"0","-102200.148123895-5779282.21514891i","1+180.99532070739i","-102199.148123895-5779101.2198282i",0,"1+197.92033695i","-202274.877530212i","-22766.7138480251","-22765.7138480251-202076.957193262i",1,"-0.0000313122070395085-3.80696028954862E-07i",-90.085084480594816,-179.30342838385829,null,"-0.000967705919893067-0.000104071816764404i",-60.235190230342667,-173.86172482823412,null,"1130.973354i","1+1130.973354i","0","-319775.181864502-18082860.4979628i","1+1130.973354i","-319774.181864502-18081729.5246088i",null,"-0.0000625292742474978-1.05052160465196E-06i",null,-84.077106590161321,-179.03749435627418]
[10000000,10000,"62831853i","-3947841751413610","-2.48050212592082E+23i",null,"100+6283.1853i",null,"201.1059118971i","1+201.1059118971i",null,"0","-126173.022375179-7927684.79444296i","1+201.1059118971i","-126172.022375179-7927483.68853106i",0,"1+219.9114855i","-277468.967805503i","-28107.0541333643","-28106.0541333643-277249.056320003i",1,"-0.0000253637726597408-2.77540588916867E-07i",-91.915202986229261,-179.37307179136388,null,"-0.000785484452441325-0.0000760214257209403i",-62.056757458708645,-174.47196854298167,null,"1256.63706i","1+1256.63706i","0","-394784.175141361-24805021.2592083i","1+1256.63706i","-394783.175141361-24803764.6221483i",null,"-0.0000506509689744292-7.65857548041287E-07i",null,-85.907252054879265,-179.13373717891864]
[{"$f":"Fsw","v":300000},{"$f":"A97/1000","v":300},"1884955.59i","-3553057576272.25","-6697355739986230000i",null,"100+188.495559i",null,"6.033177356913i",{"$f":"IMSUM(1,I97)","v":"1+6.033177356913i"},null,"0","-113.555720137661-214.04748944996i",{"$f":"J97","v":"1+6.033177356913i"},{"$f":"IMSUM(L97:N97)","v":"-112.555720137661-208.014312093047i"},2,"1+6.597344565i","-7.4916621307486i","-25.2963487200279",{"$f":"IMSUM(S97,R97,Q97)","v":"-24.2963487200279-0.8943175657486i"},1,"-0.0244471515768153-0.00842089533848738i",{"$f":"20*LOG10(IMABS(V97))","v":-31.748500628322866},-160.99357644834282,null,"-0.0510841451440229-0.269656119615447i",-11.23066551897832,-100.72709679842245,null,"37.6991118i","1+37.6991118i","0","-355.305757627225-669.735573998623i","1+37.6991118i","-354.305757627225-632.036462198623i",null,"-0.0460598028849817-0.0242379265652396i",null,-25.671937963299285,-152.24542915960262]

{"sheet":"Standard Value Calculator","index":11,"n_rows":159,"n_cols":20,"rows_kept":159,"cut":false,"hidden":true,"merged":[]}
[]
["Capacitors","Css","Cc1ea","Cc2ea","Cout","Cin","Cres","Cdither","Cc3ea","Cc4ea","Cin_Passive","Cdamp_Pssv","Cinj_AEF","Cdamp_AEF"]
["Inputs",{"$f":"Css","v":0},{"$f":"Cc1ea","v":7.4886775925446773E-9},{"$f":"Cc2ea","v":1.6786708047977347E-10},{"$f":"Cout","v":2.0000000000000001E-4},{"$f":"Cin","v":3.0000000000000001E-5},{"$f":"Cres","v":3.3333333333333335E-7},{"$f":"Cdither_init","v":2.0226537216828479E-9},{"$f":"Cc3ea","v":0},{"$f":"Cc4ea","v":0},{"$f":"'Variable Management'!B292*0.000001","v":5.8375101381924488E-4},{"$f":"K3*4","v":2.3350040552769795E-3},{"$f":"Cinj_AEF*0.000001","v":5.8375101381924482E-6},{"$f":"'Variable Management'!B295*0.000001","v":2.9187550690962241E-6},null,null,"Resistors","inputs","Standard Result"]
["Standard Result",{"$f":"SUM(B6:B158)/1000000000000","v":0},{"$f":"IF(C3=\"OPEN\",\"OPEN\",SUM(C6:C158)/1000000000000)","v":6.7999999999999997E-9},{"$f":"SUM(D6:D158)/1000000000000","v":1.8E-10},{"$f":"SUM(E6:E158)/1000000000000","v":2.2000000000000001E-4},{"$f":"SUM(F6:F158)/1000000000000","v":3.3000000000000003E-5},{"$f":"SUM(G6:G158)/1000000000000","v":3.3000000000000002E-7},{"$f":"IF(H3=\"OPEN\",\"OPEN\",SUM(H6:H158)/1000000000000)","v":2.1999999999999998E-9},0,0,5.5999999999999995E-4,2.2000000000000001E-3,5.5999999999999997E-6,2.7E-6,null,null,"Rt",{"$f":"Rfadj","v":73.2},{"$f":"IF(R4>(INT(0.5+100*POWER(10,IF(96*(LOG(R4)-INT(LOG(R4)))-ROUND(96*(LOG(R4)-INT(LOG(R4))),0)<0,ROUND(96*(LOG(R4)-INT(LOG(R4))),0)-1,ROUND(96*(LOG(R4)-INT(LOG(R4))),0))/96))*POWER(10,INT(LOG(R4))-2)+INT(0.5+100*POWER(10,(IF(96*(LOG(R4)-INT(LOG(R4)))-ROUND(96*(LOG(R4)-INT(LOG(R4))),0)<0,ROUND(96*(LOG(R4)-INT(LOG(R4))),0)-1,ROUND(96*(LOG(R4)-INT(LOG(R4))),0))+1)/96))*POWER(10,INT(LOG(R4))-2))/2,INT(0.5+100*POWER(10,(IF(96*(LOG(R4)-INT(LOG(R4)))-ROUND(96*(LOG(R4)-INT(LOG(R4))),0)<0,ROUND(96*(LOG(R4)-INT(LOG(R4))),0)-1,ROUND(96*(LOG(R4)-INT(LOG(R4))),0))+1)/96))*POWER(10,INT(LOG(R4))-2),INT(0.5+100*POWER(10,IF(96*(LOG(R4)-INT(LOG(R4)))-ROUND(96*(LOG(R4)-INT(LOG(R4))),0)<0,ROUND(96*(LOG(R4)-INT(LOG(R4))),0)-1,ROUND(96*(LOG(R4)-INT(LOG(R4))),0))/96))*POWER(10,INT(LOG(R4))-2))","v":73.2},"Ω"]
["(pF)"]
[0.47,{"$f":"IF(IF((B$3*10^12-$A7)*(B$3*10^12-$A6)*-1<0,0,1)*IF(ABS(B$3*10^12-$A7)>(B$3*10^12-$A6),$A6,$A7)=B7,0,IF((B$3*10^12-$A7)*(B$3*10^12-$A6)*-1<0,0,1)*IF(ABS(B$3*10^12-$A7)>(B$3*10^12-$A6),$A6,$A7))","v":0},0,0,0,0,0,0,0,0,0,0,0,0]
[0.56000000000000005,{"$f":"IF(IF((B$3*10^12-$A8)*(B$3*10^12-$A7)*-1<0,0,1)*IF(ABS(B$3*10^12-$A8)>(B$3*10^12-$A7),$A7,$A8)=B8,0,IF((B$3*10^12-$A8)*(B$3*10^12-$A7)*-1<0,0,1)*IF(ABS(B$3*10^12-$A8)>(B$3*10^12-$A7),$A7,$A8))","v":0},{"$f":"IF(IF((C$3*10^12-$A8)*(C$3*10^12-$A7)*-1<0,0,1)*IF(ABS(C$3*10^12-$A8)>(C$3*10^12-$A7),$A7,$A8)=C8,0,IF((C$3*10^12-$A8)*(C$3*10^12-$A7)*-1<0,0,1)*IF(ABS(C$3*10^12-$A8)>(C$3*10^12-$A7),$A7,$A8))","v":0},{"$f":"IF(IF((D$3*10^12-$A8)*(D$3*10^12-$A7)*-1<0,0,1)*IF(ABS(D$3*10^12-$A8)>(D$3*10^12-$A7),$A7,$A8)=D8,0,IF((D$3*10^12-$A8)*(D$3*10^12-$A7)*-1<0,0,1)*IF(ABS(D$3*10^12-$A8)>(D$3*10^12-$A7),$A7,$A8))","v":0},{"$f":"IF(IF((E$3*10^12-$A8)*(E$3*10^12-$A7)*-1<0,0,1)*IF(ABS(E$3*10^12-$A8)>(E$3*10^12-$A7),$A7,$A8)=E8,0,IF((E$3*10^12-$A8)*(E$3*10^12-$A7)*-1<0,0,1)*IF(ABS(E$3*10^12-$A8)>(E$3*10^12-$A7),$A7,$A8))","v":0},{"$f":"IF(IF((F$3*10^12-$A8)*(F$3*10^12-$A7)*-1<0,0,1)*IF(ABS(F$3*10^12-$A8)>(F$3*10^12-$A7),$A7,$A8)=F8,0,IF((F$3*10^12-$A8)*(F$3*10^12-$A7)*-1<0,0,1)*IF(ABS(F$3*10^12-$A8)>(F$3*10^12-$A7),$A7,$A8))","v":0},{"$f":"IF(IF((G$3*10^12-$A8)*(G$3*10^12-$A7)*-1<0,0,1)*IF(ABS(G$3*10^12-$A8)>(G$3*10^12-$A7),$A7,$A8)=G8,0,IF((G$3*10^12-$A8)*(G$3*10^12-$A7)*-1<0,0,1)*IF(ABS(G$3*10^12-$A8)>(G$3*10^12-$A7),$A7,$A8))","v":0},0,0,0,{"$f":"IF(IF((K$3*10^12-$A8)*(K$3*10^12-$A7)*-1<0,0,1)*IF(ABS(K$3*10^12-$A8)>(K$3*10^12-$A7),$A7,$A8)=K8,0,IF((K$3*10^12-$A8)*(K$3*10^12-$A7)*-1<0,0,1)*IF(ABS(K$3*10^12-$A8)>(K$3*10^12-$A7),$A7,$A8))","v":0},0,0,0,null,null,"Rc1ea",{"$f":"Rcea1","v":5313.1858498021875},{"$f":"IF(R7>(INT(0.5+100*POWER(10,IF(96*(LOG(R7)-INT(LOG(R7)))-ROUND(96*(LOG(R7)-INT(LOG(R7))),0)<0,ROUND(96*(LOG(R7)-INT(LOG(R7))),0)-1,ROUND(96*(LOG(R7)-INT(LOG(R7))),0))/96))*POWER(10,INT(LOG(R7))-2)+INT(0.5+100*POWER(10,(IF(96*(LOG(R7)-INT(LOG(R7)))-ROUND(96*(LOG(R7)-INT(LOG(R7))),0)<0,ROUND(96*(LOG(R7)-INT(LOG(R7))),0)-1,ROUND(96*(LOG(R7)-INT(LOG(R7))),0))+1)/96))*POWER(10,INT(LOG(R7))-2))/2,INT(0.5+100*POWER(10,(IF(96*(LOG(R7)-INT(LOG(R7)))-ROUND(96*(LOG(R7)-INT(LOG(R7))),0)<0,ROUND(96*(LOG(R7)-INT(LOG(R7))),0)-1,ROUND(96*(LOG(R7)-INT(LOG(R7))),0))+1)/96))*POWER(10,INT(LOG(R7))-2),INT(0.5+100*POWER(10,IF(96*(LOG(R7)-INT(LOG(R7)))-ROUND(96*(LOG(R7)-INT(LOG(R7))),0)<0,ROUND(96*(LOG(R7)-INT(LOG(R7))),0)-1,ROUND(96*(LOG(R7)-INT(LOG(R7))),0))/96))*POWER(10,INT(LOG(R7))-2))","v":5360},"Ω"]
[0.68,0,0,0,0,0,0,0,0,0,0,0,0,0,null,null,"Rc1ea",{"$f":"Rcea2","v":0},{"$f":"IF(R8>(INT(0.5+100*POWER(10,IF(96*(LOG(R8)-INT(LOG(R8)))-ROUND(96*(LOG(R8)-INT(LOG(R8))),0)<0,ROUND(96*(LOG(R8)-INT(LOG(R8))),0)-1,ROUND(96*(LOG(R8)-INT(LOG(R8))),0))/96))*POWER(10,INT(LOG(R8))-2)+INT(0.5+100*POWER(10,(IF(96*(LOG(R8)-INT(LOG(R8)))-ROUND(96*(LOG(R8)-INT(LOG(R8))),0)<0,ROUND(96*(LOG(R8)-INT(LOG(R8))),0)-1,ROUND(96*(LOG(R8)-INT(LOG(R8))),0))+1)/96))*POWER(10,INT(LOG(R8))-2))/2,INT(0.5+100*POWER(10,(IF(96*(LOG(R8)-INT(LOG(R8)))-ROUND(96*(LOG(R8)-INT(LOG(R8))),0)<0,ROUND(96*(LOG(R8)-INT(LOG(R8))),0)-1,ROUND(96*(LOG(R8)-INT(LOG(R8))),0))+1)/96))*POWER(10,INT(LOG(R8))-2),INT(0.5+100*POWER(10,IF(96*(LOG(R8)-INT(LOG(R8)))-ROUND(96*(LOG(R8)-INT(LOG(R8))),0)<0,ROUND(96*(LOG(R8)-INT(LOG(R8))),0)-1,ROUND(96*(LOG(R8)-INT(LOG(R8))),0))/96))*POWER(10,INT(LOG(R8))-2))","v":{"$error":"#NUM!"}},"Ω"]
[0.82,0,0,0,0,0,0,0,0,0,0,0,0,0]
[1,0,0,0,0,0,0,0,0,0,0,0,0,0,null,null,"Rfb1",{"$f":"Rfb1_","v":2500000},{"$f":"IF(R10>(INT(0.5+100*POWER(10,IF(96*(LOG(R10)-INT(LOG(R10)))-ROUND(96*(LOG(R10)-INT(LOG(R10))),0)<0,ROUND(96*(LOG(R10)-INT(LOG(R10))),0)-1,ROUND(96*(LOG(R10)-INT(LOG(R10))),0))/96))*POWER(10,INT(LOG(R10))-2)+INT(0.5+100*POWER(10,(IF(96*(LOG(R10)-INT(LOG(R10)))-ROUND(96*(LOG(R10)-INT(LOG(R10))),0)<0,ROUND(96*(LOG(R10)-INT(LOG(R10))),0)-1,ROUND(96*(LOG(R10)-INT(LOG(R10))),0))+1)/96))*POWER(10,INT(LOG(R10))-2))/2,INT(0.5+100*POWER(10,(IF(96*(LOG(R10)-INT(LOG(R10)))-ROUND(96*(LOG(R10)-INT(LOG(R10))),0)<0,ROUND(96*(LOG(R10)-INT(LOG(R10))),0)-1,ROUND(96*(LOG(R10)-INT(LOG(R10))),0))+1)/96))*POWER(10,INT(LOG(R10))-2),INT(0.5+100*POWER(10,IF(96*(LOG(R10)-INT(LOG(R10)))-ROUND(96*(LOG(R10)-INT(LOG(R10))),0)<0,ROUND(96*(LOG(R10)-INT(LOG(R10))),0)-1,ROUND(96*(LOG(R10)-INT(LOG(R10))),0))/96))*POWER(10,INT(LOG(R10))-2))","v":2490000},"Ω"]
[1.2,0,0,0,0,0,0,0,0,0,0,0,{"$f":"IF(IF((M$3*10^12-$A12)*(M$3*10^12-$A11)*-1<0,0,1)*IF(ABS(M$3*10^12-$A12)>(M$3*10^12-$A11),$A11,$A12)=M12,0,IF((M$3*10^12-$A12)*(M$3*10^12-$A11)*-1<0,0,1)*IF(ABS(M$3*10^12-$A12)>(M$3*10^12-$A11),$A11,$A12))","v":0},0,null,null,"Rfb2",{"$f":"Rfb2_","v":476190.47619047615},{"$f":"IF(R11=\"OPEN\",\"OPEN\",IF(R11>(INT(0.5+100*POWER(10,IF(96*(LOG(R11)-INT(LOG(R11)))-ROUND(96*(LOG(R11)-INT(LOG(R11))),0)<0,ROUND(96*(LOG(R11)-INT(LOG(R11))),0)-1,ROUND(96*(LOG(R11)-INT(LOG(R11))),0))/96))*POWER(10,INT(LOG(R11))-2)+INT(0.5+100*POWER(10,(IF(96*(LOG(R11)-INT(LOG(R11)))-ROUND(96*(LOG(R11)-INT(LOG(R11))),0)<0,ROUND(96*(LOG(R11)-INT(LOG(R11))),0)-1,ROUND(96*(LOG(R11)-INT(LOG(R11))),0))+1)/96))*POWER(10,INT(LOG(R11))-2))/2,INT(0.5+100*POWER(10,(IF(96*(LOG(R11)-INT(LOG(R11)))-ROUND(96*(LOG(R11)-INT(LOG(R11))),0)<0,ROUND(96*(LOG(R11)-INT(LOG(R11))),0)-1,ROUND(96*(LOG(R11)-INT(LOG(R11))),0))+1)/96))*POWER(10,INT(LOG(R11))-2),INT(0.5+100*POWER(10,IF(96*(LOG(R11)-INT(LOG(R11)))-ROUND(96*(LOG(R11)-INT(LOG(R11))),0)<0,ROUND(96*(LOG(R11)-INT(LOG(R11))),0)-1,ROUND(96*(LOG(R11)-INT(LOG(R11))),0))/96))*POWER(10,INT(LOG(R11))-2)))","v":475000},"Ω"]
[1.5,0,0,0,0,0,0,0,0,0,0,0,0,0,null,null,"Rt1",{"$f":"'Variable Management'!B27*1000","v":72996.296296296292},{"$f":"IF(R12>(INT(0.5+100*POWER(10,IF(96*(LOG(R12)-INT(LOG(R12)))-ROUND(96*(LOG(R12)-INT(LOG(R12))),0)<0,ROUND(96*(LOG(R12)-INT(LOG(R12))),0)-1,ROUND(96*(LOG(R12)-INT(LOG(R12))),0))/96))*POWER(10,INT(LOG(R12))-2)+INT(0.5+100*POWER(10,(IF(96*(LOG(R12)-INT(LOG(R12)))-ROUND(96*(LOG(R12)-INT(LOG(R12))),0)<0,ROUND(96*(LOG(R12)-INT(LOG(R12))),0)-1,ROUND(96*(LOG(R12)-INT(LOG(R12))),0))+1)/96))*POWER(10,INT(LOG(R12))-2))/2,INT(0.5+100*POWER(10,(IF(96*(LOG(R12)-INT(LOG(R12)))-ROUND(96*(LOG(R12)-INT(LOG(R12))),0)<0,ROUND(96*(LOG(R12)-INT(LOG(R12))),0)-1,ROUND(96*(LOG(R12)-INT(LOG(R12))),0))+1)/96))*POWER(10,INT(LOG(R12))-2),INT(0.5+100*POWER(10,IF(96*(LOG(R12)-INT(LOG(R12)))-ROUND(96*(LOG(R12)-INT(LOG(R12))),0)<0,ROUND(96*(LOG(R12)-INT(LOG(R12))),0)-1,ROUND(96*(LOG(R12)-INT(LOG(R12))),0))/96))*POWER(10,INT(LOG(R12))-2))","v":73200},"Ω"]
[1.8,0,0,0,0,0,0,0,0,0,0,0,0,0,null,null,"Rd",{"$f":"'Variable Management'!B28*1000","v":0},{"$f":"IF(R13=\"OPEN\",\"OPEN\",IF(R13>(INT(0.5+100*POWER(10,IF(96*(LOG(R13)-INT(LOG(R13)))-ROUND(96*(LOG(R13)-INT(LOG(R13))),0)<0,ROUND(96*(LOG(R13)-INT(LOG(R13))),0)-1,ROUND(96*(LOG(R13)-INT(LOG(R13))),0))/96))*POWER(10,INT(LOG(R13))-2)+INT(0.5+100*POWER(10,(IF(96*(LOG(R13)-INT(LOG(R13)))-ROUND(96*(LOG(R13)-INT(LOG(R13))),0)<0,ROUND(96*(LOG(R13)-INT(LOG(R13))),0)-1,ROUND(96*(LOG(R13)-INT(LOG(R13))),0))+1)/96))*POWER(10,INT(LOG(R13))-2))/2,INT(0.5+100*POWER(10,(IF(96*(LOG(R13)-INT(LOG(R13)))-ROUND(96*(LOG(R13)-INT(LOG(R13))),0)<0,ROUND(96*(LOG(R13)-INT(LOG(R13))),0)-1,ROUND(96*(LOG(R13)-INT(LOG(R13))),0))+1)/96))*POWER(10,INT(LOG(R13))-2),INT(0.5+100*POWER(10,IF(96*(LOG(R13)-INT(LOG(R13)))-ROUND(96*(LOG(R13)-INT(LOG(R13))),0)<0,ROUND(96*(LOG(R13)-INT(LOG(R13))),0)-1,ROUND(96*(LOG(R13)-INT(LOG(R13))),0))/96))*POWER(10,INT(LOG(R13))-2)))","v":{"$error":"#NUM!"}},"Ω"]
[2.2000000000000002,{"$f":"IF(IF((B$3*10^12-$A15)*(B$3*10^12-$A14)*-1<0,0,1)*IF(ABS(B$3*10^12-$A15)>(B$3*10^12-$A14),$A14,$A15)=B15,0,IF((B$3*10^12-$A15)*(B$3*10^12-$A14)*-1<0,0,1)*IF(ABS(B$3*10^12-$A15)>(B$3*10^12-$A14),$A14,$A15))","v":0},0,0,0,0,0,0,0,0,0,0,0,0,null,null,"Rd_AEF",{"$f":"'Variable Management'!B301","v":0.15055453054181619},{"$f":"IF(R14=\"OPEN\",\"OPEN\",IF(R14>(INT(0.5+100*POWER(10,IF(96*(LOG(R14)-INT(LOG(R14)))-ROUND(96*(LOG(R14)-INT(LOG(R14))),0)<0,ROUND(96*(LOG(R14)-INT(LOG(R14))),0)-1,ROUND(96*(LOG(R14)-INT(LOG(R14))),0))/96))*POWER(10,INT(LOG(R14))-2)+INT(0.5+100*POWER(10,(IF(96*(LOG(R14)-INT(LOG(R14)))-ROUND(96*(LOG(R14)-INT(LOG(R14))),0)<0,ROUND(96*(LOG(R14)-INT(LOG(R14))),0)-1,ROUND(96*(LOG(R14)-INT(LOG(R14))),0))+1)/96))*POWER(10,INT(LOG(R14))-2))/2,INT(0.5+100*POWER(10,(IF(96*(LOG(R14)-INT(LOG(R14)))-ROUND(96*(LOG(R14)-INT(LOG(R14))),0)<0,ROUND(96*(LOG(R14)-INT(LOG(R14))),0)-1,ROUND(96*(LOG(R14)-INT(LOG(R14))),0))+1)/96))*POWER(10,INT(LOG(R14))-2),INT(0.5+100*POWER(10,IF(96*(LOG(R14)-INT(LOG(R14)))-ROUND(96*(LOG(R14)-INT(LOG(R14))),0)<0,ROUND(96*(LOG(R14)-INT(LOG(R14))),0)-1,ROUND(96*(LOG(R14)-INT(LOG(R14))),0))/96))*POWER(10,INT(LOG(R14))-2)))","v":0.15},"Ω"]
[2.7,0,0,0,0,0,0,0,0,0,{"$f":"IF(IF((K$3*10^12-$A16)*(K$3*10^12-$A15)*-1<0,0,1)*IF(ABS(K$3*10^12-$A16)>(K$3*10^12-$A15),$A15,$A16)=K16,0,IF((K$3*10^12-$A16)*(K$3*10^12-$A15)*-1<0,0,1)*IF(ABS(K$3*10^12-$A16)>(K$3*10^12-$A15),$A15,$A16))","v":0},0,0,0]
[3.3,0,0,0,0,0,0,0,0,0,0,0,0,0,null,null,"Rs",{"$f":"Rs_ideal*1000","v":2.3574962459871922},{"$f":"IF(R16=0,0,IF(R16>(INT(0.5+100*POWER(10,IF(96*(LOG(R16)-INT(LOG(R16)))-ROUND(96*(LOG(R16)-INT(LOG(R16))),0)<0,ROUND(96*(LOG(R16)-INT(LOG(R16))),0)-1,ROUND(96*(LOG(R16)-INT(LOG(R16))),0))/96))*POWER(10,INT(LOG(R16))-2)+INT(0.5+100*POWER(10,(IF(96*(LOG(R16)-INT(LOG(R16)))-ROUND(96*(LOG(R16)-INT(LOG(R16))),0)<0,ROUND(96*(LOG(R16)-INT(LOG(R16))),0)-1,ROUND(96*(LOG(R16)-INT(LOG(R16))),0))+1)/96))*POWER(10,INT(LOG(R16))-2))/2,INT(0.5+100*POWER(10,(IF(96*(LOG(R16)-INT(LOG(R16)))-ROUND(96*(LOG(R16)-INT(LOG(R16))),0)<0,ROUND(96*(LOG(R16)-INT(LOG(R16))),0)-1,ROUND(96*(LOG(R16)-INT(LOG(R16))),0))+1)/96))*POWER(10,INT(LOG(R16))-2),INT(0.5+100*POWER(10,IF(96*(LOG(R16)-INT(LOG(R16)))-ROUND(96*(LOG(R16)-INT(LOG(R16))),0)<0,ROUND(96*(LOG(R16)-INT(LOG(R16))),0)-1,ROUND(96*(LOG(R16)-INT(LOG(R16))),0))/96))*POWER(10,INT(LOG(R16))-2)))","v":2.37},"mΩ"]
[3.9,0,0,0,0,0,0,0,0,0,0,0,0,0,null,null,"Cres",{"$f":"Cres","v":3.3333333333333335E-7},{"$f":"G4*1000000000000","v":330000},"pF"]
[4.7,0,0,0,0,0,0,0,0,0,0,0,0,0]
[5.6,0,0,0,0,0,0,0,0,0,0,0,0,0]
[6.8,0,0,0,0,0,0,0,0,0,0,0,0,0]
[8.1999999999999993,0,0,0,0,0,0,0,0,0,0,0,0,0,null,null,"Cdither",{"$f":"Cdither_init","v":2.0226537216828479E-9},{"$f":"H4","v":2.1999999999999998E-9}]
[10,0,0,0,0,0,0,0,0,0,{"$f":"IF(IF((K$3*10^12-$A23)*(K$3*10^12-$A22)*-1<0,0,1)*IF(ABS(K$3*10^12-$A23)>(K$3*10^12-$A22),$A22,$A23)=K23,0,IF((K$3*10^12-$A23)*(K$3*10^12-$A22)*-1<0,0,1)*IF(ABS(K$3*10^12-$A23)>(K$3*10^12-$A22),$A22,$A23))","v":0},0,0,0]
[12,0,0,0,0,0,0,0,0,0,0,0,0,0,null,null,"Cin_Passive",{"$f":"K4","v":5.5999999999999995E-4},{"$f":"R23*1000000","v":560},"uF"]
[15,0,0,0,0,0,0,0,0,0,0,0,0,0,null,null,"Cinj_AEF",{"$f":"Cinj_AEF","v":5.8375101381924486},{"$f":"M4*1000000","v":5.6},"uF"]
[18,0,0,0,0,0,0,0,0,0,0,0,0,0,null,null,"Cdamp_AEF",{"$f":"'Variable Management'!B295","v":2.9187550690962243},{"$f":"N4*1000000","v":2.7},"uF"]
[22,0,0,0,0,0,0,0,0,0,0,0,0,0,null,null,"Rdamp_AEF",{"$f":"'Variable Management'!B296","v":41.460260388586107},{"$f":"IF(R26=\"OPEN\",\"OPEN\",IF(R26>(INT(0.5+100*POWER(10,IF(96*(LOG(R26)-INT(LOG(R26)))-ROUND(96*(LOG(R26)-INT(LOG(R26))),0)<0,ROUND(96*(LOG(R26)-INT(LOG(R26))),0)-1,ROUND(96*(LOG(R26)-INT(LOG(R26))),0))/96))*POWER(10,INT(LOG(R26))-2)+INT(0.5+100*POWER(10,(IF(96*(LOG(R26)-INT(LOG(R26)))-ROUND(96*(LOG(R26)-INT(LOG(R26))),0)<0,ROUND(96*(LOG(R26)-INT(LOG(R26))),0)-1,ROUND(96*(LOG(R26)-INT(LOG(R26))),0))+1)/96))*POWER(10,INT(LOG(R26))-2))/2,INT(0.5+100*POWER(10,(IF(96*(LOG(R26)-INT(LOG(R26)))-ROUND(96*(LOG(R26)-INT(LOG(R26))),0)<0,ROUND(96*(LOG(R26)-INT(LOG(R26))),0)-1,ROUND(96*(LOG(R26)-INT(LOG(R26))),0))+1)/96))*POWER(10,INT(LOG(R26))-2),INT(0.5+100*POWER(10,IF(96*(LOG(R26)-INT(LOG(R26)))-ROUND(96*(LOG(R26)-INT(LOG(R26))),0)<0,ROUND(96*(LOG(R26)-INT(LOG(R26))),0)-1,ROUND(96*(LOG(R26)-INT(LOG(R26))),0))/96))*POWER(10,INT(LOG(R26))-2)))","v":41.2},"Ω"]
[27,0,0,0,0,0,0,0,0,0,0,0,{"$f":"IF(IF((M$3*10^12-$A28)*(M$3*10^12-$A27)*-1<0,0,1)*IF(ABS(M$3*10^12-$A28)>(M$3*10^12-$A27),$A27,$A28)=M28,0,IF((M$3*10^12-$A28)*(M$3*10^12-$A27)*-1<0,0,1)*IF(ABS(M$3*10^12-$A28)>(M$3*10^12-$A27),$A27,$A28))","v":0},0,null,null,"Rdamp_Passive",{"$f":"SQRT(L_infilterStd/K4)","v":3.4846602621858479E-2},{"$f":"IF(R27=\"OPEN\",\"OPEN\",IF(R27>(INT(0.5+100*POWER(10,IF(96*(LOG(R27)-INT(LOG(R27)))-ROUND(96*(LOG(R27)-INT(LOG(R27))),0)<0,ROUND(96*(LOG(R27)-INT(LOG(R27))),0)-1,ROUND(96*(LOG(R27)-INT(LOG(R27))),0))/96))*POWER(10,INT(LOG(R27))-2)+INT(0.5+100*POWER(10,(IF(96*(LOG(R27)-INT(LOG(R27)))-ROUND(96*(LOG(R27)-INT(LOG(R27))),0)<0,ROUND(96*(LOG(R27)-INT(LOG(R27))),0)-1,ROUND(96*(LOG(R27)-INT(LOG(R27))),0))+1)/96))*POWER(10,INT(LOG(R27))-2))/2,INT(0.5+100*POWER(10,(IF(96*(LOG(R27)-INT(LOG(R27)))-ROUND(96*(LOG(R27)-INT(LOG(R27))),0)<0,ROUND(96*(LOG(R27)-INT(LOG(R27))),0)-1,ROUND(96*(LOG(R27)-INT(LOG(R27))),0))+1)/96))*POWER(10,INT(LOG(R27))-2),INT(0.5+100*POWER(10,IF(96*(LOG(R27)-INT(LOG(R27)))-ROUND(96*(LOG(R27)-INT(LOG(R27))),0)<0,ROUND(96*(LOG(R27)-INT(LOG(R27))),0)-1,ROUND(96*(LOG(R27)-INT(LOG(R27))),0))/96))*POWER(10,INT(LOG(R27))-2)))","v":3.4800000000000005E-2},"Ω"]
[33,0,0,0,0,0,0,0,0,0,0,0,0,0,null,null,"Cdamp_Passive",{"$f":"L4","v":2.2000000000000001E-3},{"$f":"R28*1000000","v":2200},"uF"]
[39,0,0,0,0,0,0,0,0,0,0,0,0,0]
[47,0,0,0,0,0,0,0,0,0,0,0,0,0]
[56,0,0,0,0,0,0,0,0,0,0,0,0,0]
[68,0,0,0,0,0,0,0,0,0,0,0,0,0,null,null,"Rc1",{"$f":"S7/1000&\" kΩ\"","v":"5.36 kΩ"},{"$f":"S7/1000","v":5.36},"kΩ"]
[82,0,0,0,0,0,0,0,0,0,0,0,0,0,null,null,"Cc1",{"$f":"C4*1000000000&\" nF\"","v":"6.8 nF"},{"$f":"C4*1000000000","v":6.8},"nF"]
[{"$f":"A22*10","v":100},0,0,0,0,0,0,0,0,0,0,0,0,0,null,null,"Cc2",{"$f":"D4*1000000000000&\" pF\"","v":"180 pF"},{"$f":"D4*1000000000000","v":180},"pF"]
[{"$f":"A23*10","v":120},0,0,0,0,0,0,0,0,0,0,0,0,0]
[150,0,0,180,0,0,0,0,0,0,0,0,0,0,null,null,"Rc2",{"$f":"S8/1000&\" kΩ\"","v":{"$error":"#NUM!"}},{"$f":"S8/1000","v":{"$error":"#NUM!"}},"kΩ"]
[180,0,0,0,0,0,0,0,0,0,0,0,0,0,null,null,"Cc3",{"$f":"I4*1000000000&\" nF\"","v":"0 nF"},{"$f":"I4*1000000000","v":0},"nF"]
[220,0,0,0,0,0,0,0,0,0,0,0,0,0,null,null,"Cc4",{"$f":"J4*1000000000000&\" pF\"","v":"0 pF"},{"$f":"J4*1000000000000","v":0},"pF"]
[270,0,{"$f":"IF(IF((C$3*10^12-$A40)*(C$3*10^12-$A39)*-1<0,0,1)*IF(ABS(C$3*10^12-$A40)>(C$3*10^12-$A39),$A39,$A40)=C40,0,IF((C$3*10^12-$A40)*(C$3*10^12-$A39)*-1<0,0,1)*IF(ABS(C$3*10^12-$A40)>(C$3*10^12-$A39),$A39,$A40))","v":0},0,0,0,0,0,0,0,0,0,0,0]
[330,0,0,0,0,0,0,0,0,0,0,0,0,0,null,null,"Rent",{"$f":"'Variable Management'!B186/1000","v":199.99999999999997},{"$f":"IF(R40>(INT(0.5+100*POWER(10,IF(96*(LOG(R40)-INT(LOG(R40)))-ROUND(96*(LOG(R40)-INT(LOG(R40))),0)<0,ROUND(96*(LOG(R40)-INT(LOG(R40))),0)-1,ROUND(96*(LOG(R40)-INT(LOG(R40))),0))/96))*POWER(10,INT(LOG(R40))-2)+INT(0.5+100*POWER(10,(IF(96*(LOG(R40)-INT(LOG(R40)))-ROUND(96*(LOG(R40)-INT(LOG(R40))),0)<0,ROUND(96*(LOG(R40)-INT(LOG(R40))),0)-1,ROUND(96*(LOG(R40)-INT(LOG(R40))),0))+1)/96))*POWER(10,INT(LOG(R40))-2))/2,INT(0.5+100*POWER(10,(IF(96*(LOG(R40)-INT(LOG(R40)))-ROUND(96*(LOG(R40)-INT(LOG(R40))),0)<0,ROUND(96*(LOG(R40)-INT(LOG(R40))),0)-1,ROUND(96*(LOG(R40)-INT(LOG(R40))),0))+1)/96))*POWER(10,INT(LOG(R40))-2),INT(0.5+100*POWER(10,IF(96*(LOG(R40)-INT(LOG(R40)))-ROUND(96*(LOG(R40)-INT(LOG(R40))),0)<0,ROUND(96*(LOG(R40)-INT(LOG(R40))),0)-1,ROUND(96*(LOG(R40)-INT(LOG(R40))),0))/96))*POWER(10,INT(LOG(R40))-2))","v":200},"kΩ"]
[390,0,0,0,0,0,0,0,0,0,0,0,0,0,null,null,"Renb",{"$f":"'Variable Management'!B187/1000","v":9.5238095238095237},{"$f":"IF(R41>(INT(0.5+100*POWER(10,IF(96*(LOG(R41)-INT(LOG(R41)))-ROUND(96*(LOG(R41)-INT(LOG(R41))),0)<0,ROUND(96*(LOG(R41)-INT(LOG(R41))),0)-1,ROUND(96*(LOG(R41)-INT(LOG(R41))),0))/96))*POWER(10,INT(LOG(R41))-2)+INT(0.5+100*POWER(10,(IF(96*(LOG(R41)-INT(LOG(R41)))-ROUND(96*(LOG(R41)-INT(LOG(R41))),0)<0,ROUND(96*(LOG(R41)-INT(LOG(R41))),0)-1,ROUND(96*(LOG(R41)-INT(LOG(R41))),0))+1)/96))*POWER(10,INT(LOG(R41))-2))/2,INT(0.5+100*POWER(10,(IF(96*(LOG(R41)-INT(LOG(R41)))-ROUND(96*(LOG(R41)-INT(LOG(R41))),0)<0,ROUND(96*(LOG(R41)-INT(LOG(R41))),0)-1,ROUND(96*(LOG(R41)-INT(LOG(R41))),0))+1)/96))*POWER(10,INT(LOG(R41))-2),INT(0.5+100*POWER(10,IF(96*(LOG(R41)-INT(LOG(R41)))-ROUND(96*(LOG(R41)-INT(LOG(R41))),0)<0,ROUND(96*(LOG(R41)-INT(LOG(R41))),0)-1,ROUND(96*(LOG(R41)-INT(LOG(R41))),0))/96))*POWER(10,INT(LOG(R41))-2))","v":9.5299999999999994},"kΩ"]
[470,0,0,0,0,0,0,0,0,0,0,0,0,0]
[560,0,0,0,0,0,0,0,0,0,0,0,{"$f":"IF(IF((M$3*10^12-$A44)*(M$3*10^12-$A43)*-1<0,0,1)*IF(ABS(M$3*10^12-$A44)>(M$3*10^12-$A43),$A43,$A44)=M44,0,IF((M$3*10^12-$A44)*(M$3*10^12-$A43)*-1<0,0,1)*IF(ABS(M$3*10^12-$A44)>(M$3*10^12-$A43),$A43,$A44))","v":0},0]
[680,0,0,0,0,0,0,0,0,0,0,0,0,0]
[{"$f":"A33*10","v":820},0,0,0,0,0,0,0,0,0,0,0,0,0]
[1000,0,0,0,0,0,0,0,0,0,0,0,0,0]
[1200,0,0,0,0,0,0,0,0,0,0,0,0,0]
[1500,0,0,0,0,0,0,0,0,0,0,0,0,0]
[1800,0,0,0,0,0,0,2200,0,0,0,0,0,0]
[2200,0,0,0,0,0,0,0,0,0,0,0,0,0]
[2700,0,0,0,0,0,0,0,0,0,0,0,0,0]
[3300,0,0,0,0,0,0,0,0,0,0,0,0,0]
[3900,0,0,0,0,0,0,0,0,0,0,0,0,0]
[4700,0,0,0,0,0,0,0,0,0,0,0,0,0]
[5600,0,0,0,0,0,0,0,0,0,0,0,0,0]
[6800,0,6800,0,0,0,0,0,0,0,0,0,0,0]
[8200,0,0,0,0,0,0,0,0,0,0,0,0,0]
[10000,0,0,0,0,0,0,0,0,0,0,0,0,0]
[12000,0,0,0,0,0,0,0,0,0,0,0,{"$f":"IF(IF((M$3*10^12-$A60)*(M$3*10^12-$A59)*-1<0,0,1)*IF(ABS(M$3*10^12-$A60)>(M$3*10^12-$A59),$A59,$A60)=M60,0,IF((M$3*10^12-$A60)*(M$3*10^12-$A59)*-1<0,0,1)*IF(ABS(M$3*10^12-$A60)>(M$3*10^12-$A59),$A59,$A60))","v":0},0]
[15000,0,0,0,0,0,0,0,0,0,0,0,0,0]
[18000,0,0,0,0,0,0,0,0,0,0,0,0,0]
[22000,0,0,0,0,0,0,0,0,0,0,0,0,0]
[27000,0,0,0,0,0,0,0,0,0,0,0,0,0]
[33000,0,0,0,0,0,0,0,0,0,0,0,0,0]
[39000,0,0,0,0,0,0,0,0,0,0,0,0,0]
[47000,0,0,0,0,0,0,0,0,0,0,0,0,0]
[56000,0,0,0,0,0,0,0,0,0,0,0,0,0]
[68000,0,0,0,0,0,0,0,0,0,0,0,0,0]
[82000,0,0,0,0,0,0,0,0,{"$f":"IF(IF((J$3*10^12-$A70)*(J$3*10^12-$A69)*-1<0,0,1)*IF(ABS(J$3*10^12-$A70)>(J$3*10^12-$A69),$A69,$A70)=J70,0,IF((J$3*10^12-$A70)*(J$3*10^12-$A69)*-1<0,0,1)*IF(ABS(J$3*10^12-$A70)>(J$3*10^12-$A69),$A69,$A70))","v":0},0,0,0,0]
[100000,0,0,{"$f":"IF(IF((D$3*10^12-$A71)*(D$3*10^12-$A70)*-1<0,0,1)*IF(ABS(D$3*10^12-$A71)>(D$3*10^12-$A70),$A70,$A71)=D71,0,IF((D$3*10^12-$A71)*(D$3*10^12-$A70)*-1<0,0,1)*IF(ABS(D$3*10^12-$A71)>(D$3*10^12-$A70),$A70,$A71))","v":0},0,0,0,0,0,0,0,0,0,0]
[120000,{"$f":"IF(IF((B$3*10^12-$A72)*(B$3*10^12-$A71)*-1<0,0,1)*IF(ABS(B$3*10^12-$A72)>(B$3*10^12-$A71),$A71,$A72)=B72,0,IF((B$3*10^12-$A72)*(B$3*10^12-$A71)*-1<0,0,1)*IF(ABS(B$3*10^12-$A72)>(B$3*10^12-$A71),$A71,$A72))","v":0},{"$f":"IF(IF((C$3*10^12-$A72)*(C$3*10^12-$A71)*-1<0,0,1)*IF(ABS(C$3*10^12-$A72)>(C$3*10^12-$A71),$A71,$A72)=C72,0,IF((C$3*10^12-$A72)*(C$3*10^12-$A71)*-1<0,0,1)*IF(ABS(C$3*10^12-$A72)>(C$3*10^12-$A71),$A71,$A72))","v":0},0,0,{"$f":"IF(IF((F$3*10^12-$A72)*(F$3*10^12-$A71)*-1<0,0,1)*IF(ABS(F$3*10^12-$A72)>(F$3*10^12-$A71),$A71,$A72)=F72,0,IF((F$3*10^12-$A72)*(F$3*10^12-$A71)*-1<0,0,1)*IF(ABS(F$3*10^12-$A72)>(F$3*10^12-$A71),$A71,$A72))","v":0},{"$f":"IF(IF((G$3*10^12-$A72)*(G$3*10^12-$A71)*-1<0,0,1)*IF(ABS(G$3*10^12-$A72)>(G$3*10^12-$A71),$A71,$A72)=G72,0,IF((G$3*10^12-$A72)*(G$3*10^12-$A71)*-1<0,0,1)*IF(ABS(G$3*10^12-$A72)>(G$3*10^12-$A71),$A71,$A72))","v":0},{"$f":"IF(IF((H$3*10^12-$A72)*(H$3*10^12-$A71)*-1<0,0,1)*IF(ABS(H$3*10^12-$A72)>(H$3*10^12-$A71),$A71,$A72)=H72,0,IF((H$3*10^12-$A72)*(H$3*10^12-$A71)*-1<0,0,1)*IF(ABS(H$3*10^12-$A72)>(H$3*10^12-$A71),$A71,$A72))","v":0},{"$f":"IF(IF((I$3*10^12-$A72)*(I$3*10^12-$A71)*-1<0,0,1)*IF(ABS(I$3*10^12-$A72)>(I$3*10^12-$A71),$A71,$A72)=I72,0,IF((I$3*10^12-$A72)*(I$3*10^12-$A71)*-1<0,0,1)*IF(ABS(I$3*10^12-$A72)>(I$3*10^12-$A71),$A71,$A72))","v":0},0,0,0,0,0]
[150000,0,0,0,0,0,0,0,0,0,0,0,0,0]
[180000,0,0,0,0,0,0,0,0,0,0,0,0,0]
[220000,0,0,0,0,0,0,0,0,0,0,0,0,0]
[270000,0,0,0,0,0,0,0,0,0,0,0,0,0]
[330000,0,0,0,0,0,330000,0,0,0,0,0,0,0]
[390000,0,0,0,0,0,0,0,0,0,0,0,0,0]
[470000,0,0,0,0,0,0,0,0,0,0,0,0,0]
[560000,0,0,0,0,0,0,0,0,0,0,0,0,0]
[680000,0,0,0,0,0,0,0,0,0,0,0,0,0]
[820000,0,0,0,0,0,0,0,0,0,0,0,0,0]
[1000000,0,0,0,0,0,0,0,0,0,0,0,0,0]
[1200000,0,0,0,0,0,0,0,0,0,0,0,0,0]
[1500000,0,0,0,0,0,0,0,0,0,0,0,0,0]
[1800000,0,0,0,0,0,0,0,0,0,0,{"$f":"IF(IF((L$3*10^12-$A86)*(L$3*10^12-$A85)*-1<0,0,1)*IF(ABS(L$3*10^12-$A86)>(L$3*10^12-$A85),$A85,$A86)=L86,0,IF((L$3*10^12-$A86)*(L$3*10^12-$A85)*-1<0,0,1)*IF(ABS(L$3*10^12-$A86)>(L$3*10^12-$A85),$A85,$A86))","v":0},0,0]
[2200000,0,0,0,0,0,0,0,0,0,0,0,0,0]
[2700000,0,0,0,0,0,0,0,0,0,0,0,0,2700000]
[3300000,0,0,0,0,0,0,0,0,0,0,0,0,0]
[3900000,0,0,0,0,0,0,0,0,0,0,0,0,0]
[4700000,0,0,0,0,0,0,0,0,0,0,0,0,0]
[5600000,0,0,0,0,0,0,0,0,0,0,0,5600000,0]
[6800000,0,0,0,0,0,0,0,0,0,0,0,0,0]
[8200000,0,0,0,0,0,0,0,0,0,0,0,0,0]
[10000000,0,0,0,0,0,0,0,0,0,0,0,0,0]
[12000000,0,0,0,0,0,0,0,0,0,0,0,0,0]
[15000000,0,0,0,0,0,0,0,0,0,0,0,0,0]
[18000000,0,0,0,0,0,0,0,0,0,0,0,0,0]
[22000000,0,0,0,0,0,0,0,0,0,0,0,0,0]
[{"$f":"A87*10","v":27000000},0,0,0,0,33000000,0,0,0,0,0,0,0,0]
[33000000,0,0,0,0,0,0,0,0,0,0,0,0,0]
[39000000,0,0,0,0,0,0,0,0,0,0,0,0,0]
[47000000,0,0,0,0,0,0,0,0,0,0,0,0,0]
[56000000,0,0,0,0,{"$f":"IF(IF((F$3*10^12-$A104)*(F$3*10^12-$A103)*-1<0,0,1)*IF(ABS(F$3*10^12-$A104)>(F$3*10^12-$A103),$A103,$A104)=F104,0,IF((F$3*10^12-$A104)*(F$3*10^12-$A103)*-1<0,0,1)*IF(ABS(F$3*10^12-$A104)>(F$3*10^12-$A103),$A103,$A104))","v":0},{"$f":"IF(IF((G$3*10^12-$A104)*(G$3*10^12-$A103)*-1<0,0,1)*IF(ABS(G$3*10^12-$A104)>(G$3*10^12-$A103),$A103,$A104)=G104,0,IF((G$3*10^12-$A104)*(G$3*10^12-$A103)*-1<0,0,1)*IF(ABS(G$3*10^12-$A104)>(G$3*10^12-$A103),$A103,$A104))","v":0},{"$f":"IF(IF((H$3*10^12-$A104)*(H$3*10^12-$A103)*-1<0,0,1)*IF(ABS(H$3*10^12-$A104)>(H$3*10^12-$A103),$A103,$A104)=H104,0,IF((H$3*10^12-$A104)*(H$3*10^12-$A103)*-1<0,0,1)*IF(ABS(H$3*10^12-$A104)>(H$3*10^12-$A103),$A103,$A104))","v":0},{"$f":"IF(IF((I$3*10^12-$A104)*(I$3*10^12-$A103)*-1<0,0,1)*IF(ABS(I$3*10^12-$A104)>(I$3*10^12-$A103),$A103,$A104)=I104,0,IF((I$3*10^12-$A104)*(I$3*10^12-$A103)*-1<0,0,1)*IF(ABS(I$3*10^12-$A104)>(I$3*10^12-$A103),$A103,$A104))","v":0},0,0,0,0,0]
[68000000,0,0,0,0,0,0,0,0,0,0,0,0,0]
[82000000,0,0,0,0,0,0,0,0,0,0,0,0,0]
[100000000,0,0,0,0,0,0,0,0,0,0,0,0,0]
[120000000,0,0,0,0,0,0,0,0,0,0,0,0,0]
[150000000,0,0,0,0,0,0,0,0,0,0,0,0,0]
[180000000,0,0,0,220000000,0,0,0,0,0,0,0,0,0]
[220000000,0,0,0,0,0,0,0,0,0,0,0,0,0]
[270000000,0,0,0,0,0,0,0,0,0,0,0,0,0]
[330000000,0,0,0,0,0,0,0,0,0,0,0,0,0]
[390000000,0,0,0,0,0,0,0,0,0,0,0,0,0]
[470000000,0,0,0,0,0,0,0,0,0,0,0,0,0]
[560000000,0,0,0,0,0,0,0,0,0,560000000,0,0,0]
[680000000,0,0,0,0,0,0,0,0,0,0,0,0,0]
[820000000,0,0,0,0,0,0,0,0,0,0,0,0,0]
[1000000000,0,0,0,0,0,0,0,0,0,0,0,0,0]
[1200000000,0,0,0,0,0,0,0,0,0,0,0,0,0]
[1500000000,0,0,0,0,0,0,0,0,0,0,0,0,0]
[1800000000,0,0,0,0,0,0,0,0,0,0,0,0,0]
[2200000000,0,0,0,0,0,0,0,0,0,0,2200000000,0,0]
[2700000000,0,0,0,0,0,0,0,0,0,0,0,0,0]
[3300000000,0,0,0,0,0,0,0,0,0,0,0,0,0]
[3900000000,0,0,0,0,0,0,0,0,0,0,0,0,0]
[4700000000,0,0,0,0,0,0,0,0,0,0,0,0,0]
[5600000000,0,0,0,0,0,0,0,0,0,0,0,0,0]
[6800000000,0,0,0,0,0,0,0,0,0,0,0,0,0]
[8200000000,0,0,0,0,0,0,0,0,0,0,0,0,0]
[10000000000,0,0,0,0,0,0,0,0,0,0,0,0,0]
[12000000000,0,0,0,0,0,0,0,0,0,0,0,0,0]
[15000000000,0,0,0,0,0,0,0,0,0,{"$f":"IF(IF((K$3*10^12-$A133)*(K$3*10^12-$A132)*-1<0,0,1)*IF(ABS(K$3*10^12-$A133)>(K$3*10^12-$A132),$A132,$A133)=K133,0,IF((K$3*10^12-$A133)*(K$3*10^12-$A132)*-1<0,0,1)*IF(ABS(K$3*10^12-$A133)>(K$3*10^12-$A132),$A132,$A133))","v":0},{"$f":"IF(IF((L$3*10^12-$A133)*(L$3*10^12-$A132)*-1<0,0,1)*IF(ABS(L$3*10^12-$A133)>(L$3*10^12-$A132),$A132,$A133)=L133,0,IF((L$3*10^12-$A133)*(L$3*10^12-$A132)*-1<0,0,1)*IF(ABS(L$3*10^12-$A133)>(L$3*10^12-$A132),$A132,$A133))","v":0},0,0]
[18000000000,0,0,0,0,0,0,0,0,{"$f":"IF(IF((J$3*10^12-$A134)*(J$3*10^12-$A133)*-1<0,0,1)*IF(ABS(J$3*10^12-$A134)>(J$3*10^12-$A133),$A133,$A134)=J134,0,IF((J$3*10^12-$A134)*(J$3*10^12-$A133)*-1<0,0,1)*IF(ABS(J$3*10^12-$A134)>(J$3*10^12-$A133),$A133,$A134))","v":0},0,0,{"$f":"IF(IF((M$3*10^12-$A134)*(M$3*10^12-$A133)*-1<0,0,1)*IF(ABS(M$3*10^12-$A134)>(M$3*10^12-$A133),$A133,$A134)=M134,0,IF((M$3*10^12-$A134)*(M$3*10^12-$A133)*-1<0,0,1)*IF(ABS(M$3*10^12-$A134)>(M$3*10^12-$A133),$A133,$A134))","v":0},{"$f":"IF(IF((N$3*10^12-$A134)*(N$3*10^12-$A133)*-1<0,0,1)*IF(ABS(N$3*10^12-$A134)>(N$3*10^12-$A133),$A133,$A134)=N134,0,IF((N$3*10^12-$A134)*(N$3*10^12-$A133)*-1<0,0,1)*IF(ABS(N$3*10^12-$A134)>(N$3*10^12-$A133),$A133,$A134))","v":0}]
[22000000000,0,0,0,{"$f":"IF(IF((E$3*10^12-$A135)*(E$3*10^12-$A134)*-1<0,0,1)*IF(ABS(E$3*10^12-$A135)>(E$3*10^12-$A134),$A134,$A135)=E135,0,IF((E$3*10^12-$A135)*(E$3*10^12-$A134)*-1<0,0,1)*IF(ABS(E$3*10^12-$A135)>(E$3*10^12-$A134),$A134,$A135))","v":0},0,0,0,0,0,0,0,{"$f":"IF(IF((M$3*10^12-$A135)*(M$3*10^12-$A134)*-1<0,0,1)*IF(ABS(M$3*10^12-$A135)>(M$3*10^12-$A134),$A134,$A135)=M135,0,IF((M$3*10^12-$A135)*(M$3*10^12-$A134)*-1<0,0,1)*IF(ABS(M$3*10^12-$A135)>(M$3*10^12-$A134),$A134,$A135))","v":0},{"$f":"IF(IF((N$3*10^12-$A135)*(N$3*10^12-$A134)*-1<0,0,1)*IF(ABS(N$3*10^12-$A135)>(N$3*10^12-$A134),$A134,$A135)=N135,0,IF((N$3*10^12-$A135)*(N$3*10^12-$A134)*-1<0,0,1)*IF(ABS(N$3*10^12-$A135)>(N$3*10^12-$A134),$A134,$A135))","v":0}]
[27000000000,{"$f":"IF(IF((B$3*10^12-$A136)*(B$3*10^12-$A135)*-1<0,0,1)*IF(ABS(B$3*10^12-$A136)>(B$3*10^12-$A135),$A135,$A136)=B136,0,IF((B$3*10^12-$A136)*(B$3*10^12-$A135)*-1<0,0,1)*IF(ABS(B$3*10^12-$A136)>(B$3*10^12-$A135),$A135,$A136))","v":0},{"$f":"IF(IF((C$3*10^12-$A136)*(C$3*10^12-$A135)*-1<0,0,1)*IF(ABS(C$3*10^12-$A136)>(C$3*10^12-$A135),$A135,$A136)=C136,0,IF((C$3*10^12-$A136)*(C$3*10^12-$A135)*-1<0,0,1)*IF(ABS(C$3*10^12-$A136)>(C$3*10^12-$A135),$A135,$A136))","v":0},0,0,0,0,0,0,0,0,0,0,0]
[33000000000,0,0,0,0,0,0,0,0,0,0,0,0,0]
[39000000000,0,0,0,0,0,0,0,0,0,0,0,0,0]
[47000000000,0,0,0,0,0,0,0,0,0,0,0,0,0]
[56000000000,0,0,0,0,0,0,0,0,0,0,0,0,0]
[68000000000,0,0,0,0,0,0,0,0,0,0,0,0,0]
[82000000000,0,0,0,0,0,0,0,0,0,0,0,0,0]
[100000000000,0,0,0,0,0,0,0,0,0,0,0,0,0]
[120000000000,0,0,0,0,0,0,0,0,0,0,0,0,0]
[150000000000,0,0,0,0,0,0,0,0,0,0,0,0,0]
[180000000000,0,0,0,0,0,0,0,0,0,0,0,0,0]
[220000000000,0,0,0,0,0,0,0,0,0,0,0,0,0]
[270000000000,0,0,0,0,0,0,0,0,0,0,0,0,0]
[330000000000,0,0,0,0,0,0,0,0,0,0,0,0,0]
[390000000000,0,0,0,0,0,0,0,0,0,0,0,0,0]
[470000000000,0,0,0,0,0,0,0,0,0,0,0,0,0]
[560000000000,0,0,0,0,0,0,0,0,0,0,0,0,0]
[680000000000,0,0,0,0,0,0,0,0,0,0,0,0,0]
[820000000000,0,0,0,0,0,0,0,0,0,0,0,0,0]
[1000000000000,0,0,0,0,0,0,0,0,0,0,0,0,0]
[1200000000000,0,0,0,0,0,0,0,0,0,0,0,0,0]
[1500000000000,0,0,0,0,0,0,0,0,0,0,0,0,0]
[1800000000000,0,0,0,0,0,0,0,0,0,0,0,0,0]
[2200000000000,0,0,0,0,0,0,0,0,0,0,0,0,0]
[2700000000000,2700000000000,2700000000000,2700000000000,2700000000000,2700000000000,2700000000000,2700000000000,2700000000000,2700000000000,2700000000000,2700000000000,2700000000000,2700000000000]

{"sheet":"Snubber","index":12,"n_rows":6,"n_cols":5,"rows_kept":6,"cut":false,"hidden":true,"merged":[]}
[null,null,"UNITS","STD UNITS"]
["Frequency of Ringing",85,"MHz",{"$f":"B2*1000000","v":85000000},"Hz"]
["SW capacitance",3000,"pF",{"$f":"B3*0.000000000001","v":3E-9},"F"]
["Lpar",{"$f":"1000000000*1/((D2*2*3.14159)^2*D3)","v":1.1686430773614742},"nH",{"$f":"B4/1000000000","v":1.1686430773614743E-9},"H"]
["Csnub",{"$f":"4*B3","v":12000},"pF",{"$f":"B5*0.000000000001","v":1.2E-8},"F"]
["Rsnub",{"$f":"SQRT(D4/D3)","v":0.62413755891936573},"Ω",{"$f":"B6","v":0.62413755891936573},"Ω"]

{"sheet":"Parallel Output Caps","index":13,"n_rows":17,"n_cols":5,"rows_kept":17,"cut":false,"hidden":true,"merged":[]}
[]
[]
[]
["Fsw",{"$f":"Fsw","v":300000}]
[]
["C1",20,"uF",{"$f":"B6/1000000","v":2.0000000000000002E-5},"F"]
["R1",0.5,"mOhms",{"$f":"B7/1000","v":5.0000000000000001E-4},"Ohms"]
[]
["C2",68,"uF",{"$f":"B9/1000000","v":6.7999999999999999E-5},"F"]
["R2",20,"mOhms",{"$f":"B10/1000","v":0.02},"Ohms"]
[]
[]
["I1 ",{"$f":"(D6/(D6+D9))*SQRT((D10*D9*B4)^2+1)/SQRT((((D7+D10)*D6*D9/(D9+D6))*B4)^2+1)","v":0.2443600307654302},"%"]
["I2 ",{"$f":"1-B13","v":0.75563996923456977},"%"]
[]
["I1 ",{"$f":"B13*(Iripple1/(2*SQRT(3)))","v":{"$error":"#NAME?"}},"A"]
["I2 ",{"$f":"B14*(Iripple1/(2*SQRT(3)))","v":{"$error":"#NAME?"}},"A"]