{"text_format":"1","workbook":"xlsx","n_sheets":33,"sheets":["xMenuBar","xMenuElements","xMenuBarCfg","NoMacros","Placard","Welcome","xControls","App","xAppDefaults","Target","xSurfaceEff","xParamSave","Summary","xSummaryMap","xObjects","Map","xMap","Options","Chipsets","xChipsetFilter","Engines","xOMM","Support","xAppParmSummary","xOMMCount","xLists","xLinks","xMimic","xUnitsConvert","xOneofManyGroups","xSmartSelect","xActSheets","xColors"],"not_rendered":{"charts":12,"images":64,"macros":1,"external_links":0,"defined_names":767,"comments":2,"pivot_tables":0},"unopened":[],"bounds":{"document_bytes":16777216,"sheet_cells":100000,"rows_first":2000,"rows_last":500,"rows_between":2000,"halvings":0,"cell_chars":16384,"cell_head_chars":4096},"cells_cut":0,"cells_raw":0,"read":"whole","date_system":"1900"}

{"sheet":"xMenuBar","index":0,"n_rows":55,"n_cols":8,"rows_kept":55,"cut":false,"hidden":true,"merged":[[30,1,31,6],[30,7,30,8],[31,7,31,8],[32,7,32,8],[42,7,42,8],[35,7,35,8],[37,1,38,6],[37,7,37,8],[38,7,38,8],[39,7,39,8],[40,1,41,6],[40,7,40,8],[41,7,41,8],[16,1,17,6],[16,7,16,8],[17,7,17,8],[18,7,18,8],[33,1,34,6],[33,7,33,8],[34,7,34,8],[21,7,21,8],[24,1,25,6],[24,7,24,8],[25,7,25,8],[26,7,26,8],[27,1,28,6],[27,7,27,8],[28,7,28,8],[29,7,29,8],[9,7,9,8],[8,1,9,6],[15,7,15,8],[10,7,10,8],[13,1,14,6],[13,7,13,8],[14,7,14,8],[2,1,6,6],[43,1,44,6],[43,7,43,8],[44,7,44,8],[45,7,45,8],[3,7,3,8],[2,7,2,8],[4,7,4,8],[5,7,5,8],[6,7,6,8],[19,1,20,6],[19,7,19,8],[20,7,20,8],[7,7,7,8],[7,1,7,6],[8,7,8,8],[46,1,47,6],[46,7,46,8],[47,7,47,8],[48,7,48,8],[49,1,50,6],[49,7,49,8],[50,7,50,8],[51,7,51,8],[52,1,53,6],[52,7,52,8],[53,7,53,8],[54,7,54,8]]}
[]
[]
[null,"DLP Logo",null,null,null,null,null,14.4]
[null,null,null,null,null,null,null,14.4]
[null,null,null,null,null,null,null,14.4]
[null,null,null,null,null,null,null,14.4]
[null,null,null,null,null,null,null,14.4]
[null,null,null,null,null,null,null,7]
[null,"Button",null,null,null,null,null,14.4]
[null,null,null,null,null,null,null,14.4]
[null,null,null,null,null,null,null,9]
[]
[]
[null,"Button",null,null,null,null,null,14.4]
[null,null,null,null,null,null,null,14.4]
[null,null,null,null,null,null,null,9]
[null,"Button",null,null,null,null,null,14.4]
[null,null,null,null,null,null,null,14.4]
[null,null,null,null,null,null,null,9]
[null,"Button",null,null,null,null,null,14.4]
[null,null,null,null,null,null,null,14.4]
[null,null,null,null,null,null,null,9]
[]
[]
[null,"Button",null,null,null,null,null,14.4]
[null,null,null,null,null,null,null,14.4]
[null,null,null,null,null,null,null,9]
[null,"Button",null,null,null,null,null,14.4]
[null,null,null,null,null,null,null,14.4]
[null,null,null,null,null,null,null,9]
[null,"Button",null,null,null,null,null,14.4]
[null,null,null,null,null,null,null,14.4]
[null,null,null,null,null,null,null,9]
[null,"Button",null,null,null,null,null,14.4]
[null,null,null,null,null,null,null,14.4]
[null,null,null,null,null,null,null,9]
[]
[null,"Button",null,null,null,null,null,14.4]
[null,null,null,null,null,null,null,14.4]
[null,null,null,null,null,null,null,9]
[null,"Button",null,null,null,null,null,14.4]
[null,null,null,null,null,null,null,14.4]
[null,null,null,null,null,null,null,9]
[null,"Button",null,null,null,null,null,14.4]
[null,null,null,null,null,null,null,14.4]
[null,null,null,null,null,null,null,9]
[null,"Button",null,null,null,null,null,14.4]
[null,null,null,null,null,null,null,14.4]
[null,null,null,null,null,null,null,9]
[null,"Button",null,null,null,null,null,14.4]
[null,null,null,null,null,null,null,14.4]
[null,null,null,null,null,null,null,9]
[null,"Button",null,null,null,null,null,14.4]
[null,null,null,null,null,null,null,14.4]
[null,null,null,null,null,null,null,9]

{"sheet":"xMenuElements","index":1,"n_rows":0,"n_cols":0,"rows_kept":0,"cut":false,"hidden":true,"merged":[]}

{"sheet":"xMenuBarCfg","index":2,"n_rows":29,"n_cols":60,"rows_kept":29,"cut":false,"hidden":true,"merged":[[4,49,4,53],[4,55,4,59],[4,43,4,47],[1,2,1,8],[4,11,4,15],[4,17,4,21],[4,23,4,27],[4,31,4,35],[4,37,4,41]]}
[]
[null,null,"Menu Bar Shapes"]
[]
[null,null,1,2,3,4,5,6,7]
[null,null,null,null,null,null,null,null,null,null,null,"App",null,null,null,null,null,"Target",null,null,null,null,null,"Diff",null,null,null,null,null,null,null,"Original Shapes (unselected)",null,null,null,null,null,"Original Shapes (selected)",null,null,null,null,null,"Welcome",null,null,null,null,null,"App",null,null,null,null,null,"Target"]
[null,null,"Index","Shape Name","Width","Height","Left","Top",null,null,null,"Shape Name","Width","Height","Left","Top",null,"Shape Name","Width","Height","Left","Top",null,"Shape Name","Width","Height","Left","Top",null,null,null,"Shape Name","Width","Height","Left","Top",null,"Shape Name","Width","Height","Left","Top",null,"Shape Name","Width","Height","Left","Top",null,"Shape Name","Width","Height","Left","Top",null,"Shape Name","Width","Height","Left","Top"]
[null,null,{"$f":"MAX(C8:C30)","v":22}]
[null,null,1,"DLPLogo",148,66,10,11,null,null,null,"DLPLogo",149,66,11,11,null,"DLPLogo",151,71,9,11,null,"DLPLogo",{"$f":"M8-S8","v":-2},{"$f":"N8-T8","v":-5},{"$f":"O8-U8","v":2},{"$f":"P8-V8","v":0},null,null,null,"DLPLogo",150,73,167,29,null,"DLPLogo",150,71,383,29,null,"DLPLogo",151,71,9,11,null,"DLPLogo",149,66,11,11,null,"DLPLogo",150,66,10,11]
[null,null,2,"WelcomeButton",136,31,18,90,null,null,null,"WelcomButton",133,29,10,89,null,"WelcomeButton",86,32,565,261,null,"WelcomeButton",{"$f":"M9-S9","v":47},{"$f":"N9-T9","v":-3},{"$f":"O9-U9","v":-555},{"$f":"P9-V9","v":-172},null,null,null,"WelcomeButton",133,29,167,108,null,"WelcomeButton",133,29,383,107,null,"WelcomeButton",86,32,565,261,null,"WelcomeButton",133,29,10,89,null,"WelcomeButton",133,29,10,89]
[null,null,3,"InputHeader",99,20,43,130,null,null,null,"InputHeader",133,28,10,122,null,"InputHeader",133,28,10,120,null,"InputHeader",0,0,0,2,null,null,null,"InputHeader",133,29,167,139,null,"InputHeader",null,null,null,null,null,"InputHeader",133,28,10,120,null,"InputHeader",133,28,10,122,null,"InputHeader",133,29,10,119]
[null,null,4,"AppButton",132,27,10,152,null,null,null,"AppButton",134,30,10,149,null,"AppButton",133,29,10,148,null,"AppButton",1,1,0,1,null,null,null,"AppButton",133,29,167,168,null,"AppButton",133,29,383,164,null,"AppButton",133,29,10,148,null,"AppButton",134,30,10,149,null,"AppButton",133,29,10,148]
[null,null,5,"TargetButton",132,29,10,189,null,null,null,"TargetButton",133,30,10,186,null,"TargetButton",133,29,10,186,null,"TargetButton",0,1,0,0,null,null,null,"TargetButton",134,29,167,205,null,"TargetButton",134,29,382,201,null,"TargetButton",133,29,10,186,null,"TargetButton",133,30,10,186,null,"TargetButton",134,29,10,186]
[null,null,6,"SummaryButton",132,30,10,227,null,null,null,"SummaryButton",133,28,10,226,null,"SummaryButton",133,29,10,223,null,"SummaryButton",0,-1,0,3,null,null,null,"SummaryButton",133,29,167,242,null,"SummaryButton",133,29,383,239,null,"SummaryButton",133,29,10,223,null,"SummaryButton",133,28,10,226,null,"SummaryButton",133,29,10,223]
[null,null,7,"OutputHeader",99,20,43,267,null,null,null,"OutputHeader",134,29,10,257,null,"OutputHeader",134,28,9,254,null,"OutputHeader",0,1,1,3,null,null,null,"OutputHeader",134,29,167,274,null,"OutputHeader",null,null,null,null,null,"OutputHeader",134,28,9,254,null,"OutputHeader",134,29,10,257,null,"OutputHeader",134,29,10,254]
[null,null,8,"MapButton",132,29,10,287,null,null,null,"MapButton",133,29,10,284,null,"MapButton",133,29,10,283,null,"MapButton",0,0,0,1,null,null,null,"MapButton",134,29,167,301,null,"MapButton",133,28,383,298,null,"MapButton",133,29,10,283,null,"MapButton",133,29,10,284,null,"MapButton",134,29,10,282]
[null,null,9,"GuideButton",132,30,10,326,null,null,null,"GuideButton",133,29,10,323,null,"GuideButton",133,29,10,320,null,"GuideButton",0,0,0,3,null,null,null,"GuideButton",134,29,167,339,null,"GuideButton",133,29,383,334,null,"GuideButton",133,29,10,320,null,"GuideButton",133,29,10,323,null,"GuideButton",134,29,10,320]
[null,null,10,"EngineButton",132,29,10,363,null,null,null,"EngineButton",133,30,10,361,null,"EngineButton",133,29,10,358,null,"EngineButton",0,1,0,3,null,null,null,"EngineButton",133,29,167,376,null,"EngineButton",133,29,383,372,null,"EngineButton",133,29,10,358,null,"EngineButton",133,30,10,361,null,"EngineButton",133,29,10,357]
[null,null,11,"SupportButton",132,29,10,402,null,null,null,"SupportButton",133,29,10,398,null,"SupportButton",133,29,10,395,null,"SupportButton",0,0,0,3,null,null,null,"SupportButton",134,29,167,414,null,"SupportButton",133,29,383,409,null,"SupportButton",133,29,10,395,null,"SupportButton",133,29,10,398,null,"SupportButton",134,29,10,395]
[null,null,12,"TrackerBar",4,317,24,102,null,null,null,"TrackerBar",4,313,25,101,null,"TrackerBar",4,310,25,100,null,"TrackerBar",0,3,0,1,null,null,null,"TrackerBar",4,312,182,119,null,"TrackerBar",null,null,null,null,null,"TrackerBar",4,310,25,100,null,"TrackerBar",4,313,25,101,null,"TrackerBar",4,312,25,100]
[null,null,13,"PrintButton",115,29,26,454,null,null,null,"PrintButton",117,29,27,450,null,"PrintButton",117,29,26,447,null,"PrintButton",0,0,1,3,null,null,null,"PrintButton",117,29,184,466,null,"PrintButton",null,null,null,null,null,"PrintButton",117,29,26,447,null,"PrintButton",117,29,27,450,null,"PrintButton",117,29,27,446]
[null,null,14,"ResetButton",115,28,26,492,null,null,null,"ResetButton",116,28,27,489,null,"ResetButton",117,29,27,485,null,"ResetButton",-1,-1,0,4,null,null,null,"ResetButton",117,29,184,504,null,"ResetButton",null,null,null,null,null,"ResetButton",117,29,27,485,null,"ResetButton",116,28,27,489,null,"ResetButton",117,29,27,484]
[null,null,15,"SaveButton",49,28,26,532,null,null,null,"SaveButton",49,30,27,525,null,"SaveButton",50,29,26,523,null,"SaveButton",-1,1,1,2,null,null,null,"SaveButton",50,29,184,541,null,"SaveButton",null,null,null,null,null,"SaveButton",50,29,26,523,null,"SaveButton",49,30,27,525,null,"SaveButton",50,29,27,522]
[null,null,16,"SaveAsButton",50,29,92,531,null,null,null,"SaveAsButton",51,30,92,525,null,"SaveAsButton",51,29,93,523,null,"SaveAsButton",0,1,-1,2,null,null,null,"SaveAsButton",50,29,250,541,null,"SaveAsButton",null,null,null,null,null,"SaveAsButton",51,29,93,523,null,"SaveAsButton",51,30,92,525,null,"SaveAsButton",50,29,94,522]
[null,null,17,"ExitButton",116,29,26,569,null,null,null,"ExitButton",118,28,26,564,null,"ExitButton",117,29,26,561,null,"ExitButton",1,-1,0,3,null,null,null,"ExitButton",117,29,184,579,null,"ExitButton",null,null,null,null,null,"ExitButton",117,29,26,561,null,"ExitButton",118,28,26,564,null,"ExitButton",117,29,27,560]
[null,null,18,"OptionsButton",115,28,26,607,null,null,null,"OptionsButton",117,29,27,602,null,"OptionsButton",117,28,26,598,null,"OptionsButton",0,1,1,4,null,null,null,"OptionsButton",117,29,184,617,null,"OptionsButton",null,null,null,null,null,"OptionsButton",117,28,26,598,null,"OptionsButton",117,29,27,602,null,"OptionsButton",117,29,27,598]
[null,null,19,"ZoomLabel",38,26,32,646,null,null,null,"ZoomLabel",38,25,33,642,null,"ZoomLabel",38,25,33,638,null,"ZoomLabel",0,0,0,4,null,null,null,"ZoomLabel",38,25,190,656,null,"ZoomLabel",null,null,null,null,null,"ZoomLabel",38,25,33,638,null,"ZoomLabel",38,25,33,642,null,"ZoomLabel",38,25,33,637]
[null,null,20,"ZoomPlusButton",17,17,84,650,null,null,null,"ZoomPlusButton",17,17,85,645,null,"ZoomPlusButton",17,18,85,642,null,"ZoomPlusButton",0,-1,0,3,null,null,null,"ZoomPlusButton",17,17,242,660,null,"ZoomPlusButton",null,null,null,null,null,"ZoomPlusButton",17,18,85,642,null,"ZoomPlusButton",17,17,85,645,null,"ZoomPlusButton",17,17,85,641]
[null,null,21,"ZoomMinusButton",17,17,117,650,null,null,null,"ZoomMinusButton",16,17,119,645,null,"ZoomMinusButton",16,17,119,642,null,"ZoomMinusButton",0,0,0,3,null,null,null,"ZoomMinusButton",16,17,275,660,null,"ZoomMinusButton",null,null,null,null,null,"ZoomMinusButton",16,17,119,642,null,"ZoomMinusButton",16,17,119,645,null,"ZoomMinusButton",16,17,119,641]
[null,null,22,"Copyright",115,42,26,686,null,null,null,"Copyright",116,45,27,678,null,"Copyright",117,43,27,673,null,"Copyright",-1,2,0,5,null,null,null,"Copyright",117,44,184,695,null,"Copyright",null,null,null,null,null,"Copyright",117,43,27,673,null,"Copyright",116,45,27,678,null,"Copyright",117,43,27,676]

{"sheet":"NoMacros","index":3,"n_rows":0,"n_cols":0,"rows_kept":0,"cut":false,"hidden":false,"merged":[]}

{"sheet":"Placard","index":4,"n_rows":0,"n_cols":0,"rows_kept":0,"cut":false,"hidden":false,"merged":[]}

{"sheet":"Welcome","index":5,"n_rows":53,"n_cols":36,"rows_kept":53,"cut":false,"hidden":true,"merged":[[49,11,51,49],[52,11,57,49],[38,11,40,49],[33,16,33,33],[35,16,35,33],[35,35,35,44],[33,35,33,44],[41,11,46,49]]}
[]
[]
[]
[]
[]
[]
[]
[]
[]
[]
[]
[]
[]
[]
[]
[]
[]
[]
[]
[]
[]
[]
[]
[]
[]
[]
[]
[]
[]
[]
[]
[]
[]
[null,null,null,null,null,null,null,null,null,null,null,null,null,null,null,null,"Have feedback or questions about this tool? Contact us at: ",null,null,null,null,null,null,null,null,null,null,null,null,null,null,null,null,null,null,"dlpdisplay_smartselect@list.ti.com"]
[]
[null,null,null,null,null,null,null,null,null,null,null,null,null,null,null,null,"Couldn't find what you were looking for? Ask a question at:",null,null,null,null,null,null,null,null,null,null,null,null,null,null,null,null,null,null,"TI E2E™ design support forums"]
[]
[]
[null,null,null,null,null,null,null,null,null,null,null,"Important Notice"]
[]
[]
[null,null,null,null,null,null,null,null,null,null,null,"The products and services of Texas Instruments Incorporated and its subsidiaries described herein are sold subject to TI’s standard terms and conditions of sale. Customers are advised to obtain the most current and complete information about TI products and services before placing orders. TI assumes no liability for applications assistance, customer’s applications or product designs, software performance, or infringement of patents. The publication of information regarding any other company’s products or services does not constitute TI’s approval, warranty or endorsement thereof."]
[]
[]
[]
[]
[]
[]
[]
[null,null,null,null,null,null,null,null,null,null,null,"Disclaimer"]
[]
[]
[null,null,null,null,null,null,null,null,null,null,null,"Certain information and resources (including links to non-TI sites) may be provided by a third-party partner, and is included here merely for your convenience. TI is not the provider of, and is not responsible for, the content of such information and resources, and you should evaluate them carefully for your intended uses and on your own behalf. The inclusion of such information and resources here does not imply endorsement of any third-party company by TI, and shall not be construed as a warranty or representation regarding the suitability of any third-party products or services, either alone or in combination with any TI product or service."]

{"sheet":"xControls","index":6,"n_rows":12,"n_cols":5,"rows_kept":12,"cut":false,"hidden":true,"merged":[]}
[]
[null,"Base Version","[[Prod]]"]
[null,"Full Version","[[Prod]] (Smarta2xOPENv3)"]
[]
[]
[]
[]
[]
[null,"Display Cmd Parser Timer",null,null,"True or False (?)"]
[]
[null,"Rename Flag",null,null,"blank or not-blank"]
[null,"New Name"]

{"sheet":"App","index":7,"n_rows":133,"n_cols":72,"rows_kept":133,"cut":false,"hidden":true,"merged":[[71,22,71,33],[72,22,72,31],[51,14,51,46],[54,27,54,28],[55,27,55,28],[56,27,56,28],[54,29,54,33],[55,29,55,33],[54,22,54,26],[55,22,55,26],[56,22,56,26],[56,29,56,33],[57,29,57,33],[57,22,57,26],[57,27,57,28],[36,14,36,46],[48,14,48,46],[9,40,9,43],[9,45,9,49],[20,21,20,45],[9,22,9,33],[9,36,9,39],[18,13,18,47],[39,14,46,45],[7,36,7,43],[7,45,7,49],[8,45,8,49],[14,12,15,48],[7,12,7,19],[7,22,7,33],[8,12,8,15],[8,16,8,19],[8,22,8,33],[8,36,8,39],[9,12,9,15],[9,16,9,19],[8,40,8,43],[12,11,13,49],[78,37,78,40],[74,37,74,48],[58,22,58,26],[63,15,63,45],[60,27,60,28],[61,27,61,28],[60,29,60,33],[61,29,61,33],[59,22,59,26],[60,22,60,26],[61,22,61,26],[58,27,58,28],[70,22,70,36],[58,29,58,33],[59,29,59,33],[59,27,59,28]]}
[]
[]
[]
[]
[null,null,null,null,null,null,null,null,null,null,null,null,null,null,null,null,null,null,null,null,null,null,null,null,null,null,null,null,null,null,null,null,null,null,null,null,null,null,null,null,null,null,null,null,null,null,null,null,null,null,null,null,null,null,"Future applications"]
[]
[]
[null,null,null,null,null,null,null,null,null,null,null,null,"Resolution",null,null,null,null,null,null,null,null,null,"Image Size",null,null,null,null,null,null,null,null,null,null,null,null,null,"Brightness",null,null,null,null,null,null,null,null,"# of Matching"]
[null,null,null,null,null,null,null,null,null,null,null,"Max:",{"$f":"Display_ResolutionSimple_Max","v":"-- x --"},null,null,null,{"$f":"Display_Mpx_Max","v":"-- Mpx"},null,null,null,null,"Max:",{"$f":"CONCATENATE( \"W: \", Display_ImageWidth_Max, \"  x   H: \", Display_ImageHeight_Max, \"   ( D: \", Display_ImageDiag_Max, \" )\"  )","v":"W: -- in  x   H: -- in   ( D: -- in )"},null,null,null,null,null,null,null,null,null,null,null,null,"Max:",{"$f":"Display_Lumens_Max","v":"-- lm"},null,null,null,{"$f":"Display_Nits_Max","v":"-- nits"},null,null,null,null,"Chipsets"]
[null,null,null,null,null,null,null,null,null,null,null,"Min:",{"$f":"Display_ResolutionSimple_Min","v":"-- x --"},null,null,null,{"$f":"Display_Mpx_Min","v":"-- Mpx"},null,null,null,null,"Min:",{"$f":"CONCATENATE( \"W: \", Display_ImageWidth_Min, \"  x   H: \", Display_ImageHeight_Min, \"   ( D: \", Display_ImageDiag_Min, \" )\"  )","v":"W: -- in  x   H: -- in   ( D: -- in )"},null,null,null,null,null,null,null,null,null,null,null,null,"Min:",{"$f":"Display_Lumens_Min","v":"-- lm"},null,null,null,{"$f":"Display_Nits_Min","v":"-- nits"},null,null,null,null,{"$f":"Index_Chipset_Max","v":0}]
[]
[null,null,null,null,null,null,null,null,null,null,null,null,null,null,null,null,null,null,null,null,null,null,null,null,null,null,null,null,null,null,null,null,null,null,null,null,null,null,null,null,null,null,null,null,null,null,null,null,null,null,null,null,null,null,"Machine vision/scanning"]
[null,null,null,null,null,null,null,null,null,null,null,"Pre-Defined End-Product Applications",null,null,null,null,null,null,null,null,null,null,null,null,null,null,null,null,null,null,null,null,null,null,null,null,null,null,null,null,null,null,null,null,null,null,null,null,null,null,null,null,null,null,"3D print"]
[null,null,null,null,null,null,null,null,null,null,null,null,null,null,null,null,null,null,null,null,null,null,null,null,null,null,null,null,null,null,null,null,null,null,null,null,null,null,null,null,null,null,null,null,null,null,null,null,null,null,null,null,null,null,"Light control"]
[null,null,null,null,null,null,null,null,null,null,null,null,"If shown, select your end-product application …"]
[]
[null,null,null,null,null,null,null,null,null,null,null,null,null,null,null,null,null,null,null,null,null,null,null,null,null,null,null,null,null,null,null,null,null,null,null,null,null,null,null,null,null,null,null,null,null,null,null,null,null,null,null,null,null,null,"automotive"]
[]
[null,null,null,null,null,null,null,null,null,null,null,null,null,"Select your End-Application …"]
[]
[null,null,null,null,null,null,null,null,null,null,null,null,null,"Pre-Defined Applications",null,null,null,null,null,null,null,"( if your application is not shown, follow the Steps on the Application Parameter screen )"]
[null,null,null,null,null,null,null,null,null,null,null,null,null,null,null,null,null,null,null,null,null,null,null,null,null,null,null,null,null,null,null,null,null,null,null,null,null,null,null,null,null,null,null,null,null,null,null,null,null,null,null,null,null,null,null,null,0]
[null,null,null,null,null,null,null,null,null,null,null,null,null,null,null,null,{"$f":"xLists!C6","v":"Laser TV"},null,null,null,null,null,null,null,null,null,null,null,null,null,null,{"$f":"xLists!C17","v":"Digital Signage"},null,null,null,null,null,null,null,null,null,null,null,null,null,null,null,null,null,null,null,null,null,null,null,null,null,1,null,12]
[null,null,null,null,null,null,null,null,null,null,null,null,null,null,null,null,{"$f":"xLists!C7","v":"Mobile Smart TV (Smart Projector)"},null,null,null,null,null,null,null,null,null,null,null,null,null,null,{"$f":"xLists!C18","v":"Interactive Kiosk"},null,null,null,null,null,null,null,null,null,null,null,null,null,null,null,null,null,null,null,null,null,null,null,null,null,2,null,13]
[null,null,null,null,null,null,null,null,null,null,null,null,null,null,null,null,{"$f":"xLists!C8","v":"Mobile Projector"},null,null,null,null,null,null,null,null,null,null,null,null,null,null,{"$f":"xLists!C19","v":"Electronic Gaming Machines"},null,null,null,null,null,null,null,null,null,null,null,null,null,null,null,null,null,null,null,null,null,null,null,null,null,3,null,14]
[null,null,null,null,null,null,null,null,null,null,null,null,null,null,null,null,{"$f":"xLists!C9","v":"Enterprise Data Projector"},null,null,null,null,null,null,null,null,null,null,null,null,null,null,{"$f":"xLists!C20","v":"Collaborative Robots"},null,null,null,null,null,null,null,null,null,null,null,null,null,null,null,null,null,null,null,null,null,null,null,null,null,4,null,15]
[null,null,null,null,null,null,null,null,null,null,null,null,null,null,null,null,{"$f":"xLists!C10","v":"Education Projector"},null,null,null,null,null,null,null,null,null,null,null,null,null,null,{"$f":"xLists!C21","v":"Appliances"},null,null,null,null,null,null,null,null,null,null,null,null,null,null,null,null,null,null,null,null,null,null,null,null,null,5,null,16]
[null,null,null,null,null,null,null,null,null,null,null,null,null,null,null,null,null,null,null,null,null,null,null,null,null,null,null,null,null,null,null,{"$f":"xLists!C22","v":"Toy"},null,null,null,null,null,null,null,null,null,null,null,null,null,null,null,null,null,null,null,null,null,null,null,null,null,null,null,17]
[null,null,null,null,null,null,null,null,null,null,null,null,null,null,null,null,{"$f":"xLists!C11","v":"Smart Display"},null,null,null,null,null,null,null,null,null,null,null,null,null,null,null,null,null,null,null,null,null,null,null,null,null,null,null,null,null,null,null,null,null,null,null,null,null,null,null,null,6]
[null,null,null,null,null,null,null,null,null,null,null,null,null,null,null,null,{"$f":"xLists!C12","v":"Tablet (embedded)"},null,null,null,null,null,null,null,null,null,null,null,null,null,null,{"$f":"xLists!C23","v":"Other"},null,null,null,null,null,null,null,null,null,null,null,null,null,null,null,null,null,null,null,null,null,null,null,null,null,7,null,18]
[null,null,null,null,null,null,null,null,null,null,null,null,null,null,null,null,{"$f":"xLists!C13","v":"Smartphone (embedded)"},null,null,null,null,null,null,null,null,null,null,null,null,null,null,null,null,null,null,null,null,null,null,null,null,null,null,null,null,null,null,null,null,null,null,null,null,null,null,null,null,8]
[null,null,null,null,null,null,null,null,null,null,null,null,null,null,null,null,{"$f":"xLists!C14","v":"Smartphone Companion"},null,null,null,null,null,null,null,null,null,null,null,null,null,null,null,null,null,null,null,null,null,null,null,null,null,null,null,null,null,null,null,null,null,null,null,null,null,null,null,null,9,null,19,null,null,null,{"$f":"xLists!C24","v":"[19]"}]
[null,null,null,null,null,null,null,null,null,null,null,null,null,null,null,null,{"$f":"xLists!C15","v":"Augmented Reality Headset"},null,null,null,null,null,null,null,null,null,null,null,null,null,null,null,null,null,null,null,null,null,null,null,null,null,null,null,null,null,null,null,null,null,null,null,null,null,null,null,null,10,null,20,null,null,null,{"$f":"xLists!C25","v":"[20]"}]
[null,null,null,null,null,null,null,null,null,null,null,null,null,null,null,null,{"$f":"xLists!C16","v":"High-Performance Augmented Reality  "},null,null,null,null,null,null,null,null,null,null,null,null,null,null,null,null,null,null,null,null,null,null,null,null,null,null,null,null,null,null,null,null,null,null,null,null,null,null,null,null,11,null,21,null,null,null,{"$f":"xLists!C26","v":"[21]"}]
[]
[]
[null,null,null,null,null,null,null,null,null,null,null,null,null,null,{"$f":"CONCATENATE( IF( Index_App>0, CONCATENATE( Display_Application, \"  -  \"), \"\"), \"Application Details\" )","v":"Application Details"}]
[]
[]
[null,null,null,null,null,null,null,null,null,null,null,null,null,null,{"$f":"AppDef_App_Comment","v":""}]
[]
[]
[]
[]
[]
[]
[]
[]
[null,null,null,null,null,null,null,null,null,null,null,null,null,null,{"$f":"HYPERLINK( AppDef_Hyperlink_Address, AppDef_Hyperlink_Text )","v":""}]
[]
[]
[null,null,null,null,null,null,null,null,null,null,null,null,null,null,{"$f":"CONCATENATE( IF( Index_App>0, CONCATENATE( Display_Application, \"  -  \"), \"\"), \"Default Use-Case Parameters\" )","v":"Default Use-Case Parameters"}]
[]
[]
[null,null,null,null,null,null,null,null,null,null,null,null,null,null,{"$f":"VLOOKUP( $BF55, Table_AppDefaultSummary, $BG55 )","v":"  "},null,null,null,null,null,null,null,{"$f":"VLOOKUP( $BF55, Table_AppDefaultSummary, $BH55 )","v":"  "},null,null,null,null,{"$f":"VLOOKUP( $BF55, Table_AppDefaultSummary, $BI55 )","v":"  "},null,{"$f":"VLOOKUP( $BF55, Table_AppDefaultSummary, $BJ55 )","v":" "},null,null,null,null,null,null,null,null,null,null,null,null,null,null,null,null,null,null,null,null,null,null,null,null,null,null,null,1,3,4,5,6]
[null,null,null,null,null,null,null,null,null,null,null,null,null,null,"  ",null,null,null,null,null,null,null,{"$f":"VLOOKUP( $BF56, Table_AppDefaultSummary, $BH56 )","v":"  "},null,null,null,null,"  ",null,{"$f":"VLOOKUP( $BF56, Table_AppDefaultSummary, $BJ56 )","v":" "},null,null,null,null,null,null,null,null,null,null,null,null,null,null,null,null,null,null,null,null,null,null,null,null,null,null,null,2,3,4,5,6]
[null,null,null,null,null,null,null,null,null,null,null,null,null,null,"   ",null,null,null,null,null,null,null,"  ",null,null,null,null,"  ",null," ",null,null,null,null,null,null,null,null,null,null,null,null,null,null,null,null,null,null,null,null,null,null,null,null,null,null,null,3,3,4,5,6]
[null,null,null,null,null,null,null,null,null,null,null,null,null,null,"  ",null,null,null,null,null,null,null,"  ",null,null,null,null,"  ",null," ",null,null,null,null,null,null,null,null,null,null,null,null,null,null,null,null,null,null,null,null,null,null,null,null,null,null,null,4,3,4,5,6]
[null,null,null,null,null,null,null,null,null,null,null,null,null,null,"  ",null,null,null,null,null,null,null,"  ",null,null,null,null,"  ",null," ",null,null,null,null,null,null,null,null,null,null,null,null,null,null,null,null,null,null,null,null,null,null,null,null,null,null,null,5,3,4,5,6]
[null,null,null,null,null,null,null,null,null,null,null,null,null,null,"  ",null,null,null,null,null,null,null,"  ",null,null,null,null,"  ",null," ",null,null,null,null,null,null,null,null,null,null,null,null,null,null,null,null,null,null,null,null,null,null,null,null,null,null,null,6,3,4,5,6]
[null,null,null,null,null,null,null,null,null,null,null,null,null,null,"  ",null,null,null,null,null,null,null,"  ",null,null,null,null,"  ",null," ",null,null,null,null,null,null,null,null,null,null,null,null,null,null,null,null,null,null,null,null,null,null,null,null,null,null,null,7,3,4,5,6]
[null,null,null,null,null,null,null,null,null,null,null,null,null,null,"  ",null,null,null,null,null,null,null,"  ",null,null,null,null,"  ",null," ",null,null,null,null,null,null,null,null,null,null,null,null,null,null,null,null,null,null,null,null,null,null,null,null,null,null,null,8,3,4,5,6]
[]
[null,null,null,null,null,null,null,null,null,null,null,null,null,null,null,{"$f":"CONCATENATE( IF( Index_App>0, CONCATENATE( Display_Application, \"  -  \"), \"\"), BI70, \"Matching Chipsets\" )","v":" Matching Chipsets"},null,null,null,null,null,null,null,null,null,null,null,null,null,null,null,null,null,null,null,null,null,null,null,null,null,null,null,null,null,null,null,null,null,null,null,null,null,null,null,null,null,null,null,null,null,null,null,null,null,null,{"$f":"Table_ChipsetEngine_Count","v":{"$error":"#VALUE!"}}]
[null,null,null,null,null,null,null,null,null,null,null,null,null,null,null,{"$f":"IF( BJ65<>\"--\", BJ65, \"\" )","v":""},null,null,null,null,{"$f":"BT65","v":""},null,null,null,null,null,null,null,null,null,null,null,null,null,null,null,null,null,null,null,null,null,null,null,null,null,null,null,null,null,null,"refine on the map page",null,null,null,null,null,1,{"$f":"IFERROR( MATCH( BF65, Array_Chipset_Index, 0 ), 0 )","v":0},null,2,{"$f":"IF(BG65>0,INDEX(Table_Chipsets, BI65,BG65+2),\"--\")","v":"--"},null,null,null,{"$f":"INDEX(Table_Chipsets, BI65+1,BG65+2)","v":"DMD"},null,null,null,{"$f":"VLOOKUP(BN65, Table_ChipsetEngine_Count, 2 )","v":0},null,{"$f":"IF( BG65<>0, IF( BR65>0, CONCATENATE( \"( \", BR65, \" off-the-shelf optical engines available )\" ), \"( no off-the-shelf optical engines available )\" ), \"\" )","v":""}]
[null,null,null,null,null,null,null,null,null,null,null,null,null,null,null,{"$f":"IF( BJ66<>\"--\", BJ66, \"\" )","v":""},null,null,null,null,{"$f":"BT66","v":""},null,null,null,null,null,null,null,null,null,null,null,null,null,null,null,null,null,null,null,null,null,null,null,null,null,null,null,null,null,null,null,null,null,null,null,null,2,{"$f":"IFERROR( MATCH( BF66, Array_Chipset_Index, 0 ), 0 )","v":0},null,2,{"$f":"IF(BG66>0,INDEX(Table_Chipsets, BI66,BG66+2),\"--\")","v":"--"},null,null,null,{"$f":"INDEX(Table_Chipsets, BI66+1,BG66+2)","v":"DMD"},null,null,null,{"$f":"VLOOKUP(BN66, Table_ChipsetEngine_Count, 2 )","v":0},null,{"$f":"IF( BG66<>0, IF( BR66>0, CONCATENATE( \"( \", BR66, \" off-the-shelf optical engines available )\" ), \"( no off-the-shelf optical engines available )\" ), \"\" )","v":""}]
[null,null,null,null,null,null,null,null,null,null,null,null,null,null,null,{"$f":"IF( BJ67<>\"--\", BJ67, \"\" )","v":""},null,null,null,null,{"$f":"BT67","v":""},null,null,null,null,null,null,null,null,null,null,null,null,null,null,null,null,null,null,null,null,null,null,null,null,null,null,null,null,null,null,null,null,null,null,null,null,3,{"$f":"IFERROR( MATCH( BF67, Array_Chipset_Index, 0 ), 0 )","v":0},null,2,{"$f":"IF(BG67>0,INDEX(Table_Chipsets, BI67,BG67+2),\"--\")","v":"--"},null,null,null,{"$f":"INDEX(Table_Chipsets, BI67+1,BG67+2)","v":"DMD"},null,null,null,{"$f":"VLOOKUP(BN67, Table_ChipsetEngine_Count, 2 )","v":0},null,{"$f":"IF( BG67<>0, IF( BR67>0, CONCATENATE( \"( \", BR67, \" off-the-shelf optical engines available )\" ), \"( no off-the-shelf optical engines available )\" ), \"\" )","v":""}]
[null,null,null,null,null,null,null,null,null,null,null,null,null,null,null,{"$f":"IF( BJ68<>\"--\", BJ68, \"\" )","v":""},null,null,null,null,{"$f":"BT68","v":""},null,null,null,null,null,null,null,null,null,null,null,null,null,null,null,null,null,null,null,null,null,null,null,null,null,null,null,null,null,null,null,"adding omm stuff for all 12 chipsets",null,null,null,null,4,{"$f":"IFERROR( MATCH( BF68, Array_Chipset_Index, 0 ), 0 )","v":0},null,2,{"$f":"IF(BG68>0,INDEX(Table_Chipsets, BI68,BG68+2),\"--\")","v":"--"},null,null,null,{"$f":"INDEX(Table_Chipsets, BI68+1,BG68+2)","v":"DMD"},null,null,null,{"$f":"VLOOKUP(BN68, Table_ChipsetEngine_Count, 2 )","v":0},null,{"$f":"IF( BG68<>0, IF( BR68>0, CONCATENATE( \"( \", BR68, \" off-the-shelf optical engines available )\" ), \"( no off-the-shelf optical engines available )\" ), \"\" )","v":""}]
[null,null,null,null,null,null,null,null,null,null,null,null,null,null,null,{"$f":"IF( BJ69<>\"--\", BJ69, \"\" )","v":""},null,null,null,null,{"$f":"BT69","v":""},null,null,null,null,null,null,null,null,null,null,null,null,null,null,null,null,null,null,null,null,null,null,null,null,null,null,null,null,null,null,null,null,null,null,null,null,5,{"$f":"IFERROR( MATCH( BF69, Array_Chipset_Index, 0 ), 0 )","v":0},null,2,{"$f":"IF(BG69>0,INDEX(Table_Chipsets, BI69,BG69+2),\"--\")","v":"--"},null,null,null,{"$f":"INDEX(Table_Chipsets, BI69+1,BG69+2)","v":"DMD"},null,null,null,{"$f":"VLOOKUP(BN69, Table_ChipsetEngine_Count, 2 )","v":0},null,{"$f":"IF( BG69<>0, IF( BR69>0, CONCATENATE( \"( \", BR69, \" off-the-shelf optical engines available )\" ), \"( no off-the-shelf optical engines available )\" ), \"\" )","v":""}]
[null,null,null,null,null,null,null,null,null,null,null,null,null,null,null,null,null,null,null,null,null,null,null,null,null,null,null,null,null,null,null,null,null,null,null,null,null,null,null,null,null,null,null,null,null,null,null,null,null,null,null,null,null,null,null,null,null,null,{"$f":"COUNTIF( BG65:BG69, \"<>0\")","v":0},null,{"$f":"IF( Index_Chipset_Max=0, \" \", IF( Index_Chipset_Max<=5, CONCATENATE( BG70, \" \" ), CONCATENATE( \"First \", BG70, \" of \", Index_Chipset_Max, \" \" ) ) )","v":" "}]
[null,null,null,null,null,null,null,null,null,null,null,null,null,null,null,null,null,null,null,null,null,"Additional Resources:",{"$f":"HYPERLINK(\"https://www.ti.com/lit/an/dlpa059g/dlpa059g.pdf?ts=1690835631401\", \"Getting Started with TI DLP® Display Technology\")","v":"Getting Started with TI DLP® Display Technology"}]
[null,null,null,null,null,null,null,null,null,null,null,null,null,null,null,null,null,null,null,null,null,null,{"$f":"HYPERLINK(\"https://training.ti.com/ti-dlp-pico-product-selection\", \"TI DLP® Pico™ product selection video\")","v":"TI DLP® Pico™ product selection video"}]
[null,null,null,null,null,null,null,null,null,null,null,null,null,null,null,null,null,null,null,null,null,null,{"$f":"HYPERLINK(\"https://www.ti.com/video/series/precision-labs/ti-precision-labs-dlp-labs-display.html\", \"DLP® Labs video training series\")","v":"DLP® Labs video training series"}]
[]
[null,null,null,null,null,null,null,null,null,null,null,null,null,null,null,null,null,null,null,null,null,null,null,null,null,null,null,null,null,null,null,null,null,null,null,null,null,{"$f":"CONCATENATE( \"Ver. \", App_FullVersion )","v":"Ver. [[Prod]] (Smarta2xOPENv3)"}]
[]
[null,null,null,null,null,null,null,null,null,null,null,null,null,null,"Have feedback or questions about this tool? Contact us at . . . . . . . . . . . . . . . . . . . . . . . . . . . . . .",null,null,null,null,null,null,null,null,null,null,null,null,null,null,null,null,null,null,null,null,null,null,"dlpdisplay_smartselect@list.ti.com"]
[]
[null,null,null,null,null,null,null,null,null,null,null,null,null,null,"Couldn't find what you were looking for? Ask a question in the TI E2E™ Community . . . . . ",null,null,null,null,null,null,null,null,null,null,null,null,null,null,null,null,null,null,null,null,null,null,{"$f":"HYPERLINK(\"e2e.ti.com\", \"e2e.ti.com\" )","v":"e2e.ti.com"}]
[null,null,null,null,null,null,null,null,null,null,null,null,null,null,null,null,null,null,null,null,null,null,null,null,null,null,null,null,null,null,null,null,null,null,null,null,null,null,null,null,null,null,null,null,null,null,null,null,null,null,null,null,null,{"$f":"ROW(BB80)","v":80}]
[]
[]
[]
[]
[]
[]
[]
[]
[]
[]
[]
[]
[]
[]
[]
[]
[]
[]
[]
[]
[]
[]
[]
[]
[]
[]
[]
[]
[]
[]
[]
[null,null,null,null,null,null,null,null,null,null,null,null,null,null,null,null,null,null,null,null,null,null,null,null,null,null,null,null,null,null,null,null,null,null,null,null,null,null,null,null,null,null,null,null,null,null,null,null,null,null,null,null,null,{"$f":"ROW(BB112)","v":112}]
[]
[]
[]
[]
[]
[]
[]
[null,null,null,null,null,null,null,null,null,null,null,null,null,null,null,null,null,null,null,null,null,null,null,null,null,null,null,null,null,null,null,null,null,null,null,null,null,null,null,null,null,null,null,null,null,null,null,null,null,null,null,null,null,null,null,"●","These default Application Use-Case Parameters"]
[null,null,null,null,null,null,null,null,null,null,null,null,null,null,null,null,null,null,null,null,null,null,null,null,null,null,null,null,null,null,null,null,null,null,null,null,null,null,null,null,null,null,null,null,null,null,null,null,null,null,null,null,null,null,null,null,"are used to calcuate the range of required"]
[null,null,null,null,null,null,null,null,null,null,null,null,null,null,null,null,null,null,null,null,null,null,null,null,null,null,null,null,null,null,null,null,null,null,null,null,null,null,null,null,null,null,null,null,null,null,null,null,null,null,null,null,null,null,null,null,"display resolutions and screen lumens."]
[]
[null,null,null,null,null,null,null,null,null,null,null,null,null,null,null,null,null,null,null,null,null,null,null,null,null,null,null,null,null,null,null,null,null,null,null,null,null,null,null,null,null,null,null,null,null,null,null,null,null,null,null,null,null,null,null,"●","The display resolution and lumens are then used"]
[null,null,null,null,null,null,null,null,null,null,null,null,null,null,null,null,null,null,null,null,null,null,null,null,null,null,null,null,null,null,null,null,null,null,null,null,null,null,null,null,null,null,null,null,null,null,null,null,null,null,null,null,null,null,null,null,"to match the appropriate DLP Chipsets."]
[]
[null,null,null,null,null,null,null,null,null,null,null,null,null,null,null,null,null,null,null,null,null,null,null,null,null,null,null,null,null,null,null,null,null,null,null,null,null,null,null,null,null,null,null,null,null,null,null,null,null,null,null,null,null,null,null,"●","The Use-Case Parameters can be customized"]
[null,null,null,null,null,null,null,null,null,null,null,null,null,null,null,null,null,null,null,null,null,null,null,null,null,null,null,null,null,null,null,null,null,null,null,null,null,null,null,null,null,null,null,null,null,null,null,null,null,null,null,null,null,null,null,null,"on the \"Application Parameter\" screen."]
[]
[]
[]
[null,null,null,null,null,null,null,null,null,null,null,null,null,null,null,null,null,null,null,null,null,null,null,null,null,null,null,null,null,null,null,null,null,null,null,null,null,null,null,null,null,null,null,null,null,null,null,null,null,null,null,null,null,null,null,"●","Further details can be found on the "]
[null,null,null,null,null,null,null,null,null,null,null,null,null,null,null,null,null,null,null,null,null,null,null,null,null,null,null,null,null,null,null,null,null,null,null,null,null,null,null,null,null,null,null,null,null,null,null,null,null,null,null,null,null,null,null,null,"\"Chipset Map\"  and \"Chipset List\" screens."]

{"sheet":"xAppDefaults","index":8,"n_rows":31,"n_cols":62,"rows_kept":31,"cut":false,"hidden":true,"merged":[[1,52,1,57],[1,42,1,43],[1,44,1,47],[1,22,1,23],[1,18,1,21],[1,40,1,41],[1,14,1,15],[1,30,1,31],[1,38,1,39],[1,16,1,17],[1,24,1,25],[1,26,1,27],[1,28,1,29],[1,36,1,37],[1,32,1,33],[1,34,1,35],[1,4,1,5],[1,6,1,7],[1,8,1,9],[1,10,1,11],[1,12,1,13]]}
[null,1]
[null,null,null,null,"User Ambient  Light Level",null,"Image Nits",null,"Projected Lumens",null,"Screen Efficiency",null,"Projected Image Width",null,"Projected Image Height",null,"Projected Image Diagonal",null,"Image Aspect Ratio",null,null,null,"Viewing Distance",null,"Horizontal Image FOV",null,"Pixels Per Degree",null,"Pixels per inch",null,"Pixels per mm",null,"Text Row Height",null,"Text Arcmin",null,"Rows of Text",null,"Min Text Points",null,"Points-toPx Conv Factor",null,"Std Resolution",null,"Manual Resolution",null,null,null,"Comment",null,null,null,"Matching Tolerance"]
[null,null,null,null,"Min","Max","Min","Max","Min","Max","Min","Max","Min","Max","Min","Max","Min","Max","Num Min","Demon Min","Num Max","Demon Max","Min","Max","Min","Max","Min","Max","Min","Max","Min","Max","Min","Max","Min","Max","Min","Max","Min","Max","Min","Max","Min","Max","MinCol","MinRow","MaxCol","MaxRow",null,null,null,null,"Enable","Nom","Top","Bottom","Left","Right"]
[null,1,{"$f":"Index_App","v":0},null,{"$f":"IF( $B$4=1, E5, \"--\" )","v":"--"},{"$f":"IF( $B$4=1, F5, \"--\" )","v":"--"},{"$f":"IF( $B$4=1, G5, \"--\" )","v":"--"},"--","--","--","--","--","--","--","--","--","--","--","--","--","--","--","--","--","--","--","--","--","--","--","--","--","--","--","--","--","--","--","--","--","--","--","--","--","--","--","--","--","",{"$f":"IF( $B$4=1, AX5, \"\" )","v":""},{"$f":"IF( $B$4=1, AY5, \"\" )","v":""},{"$f":"AZ5","v":""},0,0,0,0,0,0,"--"]
[null,null,null,null,{"$f":"INDEX(E6:E31, $C4+1 )","v":"--"},{"$f":"INDEX(F6:F31, $C4+1 )","v":"--"},"--","--","--","--","--","--","--","--","--","--","--","--","--","--","--","--","--","--","--","--","--","--","--","--","--","--","--","--","--","--",{"$f":"INDEX(AK6:AK31, $C4+1 )","v":"--"},"--","--","--","--","--","--","--","--","--","--","--","","","",{"$f":"INDEX(AZ6:AZ31, $C4+1 )","v":""},0,0,0,0,0,0,"--"]
[null,null,null,null,"--","--","--","--","--","--","--","--","--","--","--","--","--","--","--","--","--","--","--","--","--","--","--","--","--","--","--","--","--","--","--","--","--","--","--","--","--","--","--","--","--","--","--","--","","","","",0,0,0,0,0,0,"--"]
[null,"Laser TV",1,{"$f":"IF( ISERROR( INDEX(List_Apps, C7+1 ) ), \"(null)\", INDEX(List_Apps, C7+1 ) )","v":"Laser TV"},1,3,"--","--","--","--",0.8,0.8,"--","--","--","--",65,120,16,9,16,9,48,144,"--","--",120,45,"--","--","--","--","--","--","--","--","--","--","--","--","--","--","--","--","--","--","--","--","Laser TVs combine DLP technology with ultra-short throw optics and laser illumination to create very large projected images from just inches away from a wall or screen. Laser TVs are convenient alternatives to ≥80” diagonal flat-panel televisions. Laser TV's are typically used for Home Theater applications, which are characterized by large images, with high image quality, in relatively dark enviroments, and projected onto dedicated, high-quality (high efficiency) screens.","https://www.ti.com/lit/wp/dlpc105a/dlpc105a.pdf ","Click here to download the DLP Technology Laser TV white paper.",null,0,0.2,0,0,0,0,"--",null,null,"https://www.ti.com/general/docs/lit/getliterature.tsp?baseLiteratureNumber=dlpc105a&fileType=pdf&HQS=dlp-cine-ecd-lasertv-dlpblog-20170420-wp-wwe"]
[null,"Mobile Smart TV",2,"Mobile Smart TV (Smart Projector)",1,4,"--","--","--","--",0.6,0.8,"--","--","--","--",55,75,16,9,16,9,36,120,"--","--",60,30,"--","--","--","--","--","--","--","--","--","--","--","--","--","--","--","--","--","--","--","--","Mobile Smart TVs are mobile projectors with built-in smart TV operating systems and wireless connectivity, which enable large projected streaming video content on virtually any surface. Mobile Smart TV's are designed to accomodate medium-size screens, in a broad range of ambient lighting conditions, with high image quality.","https://www.ti.com/lit/wp/dlpa061b/dlpa061b.pdf","Click here to download the DLP Technology Mobile Projector white paper.",null,0,0.15,0,0,0,0,"--"]
[null,"Mobile Projector  (video)",3,"Mobile Projector",1,4,"--","--","--","--",0.6,0.8,"--","--","--","--",24,60,16,9,16,9,12,180,"--","--",60,20,"--","--","--","--","--","--","--","--","--","--","--","--","--","--","--","--","--","--","--","--","Mobile projectors are small enough to be taken place to place but also capable of creating big screens on virtually any surface. They typically have HDMI and/or USB-C video input and are designed to be connected to an external device such as a streaming device or game console. Mobile Projectors is a general category which can encompass a broad spectrum of use cases. This results in use-case parameter values which each cover a wide range, and conquently matches a large number of possibly DLP Chipsets.  ","https://www.ti.com/lit/sg/dlpt029/dlpt029.pdf ","Click here to download the DLP Technology Enterprise Projector white paper.",null,0,0.15,0,0,0,0,"--",null,"\"Click here to read the DLP Technology Laser TV white paper.\""]
[null,"Enterprise Data Projector / Education",4,"Enterprise Data Projector",1,4,"--","--","--","--",0.7,0.9,"--","--","--","--",24,90,16,9,16,9,12,180,"--","--",60,30,"--","--","--","--","--","--","--","--","--","--","--","--","--","--","--","--","--","--","--","--","Mobile enterprise are used primarily to project presentations and other computer-generated documents while traveling or while presenting in a temporary location. Enterprise Data Projectors are designed to accomodate a wide range of screen sizes, in a broad range of ambient lighting conditions.  When the intent is to display highly-detailed graphics, then the image quailtiy requirements are high.  When the intent is to just display text, the image quality requirements can be relaxed.","","",null,0,0.15,0,0,0,0,"--"]
[null,"Smart Display",5,"Education Projector",3,4,"--","--","--","--",0.8,0.9,"--","--","--","--",40,100,16,9,16,9,{"$f":"5*12","v":60},{"$f":"10*12","v":120},"--","--","--","--","--","--","--","--","--","--","--","--","--","--","--","--",0.5,0.82,"--","--","--","--","--","--","Education projectors are used primarily to project presentations and other computer-generated documents in classroom settings. Education Projectors are designed specifically for displaying text, on large screens, with a narrow range of viewing distances.","","",null,0,0.15,0,0,0,0,"--"]
[null,"Tablet (embedded)",6,"Smart Display",1,5,"--","--","--","--",0.5,0.5,"--","--","--","--",12,24,16,9,16,9,60,20,"--","--",60,60,"--","--","--","--","--","--","--","--","--","--","--","--","--","--","--","--","--","--","--","--","Smart displays are enabled by a combination of voice assistants and compact displays that can be located virtually anywhere in the home. A user interacts with the smart display via voice, and receives both auditory and visual feedback. Smart displays with projection can create a large screen on a nearby wall or tabletop. ","https://www.ti.com/lit/an/dlpa120/dlpa120.pdf ","Click here to download the DLP Technology Enterprise Tablet Projector white paper.","",0,0.15,0,0,0,0,"--"]
[null,"Smartphone Companion",7,"Tablet (embedded)",1,5,"--","--","--","--",0.5,0.5,"--","--","--","--",12,20,16,9,16,9,12,24,"--","--",40,15,"--","--","--","--","--","--","--","--","--","--","--","--","--","--","--","--","--","--","--","--","Tablets have limited screen sizes because of their portable nature, but an embedded projector can help them create large projected displays on virtually any surface. The embedded projector may either mirror the device’s screen, or act as a secondary display.","","","",0,0.15,0,0,0,0,"--"]
[null,"High-End Smartphone (embedded)",8,"Smartphone (embedded)",1,5,"--","--","--","--",0.5,0.5,"--","--","--","--",12,20,16,9,16,9,12,24,"--","--",40,15,"--","--","--","--","--","--","--","--","--","--","--","--","--","--","--","--","--","--","--","--","Smartphones have limited screen sizes because of their portable nature, but an embedded projector can help them create large projected displays on virtually any surface. The embedded projector may either mirror the device’s screen, or act as a secondary display.","","","",0,0.15,0,0,0,0,"--"]
[null,"AR - Notifications",9,"Smartphone Companion",1,5,"--","--","--","--",0.5,0.5,"--","--","--","--",12,20,16,9,16,9,12,24,"--","--",40,15,"--","--","--","--","--","--","--","--","--","--","--","--","--","--","--","--","--","--","--","--","Smartphone companion projectors are mobile projectors specifically designed to use smartphones as the video source. Mobility and battery power are critical requirements, and features such as wireless screen mirroring and USB-C connectivity allow for faster and easier connections to smartphones.","https://www.ti.com/lit/wp/dlpy011/dlpy011.pdf ","Click here to download the DLP Technology Smartphone Companion Projector white paper.","",1,0.15,0,0,0,0,"--"]
[null,"AR - Industrial",10,"Augmented Reality Headset","--","--","--","--",1,20,"--","--","--","--","--","--","--","--","--","--","--","--","--","--","--","--","--","--","--","--","--","--","--","--","--","--","--","--","--","--","--","--",25,17,null,null,null,null,"AR Glasses are wearable near-to-eye products that create a virtual image that is visible only to the user. Potential applications include smartphone notifications, enterprise and industrial use cases, and gaming. ","https://www.ti.com/lit/an/dlpa051a/dlpa051a.pdf","Click here to download the DLP Technology AR white paper.","",0,0.15,10,0,0,0,"--"]
[null,"AR - Gaming",11,"High-Performance Augmented Reality  ","--","--","--","--",1,50,"--","--","--","--","--","--","--","--","--","--","--","--","--","--","--","--","--","--","--","--","--","--","--","--","--","--","--","--","--","--","--","--",17,9,null,null,null,null,"High performance AR Headsets are wearable near-to-eye products that create a virtual image that is visible only to the user. High performance specifications include higher resolutions and a larger field of view.","https://www.ti.com/lit/an/dlpa051a/dlpa051a.pdf","Click here to download the DLP Technology AR white paper.","",0,0.15,50,0,0,0,"--"]
[null,"Signage",12,"Digital Signage",3,5,"--","--","--","--",0.8,0.8,"--","--","--","--",18,55,16,9,16,9,12,120,"--","--",60,60,"--","--","--","--","--","--","--","--","--","--","--","--","--","--","--","--","--","--","--","--","Digital Signage includes a wide variety of digital displays that are designed to communicate marketing, safety, and other information to people in public spaces. Projected digital signage can create visually engaging displays on virtually any surface.","https://www.ti.com/lit/wp/dlpy001a/dlpy001a.pdf ","Click here to download the DLP Technology Digital Signage white paper.","",0,0.15,0,0,0,0,"--"]
[null,"Interactive Kiosk",13,"Interactive Kiosk",2,5,"--","--","--","--",0.3,0.8,"--","--","--","--",10,55,16,9,16,9,24,24,"--","--",60,60,"--","--","--","--","--","--","--","--","--","--","--","--","--","--","--","--","--","--","--","--","Customers in retail, dining, and hospitality environments often use interactive kiosks with displays to find information, purchase tickets, or place an order. Projected interactive kiosks can enable displays on a wide variety of surfaces such as tables or walls. After use, the display can disappear or display ambient content that blends into the environment. ","","","",0,0.15,0,0,0,0,"--"]
[null,"Gaming Machines",14,"Electronic Gaming Machines",2,5,"--","--","--","--",0.8,0.8,"--","--","--","--",10,55,16,9,16,9,24,24,"--","--",60,60,"--","--","--","--","--","--","--","--","--","--","--","--","--","--","--","--","--","--","--","--","Electronic gaming machines for casinos and other entertainment venues have evolved from simple mechanical slot machines to much more complex devices with multiple displays, interactive touch screens, and lighting effects designed to attract and engage players. A projected display can enable uniquely shaped and three-dimensional effects that can take a gaming machine to the next level of player engagement.","","","",0,0.15,0,0,0,0,"--"]
[null,"Humanoids",15,"Collaborative Robots",3,4,"--","--","--","--","--","--","--","--","--","--",30,60,16,9,16,9,"--","--","--","--","--","--","--","--","--","--","--","--","--","--","--","--","--","--","--","--",25,15,"--","--","--","--","Robots designed to collaborate with humans need to communicate in a variety of ways, including audio and visual communication. A projected display can enable a few different use cases in a collaborative robot, including a rear-projected “face” and displays on floors or walls to communicate with nearby humans.","https://www.ti.com/lit/an/dlpa126/dlpa126.pdf","Click here to download the DLP Technology Collaborative Robot Projector white paper.","",0,0.15,0,0,0,0,"--"]
[null,"Appliances",16,"Appliances",1,5,"--","--","--","--",0.15,0.15,"--","--","--","--",2,8,4,1,1,1,18,36,"--","--","--","--","--","--","--","--","--","--","--","--","--","--","--","--",2,3,"--","--","--","--","--","--","Appliance displays have traditionally been limited to monochrome alphanumeric displays, like those on microwaves and ovens. Some newer appliances integrate displays with higher resolutions and full color. Appliance manufacturers seeking to differentiate their products should consider projection displays that can create an image on virtually any surface, ranging from countertops to floors.","https://www.ti.com/lit/wp/dlpc101b/dlpc101b.pdf","Click here to download the DLP Technology Appliance Projector white paper.","",0,0.15,0,0,0,0,"--"]
[null,"Toy",17,"Toy","--","--","--","--",50,300,"--","--","--","--","--","--","--","--","--","--","--","--","--","--","--","--","--","--","--","--","--","--","--","--","--","--","--","--","--","--","--","--",25,20,"--","--","--","--","Modern toys are integrating technology more than ever before, from sound and lights, to even basic displays. A low cost projection display can enable new toys with engaging use cases, from augmented reality projection onto objects and surfaces, to basic children’s movie projection.","","","",0,0.15,0,0,0,0,"--"]
[null,"Other",18,"Other","--","--","--","--","--","--","--","--","--","--","--","--","--","--","--","--","--","--","--","--","--","--","--","--","--","--","--","--","--","--","--","--","--","--","--","--","--","--","--","--","--","--","--","--","If you have a product concept that doesn’t fit into one of these categories, please feel free to adjust the projection display requirements to find the right DLP Pico chipset for your application.","","","",0,0.15,0,0,0,0,"--"]
[null,null,19,"[19]","--","--","--","--","--","--","--","--","--","--","--","--","--","--","--","--","--","--","--","--","--","--","--","--","--","--","--","--","--","--","--","--","--","--","--","--","--","--","--","--","--","--","--","--",null,null,null,null,0,0.15,0,0,0,0,"--"]
[null,null,20,"[20]","--","--","--","--","--","--","--","--","--","--","--","--","--","--","--","--","--","--","--","--","--","--","--","--","--","--","--","--","--","--","--","--","--","--","--","--","--","--","--","--","--","--","--","--",null,null,null,null,0,0.15,0,0,0,0,"--"]
[null,null,21,"[21]","--","--","--","--","--","--","--","--","--","--","--","--","--","--","--","--","--","--","--","--","--","--","--","--","--","--","--","--","--","--","--","--","--","--","--","--","--","--","--","--","--","--","--","--",null,null,null,null,0,0.15,0,0,0,0,"--"]
[null,null,22,"[22]","--","--","--","--","--","--","--","--","--","--","--","--","--","--","--","--","--","--","--","--","--","--","--","--","--","--","--","--","--","--","--","--","--","--","--","--","--","--","--","--","--","--","--","--",null,null,null,null,0,0.15,0,0,0,0,"--"]
[null,null,23,"[23]","--","--","--","--","--","--","--","--","--","--","--","--","--","--","--","--","--","--","--","--","--","--","--","--","--","--","--","--","--","--","--","--","--","--","--","--","--","--","--","--","--","--","--","--",null,null,null,null,0,0.15,0,0,0,0,"--"]
[null,null,24,"[24]","--","--","--","--","--","--","--","--","--","--","--","--","--","--","--","--","--","--","--","--","--","--","--","--","--","--","--","--","--","--","--","--","--","--","--","--","--","--","--","--","--","--","--","--",null,null,null,null,0,0.15,0,0,0,0,"--"]
[null,null,25,"[25]",1,2,3,4,5,6,7,8,9,10,11,12,13,14,15,16,17,18,19,20,21,22,23,24,25,26,27,28,29,30,31,32,33,34,35,36,37,38,39,40,41,42,43,44,45,46,47,null,0,0.19,0.5,0.51,0.52,0.53,54]

{"sheet":"Target","index":9,"n_rows":498,"n_cols":71,"rows_kept":498,"cut":false,"hidden":true,"merged":[[250,27,250,30],[245,26,245,31],[248,26,248,31],[251,26,251,31],[307,17,308,46],[250,35,250,38],[251,34,251,39],[314,38,314,42],[313,32,313,34],[314,31,314,35],[292,13,293,48],[313,39,313,41],[313,42,313,43],[248,34,248,39],[245,34,245,39],[375,61,375,63],[376,61,376,63],[373,61,373,63],[371,61,371,63],[372,61,372,63],[343,17,344,46],[350,38,350,42],[349,39,349,41],[368,18,368,19],[346,31,346,36],[346,38,346,43],[369,38,369,42],[368,39,368,41],[350,31,350,35],[349,32,349,34],[369,31,369,35],[364,62,364,64],[367,62,367,64],[244,27,244,30],[367,65,367,66],[367,67,367,68],[367,69,367,70],[250,67,250,68],[244,69,244,70],[244,67,244,68],[247,69,247,70],[247,62,247,64],[247,65,247,66],[247,67,247,68],[313,65,313,66],[244,65,244,66],[313,62,313,64],[244,62,244,64],[250,69,250,70],[250,62,250,64],[250,65,250,66],[313,69,313,70],[313,67,313,68],[364,65,364,66],[364,67,364,68],[364,69,364,70],[247,27,247,30],[110,34,110,38],[110,26,110,30],[238,13,239,48],[241,26,241,32],[218,41,218,43],[226,16,226,21],[226,22,226,34],[226,35,226,37],[226,38,226,40],[226,41,226,43],[226,44,226,45],[187,41,187,43],[188,41,188,43],[189,41,189,43],[206,41,206,43],[207,41,207,43],[190,41,190,43],[191,41,191,43],[180,41,180,43],[181,38,181,40],[140,27,140,28],[174,41,174,43],[114,34,114,37],[141,26,141,29],[61,22,61,25],[76,26,76,30],[39,17,40,46],[60,22,60,25],[57,26,57,41],[58,22,58,25],[76,34,76,38],[56,26,56,41],[58,26,58,41],[42,26,42,30],[42,34,42,38],[60,26,60,41],[61,26,61,41],[73,17,74,46],[7,45,7,49],[12,11,13,49],[71,14,72,15],[7,12,7,19],[7,22,7,33],[7,36,7,43],[8,12,8,15],[8,16,8,19],[8,22,8,33],[8,36,8,39],[8,40,8,43],[8,45,8,49],[56,22,56,25],[57,22,57,25],[59,22,59,25],[59,26,59,41],[23,13,24,48],[9,45,9,49],[9,12,9,15],[9,16,9,19],[9,22,9,33],[64,19,64,44],[9,36,9,39],[9,40,9,43],[79,37,79,38],[92,31,92,35],[79,27,79,28],[137,26,137,30],[137,34,137,38],[80,26,80,29],[107,17,108,46],[86,31,86,40],[95,31,95,35],[134,13,135,48],[79,35,79,36],[79,29,79,30],[80,34,80,37],[105,14,106,15],[114,26,114,29],[90,26,90,30],[90,31,90,35],[91,31,91,35],[94,31,94,35],[93,31,93,35],[99,19,99,44],[91,26,91,30],[113,27,113,28],[113,35,113,36],[468,14,469,15],[410,14,411,15],[412,17,413,46],[415,35,415,44],[463,17,463,46],[464,17,464,46],[406,17,406,46],[208,41,208,43],[209,41,209,43],[210,41,210,43],[244,35,244,38],[247,35,247,38],[241,34,241,40],[211,41,211,43],[212,41,212,43],[213,41,213,43],[214,41,214,43],[385,18,385,19],[385,32,385,34],[385,39,385,41],[386,32,386,34],[386,39,386,41],[310,31,310,36],[310,38,310,43],[140,35,140,36],[164,35,164,37],[165,35,165,37],[166,35,166,37],[167,35,167,37],[168,35,168,37],[154,22,154,34],[155,22,155,34],[161,38,161,40],[163,35,163,37],[141,34,141,37],[156,38,156,40],[157,38,157,40],[158,38,158,40],[159,38,159,40],[160,38,160,40],[220,41,220,43],[169,41,169,43],[170,41,170,43],[171,41,171,43],[172,41,172,43],[173,41,173,43],[204,41,204,43],[205,41,205,43],[183,41,183,43],[219,41,219,43],[181,41,181,43],[182,41,182,43],[176,41,176,43],[177,41,177,43],[178,41,178,43],[179,41,179,43],[175,41,175,43],[199,41,199,43],[200,41,200,43],[201,41,201,43],[202,41,202,43],[203,41,203,43],[196,41,196,43],[197,41,197,43],[497,38,497,49],[470,17,471,46],[415,20,415,29],[475,34,475,36],[477,28,477,31],[477,23,477,26],[316,39,316,41],[316,32,316,34],[477,38,477,41],[475,28,475,30],[473,24,473,30],[476,24,476,26],[475,24,475,26],[477,33,477,36],[476,28,476,30],[473,34,473,40],[341,17,341,46],[316,18,316,19],[317,31,317,35],[317,38,317,42],[475,38,475,40],[476,34,476,36],[476,38,476,40],[368,32,368,34],[198,41,198,43],[210,38,210,40],[205,38,205,40],[206,38,206,40],[207,38,207,40],[208,38,208,40],[209,38,209,40],[196,38,196,40],[197,38,197,40],[225,38,225,40],[211,38,211,40],[212,38,212,40],[213,38,213,40],[222,38,222,40],[223,38,223,40],[164,41,164,43],[217,41,217,43],[182,38,182,40],[189,38,189,40],[190,38,190,40],[214,38,214,40],[215,38,215,40],[216,38,216,40],[200,38,200,40],[201,38,201,40],[195,38,195,40],[198,38,198,40],[199,38,199,40],[191,38,191,40],[215,41,215,43],[216,41,216,43],[192,41,192,43],[193,41,193,43],[194,41,194,43],[184,41,184,43],[185,41,185,43],[186,41,186,43],[195,41,195,43],[184,38,184,40],[162,38,162,40],[156,41,156,43],[157,41,157,43],[158,41,158,43],[159,41,159,43],[160,41,160,43],[161,41,161,43],[162,41,162,43],[163,41,163,43],[173,38,173,40],[174,38,174,40],[165,41,165,43],[166,41,166,43],[167,41,167,43],[168,41,168,43],[221,41,221,43],[222,41,222,43],[223,41,223,43],[225,41,225,43],[163,38,163,40],[164,38,164,40],[165,38,165,40],[166,38,166,40],[167,38,167,40],[168,38,168,40],[169,38,169,40],[170,38,170,40],[171,38,171,40],[172,38,172,40],[217,38,217,40],[180,38,180,40],[186,38,186,40],[187,38,187,40],[188,38,188,40],[183,38,183,40],[219,38,219,40],[202,38,202,40],[203,38,203,40],[204,38,204,40],[181,35,181,37],[182,35,182,37],[174,35,174,37],[179,35,179,37],[180,35,180,37],[179,38,179,40],[192,38,192,40],[193,38,193,40],[194,38,194,40],[185,38,185,40],[183,35,183,37],[184,35,184,37],[185,35,185,37],[186,35,186,37],[187,35,187,37],[188,35,188,37],[189,35,189,37],[190,35,190,37],[191,35,191,37],[169,35,169,37],[170,35,170,37],[171,35,171,37],[172,35,172,37],[173,35,173,37],[225,35,225,37],[156,22,156,34],[157,22,157,34],[158,22,158,34],[159,22,159,34],[160,22,160,34],[161,22,161,34],[162,22,162,34],[163,22,163,34],[164,22,164,34],[165,22,165,34],[166,22,166,34],[167,22,167,34],[168,22,168,34],[169,22,169,34],[208,35,208,37],[209,35,209,37],[214,35,214,37],[217,35,217,37],[199,35,199,37],[200,35,200,37],[201,35,201,37],[202,35,202,37],[198,22,198,34],[191,22,191,34],[192,22,192,34],[218,35,218,37],[219,35,219,37],[218,22,218,34],[193,22,193,34],[194,22,194,34],[195,22,195,34],[199,22,199,34],[200,22,200,34],[192,35,192,37],[193,35,193,37],[194,35,194,37],[195,35,195,37],[196,35,196,37],[197,35,197,37],[198,35,198,37],[220,35,220,37],[221,35,221,37],[222,35,222,37],[203,35,203,37],[204,35,204,37],[205,35,205,37],[206,35,206,37],[207,35,207,37],[215,35,215,37],[216,35,216,37],[210,35,210,37],[211,35,211,37],[212,35,212,37],[213,35,213,37],[183,22,183,34],[184,22,184,34],[185,22,185,34],[186,22,186,34],[170,22,170,34],[171,22,171,34],[172,22,172,34],[173,22,173,34],[174,22,174,34],[175,22,175,34],[176,22,176,34],[177,22,177,34],[178,22,178,34],[225,22,225,34],[156,16,156,21],[157,16,157,21],[158,16,158,21],[159,16,159,21],[160,16,160,21],[161,16,161,21],[162,16,162,21],[163,16,163,21],[164,16,164,21],[165,16,165,21],[166,16,166,21],[167,16,167,21],[168,16,168,21],[169,16,169,21],[170,16,170,21],[171,16,171,21],[208,16,208,21],[209,16,209,21],[194,16,194,21],[195,16,195,21],[219,16,219,21],[181,16,181,21],[219,22,219,34],[222,22,222,34],[217,22,217,34],[197,22,197,34],[201,22,201,34],[202,22,202,34],[203,22,203,34],[204,22,204,34],[205,22,205,34],[206,22,206,34],[207,22,207,34],[208,22,208,34],[209,22,209,34],[193,16,193,21],[225,16,225,21],[153,16,153,21],[153,22,153,34],[210,16,210,21],[211,16,211,21],[212,16,212,21],[213,16,213,21],[214,16,214,21],[215,16,215,21],[216,16,216,21],[217,16,217,21],[218,16,218,21],[201,16,201,21],[202,16,202,21],[203,16,203,21],[204,16,204,21],[205,16,205,21],[206,16,206,21],[207,16,207,21],[154,16,154,21],[155,16,155,21],[175,16,175,21],[180,16,180,21],[178,16,178,21],[179,16,179,21],[172,16,172,21],[173,16,173,21],[174,16,174,21],[187,22,187,34],[188,22,188,34],[189,22,189,34],[190,22,190,34],[176,16,176,21],[177,16,177,21],[182,16,182,21],[183,16,183,21],[184,16,184,21],[185,16,185,21],[186,16,186,21],[187,16,187,21],[188,16,188,21],[189,16,189,21],[190,16,190,21],[179,22,179,34],[180,22,180,34],[181,22,181,34],[182,22,182,34],[158,44,158,45],[154,41,154,43],[155,41,155,43],[154,38,154,40],[155,38,155,40],[154,35,154,37],[155,35,155,37],[177,44,177,45],[178,44,178,45],[177,35,177,37],[178,35,178,37],[178,38,178,40],[156,35,156,37],[157,35,157,37],[158,35,158,37],[159,35,159,37],[160,35,160,37],[161,35,161,37],[162,35,162,37],[175,35,175,37],[176,35,176,37],[176,38,176,40],[177,38,177,40],[175,38,175,40],[179,44,179,45],[162,44,162,45],[160,44,160,45],[161,44,161,45],[159,44,159,45],[156,44,156,45],[157,44,157,45],[224,16,224,21],[224,22,224,34],[224,35,224,37],[224,38,224,40],[224,41,224,43],[224,44,224,45],[214,44,214,45],[215,44,215,45],[216,44,216,45],[217,44,217,45],[218,44,218,45],[219,44,219,45],[220,44,220,45],[221,44,221,45],[222,44,222,45],[220,16,220,21],[223,16,223,21],[181,44,181,45],[182,44,182,45],[183,44,183,45],[184,44,184,45],[185,44,185,45],[189,44,189,45],[223,44,223,45],[212,44,212,45],[213,44,213,45],[196,44,196,45],[197,44,197,45],[198,44,198,45],[199,44,199,45],[200,44,200,45],[201,44,201,45],[202,44,202,45],[203,44,203,45],[204,44,204,45],[208,44,208,45],[209,44,209,45],[210,44,210,45],[211,44,211,45],[186,44,186,45],[187,44,187,45],[175,76,175,79],[150,16,150,21],[150,22,150,34],[150,35,150,37],[150,38,150,40],[150,41,150,43],[150,44,150,45],[163,44,163,45],[164,44,164,45],[165,44,165,45],[166,44,166,45],[167,44,167,45],[168,44,168,45],[169,44,169,45],[170,44,170,45],[153,35,153,37],[153,38,153,40],[153,41,153,43],[153,44,153,45],[154,44,154,45],[171,44,171,45],[172,44,172,45],[173,44,173,45],[174,44,174,45],[493,12,493,26],[190,44,190,45],[191,44,191,45],[192,44,192,45],[188,44,188,45],[225,44,225,45],[205,44,205,45],[206,44,206,45],[207,44,207,45],[193,44,193,45],[194,44,194,45],[195,44,195,45],[214,22,214,34],[215,22,215,34],[216,22,216,34],[221,16,221,21],[222,16,222,21],[196,16,196,21],[197,16,197,21],[198,16,198,21],[199,16,199,21],[200,16,200,21],[191,16,191,21],[192,16,192,21],[175,44,175,45],[176,44,176,45],[155,44,155,45],[180,44,180,45],[253,38,253,40],[253,34,253,36],[253,30,253,32],[253,26,253,28],[92,26,92,30],[93,26,93,30],[94,26,94,30],[95,26,95,30],[223,22,223,34],[220,22,220,34],[221,22,221,34],[223,35,223,37],[220,38,220,40],[218,38,218,40],[221,38,221,40],[196,22,196,34],[210,22,210,34],[211,22,211,34],[212,22,212,34],[213,22,213,34]]}
[]
[null,null,"qwe89+"]
[null,null,"SaveParametersButton",null,null,null,null,null,null,null,null,null,null,null,null,null,null,null,null,null,null,null,null,null,null,null,null,null,null,null,null,null,null,null,null,null,null,null,null,null,null,null,null,null,null,null,null,null,null,null,null,null,null,null,null,null,null,null,null,null,null,null,null,null,null,null,null,null,"Somehow specify that all Pico chips are <= 0.47 in diag"]
[]
[null,null,null,null,null,null,null,null,null,null,null,null,null,null,null,null,null,null,null,null,null,null,null,null,null,null,null,null,null,null,null,null,null,null,null,null,null,null,null,null,null,null,null,null,null,null,null,null,null,null,null,null,null,null,null,null,null,null,null,null,null,null,null,null,null,null,null,null,null,"Somehow make it clear that this page only needs to be filled out if users do not agree with application defaults"]
[]
[null,null,null,null,null,null,null,null,null,null,null,null,null,null,null,null,null,null,null,null,null,null,null,null,null,null,null,null,null,null,null,null,null,null,null,null,null,null,null,null,null,null,null,null,null,null,null,null,null,null,null,null,null,{"$f":"ROW(BB7)","v":7}]
[null,null,null,null,null,null,null,null,null,null,null,null,"Resolution",null,null,null,null,null,null,null,null,null,"Image Size",null,null,null,null,null,null,null,null,null,null,null,null,null,"Brightness",null,null,null,null,null,null,null,null,"# of Matching"]
[null,null,null,null,null,null,null,null,null,null,null,"Max:",{"$f":"Display_ResolutionSimple_Max","v":"-- x --"},null,null,null,{"$f":"Display_Mpx_Max","v":"-- Mpx"},null,null,null,null,"Max:",{"$f":"CONCATENATE( \"W: \", Display_ImageWidth_Max, \"  x   H: \", Display_ImageHeight_Max, \"   ( D: \", Display_ImageDiag_Max, \" )\"  )","v":"W: -- in  x   H: -- in   ( D: -- in )"},null,null,null,null,null,null,null,null,null,null,null,null,"Max:",{"$f":"Display_Lumens_Max","v":"-- lm"},null,null,null,{"$f":"Display_Nits_Max","v":"-- nits"},null,null,null,null,"Chipsets"]
[null,null,null,null,null,null,null,null,null,null,null,"Min:",{"$f":"Display_ResolutionSimple_Min","v":"-- x --"},null,null,null,{"$f":"Display_Mpx_Min","v":"-- Mpx"},null,null,null,null,"Min:",{"$f":"CONCATENATE( \"W: \", Display_ImageWidth_Min, \"  x   H: \", Display_ImageHeight_Min, \"   ( D: \", Display_ImageDiag_Min, \" )\"  )","v":"W: -- in  x   H: -- in   ( D: -- in )"},null,null,null,null,null,null,null,null,null,null,null,null,"Min:",{"$f":"Display_Lumens_Min","v":"-- lm"},null,null,null,{"$f":"Display_Nits_Min","v":"-- nits"},null,null,null,null,{"$f":"Index_Chipset_Max","v":0}]
[null,null,null,null,null,null,null,null,null,null,null,null,null,null,null,null,null,null,null,null,null,null,null,null,null,null,null,null,null,null,null,null,null,null,null,null,null,null,null,null,null,null,null,null,null,null,null,null,null,null,null,null,null,{"$f":"ROW(BB11)","v":11}]
[null,null,null,null,null,null,null,null,null,null,null,null,null,null,null,null,null,null,null,null,null,null,null,null,null,null,null,null,null,null,null,null,null,null,null,null,null,null,null,null,null,null,null,null,null,null,null,null,null,null,null,null,null,null,null,null,null,null,null,null,null,null,null,null,null,null,null,null,"Make info buttons more visible"]
[null,null,null,null,null,null,null,null,null,null,null,"Customized Application Use-Case Parameters",null,null,null,null,null,null,null,null,null,null,null,null,null,null,null,null,null,null,null,null,null,null,null,null,null,null,null,null,null,null,null,null,null,null,null,null,null,null,null,null,null,null,null,null,null,null,null,null,null,null,null,null,null,null,null,null,"Use bolder text throughout the entire program"]
[]
[]
[null,null,null,null,null,null,null,null,null,null,null,null,"Follow the steps below to customize the Application Use-Case Parameters."]
[]
[null,null,null,null,null,null,null,null,null,null,null,null,null,"Refer to the \"Detailed Inputs\" section of the \"Parameter Summary\" screen to see how the custom parameters are being applied."]
[]
[]
[]
[]
[]
[null,null,null,null,null,null,null,null,null,null,null,null,null,"Select ONE of the following … ",null,null,null,null,null,null,null,null,null,null,null,null,null,null,null,null,null,null,null,null,null,null,null,null,null,null,null,null,null,null,null,null,null,null,null,null,null,null,null,{"$f":"ROW(BB24)","v":24}]
[]
[]
[null,null,null,null,null,null,null,null,null,null,null,null,null,null,null,null,null,null,"If you know the luminous intensity your device must emit, select Projected Lumens"]
[]
[null,null,null,null,null,null,null,null,null,null,null,null,null,null,null,null,null,null,"If you know the required brightness of your projection surface, select Image Nits"]
[]
[null,null,null,null,null,null,null,null,null,null,null,null,null,null,null,null,null,null,"   If you know the typical outside light levels the projection surface will be exposed to, "]
[null,null,null,null,null,null,null,null,null,null,null,null,null,null,null,null,null,null,"select Ambient Light Level"]
[]
[null,null,null,null,null,null,null,null,null,null,null,null,null,null,null,null,null,null,"Otherwise, continue to step 2 in order to use TI’s suggested default values"]
[]
[]
[null,null,null,null,null,null,null,null,null,null,null,null,null,null,null,null,null,null,null,null,null,null,null,null,null,null,null,null,null,null,null,null,null,null,null,null,null,null,null,null,null,null,null,null,null,null,null,null,null,null,null,null,null,null,{"$f":"ROW(BC37)","v":37}]
[]
[null,null,null,null,null,null,null,null,null,null,null,null,null,null,null,null,null,null,null,null,null,null,null,null,null,null,null,null,null,null,null,null,null,null,null,null,null,null,null,null,null,null,null,null,null,null,null,null,null,null,null,null,null,null,{"$f":"ROW(BC39)","v":39}]
[null,null,null,null,null,null,null,null,null,null,null,null,null,null,null,null,null,"Select the minimum and maximum Ambient Light Levels that this product will be used in …",null,null,null,null,null,null,null,null,null,null,null,null,null,null,null,null,null,null,null,null,null,null,null,null,null,null,null,null,null,null,null,null,null,null,null,null,{"$f":"ROW(BC40)","v":40}]
[]
[]
[null,null,null,null,null,null,null,null,null,null,null,null,null,null,null,null,null,null,null,null,null,null,null,null,null,null,"Minimum",null,null,null,null,null,null,null,"Maximum"]
[]
[null,null,null,null,null,null,null,null,null,null,null,null,null,null,null,null,null,null,null,"Ambient Light Level",null,null,null,null,null,null,null,null,null,null,null,null,null,null,null,null,null,null,null,null,null,null,null,null,null,null,null,null,null,null,null,null,null,null,null,null,null,null,null,null,null,0,null,null,0]
[null,null,null,null,null,null,null,null,null,null,null,null,null,null,null,null,null,null,null,null,null,null,null,null,null,null,"<<",null,"Dark",null,null,">>",null,null,"<<",null,"Dark",null,null,">>",null,null,null,null,null,null,null,null,null,null,null,null,null,null,null,null,null,null,null,null,null,null,1,null,null,1,null,null,{"$f":"IF( AppDef_AmbientIndex_Min = BK46, 1, 0 )","v":0},null,{"$f":"IF( AppDef_AmbientIndex_Max = BN46, 1, 0 )","v":0}]
[null,null,null,null,null,null,null,null,null,null,null,null,null,null,null,null,null,null,null,null,null,null,null,null,null,null,"<<",null,"Dim",null,null,">>",null,null,"<<",null,"Dim",null,null,">>",null,null,null,null,null,null,null,null,null,null,null,null,null,null,null,null,null,null,null,null,null,null,2,null,null,2,null,null,{"$f":"IF( AppDef_AmbientIndex_Min = BK47, 1, 0 )","v":0},null,{"$f":"IF( AppDef_AmbientIndex_Max = BN47, 1, 0 )","v":0}]
[null,null,null,null,null,null,null,null,null,null,null,null,null,null,null,null,null,null,null,null,null,null,null,null,null,null,"<<",null,"Moderate",null,null,">>",null,null,"<<",null,"Moderate",null,null,">>",null,null,null,null,null,null,null,null,null,null,null,null,null,null,null,null,null,null,null,null,null,null,3,null,null,3,null,null,{"$f":"IF( AppDef_AmbientIndex_Min = BK48, 1, 0 )","v":0},null,{"$f":"IF( AppDef_AmbientIndex_Max = BN48, 1, 0 )","v":0}]
[null,null,null,null,null,null,null,null,null,null,null,null,null,null,null,null,null,null,null,null,null,null,null,null,null,null,"<<",null,"Bright",null,null,">>",null,null,"<<",null,"Bright",null,null,">>",null,null,null,null,null,null,null,null,null,null,null,null,null,null,null,null,null,null,null,null,null,null,4,null,null,4,null,null,{"$f":"IF( AppDef_AmbientIndex_Min = BK49, 1, 0 )","v":0},null,{"$f":"IF( AppDef_AmbientIndex_Max = BN49, 1, 0 )","v":0}]
[null,null,null,null,null,null,null,null,null,null,null,null,null,null,null,null,null,null,null,null,null,null,null,null,null,null,"<<",null,"Outside",null,null,">>",null,null,"<<",null,"Outside",null,null,">>",null,null,null,null,null,null,null,null,null,null,null,null,null,null,null,null,null,null,null,null,null,null,5,null,null,5,null,null,{"$f":"IF( AppDef_AmbientIndex_Min = BK50, 1, 0 )","v":0},null,{"$f":"IF( AppDef_AmbientIndex_Max = BN50, 1, 0 )","v":0}]
[]
[]
[null,null,null,null,null,null,null,null,null,null,null,null,null,null,null,null,null,null,null,null,null,null,null,null,null,null,null,null,null,null,null,null,null,null,null,null,null,null,null,null,null,null,null,null,null,null,null,null,null,null,null,null,null,null,null,{"$f":"ROW(BD53)","v":53}]
[]
[null,null,null,null,null,null,null,null,null,null,null,null,null,null,null,null,null,null,null,"The brighter the ambient light level, the brighter the projected image must be in order to be visible."]
[]
[null,null,null,null,null,null,null,null,null,null,null,null,null,null,null,null,null,null,null,null,null,null,"Light Level",null,null,null,"Description"]
[null,null,null,null,null,null,null,null,null,null,null,null,null,null,null,null,null,null,null,null,null,null,"Dark",null,null,null,"A room at night, with all lights turned off."]
[null,null,null,null,null,null,null,null,null,null,null,null,null,null,null,null,null,null,null,null,null,null,"Dim",null,null,null,"A room at night, with soft lighting."]
[null,null,null,null,null,null,null,null,null,null,null,null,null,null,null,null,null,null,null,null,null,null,"Moderate",null,null,null,"A well-lit office conference room, with no daylight."]
[null,null,null,null,null,null,null,null,null,null,null,null,null,null,null,null,null,null,null,null,null,null,"Bright",null,null,null,"A well-lit office conference room, with indirect daylight."]
[null,null,null,null,null,null,null,null,null,null,null,null,null,null,null,null,null,null,null,null,null,null,"Outside",null,null,null,"Outdoors, with indirect sunlight."]
[]
[null,null,null,null,null,null,null,null,null,null,null,null,null,null,null,null,null,null,null,"Further details can be found in the following application note: "]
[null,null,null,null,null,null,null,null,null,null,null,null,null,null,null,null,null,null,null,"\"TI DLP® System Design: Brightness Requirements and Tradeoffs\""]
[]
[]
[null,null,null,null,null,null,null,null,null,null,null,null,null,null,null,null,null,null,null,null,null,null,null,null,null,null,null,null,null,null,null,null,null,null,null,null,null,null,null,null,null,null,null,null,null,null,null,null,null,null,null,null,null,null,null,{"$f":"ROW(BD68)","v":68}]
[]
[null,null,null,null,null,null,null,null,null,null,null,null,null,null,null,null,null,null,null,null,null,null,null,null,null,null,null,null,null,null,null,null,null,null,null,null,null,null,null,null,null,null,null,null,null,null,null,null,null,null,null,null,null,null,{"$f":"ROW(BC70)","v":70}]
[]
[null,null,null,null,null,null,null,null,null,null,null,null,null,null,"OR …",null,null,null,null,null,null,null,null,null,null,null,null,null,null,null,null,null,null,null,null,null,null,null,null,null,null,null,null,null,null,null,null,null,null,null,null,null,null,null,{"$f":"ROW(BC72)","v":72}]
[null,null,null,null,null,null,null,null,null,null,null,null,null,null,null,null,null,null,null,null,null,null,null,null,null,null,null,null,null,null,null,null,null,null,null,null,null,null,null,null,null,null,null,null,null,null,null,null,null,null,null,null,null,null,{"$f":"ROW(BC73)","v":73}]
[null,null,null,null,null,null,null,null,null,null,null,null,null,null,null,null,null,"Enter the minimum and maximum Image Nits that this application requires …",null,null,null,null,null,null,null,null,null,null,null,null,null,null,null,null,null,null,null,null,null,null,null,null,null,null,null,null,null,null,null,null,null,null,null,null,{"$f":"ROW(BC74)","v":74}]
[]
[]
[null,null,null,null,null,null,null,null,null,null,null,null,null,null,null,null,null,null,null,null,null,null,null,null,null,null,"Minimum",null,null,null,null,null,null,null,"Maximum"]
[]
[]
[null,null,null,null,null,null,null,null,null,null,null,null,null,null,null,null,null,null,null,"Image Nits",null,null,null,null,null,null,null,null,null,"nits",null,null,null,null,null,null,null,"nits",null,null,null,null,null,null,null,null,null,null,null,null,null,null,null,null,null,null,null,null,null,null,null,{"$f":"IF(AB80>0, 1, 0 )","v":0},null,{"$f":"IF(AJ80>0, 1, 0 )","v":0}]
[null,null,null,null,null,null,null,null,null,null,null,null,null,null,null,null,null,null,null,null,null,null,null,null,null,null,{"$f":" IF( ISNUMBER(AppDef_Nits_Min),  CONCATENATE( \"  <<   \", AppDef_Nits_Min, \"   >>\"), \"\" )","v":""},null,null,null,null,null,null,null,{"$f":" IF( ISNUMBER(AppDef_Nits_Max),  CONCATENATE( \"  <<   \", AppDef_Nits_Max, \"   >>\"), \"\" )","v":""}]
[]
[null,null,null,null,null,null,null,null,null,null,null,null,null,null,null,null,null,null,null,null,null,null,null,null,null,null,null,null,null,null,null,null,null,null,null,null,null,null,null,null,null,null,null,null,null,null,null,null,null,null,null,null,null,null,null,{"$f":"ROW(BD83)","v":83}]
[null,null,null,null,null,null,null,null,null,null,null,null,null,null,null,null,null,null,null,"\"Nits\" are a unit of measurement for luminance, and are equal to candela/meter2, and "]
[null,null,null,null,null,null,null,null,null,null,null,null,null,null,null,null,null,null,null,"lumens / ( steradian * meter2). They are used to measure the exact brightness of the "]
[null,null,null,null,null,null,null,null,null,null,null,null,null,null,null,null,null,null,null,"projection your device will produce."]
[]
[null,null,null,null,null,null,null,null,null,null,null,null,null,null,null,null,null,null,null,"Based upon experimental data, TI has determined the minimum image brightness (expressed"]
[null,null,null,null,null,null,null,null,null,null,null,null,null,null,null,null,null,null,null,"in nits) that is required, across a variety of ambient light conditions (as shown in the table below)."]
[]
[null,null,null,null,null,null,null,null,null,null,null,null,null,null,null,null,null,null,null,null,null,null,null,null,null,null,"Light Level",null,null,null,null,"Min Image Nits"]
[null,null,null,null,null,null,null,null,null,null,null,null,null,null,null,null,null,null,null,null,null,null,null,null,null,null,"Dark",null,null,null,null,50]
[null,null,null,null,null,null,null,null,null,null,null,null,null,null,null,null,null,null,null,null,null,null,null,null,null,null,"Dim",null,null,null,null,100]
[null,null,null,null,null,null,null,null,null,null,null,null,null,null,null,null,null,null,null,null,null,null,null,null,null,null,"Moderate",null,null,null,null,200]
[null,null,null,null,null,null,null,null,null,null,null,null,null,null,null,null,null,null,null,null,null,null,null,null,null,null,"Bright",null,null,null,null,300]
[null,null,null,null,null,null,null,null,null,null,null,null,null,null,null,null,null,null,null,null,null,null,null,null,null,null,"Outside",null,null,null,null,600]
[]
[]
[null,null,null,null,null,null,null,null,null,null,null,null,null,null,null,null,null,null,null,"Further details can be found in the following application note: "]
[null,null,null,null,null,null,null,null,null,null,null,null,null,null,null,null,null,null,null,"\"TI DLP® System Design: Brightness Requirements and Tradeoffs\""]
[]
[]
[null,null,null,null,null,null,null,null,null,null,null,null,null,null,null,null,null,null,null,null,null,null,null,null,null,null,null,null,null,null,null,null,null,null,null,null,null,null,null,null,null,null,null,null,null,null,null,null,null,null,null,null,null,null,null,{"$f":"ROW(BD103)","v":103}]
[null,null,null,null,null,null,null,null,null,null,null,null,null,null,null,null,null,null,null,null,null,null,null,null,null,null,null,null,null,null,null,null,null,null,null,null,null,null,null,null,null,null,null,null,null,null,null,null,null,null,null,null,null,null,{"$f":"ROW(BC104)","v":104}]
[]
[null,null,null,null,null,null,null,null,null,null,null,null,null,null,"OR …",null,null,null,null,null,null,null,null,null,null,null,null,null,null,null,null,null,null,null,null,null,null,null,null,null,null,null,null,null,null,null,null,null,null,null,null,null,null,null,{"$f":"ROW(BC106)","v":106}]
[null,null,null,null,null,null,null,null,null,null,null,null,null,null,null,null,null,null,null,null,null,null,null,null,null,null,null,null,null,null,null,null,null,null,null,null,null,null,null,null,null,null,null,null,null,null,null,null,null,null,null,null,null,null,{"$f":"ROW(BC107)","v":107}]
[null,null,null,null,null,null,null,null,null,null,null,null,null,null,null,null,null,"Enter the minimum and maximum Projector Output Lumens that this application requires …",null,null,null,null,null,null,null,null,null,null,null,null,null,null,null,null,null,null,null,null,null,null,null,null,null,null,null,null,null,null,null,null,null,null,null,null,{"$f":"ROW(BC108)","v":108}]
[]
[]
[null,null,null,null,null,null,null,null,null,null,null,null,null,null,null,null,null,null,null,null,null,null,null,null,null,null,"Minimum",null,null,null,null,null,null,null,"Maximum"]
[]
[]
[null,null,null,null,null,null,null,null,null,null,null,null,null,null,null,null,null,null,null,"Projected Lumens",null,null,null,null,null,null,null,null,null,"lm",null,null,null,null,null,null,null,"lm"]
[null,null,null,null,null,null,null,null,null,null,null,null,null,null,null,null,null,null,null,null,null,null,null,null,null,null,{"$f":" IF( ISNUMBER(AppDef_Lumens_Min),  CONCATENATE( \"  <<   \", AppDef_Lumens_Min, \"   >>\"), \"\" )","v":""},null,null,null,null,null,null,null,{"$f":" IF( ISNUMBER(AppDef_Lumens_Max),  CONCATENATE( \"  <<   \", AppDef_Lumens_Max, \"   >>\"), \"\" )","v":""}]
[]
[null,null,null,null,null,null,null,null,null,null,null,null,null,null,null,null,null,null,null,null,null,null,null,null,null,null,null,null,null,null,null,null,null,null,null,null,null,null,null,null,null,null,null,null,null,null,null,null,null,null,null,null,null,null,null,{"$f":"ROW(BD117)","v":117}]
[]
[null,null,null,null,null,null,null,null,null,null,null,null,null,null,null,null,null,null,null,"Lumens  (abbreviated \"lm\") are a measure of luminance, which is \"luminous intensity per unit area\"."]
[null,null,null,null,null,null,null,null,null,null,null,null,null,null,null,null,null,null,null,"They are used the measure the amount of light leaving your projector at any given instant."]
[]
[null,null,null,null,null,null,null,null,null,null,null,null,null,null,null,null,null,null,null,"Note that on-screen lumens is a function of many factors, including:"]
[]
[null,null,null,null,null,null,null,null,null,null,null,null,null,null,null,null,null,null,null,null,"1)  Illumination light source capability"]
[null,null,null,null,null,null,null,null,null,null,null,null,null,null,null,null,null,null,null,null,"2)  Projector optical efficiency"]
[null,null,null,null,null,null,null,null,null,null,null,null,null,null,null,null,null,null,null,null,"3)  Projector white point"]
[null,null,null,null,null,null,null,null,null,null,null,null,null,null,null,null,null,null,null,null,"4)  DLP Controller software configuration"]
[null,null,null,null,null,null,null,null,null,null,null,null,null,null,null,null,null,null,null,null,"5)  Maximum DMD operating temperature"]
[]
[]
[null,null,null,null,null,null,null,null,null,null,null,null,null,null,null,null,null,null,null,null,null,null,null,null,null,null,null,null,null,null,null,null,null,null,null,null,null,null,null,null,null,null,null,null,null,null,null,null,null,null,null,null,null,null,null,{"$f":"ROW(BD131)","v":131}]
[]
[null,null,null,null,null,null,null,null,null,null,null,null,null,null,null,null,null,null,null,null,null,null,null,null,null,null,null,null,null,null,null,null,null,null,null,null,null,null,null,null,null,null,null,null,null,null,null,null,null,null,null,null,null,null,{"$f":"ROW(BC133)","v":133}]
[]
[null,null,null,null,null,null,null,null,null,null,null,null,null,"Enter the estimate Projection Surface Optical Efficiency ( 0% to 100% ) …"]
[]
[]
[null,null,null,null,null,null,null,null,null,null,null,null,null,null,null,null,null,null,null,null,null,null,null,null,null,null,"Minimum",null,null,null,null,null,null,null,"Maximum"]
[]
[]
[null,null,null,null,null,null,null,null,null,null,null,null,null,null,null,"Projection Surface Optical Efficiency",null,null,null,null,null,null,null,null,null,null,null,null,null,"%",null,null,null,null,null,null,null,"%"]
[null,null,null,null,null,null,null,null,null,null,null,null,null,null,null,null,null,null,null,null,null,null,null,null,null,null,{"$f":"IF( ISNUMBER(AppDef_ScreenEff_Min), CONCATENATE( \"  <<   \", AppDef_ScreenEff_Min*100, \"%   >>\"), \"\" )","v":""},null,null,null,null,null,null,null,{"$f":"IF( ISNUMBER(AppDef_ScreenEff_Max), CONCATENATE( \"  <<   \", AppDef_ScreenEff_Max*100, \"%   >>\"), \"\" )","v":""}]
[]
[null,null,null,null,null,null,null,null,null,null,null,null,null,null,null,null,null,null,null,null,null,null,null,null,null,null,null,null,null,null,null,null,null,null,null,null,null,null,null,null,null,null,null,null,null,null,null,null,null,null,null,null,null,null,null,{"$f":"ROW(BD144)","v":144}]
[]
[null,null,null,null,null,null,null,null,null,null,null,null,null,null,null,null,"Certain surfaces reflect or transmit light better than others. Projecting onto a surface with low optical efficiency "]
[null,null,null,null,null,null,null,null,null,null,null,null,null,null,null,null,"requires a higher brightness for the projected image to remain visible. "]
[]
[null,null,null,null,null,null,null,null,null,null,null,null,null,null,null,null,"The table below provides the reflection efficiency for a range of common materials/surfaces:"]
[]
[null,null,null,null,null,null,null,null,null,null,null,null,null,null,null,null,"Category",null,null,null,null,null,"Material",null,null,null,null,null,null,null,null,null,null,null,null,"Min",null,null,"Typ",null,null,"Max",null,null,"Ref"]
[]
[]
[]
[null,null,null,null,null,null,null,null,null,null,null,null,null,null,null,null,{"$f":"VLOOKUP($BG155, Table_SurfaceEff_Extra, 3 )","v":"Building Material"},null,null,null,null,null,{"$f":"VLOOKUP($BG155,Table_SurfaceEff_Extra,4)","v":"Silver - Highly polished"},null,null,null,null,null,null,null,null,null,null,null,null,{"$f":"VLOOKUP($BG155, Table_SurfaceEff_Extra, 5 )","v":0.9},null,null,{"$f":"VLOOKUP($BG155, Table_SurfaceEff_Extra, 6 )","v":0.91},null,null,{"$f":"VLOOKUP($BG155, Table_SurfaceEff_Extra, 7)","v":0.92},null,null,{"$f":"VLOOKUP($BG155,Table_SurfaceEff_Extra,8)","v":2},null,null,null,null,null,null,null,null,null,null,null,null,null,1]
[null,null,null,null,null,null,null,null,null,null,null,null,null,null,null,null,"Natural Material",null,null,null,null,null,"Snow - Fresh",null,null,null,null,null,null,null,null,null,null,null,null,0,null,null,0.85,null,null,0,null,null,2,null,null,null,null,null,null,null,null,null,null,null,null,null,2]
[null,null,null,null,null,null,null,null,null,null,null,null,null,null,null,null,"Building Material",null,null,null,null,null,"Aluminum - Pure, Highly polished",null,null,null,null,null,null,null,null,null,null,null,null,0.8,null,null,0.84,null,null,0.87,null,null,2,null,null,null,null,null,null,null,null,null,null,null,null,null,3]
[null,null,null,null,null,null,null,null,null,null,null,null,null,null,null,null,"Building Material",null,null,null,null,null,"Mirror - Silvered behind glass",null,null,null,null,null,null,null,null,null,null,null,null,0.8,null,null,0.84,null,null,0.88,null,null,2,null,null,null,null,null,null,null,null,null,null,null,null,null,4]
[null,null,null,null,null,null,null,null,null,null,null,null,null,null,null,null,"Building Material",null,null,null,null,null,"Aluminum - Aanodized, Matte",null,null,null,null,null,null,null,null,null,null,null,null,0.8,null,null,0.83,null,null,0.85,null,null,2,null,null,null,null,null,null,null,null,null,null,null,null,null,5]
[null,null,null,null,null,null,null,null,null,null,null,null,null,null,null,null,"Painted Surface",null,null,null,null,null,"Lacquer - Pure white",null,null,null,null,null,null,null,null,null,null,null,null,0.8,null,null,0.83,null,null,0.85,null,null,2,null,null,null,null,null,null,null,null,null,null,null,null,null,6]
[null,null,null,null,null,null,null,null,null,null,null,null,null,null,null,null,"General",null,null,null,null,null,"White Screen",null,null,null,null,null,null,null,null,null,null,null,null,0.75,null,null,0.8,null,null,0.85,null,null,2,null,null,null,null,null,null,null,null,null,null,null,null,null,7]
[null,null,null,null,null,null,null,null,null,null,null,null,null,null,null,null,"Painted Surface",null,null,null,null,null,"Paint - White",null,null,null,null,null,null,null,null,null,null,null,null,0.75,null,null,0.8,null,null,0.85,null,null,2,null,null,null,null,null,null,null,null,null,null,null,null,null,8]
[null,null,null,null,null,null,null,null,null,null,null,null,null,null,null,null,"Painted Surface",null,null,null,null,null,"White Paint on Plain Plasterboard",null,null,null,null,null,null,null,null,null,null,null,null,0,null,null,0.8,null,null,0,null,null,1,null,null,null,null,null,null,null,null,null,null,null,null,null,9]
[null,null,null,null,null,null,null,null,null,null,null,null,null,null,null,null,"Painted Surface",null,null,null,null,null,"White Paint on Plasterboard, Tiles",null,null,null,null,null,null,null,null,null,null,null,null,0,null,null,0.8,null,null,0,null,null,1,null,null,null,null,null,null,null,null,null,null,null,null,null,10]
[null,null,null,null,null,null,null,null,null,null,null,null,null,null,null,null,"Building Material",null,null,null,null,null,"Paper - White",null,null,null,null,null,null,null,null,null,null,null,null,0.7,null,null,0.75,null,null,0.8,null,null,2,null,null,null,null,null,null,null,null,null,null,null,null,null,11]
[null,null,null,null,null,null,null,null,null,null,null,null,null,null,null,null,"Building Material",null,null,null,null,null,"Copper - Highly polished",null,null,null,null,null,null,null,null,null,null,null,null,0.7,null,null,0.73,null,null,0.75,null,null,2,null,null,null,null,null,null,null,null,null,null,null,null,null,12]
[null,null,null,null,null,null,null,null,null,null,null,null,null,null,null,null,"Building Material",null,null,null,null,null,"Aluminum - Polished",null,null,null,null,null,null,null,null,null,null,null,null,0.65,null,null,0.7,null,null,0.75,null,null,2,null,null,null,null,null,null,null,null,null,null,null,null,null,13]
[null,null,null,null,null,null,null,null,null,null,null,null,null,null,null,null,"Building Material",null,null,null,null,null,"Porcelain enamel - White",null,null,null,null,null,null,null,null,null,null,null,null,0.65,null,null,0.7,null,null,0.75,null,null,2,null,null,null,null,null,null,null,null,null,null,null,null,null,14]
[null,null,null,null,null,null,null,null,null,null,null,null,null,null,null,null,"Painted Surface",null,null,null,null,null,"White Paint on Acoustic Tile",null,null,null,null,null,null,null,null,null,null,null,null,0,null,null,0.7,null,null,0,null,null,1,null,null,null,null,null,null,null,null,null,null,null,null,null,15]
[null,null,null,null,null,null,null,null,null,null,null,null,null,null,null,null,"Building Material",null,null,null,null,null,"Aluminum - Matte",null,null,null,null,null,null,null,null,null,null,null,null,0.55000000000000004,null,null,0.65,null,null,0.75,null,null,2,null,null,null,null,null,null,null,null,null,null,null,null,null,16]
[null,null,null,null,null,null,null,null,null,null,null,null,null,null,null,null,"Building Material",null,null,null,null,null,"Chrome - Polished",null,null,null,null,null,null,null,null,null,null,null,null,0.6,null,null,0.65,null,null,0.7,null,null,2,null,null,null,null,null,null,null,null,null,null,null,null,null,17]
[null,null,null,null,null,null,null,null,null,null,null,null,null,null,null,null,"Painted Surface",null,null,null,null,null,"Paint - Light yellow",null,null,null,null,null,null,null,null,null,null,null,null,0.6,null,null,0.65,null,null,0.7,null,null,2,null,null,null,null,null,null,null,null,null,null,null,null,null,18]
[null,null,null,null,null,null,null,null,null,null,null,null,null,null,null,null,"Natural Material",null,null,null,null,null,"Beach Sand",null,null,null,null,null,null,null,null,null,null,null,null,0,null,null,0.6,null,null,0,null,null,1,null,null,null,null,null,null,null,null,null,null,null,null,null,19]
[null,null,null,null,null,null,null,null,null,null,null,null,null,null,null,null,"Painted Surface",null,null,null,null,null,"White Paint on Non-fines Concrete",null,null,null,null,null,null,null,null,null,null,null,null,0,null,null,0.6,null,null,0,null,null,1,null,null,null,null,null,null,null,null,null,null,null,null,null,20]
[null,null,null,null,null,null,null,null,null,null,null,null,null,null,null,null,"Building Material",null,null,null,null,null,"Aluminum Coatings - Matte",null,null,null,null,null,null,null,null,null,null,null,null,0.55000000000000004,null,null,0.56000000000000005,null,null,0.56000000000000005,null,null,2,null,null,null,null,null,null,null,null,null,null,null,null,null,21]
[null,null,null,null,null,null,null,null,null,null,null,null,null,null,null,null,"Building Material",null,null,null,null,null,"Nickel - Highly polished",null,null,null,null,null,null,null,null,null,null,null,null,0.5,null,null,0.55000000000000004,null,null,0.6,null,null,2,null,null,null,null,null,null,null,null,null,null,null,null,null,22]
[null,null,null,null,null,null,null,null,null,null,null,null,null,null,null,null,"Building Material",null,null,null,null,null,"Marble - Polished",null,null,null,null,null,null,null,null,null,null,null,null,0.3,null,null,0.5,null,null,0.7,null,null,2,null,null,null,null,null,null,null,null,null,null,null,null,null,23]
[null,null,null,null,null,null,null,null,null,null,null,null,null,null,null,null,"Building Material",null,null,null,null,null,"Stainless Steel",null,null,null,null,null,null,null,null,null,null,null,null,0,null,null,0.5,null,null,0,null,null,2,null,null,null,null,null,null,null,null,null,null,null,null,null,24]
[null,null,null,null,null,null,null,null,null,null,null,null,null,null,null,null,"Painted Surface",null,null,null,null,null,"Paint - Light green",null,null,null,null,null,null,null,null,null,null,null,null,0.45,null,null,0.5,null,null,0.55000000000000004,null,null,2,null,null,null,null,null,null,null,null,null,null,null,null,null,25]
[null,null,null,null,null,null,null,null,null,null,null,null,null,null,null,null,"Building Material",null,null,null,null,null,"Carpet - Light Grey",null,null,null,null,null,null,null,null,null,null,null,null,0,null,null,0.45,null,null,0,null,null,1,null,null,null,null,null,null,null,null,null,null,null,null,null,26]
[null,null,null,null,null,null,null,null,null,null,null,null,null,null,null,null,"Building Material",null,null,null,null,null,"Limestone",null,null,null,null,null,null,null,null,null,null,null,null,0.35,null,null,0.45,null,null,0.55000000000000004,null,null,2,null,null,null,null,null,null,null,null,null,null,null,null,null,27]
[null,null,null,null,null,null,null,null,null,null,null,null,null,null,null,null,"Building Material",null,null,null,null,null,"PVC Tiles - Cream",null,null,null,null,null,null,null,null,null,null,null,null,0,null,null,0.45,null,null,0,null,null,1,null,null,null,null,null,null,null,null,null,null,null,null,null,28]
[null,null,null,null,null,null,null,null,null,null,null,null,null,null,null,null,"Natural Material",null,null,null,null,null,"Snow - Old",null,null,null,null,null,null,null,null,null,null,null,null,0,null,null,0.45,null,null,0,null,null,2,null,null,null,null,null,null,null,null,null,null,null,null,null,29]
[null,null,null,null,null,null,null,null,null,null,null,null,null,null,null,null,"Building Material",null,null,null,null,null,"Plaster - Light",null,null,null,null,null,null,null,null,null,null,null,null,0.4,null,null,0.43,null,null,0.45,null,null,2,null,null,null,null,null,null,null,null,null,null,null,null,null,30]
[null,null,null,null,null,null,null,null,null,null,null,null,null,null,null,null,"Building Material",null,null,null,null,null,"Concrete - Light Grey, Smooth",null,null,null,null,null,null,null,null,null,null,null,null,0,null,null,0.4,null,null,0,null,null,1,null,null,null,null,null,null,null,null,null,null,null,null,null,31]
[null,null,null,null,null,null,null,null,null,null,null,null,null,null,null,null,"Building Material",null,null,null,null,null,"White Fibre Cement",null,null,null,null,null,null,null,null,null,null,null,null,0,null,null,0.4,null,null,0,null,null,1,null,null,null,null,null,null,null,null,null,null,null,null,null,32]
[null,null,null,null,null,null,null,null,null,null,null,null,null,null,null,null,{"$f":"VLOOKUP($BG187, Table_SurfaceEff_Extra, 3 )","v":"Natural Material"},null,null,null,null,null,{"$f":"VLOOKUP($BG187,Table_SurfaceEff_Extra,4)","v":"Sand - Dry"},null,null,null,null,null,null,null,null,null,null,null,null,{"$f":"VLOOKUP($BG187, Table_SurfaceEff_Extra, 5 )","v":0.38},null,null,{"$f":"VLOOKUP($BG187, Table_SurfaceEff_Extra, 6 )","v":0.4},null,null,{"$f":"VLOOKUP($BG187, Table_SurfaceEff_Extra, 7)","v":0.42},null,null,{"$f":"VLOOKUP($BG187,Table_SurfaceEff_Extra,8)","v":2},null,null,null,null,null,null,null,null,null,null,null,null,null,33]
[null,null,null,null,null,null,null,null,null,null,null,null,null,null,null,null,"Building Material",null,null,null,null,null,"Synthetic Grass",null,null,null,null,null,null,null,null,null,null,null,null,0,null,null,0.35,null,null,0,null,null,1,null,null,null,null,null,null,null,null,null,null,null,null,null,34]
[null,null,null,null,null,null,null,null,null,null,null,null,null,null,null,null,"Building Material",null,null,null,null,null,"Timber - Light",null,null,null,null,null,null,null,null,null,null,null,null,0,null,null,0.35,null,null,0,null,null,1,null,null,null,null,null,null,null,null,null,null,null,null,null,35]
[null,null,null,null,null,null,null,null,null,null,null,null,null,null,null,null,"Natural Material",null,null,null,null,null,"Ice",null,null,null,null,null,null,null,null,null,null,null,null,0.32,null,null,0.35,null,null,0.38,null,null,2,null,null,null,null,null,null,null,null,null,null,null,null,null,36]
[null,null,null,null,null,null,null,null,null,null,null,null,null,null,null,null,"Building Material",null,null,null,null,null,"Plywood - Rough",null,null,null,null,null,null,null,null,null,null,null,null,0.25,null,null,0.33,null,null,0.4,null,null,2,null,null,null,null,null,null,null,null,null,null,null,null,null,37]
[null,null,null,null,null,null,null,null,null,null,null,null,null,null,null,null,"Building Material",null,null,null,null,null,"Oak - Light polished",null,null,null,null,null,null,null,null,null,null,null,null,0.25,null,null,0.3,null,null,0.35,null,null,2,null,null,null,null,null,null,null,null,null,null,null,null,null,38]
[null,null,null,null,null,null,null,null,null,null,null,null,null,null,null,null,"Building Material",null,null,null,null,null,"Sandstone",null,null,null,null,null,null,null,null,null,null,null,null,0.2,null,null,0.3,null,null,0.4,null,null,2,null,null,null,null,null,null,null,null,null,null,null,null,null,39]
[null,null,null,null,null,null,null,null,null,null,null,null,null,null,null,null,"Painted Surface",null,null,null,null,null,"Paint - Medium grey",null,null,null,null,null,null,null,null,null,null,null,null,0.25,null,null,0.3,null,null,0.35,null,null,2,null,null,null,null,null,null,null,null,null,null,null,null,null,40]
[null,null,null,null,null,null,null,null,null,null,null,null,null,null,null,null,"Natural Material",null,null,null,null,null,"Gravel",null,null,null,null,null,null,null,null,null,null,null,null,0,null,null,0.28999999999999998,null,null,0,null,null,"--",null,null,null,null,null,null,null,null,null,null,null,null,null,41]
[null,null,null,null,null,null,null,null,null,null,null,null,null,null,null,null,"Natural Material",null,null,null,null,null,"Soil - Dry",null,null,null,null,null,null,null,null,null,null,null,null,0.22,null,null,0.28000000000000003,null,null,0.34,null,null,2,null,null,null,null,null,null,null,null,null,null,null,null,null,42]
[null,null,null,null,null,null,null,null,null,null,null,null,null,null,null,null,"Building Material",null,null,null,null,null,"Carpet - Green",null,null,null,null,null,null,null,null,null,null,null,null,0,null,null,0.25,null,null,0,null,null,1,null,null,null,null,null,null,null,null,null,null,null,null,null,43]
[null,null,null,null,null,null,null,null,null,null,null,null,null,null,null,null,"Building Material",null,null,null,null,null,"Concrete - Light Grey",null,null,null,null,null,null,null,null,null,null,null,null,0,null,null,0.25,null,null,0,null,null,1,null,null,null,null,null,null,null,null,null,null,null,null,null,44]
[null,null,null,null,null,null,null,null,null,null,null,null,null,null,null,null,"Building Material",null,null,null,null,null,"Concrete - Rough",null,null,null,null,null,null,null,null,null,null,null,null,0.2,null,null,0.25,null,null,0.3,null,null,2,null,null,null,null,null,null,null,null,null,null,null,null,null,45]
[null,null,null,null,null,null,null,null,null,null,null,null,null,null,null,null,"Building Material",null,null,null,null,null,"PVC Tiles - Brown, marbled",null,null,null,null,null,null,null,null,null,null,null,null,0,null,null,0.25,null,null,0,null,null,1,null,null,null,null,null,null,null,null,null,null,null,null,null,46]
[null,null,null,null,null,null,null,null,null,null,null,null,null,null,null,null,"Building Material",null,null,null,null,null,"Timber - Medium",null,null,null,null,null,null,null,null,null,null,null,null,0,null,null,0.25,null,null,0,null,null,1,null,null,null,null,null,null,null,null,null,null,null,null,null,47]
[null,null,null,null,null,null,null,null,null,null,null,null,null,null,null,null,"Building Material",null,null,null,null,null,"Timber Panelling - Light oak, Mahogany",null,null,null,null,null,null,null,null,null,null,null,null,0,null,null,0.25,null,null,0,null,null,1,null,null,null,null,null,null,null,null,null,null,null,null,null,48]
[null,null,null,null,null,null,null,null,null,null,null,null,null,null,null,null,"Natural Material",null,null,null,null,null,"Grass",null,null,null,null,null,null,null,null,null,null,null,null,0,null,null,0.25,null,null,0,null,null,1,null,null,null,null,null,null,null,null,null,null,null,null,null,49]
[null,null,null,null,null,null,null,null,null,null,null,null,null,null,null,null,"Natural Material",null,null,null,null,null,"Sand - Wet",null,null,null,null,null,null,null,null,null,null,null,null,0.22,null,null,0.25,null,null,0.28000000000000003,null,null,2,null,null,null,null,null,null,null,null,null,null,null,null,null,50]
[null,null,null,null,null,null,null,null,null,null,null,null,null,null,null,null,"Painted Surface",null,null,null,null,null,"Paint - Brown",null,null,null,null,null,null,null,null,null,null,null,null,0.2,null,null,0.25,null,null,0.3,null,null,2,null,null,null,null,null,null,null,null,null,null,null,null,null,51]
[null,null,null,null,null,null,null,null,null,null,null,null,null,null,null,null,"Building Material",null,null,null,null,null,"Brick - Common",null,null,null,null,null,null,null,null,null,null,null,null,0.15,null,null,0.23,null,null,0.3,null,null,1,null,null,null,null,null,null,null,null,null,null,null,null,null,52]
[null,null,null,null,null,null,null,null,null,null,null,null,null,null,null,null,"Building Material",null,null,null,null,null,"Granite",null,null,null,null,null,null,null,null,null,null,null,null,0.2,null,null,0.23,null,null,0.25,null,null,2,null,null,null,null,null,null,null,null,null,null,null,null,null,53]
[null,null,null,null,null,null,null,null,null,null,null,null,null,null,null,null,"Building Material",null,null,null,null,null,"Plaster - Dark",null,null,null,null,null,null,null,null,null,null,null,null,0.15,null,null,0.2,null,null,0.25,null,null,2,null,null,null,null,null,null,null,null,null,null,null,null,null,54]
[null,null,null,null,null,null,null,null,null,null,null,null,null,null,null,null,"Building Material",null,null,null,null,null,"Timber - Dark",null,null,null,null,null,null,null,null,null,null,null,null,0,null,null,0.2,null,null,0,null,null,1,null,null,null,null,null,null,null,null,null,null,null,null,null,55]
[null,null,null,null,null,null,null,null,null,null,null,null,null,null,null,null,"Building Material",null,null,null,null,null,"Timber Panelling - Dark",null,null,null,null,null,null,null,null,null,null,null,null,0,null,null,0.2,null,null,0,null,null,1,null,null,null,null,null,null,null,null,null,null,null,null,null,56]
[null,null,null,null,null,null,null,null,null,null,null,null,null,null,null,null,"Natural Material",null,null,null,null,null,"Crops",null,null,null,null,null,null,null,null,null,null,null,null,0.15,null,null,0.2,null,null,0.24,null,null,2,null,null,null,null,null,null,null,null,null,null,null,null,null,57]
[null,null,null,null,null,null,null,null,null,null,null,null,null,null,null,null,"Painted Surface",null,null,null,null,null,"Paint - Dark blue",null,null,null,null,null,null,null,null,null,null,null,null,0.15,null,null,0.18,null,null,0.2,null,null,2,null,null,null,null,null,null,null,null,null,null,null,null,null,58]
[null,null,null,null,null,null,null,null,null,null,null,null,null,null,null,null,"Painted Surface",null,null,null,null,null,"Paint - Dark green",null,null,null,null,null,null,null,null,null,null,null,null,0.15,null,null,0.18,null,null,0.2,null,null,2,null,null,null,null,null,null,null,null,null,null,null,null,null,59]
[null,null,null,null,null,null,null,null,null,null,null,null,null,null,null,null,"Painted Surface",null,null,null,null,null,"Paint - Dark red",null,null,null,null,null,null,null,null,null,null,null,null,0.15,null,null,0.18,null,null,0.2,null,null,2,null,null,null,null,null,null,null,null,null,null,null,null,null,60]
[null,null,null,null,null,null,null,null,null,null,null,null,null,null,null,null,"Sports",null,null,null,null,null,"Colored Court - Dark/Light Blue",null,null,null,null,null,null,null,null,null,null,null,null,0.1,null,null,0.15000000000000002,null,null,0.2,null,null,1,null,null,null,null,null,null,null,null,null,null,null,null,null,61]
[null,null,null,null,null,null,null,null,null,null,null,null,null,null,null,null,"Sports",null,null,null,null,null,"Colored Court - Dark/Light Green",null,null,null,null,null,null,null,null,null,null,null,null,0.1,null,null,0.15000000000000002,null,null,0.2,null,null,1,null,null,null,null,null,null,null,null,null,null,null,null,null,62]
[null,null,null,null,null,null,null,null,null,null,null,null,null,null,null,null,"Building Material",null,null,null,null,null,"Brick - Red",null,null,null,null,null,null,null,null,null,null,null,null,0.1,null,null,0.13,null,null,0.15,null,null,2,null,null,null,null,null,null,null,null,null,null,null,null,null,63]
[null,null,null,null,null,null,null,null,null,null,null,null,null,null,null,null,"Natural Material",null,null,null,null,null,"Forrest",null,null,null,null,null,null,null,null,null,null,null,null,7.0000000000000007E-2,null,null,0.11,null,null,0.14000000000000001,null,null,2,null,null,null,null,null,null,null,null,null,null,null,null,null,64]
[null,null,null,null,null,null,null,null,null,null,null,null,null,null,null,null,{"$f":"VLOOKUP($BG219, Table_SurfaceEff_Extra, 3 )","v":"Natural Material"},null,null,null,null,null,{"$f":"VLOOKUP($BG219,Table_SurfaceEff_Extra,4)","v":"Soil - Dark wet"},null,null,null,null,null,null,null,null,null,null,null,null,{"$f":"VLOOKUP($BG219, Table_SurfaceEff_Extra, 5 )","v":7.0000000000000007E-2},null,null,{"$f":"VLOOKUP($BG219, Table_SurfaceEff_Extra, 6 )","v":0.11},null,null,{"$f":"VLOOKUP($BG219, Table_SurfaceEff_Extra, 7)","v":0.14000000000000001},null,null,{"$f":"VLOOKUP($BG219,Table_SurfaceEff_Extra,8)","v":2},null,null,null,null,null,null,null,null,null,null,null,null,null,65]
[null,null,null,null,null,null,null,null,null,null,null,null,null,null,null,null,"Building Material",null,null,null,null,null,"Carpet - Dark",null,null,null,null,null,null,null,null,null,null,null,null,0,null,null,0.1,null,null,0,null,null,1,null,null,null,null,null,null,null,null,null,null,null,null,null,66]
[null,null,null,null,null,null,null,null,null,null,null,null,null,null,null,null,"Building Material",null,null,null,null,null,"Tiles - Red",null,null,null,null,null,null,null,null,null,null,null,null,0,null,null,0.1,null,null,0,null,null,1,null,null,null,null,null,null,null,null,null,null,null,null,null,67]
[null,null,null,null,null,null,null,null,null,null,null,null,null,null,null,null,"Natural Material",null,null,null,null,null,"Asphalt",null,null,null,null,null,null,null,null,null,null,null,null,0,null,null,0.1,null,null,0,null,null,1,null,null,null,null,null,null,null,null,null,null,null,null,null,68]
[null,null,null,null,null,null,null,null,null,null,null,null,null,null,null,null,"Sports",null,null,null,null,null,"Colored Court - Brown, Sand, Tan, Clay",null,null,null,null,null,null,null,null,null,null,null,null,0.05,null,null,0.1,null,null,0.15,null,null,1,null,null,null,null,null,null,null,null,null,null,null,null,null,69]
[null,null,null,null,null,null,null,null,null,null,null,null,null,null,null,null,"Natural Material",null,null,null,null,null,"Water",null,null,null,null,null,null,null,null,null,null,null,null,7.0000000000000007E-2,null,null,0.08,null,null,0.09,null,null,2,null,null,null,null,null,null,null,null,null,null,null,null,null,70]
[null,null,null,null,null,null,null,null,null,null,null,null,null,null,null,null,"Building Material",null,null,null,null,null,"Black Chalkboard",null,null,null,null,null,null,null,null,null,null,null,null,0,null,null,0.05,null,null,0,null,null,1,null,null,null,null,null,null,null,null,null,null,null,null,null,71]
[null,null,null,null,null,null,null,null,null,null,null,null,null,null,null,null,"General",null,null,null,null,null,"Body where all light is reflected",null,null,null,null,null,null,null,null,null,null,null,null,0,null,null,0,null,null,1,null,null,"--",null,null,null,null,null,null,null,null,null,null,null,null,null,72]
[null,null,null,null,null,null,null,null,null,null,null,null,null,null,null,null,{"$error":"#N/A"},null,null,null,null,null,{"$error":"#N/A"},null,null,null,null,null,null,null,null,null,null,null,null,{"$error":"#N/A"},null,null,{"$error":"#N/A"},null,null,{"$error":"#N/A"},null,null,{"$error":"#N/A"}]
[null,null,null,null,null,null,null,null,null,null,null,null,null,null,null,null,"References:"]
[null,null,null,null,null,null,null,null,null,null,null,null,null,null,null,null,null,1,"https://decrolux.com.au/learning-centre/2018/approximate-reflectance-values-of-typical-building-finishes"]
[null,null,null,null,null,null,null,null,null,null,null,null,null,null,null,null,null,2,"https://www.engineeringtoolbox.com/light-material-reflecting-factor-d_1842.html"]
[]
[null,null,null,null,null,null,null,null,null,null,null,null,null,null,null,null,null,null,null,null,null,null,null,null,null,null,null,null,null,null,null,null,null,null,null,null,null,null,null,null,null,null,null,null,null,null,null,null,null,null,null,null,null,null,null,{"$f":"ROW(BD232)","v":232}]
[]
[null,null,null,null,null,null,null,null,null,null,null,null,null,null,null,null,null,null,null,null,null,null,null,null,null,null,null,null,null,null,null,null,null,null,null,null,null,null,null,null,null,null,null,null,null,null,null,null,null,null,null,null,null,{"$f":"ROW(BB234)","v":234}]
[]
[]
[null,null,null,null,null,null,null,null,null,null,null,null,null,null,null,null,null,null,null,null,null,null,null,null,null,null,null,null,null,null,null,null,null,null,null,null,null,null,null,null,null,null,null,null,null,null,null,null,null,null,null,null,null,{"$f":"ROW(BB237)","v":237}]
[]
[null,null,null,null,null,null,null,null,null,null,null,null,null,"Enter the Min and Max for any TWO of the following parameters …",null,null,null,null,null,null,null,null,null,null,null,null,null,null,null,null,null,null,null,null,null,null,null,null,null,null,null,null,null,null,null,null,null,null,null,null,null,null,null,{"$f":"ROW(BB239)","v":239}]
[]
[]
[null,null,null,null,null,null,null,null,null,null,null,null,null,null,null,null,null,null,null,null,null,null,null,null,null,null,"Minimum",null,null,null,null,null,null,null,"Maximum"]
[]
[]
[null,null,null,null,null,null,null,null,null,null,null,null,null,null,null,null,null,"Projected Image Width",null,null,null,null,null,null,null,null,null,null,null,null,null,null,null,null,null,null,null,null,null,null,null,null,null,null,null,null,null,null,null,null,null,null,null,{"$f":"ROW(BB245)","v":245},null,null,null,null,null,null,null,2,{"$f":"INDEX( Table_UnitConvert, TSize_WidthUnitsIndex, Value_SystemUnitsIndex )","v":1},null,null,{"$f":"TSize_ImageWidth_xMin*BK245","v":0},null,{"$f":"TSize_ImageWidth_xMax*BK245","v":0},null,{"$f":"INDEX( Array_SystemUnits, 1, Value_SystemUnitsIndex)","v":{"$error":"#REF!"}}]
[null,null,null,null,null,null,null,null,null,null,null,null,null,null,null,null,null,null,null,null,null,null,null,null,null,null,{"$f":" IF( ISNUMBER(AppDef_ImageWidth_Min),  CONCATENATE(\"<< \", AppDef_ImageWidth_Min, \"  >>\"), \"\" )","v":""},null,null,null,null,null,null,null,{"$f":" IF( ISNUMBER(AppDef_ImageWidth_Max),  CONCATENATE(\"<< \", AppDef_ImageWidth_Max, \"  >>\"), \"\" )","v":""}]
[]
[null,null,null,null,null,null,null,null,null,null,null,null,null,null,null,null,null,"Projected Image Height",null,null,null,null,null,null,null,null,null,null,null,null,null,null,null,null,null,null,null,null,null,null,null,null,null,null,null,null,null,null,null,null,null,null,null,{"$f":"ROW(BB248)","v":248},null,null,null,null,null,null,null,null,{"$f":"INDEX( Table_UnitConvert, TSize_SizeUnitsIndex, Value_SystemUnitsIndex )","v":1},null,null,{"$f":"TSize_ImageHeight_xMin*BK248","v":0},null,{"$f":"TSize_ImageHeight_xMax*BK248","v":0},null,{"$f":"INDEX( Array_SystemUnits, 0, Value_SystemUnitsIndex)","v":{"$error":"#REF!"}}]
[null,null,null,null,null,null,null,null,null,null,null,null,null,null,null,null,null,null,null,null,null,null,null,null,null,null,{"$f":" IF( ISNUMBER(AppDef_ImageHeight_Min),  CONCATENATE(\"<< \", AppDef_ImageHeight_Min, \"  >>\"), \"\" )","v":""},null,null,null,null,null,null,null,{"$f":" IF( ISNUMBER(AppDef_ImageHeight_Max),  CONCATENATE(\"<< \", AppDef_ImageHeight_Max, \"  >>\"), \"\" )","v":""}]
[]
[null,null,null,null,null,null,null,null,null,null,null,null,null,null,null,null,null,"Projected Image Diagonal",null,null,null,null,null,null,null,null,null,null,null,null,null,null,null,null,null,null,null,null,null,null,null,null,null,null,null,null,null,null,null,null,null,null,null,{"$f":"ROW(BB251)","v":251},null,null,null,null,null,null,null,null,{"$f":"INDEX( Table_UnitConvert, TSize_SizeUnitsIndex, Value_SystemUnitsIndex )","v":1},null,null,{"$f":"TSize_ImageDiag_xMin*BK251","v":0},null,{"$f":"TSize_ImageDiag_xMax*BK251","v":0},null,{"$f":"INDEX( Array_SystemUnits, 0, Value_SystemUnitsIndex)","v":{"$error":"#REF!"}}]
[null,null,null,null,null,null,null,null,null,null,null,null,null,null,null,null,null,null,null,null,null,null,null,null,null,null,{"$f":" IF( ISNUMBER(AppDef_ImageDiag_Min),  CONCATENATE(\"<< \", AppDef_ImageDiag_Min, \"  >>\"), \"\" )","v":""},null,null,null,null,null,null,null,{"$f":" IF( ISNUMBER(AppDef_ImageDiag_Max),  CONCATENATE(\"<< \", AppDef_ImageDiag_Max, \"  >>\"), \"\" )","v":""}]
[]
[null,null,null,null,null,null,null,null,null,null,null,null,null,null,null,null,null,"Aspect Ratio",null,null,null,null,null,null,null,null,null,null,null,":",null,null,null,null,null,null,null,":",null,null,null,null,null,null,null,null,null,null,null,null,null,null,null,{"$f":"ROW(BB254)","v":254}]
[null,null,null,null,null,null,null,null,null,null,null,null,null,null,null,null,null,null,null,null,null,null,null,null,null,null,null,{"$f":" IF( ISNUMBER(AppDef_ImageARNum_Min),  CONCATENATE( \"  <<   \", AppDef_ImageARNum_Min), \"\" )","v":""},null,{"$f":" IF( AND( ISNUMBER(AppDef_ImageARNum_Min), ISNUMBER(AppDef_ImageARDenom_Min)),  \":\", \"\" )","v":""},null,{"$f":" IF( ISNUMBER(AppDef_ImageARDenom_Min),  CONCATENATE( AppDef_ImageARDenom_Min, \"  >>\"), \"\" )","v":""},null,null,null,{"$f":" IF( ISNUMBER(AppDef_ImageARNum_Max),  CONCATENATE( \"  <<   \", AppDef_ImageARNum_Max), \"\" )","v":""},null,{"$f":" IF( AND( ISNUMBER(AppDef_ImageARNum_Max), ISNUMBER(AppDef_ImageARDenom_Max)),  \":\", \"\" )","v":""},null,{"$f":" IF( ISNUMBER(AppDef_ImageARDenom_Max),  CONCATENATE( AppDef_ImageARDenom_Max, \"  >>\"), \"\" )","v":""}]
[null,null,null,null,null,null,null,null,null,null,null,null,null,null,null,null,null,null,null,null,null,null,null,null,null,null,null,null,null,null,null,null,null,null,null,null,null,null,null,null,null,null,null,null,null,null,null,null,null,null,null,null,null,null,{"$f":"ROW(BC256)","v":256}]
[]
[null,null,null,null,null,null,null,null,null,null,null,null,null,null,null,"The diagram below illustrates the Image Width, Image Height, and Image Diagonal."]
[]
[]
[]
[]
[]
[]
[]
[]
[]
[]
[]
[]
[]
[null,null,null,null,null,null,null,null,null,null,null,null,null,null,null,null,null,null,null,null,null,null,null,null,null,null,null,null,null,null,null,null,null,null,null,null,null,null,null,null,null,null,null,null,null,null,null,null,null,null,null,null,null,null,{"$f":"ROW(BC273)","v":273}]
[]
[null,null,null,null,null,null,null,null,null,null,null,null,null,null,null,null,null,null,null,null,null,null,null,null,null,null,null,null,null,null,null,null,null,null,null,null,null,null,null,null,null,null,null,null,null,null,null,null,null,null,null,null,null,null,{"$f":"ROW(BC274)","v":274}]
[null,null,null,null,null,null,null,null,null,null,null,null,null,null,null,"The Image Aspect Ratio is equal to the Image Width divided by the Image Height."]
[]
[]
[]
[]
[]
[]
[]
[]
[]
[]
[]
[null,null,null,null,null,null,null,null,null,null,null,null,null,null,null,null,null,null,null,null,null,null,null,null,null,null,null,null,null,null,null,null,null,null,null,null,null,null,null,null,null,null,null,null,null,null,null,null,null,null,null,null,null,null,{"$f":"ROW(BC287)","v":287}]
[null,null,null,null,null,null,null,null,null,null,null,null,null,null,null,null,null,null,null,null,null,null,null,null,null,null,null,null,null,null,null,null,null,null,null,null,null,null,null,null,null,null,null,null,null,null,null,null,null,null,null,null,null,{"$f":"ROW(BB288)","v":288}]
[]
[]
[null,null,null,null,null,null,null,null,null,null,null,null,null,null,null,null,null,null,null,null,null,null,null,null,null,null,null,null,null,null,null,null,null,null,null,null,null,null,null,null,null,null,null,null,null,null,null,null,null,null,null,null,null,{"$f":"ROW(BB291)","v":291}]
[]
[null,null,null,null,null,null,null,null,null,null,null,null,null,"Select ONE of the following … ",null,null,null,null,null,null,null,null,null,null,null,null,null,null,null,null,null,null,null,null,null,null,null,null,null,null,null,null,null,null,null,null,null,null,null,null,null,null,null,{"$f":"ROW(BB293)","v":293},null,null,null,"TRes_Start"]
[]
[null,null,null,null,null,null,null,null,null,null,null,null,null,null,null,null,null,null,null,null,null,null,null,null,null,null,null,null,null,null,null,null,null,null,null,null,null,null,null,null,null,null,null,null,null,null,null,null,null,null,null,null,null,{"$f":"ROW(BB295)","v":295}]
[null,null,null,null,null,null,null,null,null,null,null,null,null,null,null,null,null,null,"If you know the exact range of resolutions for your display, select Manual Screen Resolution"]
[]
[null,null,null,null,null,null,null,null,null,null,null,null,null,null,null,null,null,null,"If you know the range of resolutions by standard terms, select Industry Standard"]
[]
[null,null,null,null,null,null,null,null,null,null,null,null,null,null,null,null,null,null,"If you know the typical viewing location of your display, select Fundamental Parameters"]
[]
[null,null,null,null,null,null,null,null,null,null,null,null,null,null,null,null,null,null,"Otherwise, continue to Parameter Summary to use TI's suggested default values"]
[null,null,null,null,null,null,null,null,null,null,null,null,null,null,null,null,null,null,null,null,null,null,null,null,null,null,null,null,null,null,null,null,null,null,null,null,null,null,null,null,null,null,null,null,null,null,null,null,null,null,null,null,null,{"$f":"ROW(BB303)","v":303}]
[]
[null,null,null,null,null,null,null,null,null,null,null,null,null,null,null,null,null,null,null,null,null,null,null,null,null,null,null,null,null,null,null,null,null,null,null,null,null,null,null,null,null,null,null,null,null,null,null,null,null,null,null,null,null,null,{"$f":"ROW(BC305)","v":305}]
[]
[null,null,null,null,null,null,null,null,null,null,null,null,null,null,null,null,null,null,null,null,null,null,null,null,null,null,null,null,null,null,null,null,null,null,null,null,null,null,null,null,null,null,null,null,null,null,null,null,null,null,null,null,null,null,{"$f":"ROW(BC307)","v":307}]
[null,null,null,null,null,null,null,null,null,null,null,null,null,null,null,null,null,"Enter the minimum and maximum of either parameter …",null,null,null,null,null,null,null,null,null,null,null,null,null,null,null,null,null,null,null,null,null,null,null,null,null,null,null,null,null,null,null,null,null,null,null,null,{"$f":"ROW(BC308)","v":308},null,null,"TRes_Fundamental_Start"]
[]
[]
[null,null,null,null,null,null,null,null,null,null,null,null,null,null,null,null,null,null,null,null,null,null,null,null,null,null,null,null,null,null,null,"Minimum",null,null,null,null,null,null,"Maximum"]
[]
[]
[null,null,null,null,null,null,null,null,null,null,null,null,null,null,null,null,null,null,null,null,"Viewing Distance",null,null,null,null,null,null,null,null,null,null,null,null,null,null,null,null,null,null,null,null,null,null,null,null,null,null,null,null,null,null,null,null,{"$f":"ROW(BB314)","v":314},null,null,null,null,null,null,null,2,{"$f":"INDEX( Table_UnitConvert, TRes_ViewDistUnitsIndex, Value_SystemUnitsIndex )","v":1},null,null,{"$f":"TRes_ViewDist_xMin*BK314","v":0},null,{"$f":"TRes_ViewDist_xMax*BK314","v":0},null,{"$f":"INDEX( Array_SystemUnits, 0, Value_SystemUnitsIndex )","v":{"$error":"#REF!"}}]
[null,null,null,null,null,null,null,null,null,null,null,null,null,null,null,null,null,null,null,null,null,null,null,null,null,null,null,null,null,null,null,{"$f":" IF( ISNUMBER(AppDef_ViewDist_Min),  CONCATENATE(\"<< \", AppDef_ViewDist_Min, \"  >>\"), \"\" )","v":""},null,null,null,null,null,null,{"$f":" IF( ISNUMBER(AppDef_ViewDist_Max),  CONCATENATE(\"<< \", AppDef_ViewDist_Max, \"  >>\"), \"\" )","v":""}]
[]
[null,null,null,null,null,null,null,null,null,null,null,null,null,null,null,null,null,null,"OR …",null,"Field-of-View",null,null,null,null,null,null,null,null,null,null,null,null,null,null,"deg",null,null,null,null,null,null,"deg",null,null,null,null,null,null,null,null,null,null,{"$f":"ROW(BB317)","v":317}]
[null,null,null,null,null,null,null,null,null,null,null,null,null,null,null,null,null,null,null,null,null,null,null,null,null,null,null,null,null,null,null,{"$f":" IF( ISNUMBER(AppDef_FOV_Min),  CONCATENATE( \" <<   \", AppDef_FOV_Min, \"   >>\"), \"\" )","v":""},null,null,null,null,null,null,{"$f":" IF( ISNUMBER(AppDef_FOV_Max),  CONCATENATE( \" <<   \", AppDef_FOV_Max, \"   >>\"), \"\" )","v":""}]
[null,null,null,null,null,null,null,null,null,null,null,null,null,null,null,null,null,null,null,null,null,null,null,null,null,null,null,null,null,null,null,null,null,null,null,null,null,null,null,null,null,null,null,null,null,null,null,null,null,null,null,null,null,null,null,{"$f":"ROW(BD319)","v":319},{"$f":"ROW(BE319)","v":319}]
[null,null,null,null,null,null,null,null,null,null,null,null,null,null,null,null,null,null,null,"The diagram below illustrates the Viewing Distance, and Field of View."]
[]
[]
[]
[]
[]
[]
[]
[]
[]
[]
[]
[]
[]
[]
[]
[]
[]
[]
[]
[]
[null,null,null,null,null,null,null,null,null,null,null,null,null,null,null,null,null,null,null,null,null,null,null,null,null,null,null,null,null,null,null,null,null,null,null,null,null,null,null,null,null,null,null,null,null,null,null,null,null,null,null,null,null,null,null,{"$f":"ROW(BD341)","v":341},{"$f":"ROW(BE341)","v":341}]
[]
[]
[null,null,null,null,null,null,null,null,null,null,null,null,null,null,null,null,null,"And enter the minimum and maximum for one of the following …"]
[]
[]
[null,null,null,null,null,null,null,null,null,null,null,null,null,null,null,null,null,null,null,null,null,null,null,null,null,null,null,null,null,null,null,"Minimum",null,null,null,null,null,null,"Maximum"]
[]
[]
[null,null,null,null,null,null,null,null,null,null,null,null,null,null,null,null,null,null,null,null,"Pixels-per-Degree",null,null,null,null,null,null,null,null,null,null,null,null,null,null,"ppd",null,null,null,null,null,null,"ppd",null,null,null,null,null,null,null,null,null,null,{"$f":"ROW(BB350)","v":350}]
[null,null,null,null,null,null,null,null,null,null,null,null,null,null,null,null,null,null,null,null,null,null,null,null,null,null,null,null,null,null,null,{"$f":" IF( ISNUMBER(AppDef_PxPerDeg_Min),  IF(AppDef_PxPerDeg_Min<AppDef_PxPerDeg_Max, CONCATENATE( \" <<   \", AppDef_PxPerDeg_Min, \"   >>\"), CONCATENATE( \" <<   \", AppDef_PxPerDeg_Max, \"   >>\")), \"\" )","v":""},null,null,null,null,null,null,{"$f":" IF( ISNUMBER(AppDef_PxPerDeg_Max),  IF(AppDef_PxPerDeg_Min<AppDef_PxPerDeg_Max, CONCATENATE( \" <<   \", AppDef_PxPerDeg_Max, \"   >>\"), CONCATENATE( \" <<   \", AppDef_PxPerDeg_Min, \"   >>\")), \"\" )","v":""}]
[null,null,null,null,null,null,null,null,null,null,null,null,null,null,null,null,null,null,null,null,null,null,null,null,null,null,null,null,null,null,null,null,null,null,null,null,null,null,null,null,null,null,null,null,null,null,null,null,null,null,null,null,null,null,null,{"$f":"ROW(BD352)","v":352}]
[null,null,null,null,null,null,null,null,null,null,null,null,null,null,null,null,null,null,null,"The metric pixels per degree (ppd) is calculated by dividing the number of horizontal pixels"]
[null,null,null,null,null,null,null,null,null,null,null,null,null,null,null,null,null,null,null,"(being displayed) by the users field of view. This is effectively a measurement of display resolution"]
[null,null,null,null,null,null,null,null,null,null,null,null,null,null,null,null,null,null,null,"as perceived by the viewer."]
[]
[null,null,null,null,null,null,null,null,null,null,null,null,null,null,null,null,null,null,null,"By definition an individual with average visual acuity has \"20/20 vision\", which means they can"]
[null,null,null,null,null,null,null,null,null,null,null,null,null,null,null,null,null,null,null,"discern features (technically, line-pairs) which are 1.75 mm apart from 20 feet away. This "]
[null,null,null,null,null,null,null,null,null,null,null,null,null,null,null,null,null,null,null,"calculates to ~1 pixel (feature) per arc-minute, or ~60 pixels per degree (ppd).",null,null,null,null,null,null,null,null,null,null,null,null,null,null,null,null,null,null,null,null,null,null,null,null,null,null,null,null,null,null,null,null,null,null,null,null,null,null,null,null,{"$f":"#NAME?","v":{"$error":"#NAME?"}}]
[]
[null,null,null,null,null,null,null,null,null,null,null,null,null,null,null,null,null,null,null,"While 60 ppd provides a useful reference point, it should not be assumed that this is a strict"]
[null,null,null,null,null,null,null,null,null,null,null,null,null,null,null,null,null,null,null,"requirement. The appropriate measurement for a given display system will depend upon a "]
[null,null,null,null,null,null,null,null,null,null,null,null,null,null,null,null,null,null,null,"number of factors such as displayed content, intended functional use, typical viewing distance, "]
[null,null,null,null,null,null,null,null,null,null,null,null,null,null,null,null,null,null,null,"and ambient light conditions."]
[]
[]
[null,null,null,null,null,null,null,null,null,null,null,null,null,null,null,null,null,null,null,null,null,null,null,null,null,null,null,null,null,null,null,null,null,null,null,null,null,null,null,null,null,null,null,null,null,null,null,null,null,null,null,null,null,null,null,{"$f":"ROW(BD367)","v":367}]
[null,null,null,null,null,null,null,null,null,null,null,null,null,null,null,null,null,null,null,null,null,null,null,null,null,null,null,null,null,null,null,null,null,null,null,null,null,null,null,null,null,null,null,null,null,null,null,null,null,null,null,null,null,null,null,null,null,null,null,null,null,6,{"$f":"INDEX( Table_UnitConvert, TRes_ViewDensUnitsIndex, Value_SystemUnitsIndex )","v":39.370080000000002},null,null,{"$f":"TRes_PxDens_xMin*BK368","v":0},null,{"$f":"TRes_PxDens_xMax*BK368","v":0},null,{"$f":"INDEX( Array_SystemUnits, 0, Value_SystemUnitsIndex )","v":{"$error":"#REF!"}}]
[null,null,null,null,null,null,null,null,null,null,null,null,null,null,null,null,null,null,"OR …",null,"Pixels-per-Length",null,null,null,null,null,null,null,null,null,null,null,null,null,null,"/",null,null,null,null,null,null,"/",null,null,null,null,null,null,null,null,null,null,{"$f":"ROW(BB369)","v":369}]
[null,null,null,null,null,null,null,null,null,null,null,null,null,null,null,null,null,null,null,null,null,null,null,null,null,null,null,null,null,null,null,{"$f":" IF( ISNUMBER(AppDef_PxPerInch_Min),  CONCATENATE( \" <<   \", AppDef_PxPerInch_Min, \"   >>\"), \"\" )","v":""},null,null,null,null,null,null,{"$f":" IF( ISNUMBER(AppDef_PxPerInch_Max),  CONCATENATE( \" <<   \", AppDef_PxPerInch_Max, \"   >>\"), \"\" )","v":""}]
[null,null,null,null,null,null,null,null,null,null,null,null,null,null,null,null,null,null,null,null,null,null,null,null,null,null,null,null,null,null,null,null,null,null,null,null,null,null,null,null,null,null,null,null,null,null,null,null,null,null,null,null,null,null,null,{"$f":"ROW(BD371)","v":371}]
[null,null,null,null,null,null,null,null,null,null,null,null,null,null,null,null,null,null,null,"The metric pixels-per-length is calculated by dividing the number of horizontal pixels",null,null,null,null,null,null,null,null,null,null,null,null,null,null,null,null,null,null,null,null,null,null,null,null,null,null,null,null,null,null,null,null,null,null,null,null,null,null,null,null,null,{"$f":"BJ373/(1920/1080)","v":7.59375},null,null,"in high"]
[null,null,null,null,null,null,null,null,null,null,null,null,null,null,null,null,null,null,null,"(being displayed) by the width of the projected image in inches. This is effectively a measurement ",null,null,null,null,null,null,null,null,null,null,null,null,null,null,null,null,null,null,null,null,null,null,null,null,null,null,null,null,null,null,null,null,null,null,null,null,null,null,null,null,null,13.5,null,null,"in wide"]
[null,null,null,null,null,null,null,null,null,null,null,null,null,null,null,null,null,null,null,"of display resolution at the surface of the image.",null,null,null,null,null,null,null,null,null,null,null,null,null,null,null,null,null,null,null,null,null,null,null,null,null,null,null,null,null,null,null,null,null,null,null,null,null,null,null,null,null,{"$f":"SQRT( (BJ372^2)+(BJ373^2) )","v":15.48919103964116}]
[]
[null,null,null,null,null,null,null,null,null,null,null,null,null,null,null,null,null,null,null,"For reference: A 15.5\" (diagonal) laptop display, with a native resolution of 1080p, will have",null,null,null,null,null,null,null,null,null,null,null,null,null,null,null,null,null,null,null,null,null,null,null,null,null,null,null,null,null,null,null,null,null,null,null,null,null,null,null,null,null,1920,null,null,"pixel wide"]
[null,null,null,null,null,null,null,null,null,null,null,null,null,null,null,null,null,null,null,"a pixel density of ~140 in, and when viewed from 24\" will have ~60 ppd.",null,null,null,null,null,null,null,null,null,null,null,null,null,null,null,null,null,null,null,null,null,null,null,null,null,null,null,null,null,null,null,null,null,null,null,null,null,null,null,null,null,24,null,null,"in view dist"]
[]
[null,null,null,null,null,null,null,null,null,null,null,null,null,null,null,null,null,null,null,"The appropriate density requirement for a given display system will depend upon a number of"]
[null,null,null,null,null,null,null,null,null,null,null,null,null,null,null,null,null,null,null,"factors such as displayed content, itended functional use, typical viewing distance, and ambient"]
[null,null,null,null,null,null,null,null,null,null,null,null,null,null,null,null,null,null,null,"light conditions."]
[]
[]
[null,null,null,null,null,null,null,null,null,null,null,null,null,null,null,null,null,null,null,null,null,null,null,null,null,null,null,null,null,null,null,null,null,null,null,null,null,null,null,null,null,null,null,null,null,null,null,null,null,null,null,null,null,null,null,{"$f":"ROW(BD384)","v":384}]
[]
[null,null,null,null,null,null,null,null,null,null,null,null,null,null,null,null,null,null,"OR …",null,"Pixels-per-Point Conversion Factor",null,null,null,null,null,null,null,null,null,null,null,null,null,null,null,null,null,null,null,null,null,null,null,null,null,null,null,null,null,null,null,null,{"$f":"ROW(BB386)","v":386}]
[null,null,null,null,null,null,null,null,null,null,null,null,null,null,null,null,null,null,null,null,null,null,null,null,null,null,null,null,null,null,null,null,{"$f":" IF( ISNUMBER(AppDef_PointsToPixelsFactor_Min),  CONCATENATE( \"<<   \", AppDef_PointsToPixelsFactor_Min, \"   >>\"), \"\" )","v":""},null,null,null,null,null,null,{"$f":" IF( ISNUMBER(AppDef_PointsToPixelsFactor_Max),  CONCATENATE( \"<<   \", AppDef_PointsToPixelsFactor_Max, \"   >>\"), \"\" )","v":""}]
[null,null,null,null,null,null,null,null,null,null,null,null,null,null,null,null,null,null,null,null,null,null,null,null,null,null,null,null,null,null,null,null,null,null,null,null,null,null,null,null,null,null,null,null,null,null,null,null,null,null,null,null,null,null,null,{"$f":"ROW(BD388)","v":388}]
[null,null,null,null,null,null,null,null,null,null,null,null,null,null,null,null,null,null,null,"Converting text point-size to a minimum number of pixels is an inexact science, with the \"appropriate\""]
[null,null,null,null,null,null,null,null,null,null,null,null,null,null,null,null,null,null,null,"conversion factor depending on a number of factors, such as: the complexity of the font typeface "]
[null,null,null,null,null,null,null,null,null,null,null,null,null,null,null,null,null,null,null,"and style, the intended functional use of the display, the typical viewing distance, and the "]
[null,null,null,null,null,null,null,null,null,null,null,null,null,null,null,null,null,null,null,"typical ambient light conditions. A resonable range to consider is ~1.32  to ~4.75 pixels per point."]
[]
[]
[]
[]
[]
[]
[]
[]
[]
[]
[]
[]
[]
[null,null,null,null,null,null,null,null,null,null,null,null,null,null,null,null,null,null,null,null,null,null,null,null,null,null,null,null,null,null,null,null,null,null,null,null,null,null,null,null,null,null,null,null,null,null,null,null,null,null,null,null,null,null,null,{"$f":"ROW(BD406)","v":406}]
[null,null,null,null,null,null,null,null,null,null,null,null,null,null,null,null,null,null,null,null,null,null,null,null,null,null,null,null,null,null,null,null,null,null,null,null,null,null,null,null,null,null,null,null,null,null,null,null,null,null,null,null,null,null,null,null,null,null,null,null,null,{"$f":"IF( AND((#NAME?>0), (#NAME?>0), (#NAME?>0), (#NAME?>0)), CONCATENATE( CHAR(34), \"Manual Resolution\", CHAR(34), \" values\"), \"--\" )","v":{"$error":"#NAME?"}},null,null,{"$f":"IF( AND((#NAME?>0), (#NAME?>0)), CONCATENATE(\"manual \",CHAR(34),\"Industry Standard\",CHAR(34),\" resolution values.\"), \"--\" )","v":{"$error":"#NAME?"}}]
[null,null,null,null,null,null,null,null,null,null,null,null,null,null,null,null,null,null,null,null,null,null,null,null,null,null,null,null,null,null,null,null,null,null,null,null,null,null,null,null,null,null,null,null,null,null,null,null,null,null,null,null,null,null,null,null,null,"TRes_Fundamental_Start"]
[null,null,null,null,null,null,null,null,null,null,null,null,null,null,null,null,null,null,null,null,null,null,null,null,null,null,null,null,null,null,null,null,null,null,null,null,null,null,null,null,null,null,null,null,null,null,null,null,null,null,null,null,null,null,{"$f":"ROW(BC409)","v":409}]
[]
[null,null,null,null,null,null,null,null,null,null,null,null,null,null,"OR …",null,null,null,null,null,null,null,null,null,null,null,null,null,null,null,null,null,null,null,null,null,null,null,null,null,null,null,null,null,null,null,null,null,null,null,null,null,null,null,{"$f":"ROW(BC411)","v":411}]
[null,null,null,null,null,null,null,null,null,null,null,null,null,null,null,null,null,null,null,null,null,null,null,null,null,null,null,null,null,null,null,null,null,null,null,null,null,null,null,null,null,null,null,null,null,null,null,null,null,null,null,null,null,null,{"$f":"ROW(BC412)","v":412}]
[null,null,null,null,null,null,null,null,null,null,null,null,null,null,null,null,null,"Select a minimum and maximum Resolution Standard …",null,null,null,null,null,null,null,null,null,null,null,null,null,null,null,null,null,null,null,null,null,null,null,null,null,null,null,null,null,null,null,null,null,null,null,null,{"$f":"ROW(BC413)","v":413},null,null,"TRes_IndustryStd_Start"]
[]
[]
[null,null,null,null,null,null,null,null,null,null,null,null,null,null,null,null,null,null,null,null,"Minimum",null,null,null,null,null,null,null,null,null,null,null,null,null,null,"Maximum",null,null,null,null,null,null,null,null,null,null,null,null,null,null,null,null,null,null,null,null,null,null,null,null,null,0,null,null,0]
[]
[]
[null,null,null,null,null,null,null,null,null,null,null,null,null,null,null,null,null,null,"<<",null,null,null,{"$f":"xLists!V6","v":"8K UHD"},null,null,null,null,null,{"$f":"xLists!W6","v":"    ( 7680 x 4320,  33.2Mpx )"},null,">>",null,null,"<<",null,null,null,{"$f":"xLists!V6","v":"8K UHD"},null,null,null,null,null,{"$f":"xLists!W6","v":"    ( 7680 x 4320,  33.2Mpx )"},null,">>",null,null,null,null,null,null,null,null,null,null,null,null,null,null,null,null,{"$f":"xLists!U6","v":1},null,null,{"$f":"xLists!X6","v":2},null,null,{"$f":"IF( AppDef_StdRes_Min = BK419, 1, 0 )","v":0},null,{"$f":"IF( AppDef_StdRes_Max = BK419, 1, 0 )","v":0}]
[null,null,null,null,null,null,null,null,null,null,null,null,null,null,null,null,null,null,"<<",null,null,null,{"$f":"xLists!V7","v":"5K"},null,null,null,null,null,{"$f":"xLists!W7","v":"    ( 5120 x 2880,  14.7Mpx )"},null,">>",null,null,"<<",null,null,null,{"$f":"xLists!V7","v":"5K"},null,null,null,null,null,{"$f":"xLists!W7","v":"    ( 5120 x 2880,  14.7Mpx )"},null,">>",null,null,null,null,null,null,null,null,null,null,null,null,null,null,null,null,{"$f":"xLists!U7","v":2},null,null,{"$f":"xLists!X7","v":2},null,null,0,null,0]
[null,null,null,null,null,null,null,null,null,null,null,null,null,null,null,null,null,null,"<<",null,null,null,{"$f":"xLists!V8","v":"4K"},null,null,null,null,null,{"$f":"xLists!W8","v":"    ( 4096 x 2160,    8.8Mpx )"},null,">>",null,null,"<<",null,null,null,{"$f":"xLists!V8","v":"4K"},null,null,null,null,null,{"$f":"xLists!W8","v":"    ( 4096 x 2160,    8.8Mpx )"},null,">>",null,null,null,null,null,null,null,null,null,null,null,null,null,null,null,null,{"$f":"xLists!U8","v":3},null,null,{"$f":"xLists!X8","v":2},null,null,0,null,0]
[null,null,null,null,null,null,null,null,null,null,null,null,null,null,null,null,null,null,"<<",null,null,null,{"$f":"xLists!V9","v":"4K / UHD"},null,null,null,null,null,{"$f":"xLists!W9","v":"    ( 3840 x 2160,    8.3Mpx )"},null,">>",null,null,"<<",null,null,null,{"$f":"xLists!V9","v":"4K / UHD"},null,null,null,null,null,{"$f":"xLists!W9","v":"    ( 3840 x 2160,    8.3Mpx )"},null,">>",null,null,null,null,null,null,null,null,null,null,null,null,null,null,null,null,{"$f":"xLists!U9","v":4},null,null,{"$f":"xLists!X9","v":2},null,null,0,null,0]
[null,null,null,null,null,null,null,null,null,null,null,null,null,null,null,null,null,null,"<<",null,null,null,{"$f":"xLists!V10","v":"QHD"},null,null,null,null,null,{"$f":"xLists!W10","v":"    ( 2560 x 1440,    3.7Mpx )"},null,">>",null,null,"<<",null,null,null,{"$f":"xLists!V10","v":"QHD"},null,null,null,null,null,{"$f":"xLists!W10","v":"    ( 2560 x 1440,    3.7Mpx )"},null,">>",null,null,null,null,null,null,null,null,null,null,null,null,null,null,null,null,{"$f":"xLists!U10","v":5},null,null,{"$f":"xLists!X10","v":2},null,null,0,null,0]
[null,null,null,null,null,null,null,null,null,null,null,null,null,null,null,null,null,null,"<<",null,null,null,{"$f":"xLists!V11","v":"QWXGA"},null,null,null,null,null,{"$f":"xLists!W11","v":"    ( 2048 x 1152,    2.4Mpx )"},null,">>",null,null,"<<",null,null,null,{"$f":"xLists!V11","v":"QWXGA"},null,null,null,null,null,{"$f":"xLists!W11","v":"    ( 2048 x 1152,    2.4Mpx )"},null,">>",null,null,null,null,null,null,null,null,null,null,null,null,null,null,null,null,{"$f":"xLists!U11","v":6},null,null,{"$f":"xLists!X11","v":2},null,null,0,null,0]
[null,null,null,null,null,null,null,null,null,null,null,null,null,null,null,null,null,null,"<<",null,null,null,{"$f":"xLists!V12","v":"WUXGA"},null,null,null,null,null,{"$f":"xLists!W12","v":"    ( 1920 x 1200,    2.3Mpx )"},null,">>",null,null,"<<",null,null,null,{"$f":"xLists!V12","v":"WUXGA"},null,null,null,null,null,{"$f":"xLists!W12","v":"    ( 1920 x 1200,    2.3Mpx )"},null,">>",null,null,null,null,null,null,null,null,null,null,null,null,null,null,null,null,{"$f":"xLists!U12","v":7},null,null,{"$f":"xLists!X12","v":2},null,null,0,null,0]
[null,null,null,null,null,null,null,null,null,null,null,null,null,null,null,null,null,null,"<<",null,null,null,{"$f":"xLists!V13","v":"2K"},null,null,null,null,null,{"$f":"xLists!W13","v":"    ( 2048 x 1080,    2.2Mpx )"},null,">>",null,null,"<<",null,null,null,{"$f":"xLists!V13","v":"2K"},null,null,null,null,null,{"$f":"xLists!W13","v":"    ( 2048 x 1080,    2.2Mpx )"},null,">>",null,null,null,null,null,null,null,null,null,null,null,null,null,null,null,null,{"$f":"xLists!U13","v":8},null,null,{"$f":"xLists!X13","v":2},null,null,0,null,0]
[null,null,null,null,null,null,null,null,null,null,null,null,null,null,null,null,null,null,"<<",null,null,null,{"$f":"xLists!V14","v":"1080p"},null,null,null,null,null,{"$f":"xLists!W14","v":"    ( 1920 x 1080,    2.1Mpx )"},null,">>",null,null,"<<",null,null,null,{"$f":"xLists!V14","v":"1080p"},null,null,null,null,null,{"$f":"xLists!W14","v":"    ( 1920 x 1080,    2.1Mpx )"},null,">>",null,null,null,null,null,null,null,null,null,null,null,null,null,null,null,null,{"$f":"xLists!U14","v":9},null,null,{"$f":"xLists!X14","v":2},null,null,0,null,0]
[null,null,null,null,null,null,null,null,null,null,null,null,null,null,null,null,null,null,"<<",null,null,null,{"$f":"xLists!V15","v":"WQXGA"},null,null,null,null,null,{"$f":"xLists!W15","v":"    ( 1260 x 1600,    2.0Mpx )"},null,">>",null,null,"<<",null,null,null,{"$f":"xLists!V15","v":"WQXGA"},null,null,null,null,null,{"$f":"xLists!W15","v":"    ( 1260 x 1600,    2.0Mpx )"},null,">>",null,null,null,null,null,null,null,null,null,null,null,null,null,null,null,null,{"$f":"xLists!U15","v":10},null,null,{"$f":"xLists!X15","v":2},null,null,0,null,0]
[null,null,null,null,null,null,null,null,null,null,null,null,null,null,null,null,null,null,"<<",null,null,null,{"$f":"xLists!V16","v":"WSXGA+"},null,null,null,null,null,{"$f":"xLists!W16","v":"    ( 1680 x 1050,    1.8Mpx )"},null,">>",null,null,"<<",null,null,null,{"$f":"xLists!V16","v":"WSXGA+"},null,null,null,null,null,{"$f":"xLists!W16","v":"    ( 1680 x 1050,    1.8Mpx )"},null,">>",null,null,null,null,null,null,null,null,null,null,null,null,null,null,null,null,{"$f":"xLists!U16","v":11},null,null,{"$f":"xLists!X16","v":2},null,null,0,null,0]
[null,null,null,null,null,null,null,null,null,null,null,null,null,null,null,null,null,null,"<<",null,null,null,{"$f":"xLists!V17","v":"HD+"},null,null,null,null,null,{"$f":"xLists!W17","v":"    ( 1600 x 900,    1.4Mpx )"},null,">>",null,null,"<<",null,null,null,{"$f":"xLists!V17","v":"HD+"},null,null,null,null,null,{"$f":"xLists!W17","v":"    ( 1600 x 900,    1.4Mpx )"},null,">>",null,null,null,null,null,null,null,null,null,null,null,null,null,null,null,null,{"$f":"xLists!U17","v":12},null,null,{"$f":"xLists!X17","v":2},null,null,0,null,0]
[null,null,null,null,null,null,null,null,null,null,null,null,null,null,null,null,null,null,"<<",null,null,null,{"$f":"xLists!V18","v":"SXGA"},null,null,null,null,null,{"$f":"xLists!W18","v":"    ( 1280 x 1024,    1.3Mpx )"},null,">>",null,null,"<<",null,null,null,{"$f":"xLists!V18","v":"SXGA"},null,null,null,null,null,{"$f":"xLists!W18","v":"    ( 1280 x 1024,    1.3Mpx )"},null,">>",null,null,null,null,null,null,null,null,null,null,null,null,null,null,null,null,{"$f":"xLists!U18","v":13},null,null,{"$f":"xLists!X18","v":2},null,null,0,null,0]
[null,null,null,null,null,null,null,null,null,null,null,null,null,null,null,null,null,null,"<<",null,null,null,{"$f":"xLists!V19","v":"WXGA+"},null,null,null,null,null,{"$f":"xLists!W19","v":"    ( 1440 x 900,    1.3Mpx )"},null,">>",null,null,"<<",null,null,null,{"$f":"xLists!V19","v":"WXGA+"},null,null,null,null,null,{"$f":"xLists!W19","v":"    ( 1440 x 900,    1.3Mpx )"},null,">>",null,null,null,null,null,null,null,null,null,null,null,null,null,null,null,null,{"$f":"xLists!U19","v":14},null,null,{"$f":"xLists!X19","v":2},null,null,0,null,0]
[null,null,null,null,null,null,null,null,null,null,null,null,null,null,null,null,null,null,"<<",null,null,null,{"$f":"xLists!V20","v":"HD"},null,null,null,null,null,{"$f":"xLists!W20","v":"    ( 1360 x 768,    1.0Mpx )"},null,">>",null,null,"<<",null,null,null,{"$f":"xLists!V20","v":"HD"},null,null,null,null,null,{"$f":"xLists!W20","v":"    ( 1360 x 768,    1.0Mpx )"},null,">>",null,null,null,null,null,null,null,null,null,null,null,null,null,null,null,null,{"$f":"xLists!U20","v":15},null,null,{"$f":"xLists!X20","v":2},null,null,0,null,0]
[null,null,null,null,null,null,null,null,null,null,null,null,null,null,null,null,null,null,"<<",null,null,null,{"$f":"xLists!V21","v":"WXGA"},null,null,null,null,null,{"$f":"xLists!W21","v":"    ( 1280 x 800,    1.0Mpx )"},null,">>",null,null,"<<",null,null,null,{"$f":"xLists!V21","v":"WXGA"},null,null,null,null,null,{"$f":"xLists!W21","v":"    ( 1280 x 800,    1.0Mpx )"},null,">>",null,null,null,null,null,null,null,null,null,null,null,null,null,null,null,null,{"$f":"xLists!U21","v":16},null,null,{"$f":"xLists!X21","v":2},null,null,0,null,0]
[null,null,null,null,null,null,null,null,null,null,null,null,null,null,null,null,null,null,"<<",null,null,null,{"$f":"xLists!V22","v":"720p"},null,null,null,null,null,{"$f":"xLists!W22","v":"    ( 1280 x 720,    0.9Mpx )"},null,">>",null,null,"<<",null,null,null,{"$f":"xLists!V22","v":"720p"},null,null,null,null,null,{"$f":"xLists!W22","v":"    ( 1280 x 720,    0.9Mpx )"},null,">>",null,null,null,null,null,null,null,null,null,null,null,null,null,null,null,null,{"$f":"xLists!U22","v":17},null,null,{"$f":"xLists!X22","v":2},null,null,0,null,0]
[null,null,null,null,null,null,null,null,null,null,null,null,null,null,null,null,null,null,"<<",null,null,null,{"$f":"xLists!V23","v":"XGA"},null,null,null,null,null,{"$f":"xLists!W23","v":"    ( 1024 x 768,    0.8Mpx )"},null,">>",null,null,"<<",null,null,null,{"$f":"xLists!V23","v":"XGA"},null,null,null,null,null,{"$f":"xLists!W23","v":"    ( 1024 x 768,    0.8Mpx )"},null,">>",null,null,null,null,null,null,null,null,null,null,null,null,null,null,null,null,{"$f":"xLists!U23","v":18},null,null,{"$f":"xLists!X23","v":2},null,null,0,null,0]
[null,null,null,null,null,null,null,null,null,null,null,null,null,null,null,null,null,null,"<<",null,null,null,{"$f":"xLists!V24","v":"WSVGA"},null,null,null,null,null,{"$f":"xLists!W24","v":"    ( 1024 x 600,    0.6Mpx )"},null,">>",null,null,"<<",null,null,null,{"$f":"xLists!V24","v":"WSVGA"},null,null,null,null,null,{"$f":"xLists!W24","v":"    ( 1024 x 600,    0.6Mpx )"},null,">>",null,null,null,null,null,null,null,null,null,null,null,null,null,null,null,null,{"$f":"xLists!U24","v":19},null,null,{"$f":"xLists!X24","v":2},null,null,0,null,0]
[null,null,null,null,null,null,null,null,null,null,null,null,null,null,null,null,null,null,"<<",null,null,null,{"$f":"xLists!V25","v":"qHD"},null,null,null,null,null,{"$f":"xLists!W25","v":"    ( 960 x 540,    0.5Mpx )"},null,">>",null,null,"<<",null,null,null,{"$f":"xLists!V25","v":"qHD"},null,null,null,null,null,{"$f":"xLists!W25","v":"    ( 960 x 540,    0.5Mpx )"},null,">>",null,null,null,null,null,null,null,null,null,null,null,null,null,null,null,null,{"$f":"xLists!U25","v":20},null,null,{"$f":"xLists!X25","v":2},null,null,0,null,0]
[null,null,null,null,null,null,null,null,null,null,null,null,null,null,null,null,null,null,"<<",null,null,null,{"$f":"xLists!V26","v":"SVGA"},null,null,null,null,null,{"$f":"xLists!W26","v":"    ( 800 x 600,    0.5Mpx )"},null,">>",null,null,"<<",null,null,null,{"$f":"xLists!V26","v":"SVGA"},null,null,null,null,null,{"$f":"xLists!W26","v":"    ( 800 x 600,    0.5Mpx )"},null,">>",null,null,null,null,null,null,null,null,null,null,null,null,null,null,null,null,{"$f":"xLists!U26","v":21},null,null,{"$f":"xLists!X26","v":2},null,null,0,null,0]
[null,null,null,null,null,null,null,null,null,null,null,null,null,null,null,null,null,null,"<<",null,null,null,{"$f":"xLists!V27","v":"WVGA"},null,null,null,null,null,{"$f":"xLists!W27","v":"    ( 854 x 480,    0.4Mpx )"},null,">>",null,null,"<<",null,null,null,{"$f":"xLists!V27","v":"WVGA"},null,null,null,null,null,{"$f":"xLists!W27","v":"    ( 854 x 480,    0.4Mpx )"},null,">>",null,null,null,null,null,null,null,null,null,null,null,null,null,null,null,null,{"$f":"xLists!U27","v":22},null,null,{"$f":"xLists!X27","v":2},null,null,0,null,0]
[null,null,null,null,null,null,null,null,null,null,null,null,null,null,null,null,null,null,"<<",null,null,null,{"$f":"xLists!V28","v":"VGA"},null,null,null,null,null,{"$f":"xLists!W28","v":"    ( 684 x 456,    0.3Mpx )"},null,">>",null,null,"<<",null,null,null,{"$f":"xLists!V28","v":"VGA"},null,null,null,null,null,{"$f":"xLists!W28","v":"    ( 684 x 456,    0.3Mpx )"},null,">>",null,null,null,null,null,null,null,null,null,null,null,null,null,null,null,null,{"$f":"xLists!U28","v":23},null,null,{"$f":"xLists!X28","v":2},null,null,0,null,0]
[null,null,null,null,null,null,null,null,null,null,null,null,null,null,null,null,null,null,"<<",null,null,null,{"$f":"xLists!V29","v":"nHD"},null,null,null,null,null,{"$f":"xLists!W29","v":"    ( 640 x 360,    0.2Mpx )"},null,">>",null,null,"<<",null,null,null,{"$f":"xLists!V29","v":"nHD"},null,null,null,null,null,{"$f":"xLists!W29","v":"    ( 640 x 360,    0.2Mpx )"},null,">>",null,null,null,null,null,null,null,null,null,null,null,null,null,null,null,null,{"$f":"xLists!U29","v":24},null,null,{"$f":"xLists!X29","v":2},null,null,0,null,0]
[null,null,null,null,null,null,null,null,null,null,null,null,null,null,null,null,null,null,"<<",null,null,null,{"$f":"xLists!V30","v":"QnHD"},null,null,null,null,null,{"$f":"xLists!W30","v":"    ( 320 x 180,    0.1Mpx )"},null,">>",null,null,"<<",null,null,null,{"$f":"xLists!V30","v":"QnHD"},null,null,null,null,null,{"$f":"xLists!W30","v":"    ( 320 x 180,    0.1Mpx )"},null,">>",null,null,null,null,null,null,null,null,null,null,null,null,null,null,null,null,{"$f":"xLists!U30","v":25},null,null,{"$f":"xLists!X30","v":2},null,null,0,null,0]
[]
[]
[null,null,null,null,null,null,null,null,null,null,null,null,null,null,null,null,null,null,null,null,null,null,null,null,null,null,null,null,null,null,null,null,null,null,null,null,null,null,null,null,null,null,null,null,null,null,null,null,null,null,null,null,null,null,{"$f":"ROW(BC446)","v":446}]
[null,null,null,null,null,null,null,null,null,null,null,null,null,null,null,null,null,null,null,"Specific terminology may vary across platforms and companies. Common resolutions include:"]
[]
[null,null,null,null,null,null,null,null,null,null,null,null,null,null,null,null,null,null,null,null,"1)  720p - Most TV stations are broadcast at this resolution"]
[null,null,null,null,null,null,null,null,null,null,null,null,null,null,null,null,null,null,null,null,"2)  1080p - This is the resolution of Blu-Ray movies"]
[null,null,null,null,null,null,null,null,null,null,null,null,null,null,null,null,null,null,null,null,"3)  4K - This is the highest capable resolution for most televisions sold today"]
[]
[]
[]
[]
[]
[]
[]
[]
[]
[]
[]
[]
[null,null,null,null,null,null,null,null,null,null,null,null,null,null,null,null,null,null,null,null,null,null,null,null,null,null,null,null,null,null,null,null,null,null,null,null,null,null,null,null,null,null,null,null,null,null,null,null,null,null,null,null,null,null,{"$f":"ROW(BC464)","v":464},null,null,null,null,null,null,{"$f":"IF( AND((#NAME?>0), (#NAME?>0), (#NAME?>0), (#NAME?>0)), CONCATENATE( CHAR(34), \"Manual Resolution\", CHAR(34), \" values\"), \"--\" )","v":{"$error":"#NAME?"}},null,null,{"$f":"IF( AND((#NAME?>0), (#NAME?>0)), CONCATENATE(\"manual \",CHAR(34),\"Industry Standard\",CHAR(34),\" resolution values.\"), \"--\" )","v":{"$error":"#NAME?"}}]
[]
[null,null,null,null,null,null,null,null,null,null,null,null,null,null,null,null,null,null,null,null,null,null,null,null,null,null,null,null,null,null,null,null,null,null,null,null,null,null,null,null,null,null,null,null,null,null,null,null,null,null,null,null,null,null,null,null,null,"TRes_IndustryStd_End"]
[null,null,null,null,null,null,null,null,null,null,null,null,null,null,null,null,null,null,null,null,null,null,null,null,null,null,null,null,null,null,null,null,null,null,null,null,null,null,null,null,null,null,null,null,null,null,null,null,null,null,null,null,null,null,{"$f":"ROW(BC467)","v":467}]
[]
[null,null,null,null,null,null,null,null,null,null,null,null,null,null,"OR …",null,null,null,null,null,null,null,null,null,null,null,null,null,null,null,null,null,null,null,null,null,null,null,null,null,null,null,null,null,null,null,null,null,null,null,null,null,null,null,{"$f":"ROW(BC469)","v":469}]
[null,null,null,null,null,null,null,null,null,null,null,null,null,null,null,null,null,null,null,null,null,null,null,null,null,null,null,null,null,null,null,null,null,null,null,null,null,null,null,null,null,null,null,null,null,null,null,null,null,null,null,null,null,null,{"$f":"ROW(BC470)","v":470}]
[null,null,null,null,null,null,null,null,null,null,null,null,null,null,null,null,null,"Enter the desired minimum and maximum Resolution values …",null,null,null,null,null,null,null,null,null,null,null,null,null,null,null,null,null,null,null,null,null,null,null,null,null,null,null,null,null,null,null,null,null,null,null,null,{"$f":"ROW(BC471)","v":471},null,null,"TRes_ManualRes_Start"]
[]
[]
[null,null,null,null,null,null,null,null,null,null,null,null,null,null,null,null,null,null,null,null,null,null,null,null,"Minimum",null,null,null,null,null,null,null,null,null,"Maximum"]
[]
[null,null,null,null,null,null,null,null,null,null,null,null,null,null,null,null,null,null,null,null,null,null,null,null,"Columns",null,null,null,"Rows",null,null,null,null,null,"Columns",null,null,null,"Rows"]
[null,null,null,null,null,null,null,null,null,null,null,null,null,null,null,null,null,null,"Manual Resolution",null,null,null,null,null,null,null,null,"x",null,null,null,null,null,null,null,null,null,"x",null,null,null,null,null,null,null,null,null,null,null,null,null,null,null,null,null,null,null,null,null,null,null,{"$f":"IF( AND( (#NAME?>0), (#NAME?>0), (#NAME?>0), (#NAME?>0) ), 1, 0 )","v":{"$error":"#NAME?"}}]
[null,null,null,null,null,null,null,null,null,null,null,null,null,null,null,null,null,null,null,null,null,null,null,{"$f":" IF( ISNUMBER(AppDef_ManCol_Min),  CONCATENATE( \"  <<   \", AppDef_ManCol_Min), \"\" )","v":""},null,null,null,{"$f":" IF( AND( ISNUMBER(AppDef_ManCol_Min), ISNUMBER(AppDef_ManRow_Min) ),  \"x\", \"\" )","v":""},{"$f":" IF( ISNUMBER(AppDef_ManRow_Min),  CONCATENATE( AppDef_ManRow_Min, \"  >>\"), \"\" )","v":""},null,null,null,null,{"$f":" IF( ISNUMBER(AppDef_ManCol_Max),  CONCATENATE( \"  <<   \", AppDef_ManCol_Max), \"\" )","v":""},null,null,null,{"$f":" IF( AND( ISNUMBER(AppDef_ManCol_Max), ISNUMBER(AppDef_ManRow_Max) ),  \"x\", \"\" )","v":""},{"$f":" IF( ISNUMBER(AppDef_ManCol_Max),  CONCATENATE( AppDef_ManRow_Max, \"  >>\"), \"\" )","v":""}]
[]
[null,null,null,null,null,null,null,null,null,null,null,null,null,null,null,null,null,null,null,null,null,null,null,null,null,null,null,null,null,null,null,null,null,null,null,null,null,null,null,null,null,null,null,null,null,null,null,null,null,null,null,null,null,null,null,{"$f":"ROW(BD480)","v":480}]
[]
[null,null,null,null,null,null,null,null,null,null,null,null,null,null,null,null,null,null,null,"Resolution is the number of pixels located horizontally and vertically across the display"]
[null,null,null,null,null,null,null,null,null,null,null,null,null,null,null,null,null,null,null,null,null,null,null,null,null,null,null,null,null,null,null,null,null,null,null,null,null,null,null,null,null,null,null,null,null,null,null,null,null,null,null,null,null,null,null,{"$f":"ROW(BD483)","v":483}]
[]
[null,null,null,null,null,null,null,null,null,null,null,null,null,null,null,null,null,null,null,null,null,null,null,null,null,null,null,null,null,null,null,null,null,null,null,null,null,null,null,null,null,null,null,null,null,null,null,null,null,null,null,null,null,null,{"$f":"ROW(BC485)","v":485},null,null,"TRes_ManualRes_End"]
[]
[null,null,null,null,null,null,null,null,null,null,null,null,null,null,null,null,null,null,null,null,null,null,null,null,null,null,null,null,null,null,null,null,null,null,null,null,null,null,null,null,null,null,null,null,null,null,null,null,null,null,null,null,null,{"$f":"ROW(BB487)","v":487},null,null,null,"TRes_End"]
[]
[]
[]
[]
[]
[]
[]
[]
[]
[]
[null,null,null,null,null,null,null,null,null,null,null,null,null,null,null,null,null,null,null,null,null,null,null,null,null,null,null,null,null,null,null,null,null,null,null,null,null,null,{"$f":"CONCATENATE( \"Ver. \", App_FullVersion )","v":"Ver. [[Prod]] (Smarta2xOPENv3)"}]

{"sheet":"xSurfaceEff","index":10,"n_rows":79,"n_cols":9,"rows_kept":79,"cut":false,"hidden":true,"merged":[]}
[]
[]
[]
[]
[]
[]
[null,1,33,"Building Material","Silver - Highly polished",0.9,0.91,0.92,2]
[null,2,52,"Natural Material","Snow - Fresh",null,0.85,null,2]
[null,3,6,"Building Material","Aluminum - Pure, Highly polished",0.8,0.84,0.87,2]
[null,4,22,"Building Material","Mirror - Silvered behind glass",0.8,0.84,0.88,2]
[null,5,3,"Building Material","Aluminum - Aanodized, Matte",0.8,0.83,0.85,2]
[null,6,57,"Painted Surface","Lacquer - Pure white",0.8,0.83,0.85,2]
[null,7,43,"General","White Screen",0.75,0.8,0.85,2]
[null,8,65,"Painted Surface","Paint - White",0.75,0.8,0.85,2]
[null,9,68,"Painted Surface","White Paint on Plain Plasterboard",null,0.8,null,1]
[null,10,69,"Painted Surface","White Paint on Plasterboard, Tiles",null,0.8,null,1]
[null,11,25,"Building Material","Paper - White",0.7,0.75,0.8,2]
[null,12,18,"Building Material","Copper - Highly polished",0.7,0.73,0.75,2]
[null,13,5,"Building Material","Aluminum - Polished",0.65,0.7,0.75,2]
[null,14,29,"Building Material","Porcelain enamel - White",0.65,0.7,0.75,2]
[null,15,66,"Painted Surface","White Paint on Acoustic Tile",null,0.7,null,1]
[null,16,4,"Building Material","Aluminum - Matte",0.55000000000000004,0.65,0.75,2]
[null,17,14,"Building Material","Chrome - Polished",0.6,0.65,0.7,2]
[null,18,63,"Painted Surface","Paint - Light yellow",0.6,0.65,0.7,2]
[null,19,44,"Natural Material","Beach Sand",null,0.6,null,1]
[null,20,67,"Painted Surface","White Paint on Non-fines Concrete",null,0.6,null,1]
[null,21,7,"Building Material","Aluminum Coatings - Matte",0.55000000000000004,0.56000000000000005,0.56000000000000005,2]
[null,22,23,"Building Material","Nickel - Highly polished",0.5,0.55000000000000004,0.6,2]
[null,23,21,"Building Material","Marble - Polished",0.3,0.5,0.7,2]
[null,24,34,"Building Material","Stainless Steel",null,0.5,null,2]
[null,25,62,"Painted Surface","Paint - Light green",0.45,0.5,0.55000000000000004,2]
[null,26,13,"Building Material","Carpet - Light Grey",null,0.45,null,1]
[null,27,20,"Building Material","Limestone",0.35,0.45,0.55000000000000004,2]
[null,28,31,"Building Material","PVC Tiles - Cream",null,0.45,null,1]
[null,29,53,"Natural Material","Snow - Old",null,0.45,null,2]
[null,30,27,"Building Material","Plaster - Light",0.4,0.43,0.45,2]
[null,31,16,"Building Material","Concrete - Light Grey, Smooth",null,0.4,null,1]
[null,32,42,"Building Material","White Fibre Cement",null,0.4,null,1]
[null,33,50,"Natural Material","Sand - Dry",0.38,0.4,0.42,2]
[null,34,35,"Building Material","Synthetic Grass",null,0.35,null,1]
[null,35,38,"Building Material","Timber - Light",null,0.35,null,1]
[null,36,49,"Natural Material","Ice",0.32,0.35,0.38,2]
[null,37,28,"Building Material","Plywood - Rough",0.25,0.33,0.4,2]
[null,38,24,"Building Material","Oak - Light polished",0.25,0.3,0.35,2]
[null,39,32,"Building Material","Sandstone",0.2,0.3,0.4,2]
[null,40,64,"Painted Surface","Paint - Medium grey",0.25,0.3,0.35,2]
[null,41,48,"Natural Material","Gravel",null,0.28999999999999998,null,"--"]
[null,42,55,"Natural Material","Soil - Dry",0.22,0.28000000000000003,0.34,2]
[null,43,12,"Building Material","Carpet - Green",null,0.25,null,1]
[null,44,15,"Building Material","Concrete - Light Grey",null,0.25,null,1]
[null,45,17,"Building Material","Concrete - Rough",0.2,0.25,0.3,2]
[null,46,30,"Building Material","PVC Tiles - Brown, marbled",null,0.25,null,1]
[null,47,39,"Building Material","Timber - Medium",null,0.25,null,1]
[null,48,41,"Building Material","Timber Panelling - Light oak, Mahogany",null,0.25,null,1]
[null,49,47,"Natural Material","Grass",null,0.25,null,1]
[null,50,51,"Natural Material","Sand - Wet",0.22,0.25,0.28000000000000003,2]
[null,51,58,"Painted Surface","Paint - Brown",0.2,0.25,0.3,2]
[null,52,9,"Building Material","Brick - Common",0.15,0.23,0.3,1]
[null,53,19,"Building Material","Granite",0.2,0.23,0.25,2]
[null,54,26,"Building Material","Plaster - Dark",0.15,0.2,0.25,2]
[null,55,37,"Building Material","Timber - Dark",null,0.2,null,1]
[null,56,40,"Building Material","Timber Panelling - Dark",null,0.2,null,1]
[null,57,45,"Natural Material","Crops",0.15,0.2,0.24,2]
[null,58,59,"Painted Surface","Paint - Dark blue",0.15,0.18,0.2,2]
[null,59,60,"Painted Surface","Paint - Dark green",0.15,0.18,0.2,2]
[null,60,61,"Painted Surface","Paint - Dark red",0.15,0.18,0.2,2]
[null,61,71,"Sports","Colored Court - Dark/Light Blue",0.1,0.15000000000000002,0.2,1]
[null,62,72,"Sports","Colored Court - Dark/Light Green",0.1,0.15000000000000002,0.2,1]
[null,63,10,"Building Material","Brick - Red",0.1,0.13,0.15,2]
[null,64,46,"Natural Material","Forrest",7.0000000000000007E-2,0.11,0.14000000000000001,2]
[null,65,54,"Natural Material","Soil - Dark wet",7.0000000000000007E-2,0.11,0.14000000000000001,2]
[null,66,11,"Building Material","Carpet - Dark",null,0.1,null,1]
[null,67,36,"Building Material","Tiles - Red",null,0.1,null,1]
[null,68,43,"Natural Material","Asphalt",null,0.1,null,1]
[null,69,70,"Sports","Colored Court - Brown, Sand, Tan, Clay",0.05,0.1,0.15,1]
[null,70,56,"Natural Material","Water",7.0000000000000007E-2,0.08,0.09,2]
[null,71,8,"Building Material","Black Chalkboard",null,0.05,null,1]
[null,72,1,"General","Body where all light is reflected",null,null,1,"--"]
[null,73,2,"General","Body where no light is reflected (Black body)",null,null,0,"--"]

{"sheet":"xParamSave","index":11,"n_rows":51,"n_cols":8,"rows_kept":51,"cut":false,"hidden":true,"merged":[]}
[]
[]
[null,{"$f":"MAX(B5:B50)","v":41},"Parameter …","From …","To …","Value …","OOM Group","Unit Shape Name"]
[null,1,"Application","App_Select","Save_App_Select",15,5]
[null,2,"Sysetm Units","Tunits","Save_Tunits",1,8]
[null,3,"Ambient Light Level","TBright_Ambient_MinSelect","Save_Ambient_MinSelect",0,1]
[null,4,null,"TBright_Ambient_MaxSelect","Save_Ambient_MaxSelect",0,2]
[null,5,"Image Nits","TBright_Nits_Min","Save_Nits_Min"]
[null,6,null,"TBright_Nits_Max","Save_Nits_Max"]
[null,7,"Projected Lumens","TBright_Lumens_Min","Save_Lumens_Min"]
[null,8,null,"TBright_Lumens_Max","Save_Lumens_Max"]
[null,9,"Screen Eff","TBright_ScreenEff_Min","Save_ScreenEff_Min"]
[null,10,null,"TBright_ScreenEff_Max","Save_ScreenEff_Max"]
[null,11,"Projected Width","TSize_ImageWidth_xMin","Save_ImageWidth_xMin"]
[null,12,null,"TSize_ImageWidth_xMax","Save_ImageWidth_xMax"]
[null,13,"Projected Width Units","TSize_SizeUnitsIndex","Save_SizeUnitsIndex",6,null,"TSize_WidthUnitButton1"]
[null,14,"Projected Height","TSize_ImageHeight_xMin","Save_ImageHeight_xMin"]
[null,15,null,"TSize_ImageHeight_xMax","Save_ImageHeight_xMax"]
[null,16,"Projected Height Units","TSize_SizeUnitsIndex","Save_SizeUnitsIndex",5]
[null,17,"Projected Diag","TSize_ImageDiag_xMin","Save_ImageDiag_xMin"]
[null,18,null,"TSize_ImageDiag_xMax","Save_ImageDiag_xMax"]
[null,19,"Projected Diag Units","TSize_SizeUnitsIndex","Save_SizeUnitsIndex",5]
[null,20,"Aspect Ratio","TSize_ImageARNum_Min","Save_ImageARNum_Min"]
[null,21,null,"TSize_ImageARDenom_Min","Save_ImageARDenom_Min"]
[null,22,null,"TSize_ImageARNum_Max","Save_ImageARNum_Max"]
[null,23,null,"TSize_ImageARDenom_Max","Save_ImageARDenom_Max"]
[null,24,"View Dist","TRes_ViewDist_xMin","Save_ViewDist_xMin"]
[null,25,null,"TRes_ViewDist_xMax","Save_ViewDist_xMax"]
[null,26,"View Dist Units","TRes_ViewDistUnitsIndex","Save_ViewDistUnitsIndex",2,null,"TRes_ViewDistUnitButton1"]
[null,27,"FOV","TRes_FOV_Min","Save_FOV_Min"]
[null,28,null,"TRes_FOV_Max","Save_FOV_Max"]
[null,29,"PPD","TRes_PxPerDeg_Min","Save_PxPerDeg_Min"]
[null,30,null,"TRes_PxPerDeg_Max","Save_PxPerDeg_Max"]
[null,31,"PPI","TRes_PxPerInch_Min","Save_PxPerInch_Min"]
[null,32,null,"TRes_PxPerInch_Max","Save_PxPerInch_Max"]
[null,33,"View Dens Units","TRes_ViewDensUnitsIndex","Save_ViewDensUnitsIndex",6,null,"TRes_ViewDensUnitButton1"]
[null,34,"Text Convert","TRes_PointsToPixelsFactor_Min","Save_PointsToPixelsFactor_Min"]
[null,35,null,"TRes_PointsToPixelsFactor_Max","Save_PointsToPixelsFactor_Max"]
[null,36,"Std Resolution","StdRes_Select_Min","Save_StdRes_Select_Min",0,6]
[null,37,null,"StdRes_Select_Max","Save_StdRes_Select_Max",0,7]
[null,38,"Manual Resolution","TRes_ManResCol_Min","Save_ManResCol_Min"]
[null,39,null,"TRes_ManResRow_Min","Save_ManResRow_Min"]
[null,40,null,"TRes_ManResCol_Max","Save_ManResCol_Max"]
[null,41,null,"TRes_ManResRow_Max","Save_ManResRow_Max",0]
[null,null,null,null,null,0]
[]
[]
[]
[]
[]
[null,null,"OOM button refresh"]

{"sheet":"Summary","index":12,"n_rows":161,"n_cols":114,"rows_kept":161,"cut":false,"hidden":true,"merged":[[7,12,7,19],[7,22,7,33],[7,36,7,43],[66,108,66,112],[65,89,65,93],[65,94,65,95],[65,106,65,107],[59,108,59,112],[60,108,60,112],[15,28,15,35],[15,38,15,45],[16,28,16,35],[22,28,22,35],[16,38,16,45],[22,38,22,45],[28,38,28,45],[28,28,28,35],[59,96,59,100],[61,108,61,112],[61,106,61,107],[61,96,61,100],[62,108,62,112],[59,106,59,107],[60,106,60,107],[87,83,87,92],[8,12,8,15],[8,16,8,19],[8,22,8,33],[8,36,8,39],[34,38,34,45],[35,38,35,45],[34,28,34,35],[35,28,35,35],[9,12,9,15],[9,16,9,19],[9,22,9,33],[9,36,9,39],[9,40,9,43],[8,40,8,43],[33,38,33,45],[36,38,36,45],[53,39,53,50],[59,89,59,93],[32,38,32,45],[87,93,87,99],[30,38,30,45],[31,38,31,45],[30,36,30,37],[86,109,86,120],[87,100,87,101],[84,109,84,120],[61,101,61,105],[60,101,60,105],[59,101,59,105],[78,96,78,100],[71,108,71,112],[71,89,71,93],[71,94,71,95],[71,96,71,100],[76,101,76,105],[73,106,73,107],[74,108,74,112],[68,108,68,112],[84,93,84,108],[84,83,84,92],[86,93,86,99],[86,102,86,108],[72,108,72,112],[77,96,77,100],[77,89,77,93],[72,101,72,105],[67,108,67,112],[104,102,104,108],[113,93,113,99],[113,100,113,101],[97,102,97,108],[113,102,113,108],[111,93,111,99],[111,100,111,101],[111,102,111,108],[112,93,112,99],[112,100,112,101],[108,100,108,101],[98,102,98,108],[104,100,104,101],[101,102,101,108],[110,109,113,120],[110,100,110,101],[110,102,110,108],[112,102,112,108],[76,113,77,118],[76,108,76,112],[73,101,73,105],[7,45,7,49],[9,45,9,49],[8,45,8,49],[75,89,75,93],[94,93,94,99],[94,100,94,101],[94,102,94,108],[89,100,89,101],[66,89,66,93],[65,108,65,112],[76,81,77,88],[60,89,60,93],[78,101,78,105],[78,106,78,107],[78,108,78,112],[78,89,78,93],[78,94,78,95],[76,96,76,100],[76,94,77,95],[77,108,77,112],[77,101,77,105],[74,94,74,95],[74,96,74,100],[72,96,72,100],[68,89,68,93],[73,108,73,112],[73,94,73,95],[75,108,75,112],[75,94,75,95],[59,94,59,95],[103,83,103,92],[104,83,104,92],[60,94,60,95],[60,96,60,100],[66,101,66,105],[66,106,66,107],[67,94,67,95],[67,89,67,93],[67,106,67,107],[62,89,62,93],[62,94,62,95],[62,106,62,107],[67,101,67,105],[66,94,66,95],[66,96,66,100],[65,101,65,105],[62,101,62,105],[62,96,62,100],[65,96,65,100],[61,89,61,93],[61,94,61,95],[99,102,99,108],[100,102,100,108],[88,83,88,92],[89,83,89,92],[88,100,88,101],[95,100,95,101],[101,83,101,92],[100,93,100,99],[101,100,101,101],[91,83,93,92],[97,93,97,99],[88,93,88,99],[100,83,100,92],[99,83,99,92],[98,93,98,99],[99,93,99,99],[101,93,101,99],[97,100,97,101],[98,100,98,101],[99,100,99,101],[100,100,100,101],[89,93,89,99],[95,93,95,99],[111,83,111,92],[113,83,113,92],[103,93,103,99],[103,100,103,101],[110,93,110,99],[107,100,107,101],[107,93,107,99],[91,109,93,120],[94,83,94,92],[104,93,104,99],[106,102,106,108],[108,83,108,92],[107,83,107,92],[107,102,107,108],[108,102,108,108],[106,83,106,92],[106,93,106,99],[106,100,106,101],[108,93,108,99],[98,83,98,92],[97,83,97,92],[103,102,103,108],[95,83,95,92],[110,83,110,92],[88,102,88,108],[87,102,87,108],[89,102,89,108],[95,102,95,108],[73,89,73,93],[74,89,74,93],[67,96,67,100],[72,106,72,107],[74,101,74,105],[68,94,68,95],[68,106,68,107],[71,106,71,107],[76,106,77,107],[76,89,76,93],[68,101,68,105],[68,96,68,100],[71,101,71,105],[72,89,72,93],[72,94,72,95],[75,96,75,100],[75,101,75,105],[75,106,75,107],[73,96,73,100],[74,106,74,107],[33,28,33,35],[30,28,30,35],[17,38,17,45],[18,38,18,45],[19,38,19,45],[20,38,20,45],[23,38,23,45],[24,38,24,45],[25,38,25,45],[26,38,26,45],[29,38,29,45],[29,36,29,37],[26,36,26,37],[25,36,25,37],[24,36,24,37],[36,28,36,35],[31,28,31,35],[31,36,31,37],[17,36,17,37],[17,28,17,35],[18,28,18,35],[19,28,19,35],[20,28,20,35],[34,16,35,27],[36,16,36,27],[19,36,19,37],[18,36,18,37],[23,36,23,37],[20,36,20,37],[25,28,25,35],[26,28,26,35],[29,28,29,35],[36,36,36,37],[34,36,35,37],[33,36,33,37],[32,36,32,37],[23,28,23,35],[24,28,24,35],[32,28,32,35]]}
[]
[]
[]
[]
[]
[]
[]
[null,null,null,null,null,null,null,null,null,null,null,null,"Resolution",null,null,null,null,null,null,null,null,null,"Image Size",null,null,null,null,null,null,null,null,null,null,null,null,null,"Brightness",null,null,null,null,null,null,null,null,"# of Matching"]
[null,null,null,null,null,null,null,null,null,null,null,"Max:",{"$f":"Display_ResolutionSimple_Max","v":"-- x --"},null,null,null,{"$f":"Display_Mpx_Max","v":"-- Mpx"},null,null,null,null,"Max:",{"$f":"CONCATENATE( \"W: \", Display_ImageWidth_Max, \"  x   H: \", Display_ImageHeight_Max, \"   ( D: \", Display_ImageDiag_Max, \" )\"  )","v":"W: -- in  x   H: -- in   ( D: -- in )"},null,null,null,null,null,null,null,null,null,null,null,null,"Max:",{"$f":"Display_Lumens_Max","v":"-- lm"},null,null,null,{"$f":"Display_Nits_Max","v":"-- nits"},null,null,null,null,"Chipsets"]
[null,null,null,null,null,null,null,null,null,null,null,"Min:",{"$f":"Display_ResolutionSimple_Min","v":"-- x --"},null,null,null,{"$f":"Display_Mpx_Min","v":"-- Mpx"},null,null,null,null,"Min:",{"$f":"CONCATENATE( \"W: \", Display_ImageWidth_Min, \"  x   H: \", Display_ImageHeight_Min, \"   ( D: \", Display_ImageDiag_Min, \" )\"  )","v":"W: -- in  x   H: -- in   ( D: -- in )"},null,null,null,null,null,null,null,null,null,null,null,null,"Min:",{"$f":"Display_Lumens_Min","v":"-- lm"},null,null,null,{"$f":"Display_Nits_Min","v":"-- nits"},null,null,null,null,{"$f":"Index_Chipset_Max","v":0}]
[]
[]
[]
[]
[]
[null,null,null,null,null,null,null,null,null,null,null,null,null,null,null,null,null,null,null,null,null,null,null,null,null,null,null,null,null,null,null,null,null,null,null,null,null,null,null,null,null,null,null,null,null,null,null,null,null,null,null,null,null,{"$f":"ROW(BB16)","v":16}]
[null,null,null,null,null,null,null,null,null,null,null,null,null,null,null,null,"Image Brightness",null,null,null,null,null,null,null,null,null,null,null,"Min",null,null,null,null,null,null,null,null,null,"Max",null,null,null,null,null,null,null,null,null,null,null,null,null,null,null,null,null,null,null,null,null,null,null,null,null,null,null,null,null,null,null,null,null,null,null,null,null,null,null,null,null,null,true]
[null,null,null,null,null,null,null,null,null,null,null,null,null,null,null,null,"Ambient Light Level",null,null,null,null,null,null,null,null,null,null,null,{"$f":"Display_Ambient_Min","v":"--"},null,null,null,null,null,null,null,"- to -",null,{"$f":"Display_Ambient_Max","v":"--"},null,null,null,null,null,null,null,null,null,null,null,null,null,null,null,null,null,null,{"$f":"#REF!","v":{"$error":"#REF!"}},null,{"$f":"#REF!","v":{"$error":"#REF!"}},null,null,null,null,null,null,null,null,null,null,null,null,null,null,null,null,null,null,null,null,null,true]
[null,null,null,null,null,null,null,null,null,null,null,null,null,null,null,null,"Image Nits",null,null,null,null,null,null,null,null,null,null,null,{"$f":"Display_Nits_Min","v":"-- nits"},null,null,null,null,null,null,null,"- to -",null,{"$f":"Display_Nits_Max","v":"-- nits"},null,null,null,null,null,null,null,null,null,null,null,null,null,null,null,null,null,null,{"$f":"#REF!","v":{"$error":"#REF!"}},null,{"$f":"#REF!","v":{"$error":"#REF!"}},null,null,null,null,null,null,null,null,null,null,null,null,null,null,null,null,null,null,null,null,null,false]
[null,null,null,null,null,null,null,null,null,null,null,null,null,null,null,null,"Projected Lumens",null,null,null,null,null,null,null,null,null,null,null,{"$f":"Display_Lumens_Min","v":"-- lm"},null,null,null,null,null,null,null,"- to -",null,{"$f":"Display_Lumens_Max","v":"-- lm"},null,null,null,null,null,null,null,null,null,null,null,null,null,null,null,null,null,null,{"$f":"#REF!","v":{"$error":"#REF!"}},null,{"$f":"#REF!","v":{"$error":"#REF!"}}]
[null,null,null,null,null,null,null,null,null,null,null,null,null,null,null,null,"Screen Efficiency",null,null,null,null,null,null,null,null,null,null,null,{"$f":"Display_ScreenEff_Min","v":"-- %"},null,null,null,null,null,null,null,"- to -",null,{"$f":"Display_ScreenEff_Max","v":"-- %"},null,null,null,null,null,null,null,null,null,null,null,null,null,null,null,null,null,null,{"$f":"#REF!","v":{"$error":"#REF!"}},null,{"$f":"#REF!","v":{"$error":"#REF!"}}]
[]
[null,null,null,null,null,null,null,null,null,null,null,null,null,null,null,null,"Image Size",null,null,null,null,null,null,null,null,null,null,null,"Min",null,null,null,null,null,null,null,null,null,"Max"]
[null,null,null,null,null,null,null,null,null,null,null,null,null,null,null,null,"Projected Image Width",null,null,null,null,null,null,null,null,null,null,null,{"$f":"Display_ImageWidth_Min","v":"-- in"},null,null,null,null,null,null,null,"- to -",null,{"$f":"Display_ImageWidth_Max","v":"-- in"},null,null,null,null,null,null,null,null,null,null,null,null,null,null,null,null,null,null,{"$f":"IF( AND(#REF!=1,#REF!= 1,#REF!= 1), 1, 0 )","v":{"$error":"#REF!"}},null,{"$f":"IF( AND(#REF!=1,#REF!= 1,#REF!= 1), 1, 0 )","v":{"$error":"#REF!"}}]
[null,null,null,null,null,null,null,null,null,null,null,null,null,null,null,null,"Projected Image Height",null,null,null,null,null,null,null,null,null,null,null,{"$f":"Display_ImageHeight_Min","v":"-- in"},null,null,null,null,null,null,null,"- to -",null,{"$f":"Display_ImageHeight_Max","v":"-- in"},null,null,null,null,null,null,null,null,null,null,null,null,null,null,null,null,null,null,{"$f":"IF( AND(#REF!=1,#REF!= 1,#REF!= 1), 1, 0 )","v":{"$error":"#REF!"}},null,{"$f":"IF( AND(#REF!=1,#REF!= 1,#REF!= 1), 1, 0 )","v":{"$error":"#REF!"}}]
[null,null,null,null,null,null,null,null,null,null,null,null,null,null,null,null,"Projected Image Diagonal",null,null,null,null,null,null,null,null,null,null,null,{"$f":"Display_ImageDiag_Min","v":"-- in"},null,null,null,null,null,null,null,"- to -",null,{"$f":"Display_ImageDiag_Max","v":"-- in"},null,null,null,null,null,null,null,null,null,null,null,null,null,null,null,null,null,null,{"$f":"IF( AND(#REF!=1,#REF!= 1,#REF!= 1), 1, 0 )","v":{"$error":"#REF!"}},null,{"$f":"IF( AND(#REF!=1,#REF!= 1,#REF!= 1), 1, 0 )","v":{"$error":"#REF!"}}]
[null,null,null,null,null,null,null,null,null,null,null,null,null,null,null,null,"Image Aspect Ratio",null,null,null,null,null,null,null,null,null,null,null,{"$f":"IF(Display_AspectRatio_Min=AppDef_AR_Min,DisplayApp_AR_Min,IF(Display_AspectRatio_Min=UserDef_AR_Min,DisplayUser_AR_Min,Display_AspectRatio_Min))","v":"--"},null,null,null,null,null,null,null,"- to -",null,{"$f":"IF(Display_AspectRatio_Max=AppDef_AR_Max,DisplayApp_AR_Max,IF(Display_AspectRatio_Max=UserDef_AR_Max,DisplayUser_AR_Max,Display_AspectRatio_Max))","v":"--"},null,null,null,null,null,null,null,null,null,null,null,null,null,null,null,null,null,null,{"$f":"IF( AND(#REF!=1,#REF!= 1,#REF!= 1), 1, 0 )","v":{"$error":"#REF!"}},null,{"$f":"IF( AND(#REF!=1,#REF!= 1,#REF!= 1), 1, 0 )","v":{"$error":"#REF!"}}]
[]
[null,null,null,null,null,null,null,null,null,null,null,null,null,null,null,null,"Image Resolution",null,null,null,null,null,null,null,null,null,null,null,"Min",null,null,null,null,null,null,null,null,null,"Max"]
[null,null,null,null,null,null,null,null,null,null,null,null,null,null,null,null,"Viewing Distance",null,null,null,null,null,null,null,null,null,null,null,{"$f":"IF(OR(DisplayDefaults_Toggle,DisplayUser_ViewDist_Min=\"--\"), DisplayApp_ViewDist_Min, DisplayUser_ViewDist_Min)","v":"--"},null,null,null,null,null,null,null,"- to -",null,{"$f":"IF(OR(DisplayDefaults_Toggle,DisplayUser_ViewDist_Max=\"--\"), DisplayApp_ViewDist_Max, DisplayUser_ViewDist_Max)","v":"--"},null,null,null,null,null,null,null,null,null,null,null,null,null,null,null,null,null,null,{"$f":"IF( AND(#REF!=1,#REF!= 1), 1, 0 )","v":{"$error":"#REF!"}},null,{"$f":"IF( AND(#REF!=1,#REF!= 1), 1, 0 )","v":{"$error":"#REF!"}}]
[null,null,null,null,null,null,null,null,null,null,null,null,null,null,null,null,"Horizontal Image FOV",null,null,null,null,null,null,null,null,null,null,null,{"$f":"IF(OR(DisplayDefaults_Toggle,DisplayUser_FOV_Min=\"--\"), DisplayApp_FOV_Min, DisplayUser_FOV_Min)","v":"--"},null,null,null,null,null,null,null,"- to -",null,{"$f":"IF(OR(DisplayDefaults_Toggle,DisplayUser_FOV_Max=\"--\"), DisplayApp_FOV_Max, DisplayUser_FOV_Max)","v":"--"},null,null,null,null,null,null,null,null,null,null,null,null,null,null,null,null,null,null,{"$f":"IF( AND(#REF!=1,#REF!= 1), 1, 0 )","v":{"$error":"#REF!"}},null,{"$f":"IF( AND(#REF!=1,#REF!= 1), 1, 0 )","v":{"$error":"#REF!"}}]
[null,null,null,null,null,null,null,null,null,null,null,null,null,null,null,null,"Pixels Per Degree",null,null,null,null,null,null,null,null,null,null,null,{"$f":"IF(OR(DisplayDefaults_Toggle,DisplayUser_PxPerDeg_Min=\"--\"), IF(AppDef_PxPerDeg_Min<AppDef_PxPerDeg_Max, DisplayApp_PxPerDeg_Min, DisplayApp_PxPerDeg_Max), DisplayUser_PxPerDeg_Min)","v":"--"},null,null,null,null,null,null,null,"- to -",null,{"$f":"IF(OR(DisplayDefaults_Toggle,DisplayUser_PxPerDeg_Max=\"--\"), IF(AppDef_PxPerDeg_Min<AppDef_PxPerDeg_Max, DisplayApp_PxPerDeg_Max, DisplayApp_PxPerDeg_Min), DisplayUser_PxPerDeg_Max)","v":"--"},null,null,null,null,null,null,null,null,null,null,null,null,null,null,null,null,null,null,{"$f":"IF( AND(#REF!= 1,#REF!= 1), 1, 0 )","v":{"$error":"#REF!"}},null,{"$f":"IF( AND(#REF!= 1,#REF!= 1), 1, 0 )","v":{"$error":"#REF!"}}]
[null,null,null,null,null,null,null,null,null,null,null,null,null,null,null,null,"Pixels Per Length",null,null,null,null,null,null,null,null,null,null,null,{"$f":"IF(OR(DisplayDefaults_Toggle,DisplayUser_PxPerIn_Min=\"--\"), DisplayApp_PxPerIn_Min, DisplayUser_PxPerIn_Min)","v":"--"},null,null,null,null,null,null,null,"- to -",null,{"$f":"IF(OR(DisplayDefaults_Toggle,DisplayUser_PxPerIn_Max=\"--\"), DisplayApp_PxPerIn_Max, DisplayUser_PxPerIn_Max)","v":"--"},null,null,null,null,null,null,null,null,null,null,null,null,null,null,null,null,null,null,{"$f":"IF( AND(#REF!= 1,#REF!= 1), 1, 0 )","v":{"$error":"#REF!"}},null,{"$f":"IF( AND(#REF!= 1,#REF!= 1), 1, 0 )","v":{"$error":"#REF!"}}]
[null,null,null,null,null,null,null,null,null,null,null,null,null,null,null,null,"Pixels per Point",null,null,null,null,null,null,null,null,null,null,null,{"$f":"IF(OR(DisplayDefaults_Toggle,DisplayUser_TextFactor_Min=\"--\"), DisplayApp_TextFactor_Min, DisplayUser_TextFactor_Min)","v":"--"},null,null,null,null,null,null,null,"- to -",null,{"$f":"IF(OR(DisplayDefaults_Toggle,DisplayUser_TextFactor_Max=\"--\"), DisplayApp_TextFactor_Max, DisplayUser_TextFactor_Max)","v":"--"},null,null,null,null,null,null,null,null,null,null,null,null,null,null,null,null,null,null,{"$f":"IF( AND(#REF!= 1,#REF!= 1), 1, 0 )","v":{"$error":"#REF!"}},null,{"$f":"IF( AND(#REF!= 1,#REF!= 1), 1, 0 )","v":{"$error":"#REF!"}}]
[null,null,null,null,null,null,null,null,null,null,null,null,null,null,null,null,"   Standard Resolution",null,null,null,null,null,null,null,null,null,null,null,{"$f":"IF(Display_Mpx_Max>=Display_Mpx_Min,Display_ResolutionName_Min,Display_ResolutionName_Max)","v":"--"},null,null,null,null,null,null,null,"- to -",null,{"$f":"IF(Display_Mpx_Max>=Display_Mpx_Min,Display_ResolutionName_Max,Display_ResolutionName_Min)","v":"--"},null,null,null,null,null,null,null,null,null,null,null,null,null,null,null,null,null,null,{"$f":"IF( AND(#REF!= 1,#REF!= 1), 1, 0 )","v":{"$error":"#REF!"}},null,{"$f":"IF( AND(#REF!= 1,#REF!= 1), 1, 0 )","v":{"$error":"#REF!"}}]
[null,null,null,null,null,null,null,null,null,null,null,null,null,null,null,null,null,null,null,null,null,null,null,null,null,null,null,null,{"$f":"IF(AC35 = \"--\", \"--\", IF(Display_Mpx_Max>=Display_Mpx_Min,Display_ResolutionSimple_Min,Display_ResolutionSimple_Max))","v":"--"},null,null,null,null,null,null,null,null,null,{"$f":"IF(AM35 = \"--\", \"--\", IF(Display_Mpx_Max>=Display_Mpx_Min,Display_ResolutionSimple_Max,Display_ResolutionSimple_Min))","v":"--"},null,null,null,null,null,null,null,null,null,null,null,null,null,null,null,null,null,null,{"$f":"BF75","v":0},null,{"$f":"BH75","v":0}]
[null,null,null,null,null,null,null,null,null,null,null,null,null,null,null,null,"   Manual Resolution",null,null,null,null,null,null,null,null,null,null,null,{"$f":"IF(AC35 <> \"--\", \"--\", IF(Display_Mpx_Max>=Display_Mpx_Min,Display_ResolutionSimple_Min,Display_ResolutionSimple_Max))","v":"-- x --"},null,null,null,null,null,null,null,"- to -",null,{"$f":"IF(AM35 <> \"--\", \"--\", IF(Display_Mpx_Max>=Display_Mpx_Min,Display_ResolutionSimple_Max,Display_ResolutionSimple_Min))","v":"-- x --"},null,null,null,null,null,null,null,null,null,null,null,null,null,null,null,null,null,null,{"$f":"IF( AND(#REF!= 1,#REF!= 1), 1, 0 )","v":{"$error":"#REF!"}},null,{"$f":"IF( AND(#REF!= 1,#REF!= 1), 1, 0 )","v":{"$error":"#REF!"}}]
[null,null,null,null,null,null,null,null,null,null,null,null,null,null,null,null,null,null,null,null,null,null,null,null,null,null,null,null,null,null,null,null,null,null,null,null,null,null,null,null,null,null,null,null,null,null,null,null,null,null,null,null,null,{"$f":"ROW(BB38)","v":38}]
[]
[]
[]
[]
[null,null,null,null,null,null,null,null,null,null,null,null,null,null,null,null,null,null,null,null,null,null,null,null,null,null,null,null,null,null,null,null,null,null,null,null,null,null,null,null,null,null,null,null,null,null,null,null,null,null,null,null,null,{"$f":"ROW(BB43)","v":43}]
[null,null,null,null,null,null,null,null,null,null,null,null,null,"Display Units ",null,null,null,null,null,null,null,null,null,null,null,null,null,null,null,null,null,null,null,null,null,null,null,null,null,null,null,null,null,null,null,null,null,null,null,null,null,null,null,null,null,null,null,null,null,null,0]
[null,null,null,null,null,null,null,null,null,null,null,null,null,null,null,null,null,"inches",null,null,null,null,"• All calculation results are shown in these units",null,null,null,null,null,null,null,null,null,null,null,null,null,null,null,null,null,null,null,null,null,null,null,null,null,null,null,null,null,null,null,null,null,null,null,null,null,null,1]
[null,null,null,null,null,null,null,null,null,null,null,null,null,null,null,null,null,"feet",null,null,null,null,null,null,null,null,null,null,null,null,null,null,null,null,null,null,null,null,null,null,null,null,null,null,null,null,null,null,null,null,null,null,null,null,null,null,null,null,null,null,null,2]
[null,null,null,null,null,null,null,null,null,null,null,null,null,null,null,null,null,"meters",null,null,null,null,null,null,null,null,null,null,null,null,null,null,null,null,null,null,null,null,null,null,null,null,null,null,null,null,null,null,null,null,null,null,null,null,null,null,null,null,null,null,null,3]
[]
[]
[]
[null,null,null,null,null,null,null,null,null,null,null,null,null,null,null,null,null,null,null,null,null,null,null,null,null,null,null,null,null,null,null,null,null,null,null,null,null,null,null,null,null,null,null,null,null,null,null,null,null,null,null,null,null,{"$f":"ROW(BB51)","v":51}]
[]
[]
[null,null,null,null,null,null,null,null,null,null,null,null,null,null,null,null,null,null,null,null,null,null,null,null,null,null,null,null,null,null,null,null,null,null,null,null,null,null,null,{"$f":"CONCATENATE( \"Ver. \", App_FullVersion )","v":"Ver. [[Prod]] (Smarta2xOPENv3)"}]
[]
[]
[]
[null,null,null,null,null,null,null,null,null,null,null,null,null,null,null,null,null,null,null,null,null,null,null,null,null,null,null,null,null,null,null,null,null,null,null,null,null,null,null,null,null,null,null,null,null,null,null,null,null,null,null,null,null,{"$f":"ROW(BB58)","v":58}]
[null,null,null,null,null,null,null,null,null,null,null,null,null,null,null,null,null,null,null,null,null,null,null,null,null,null,null,null,null,null,null,null,null,null,null,null,null,null,null,null,null,null,null,null,null,null,null,null,null,null,null,null,null,null,null,null,null,null,null,null,null,null,null,null,null,null,null,null,null,null,null,null,null,null,null,null,null,null,null,null,null,"Image Brightness"]
[null,null,null,null,null,null,null,null,null,null,null,null,null,null,null,null,null,null,null,null,null,null,null,null,null,null,null,null,null,null,null,null,null,null,null,null,null,null,null,null,null,null,null,null,null,null,null,null,null,null,null,null,null,null,null,null,null,null,null,null,null,null,null,null,null,null,null,null,null,null,null,null,null,null,null,null,null,null,null,null,null,"Ambient Light Level",null,null,null,null,null,null,null,{"$f":"#NAME?","v":{"$error":"#NAME?"}},null,null,null,null,"- to -",null,{"$f":"#NAME?","v":{"$error":"#NAME?"}},null,null,null,null,{"$f":"#NAME?","v":{"$error":"#NAME?"}},null,null,null,null,"- to -",null,{"$f":"#NAME?","v":{"$error":"#NAME?"}},null,null,null,null,{"$f":"#NAME?","v":{"$error":"#NAME?"}}]
[null,null,null,null,null,null,null,null,null,null,null,null,null,null,null,null,null,null,null,null,null,null,null,null,null,null,null,null,null,null,null,null,null,null,null,null,null,null,null,null,null,null,null,null,null,null,null,null,null,null,null,null,null,null,null,null,null,null,null,null,null,null,null,null,null,null,null,null,null,null,null,null,null,null,null,null,null,null,null,null,null,"Image Nits",null,null,null,null,null,null,null,{"$f":"#NAME?","v":{"$error":"#NAME?"}},null,null,null,null,"- to -",null,{"$f":"#NAME?","v":{"$error":"#NAME?"}},null,null,null,null,{"$f":"#NAME?","v":{"$error":"#NAME?"}},null,null,null,null,"- to -",null,{"$f":"#NAME?","v":{"$error":"#NAME?"}},null,null,null,null,{"$f":"#NAME?","v":{"$error":"#NAME?"}}]
[null,null,null,null,null,null,null,null,null,null,null,null,null,null,null,null,null,null,null,null,null,null,null,null,null,null,null,null,null,null,null,null,null,null,null,null,null,null,null,null,null,null,null,null,null,null,null,null,null,null,null,null,null,null,null,null,null,null,null,null,null,null,null,null,null,null,null,null,null,null,null,null,null,null,null,null,null,null,null,null,null,"Projected Lumens",null,null,null,null,null,null,null,{"$f":"#NAME?","v":{"$error":"#NAME?"}},null,null,null,null,"- to -",null,{"$f":"#NAME?","v":{"$error":"#NAME?"}},null,null,null,null,{"$f":"#NAME?","v":{"$error":"#NAME?"}},null,null,null,null,"- to -",null,{"$f":"#NAME?","v":{"$error":"#NAME?"}},null,null,null,null,{"$f":"#NAME?","v":{"$error":"#NAME?"}}]
[null,null,null,null,null,null,null,null,null,null,null,null,null,null,null,null,null,null,null,null,null,null,null,null,null,null,null,null,null,null,null,null,null,null,null,null,null,null,null,null,null,null,null,null,null,null,null,null,null,null,null,null,null,null,null,null,null,null,null,null,null,null,null,null,null,null,null,null,null,null,null,null,null,null,null,null,null,null,null,null,null,"Screen Efficiency",null,null,null,null,null,null,null,{"$f":"#NAME?","v":{"$error":"#NAME?"}},null,null,null,null,"- to -",null,{"$f":"#NAME?","v":{"$error":"#NAME?"}},null,null,null,null,{"$f":"#REF!","v":{"$error":"#REF!"}},null,null,null,null,"- to -",null,{"$f":"#REF!","v":{"$error":"#REF!"}},null,null,null,null,{"$f":"#NAME?","v":{"$error":"#NAME?"}}]
[]
[null,null,null,null,null,null,null,null,null,null,null,null,null,null,null,null,null,null,null,null,null,null,null,null,null,null,null,null,null,null,null,null,null,null,null,null,null,null,null,null,null,null,null,null,null,null,null,null,null,null,null,null,null,null,null,null,null,null,null,null,null,null,null,null,null,null,null,null,null,null,null,null,null,null,null,null,null,null,null,null,null,"Image Size"]
[null,null,null,null,null,null,null,null,null,null,null,null,null,null,null,null,null,null,null,null,null,null,null,null,null,null,null,null,null,null,null,null,null,null,null,null,null,null,null,null,null,null,null,null,null,null,null,null,null,null,null,null,null,null,null,null,null,null,null,null,null,null,null,null,null,null,null,null,null,null,null,null,null,null,null,null,null,null,null,null,null,"Projected Image Width",null,null,null,null,null,null,null,{"$f":"#NAME?","v":{"$error":"#NAME?"}},null,null,null,null,"- to -",null,{"$f":"#NAME?","v":{"$error":"#NAME?"}},null,null,null,null,{"$f":"#NAME?","v":{"$error":"#NAME?"}},null,null,null,null,"- to -",null,{"$f":"#NAME?","v":{"$error":"#NAME?"}},null,null,null,null,{"$f":"#REF!","v":{"$error":"#REF!"}}]
[null,null,null,null,null,null,null,null,null,null,null,null,null,null,null,null,null,null,null,null,null,null,null,null,null,null,null,null,null,null,null,null,null,null,null,null,null,null,null,null,null,null,null,null,null,null,null,null,null,null,null,null,null,null,null,null,null,null,null,null,null,null,null,null,null,null,null,null,null,null,null,null,null,null,null,null,null,null,null,null,null,"Projected Image Height",null,null,null,null,null,null,null,{"$f":"#NAME?","v":{"$error":"#NAME?"}},null,null,null,null,"- to -",null,{"$f":"#NAME?","v":{"$error":"#NAME?"}},null,null,null,null,{"$f":"#NAME?","v":{"$error":"#NAME?"}},null,null,null,null,"- to -",null,{"$f":"#NAME?","v":{"$error":"#NAME?"}},null,null,null,null,{"$f":"#REF!","v":{"$error":"#REF!"}}]
[null,null,null,null,null,null,null,null,null,null,null,null,null,null,null,null,null,null,null,null,null,null,null,null,null,null,null,null,null,null,null,null,null,null,null,null,null,null,null,null,null,null,null,null,null,null,null,null,null,null,null,null,null,null,null,null,null,null,null,null,null,null,null,null,null,null,null,null,null,null,null,null,null,null,null,null,null,null,null,null,null,"Projected Image Diagonal",null,null,null,null,null,null,null,{"$f":"#NAME?","v":{"$error":"#NAME?"}},null,null,null,null,"- to -",null,{"$f":"#NAME?","v":{"$error":"#NAME?"}},null,null,null,null,{"$f":"#NAME?","v":{"$error":"#NAME?"}},null,null,null,null,"- to -",null,{"$f":"#NAME?","v":{"$error":"#NAME?"}},null,null,null,null,{"$f":"#REF!","v":{"$error":"#REF!"}}]
[null,null,null,null,null,null,null,null,null,null,null,null,null,null,null,null,null,null,null,null,null,null,null,null,null,null,null,null,null,null,null,null,null,null,null,null,null,null,null,null,null,null,null,null,null,null,null,null,null,null,null,null,null,null,null,null,null,null,null,null,null,null,null,null,null,null,null,null,null,null,null,null,null,null,null,null,null,null,null,null,null,"Image Aspect Ratio",null,null,null,null,null,null,null,{"$f":"#NAME?","v":{"$error":"#NAME?"}},null,null,null,null,"- to -",null,{"$f":"#NAME?","v":{"$error":"#NAME?"}},null,null,null,null,{"$f":"#NAME?","v":{"$error":"#NAME?"}},null,null,null,null,"- to -",null,{"$f":"#NAME?","v":{"$error":"#NAME?"}},null,null,null,null,{"$f":"#REF!","v":{"$error":"#REF!"}}]
[]
[null,null,null,null,null,null,null,null,null,null,null,null,null,null,null,null,null,null,null,null,null,null,null,null,null,null,null,null,null,null,null,null,null,null,null,null,null,null,null,null,null,null,null,null,null,null,null,null,null,null,null,null,null,null,null,null,null,null,null,null,null,null,null,null,null,null,null,null,null,null,null,null,null,null,null,null,null,null,null,null,null,"Image Resolution"]
[null,null,null,null,null,null,null,null,null,null,null,null,null,null,null,null,null,null,null,null,null,null,null,null,null,null,null,null,null,null,null,null,null,null,null,null,null,null,null,null,null,null,null,null,null,null,null,null,null,null,null,null,null,null,null,null,null,null,null,null,null,null,null,null,null,null,null,null,null,null,null,null,null,null,null,null,null,null,null,null,null,"Viewing Distance",null,null,null,null,null,null,null,{"$f":"#NAME?","v":{"$error":"#NAME?"}},null,null,null,null,"- to -",null,{"$f":"#NAME?","v":{"$error":"#NAME?"}},null,null,null,null,{"$f":"#NAME?","v":{"$error":"#NAME?"}},null,null,null,null,"- to -",null,{"$f":"#NAME?","v":{"$error":"#NAME?"}},null,null,null,null,{"$f":"#REF!","v":{"$error":"#REF!"}}]
[null,null,null,null,null,null,null,null,null,null,null,null,null,null,null,null,null,null,null,null,null,null,null,null,null,null,null,null,null,null,null,null,null,null,null,null,null,null,null,null,null,null,null,null,null,null,null,null,null,null,null,null,null,null,null,null,null,null,null,null,null,null,null,null,null,null,null,null,null,null,null,null,null,null,null,null,null,null,null,null,null,"Horizontal Image FOV",null,null,null,null,null,null,null,{"$f":"#NAME?","v":{"$error":"#NAME?"}},null,null,null,null,"- to -",null,{"$f":"#NAME?","v":{"$error":"#NAME?"}},null,null,null,null,{"$f":"#NAME?","v":{"$error":"#NAME?"}},null,null,null,null,"- to -",null,{"$f":"#NAME?","v":{"$error":"#NAME?"}},null,null,null,null,{"$f":"#REF!","v":{"$error":"#REF!"}}]
[null,null,null,null,null,null,null,null,null,null,null,null,null,null,null,null,null,null,null,null,null,null,null,null,null,null,null,null,null,null,null,null,null,null,null,null,null,null,null,null,null,null,null,null,null,null,null,null,null,null,null,null,null,null,null,null,null,null,null,null,null,null,null,null,null,null,null,null,null,null,null,null,null,null,null,null,null,null,null,null,null,"Pixels Per Degree",null,null,null,null,null,null,null,{"$f":"#NAME?","v":{"$error":"#NAME?"}},null,null,null,null,"- to -",null,{"$f":"#NAME?","v":{"$error":"#NAME?"}},null,null,null,null,{"$f":"#NAME?","v":{"$error":"#NAME?"}},null,null,null,null,"- to -",null,{"$f":"#NAME?","v":{"$error":"#NAME?"}},null,null,null,null,{"$f":"#REF!","v":{"$error":"#REF!"}}]
[null,null,null,null,null,null,null,null,null,null,null,null,null,null,null,null,null,null,null,null,null,null,null,null,null,null,null,null,null,null,null,null,null,null,null,null,null,null,null,null,null,null,null,null,null,null,null,null,null,null,null,null,null,null,null,null,null,null,null,null,null,null,null,null,null,null,null,null,null,null,null,null,null,null,null,null,null,null,null,null,null,"Pixel Density",null,null,null,null,null,null,null,{"$f":"#NAME?","v":{"$error":"#NAME?"}},null,null,null,null,"- to -",null,{"$f":"#NAME?","v":{"$error":"#NAME?"}},null,null,null,null,{"$f":"#NAME?","v":{"$error":"#NAME?"}},null,null,null,null,"- to -",null,{"$f":"#NAME?","v":{"$error":"#NAME?"}},null,null,null,null,{"$f":"#REF!","v":{"$error":"#REF!"}}]
[null,null,null,null,null,null,null,null,null,null,null,null,null,null,null,null,null,null,null,null,null,null,null,null,null,null,null,null,null,null,null,null,null,null,null,null,null,null,null,null,null,null,null,null,null,null,null,null,null,null,null,null,null,null,null,null,null,null,null,null,null,null,null,null,null,null,null,null,null,null,null,null,null,null,null,null,null,null,null,null,null,"Pixels per Point",null,null,null,null,null,null,null,{"$f":"#NAME?","v":{"$error":"#NAME?"}},null,null,null,null,"- to -",null,{"$f":"#NAME?","v":{"$error":"#NAME?"}},null,null,null,null,{"$f":"#NAME?","v":{"$error":"#NAME?"}},null,null,null,null,"- to -",null,{"$f":"#NAME?","v":{"$error":"#NAME?"}},null,null,null,null,{"$f":"#REF!","v":{"$error":"#REF!"}}]
[null,null,null,null,null,null,null,null,null,null,null,null,null,null,null,null,null,null,null,null,null,null,null,null,null,null,null,null,null,null,null,null,null,null,null,null,null,null,null,null,null,null,null,null,null,null,null,null,null,null,null,null,null,null,null,null,null,null,null,null,null,null,null,null,null,null,null,null,null,null,null,null,null,null,null,null,null,null,null,null,null,"Standard Resolution",null,null,null,null,null,null,null,{"$f":"#NAME?","v":{"$error":"#NAME?"}},null,null,null,null,"- to -",null,{"$f":"#NAME?","v":{"$error":"#NAME?"}},null,null,null,null,{"$f":"#NAME?","v":{"$error":"#NAME?"}},null,null,null,null,"- to -",null,{"$f":"#NAME?","v":{"$error":"#NAME?"}},null,null,null,null,{"$f":"#REF!","v":{"$error":"#REF!"}}]
[null,null,null,null,null,null,null,null,null,null,null,null,null,null,null,null,null,null,null,null,null,null,null,null,null,null,null,null,null,null,null,null,null,null,null,null,null,null,null,null,null,null,null,null,null,null,null,null,null,null,null,null,null,null,null,null,null,null,null,null,null,null,null,null,null,null,null,null,null,null,null,null,null,null,null,null,null,null,null,null,null,null,null,null,null,null,null,null,null,{"$f":"#NAME?","v":{"$error":"#NAME?"}},null,null,null,null,null,null,{"$f":"#NAME?","v":{"$error":"#NAME?"}},null,null,null,null,{"$f":"#NAME?","v":{"$error":"#NAME?"}},null,null,null,null,null,null,{"$f":"#NAME?","v":{"$error":"#NAME?"}}]
[null,null,null,null,null,null,null,null,null,null,null,null,null,null,null,null,null,null,null,null,null,null,null,null,null,null,null,null,null,null,null,null,null,null,null,null,null,null,null,null,null,null,null,null,null,null,null,null,null,null,null,null,null,null,null,null,null,null,null,null,null,null,null,null,null,null,null,null,null,null,null,null,null,null,null,null,null,null,null,null,null,"Manual Resolution",null,null,null,null,null,null,null,{"$f":"#NAME?","v":{"$error":"#NAME?"}},null,null,null,null,"- to -",null,{"$f":"#NAME?","v":{"$error":"#NAME?"}},null,null,null,null,{"$f":"#NAME?","v":{"$error":"#NAME?"}},null,null,null,null,"- to -",null,{"$f":"#NAME?","v":{"$error":"#NAME?"}},null,null,null,null,{"$f":"#REF!","v":{"$error":"#REF!"}}]
[]
[null,null,null,null,null,null,null,null,null,null,null,null,null,null,null,null,null,null,null,null,null,null,null,null,null,null,null,null,null,null,null,null,null,null,null,null,null,null,null,null,null,null,null,null,null,null,null,null,null,null,null,null,null,null,null,null,null,null,null,null,null,null,null,null,null,null,null,null,null,null,null,null,null,null,null,null,null,null,null,null,null,null,"Calculation Results: Find way to visualize and use in future release"]
[]
[]
[]
[null,null,null,null,null,null,null,null,null,null,null,null,null,null,null,null,null,null,null,null,null,null,null,null,null,null,null,null,null,null,null,null,null,null,null,null,null,null,null,null,null,null,null,null,null,null,null,null,null,null,null,null,null,null,null,null,null,null,null,null,null,null,null,null,null,null,null,null,null,null,null,null,null,null,null,null,null,null,null,null,null,null,null,"Target Application",null,null,null,null,null,null,null,null,null,{"$f":"IF( #NAME?=0, \"( No Application Selected )\", #NAME? )","v":{"$error":"#NAME?"}},null,null,null,null,null,null,null,null,null,null,null,null,null,null,null,{"$f":"CONCATENATE( \"( \", #NAME?, \" matching chipsets )\" )","v":{"$error":"#NAME?"}}]
[]
[null,null,null,null,null,null,null,null,null,null,null,null,null,null,null,null,null,null,null,null,null,null,null,null,null,null,null,null,null,null,null,null,null,null,null,null,null,null,null,null,null,null,null,null,null,null,null,null,null,null,null,null,null,null,null,null,null,null,null,null,null,null,null,null,null,null,null,null,null,null,null,null,null,null,null,null,null,null,null,null,null,null,null,null,null,null,null,null,null,null,null,null,null,"Minimum",null,null,null,null,null,null,null,null,"Maximum",null,null,null,null,null,null,"Data Source"]
[null,null,null,null,null,null,null,null,null,null,null,null,null,null,null,null,null,null,null,null,null,null,null,null,null,null,null,null,null,null,null,null,null,null,null,null,null,null,null,null,null,null,null,null,null,null,null,null,null,null,null,null,null,null,null,null,null,null,null,null,null,null,null,null,null,null,null,null,null,null,null,null,null,null,null,null,null,null,null,null,null,null,null,"Resolution Standard",null,null,null,null,null,null,null,null,null,{"$f":"#NAME?","v":{"$error":"#NAME?"}},null,null,null,null,null,null,"- to -",null,{"$f":"#NAME?","v":{"$error":"#NAME?"}}]
[null,null,null,null,null,null,null,null,null,null,null,null,null,null,null,null,null,null,null,null,null,null,null,null,null,null,null,null,null,null,null,null,null,null,null,null,null,null,null,null,null,null,null,null,null,null,null,null,null,null,null,null,null,null,null,null,null,null,null,null,null,null,null,null,null,null,null,null,null,null,null,null,null,null,null,null,null,null,null,null,null,null,null,"Resolution",null,null,null,null,null,null,null,null,null,{"$f":"#NAME?","v":{"$error":"#NAME?"}},null,null,null,null,null,null,"- to -",null,{"$f":"#NAME?","v":{"$error":"#NAME?"}},null,null,null,null,null,null,{"$f":"#REF!","v":{"$error":"#REF!"}}]
[null,null,null,null,null,null,null,null,null,null,null,null,null,null,null,null,null,null,null,null,null,null,null,null,null,null,null,null,null,null,null,null,null,null,null,null,null,null,null,null,null,null,null,null,null,null,null,null,null,null,null,null,null,null,null,null,null,null,null,null,null,null,null,null,null,null,null,null,null,null,null,null,null,null,null,null,null,null,null,null,null,null,null,"Resolution Megapixels",null,null,null,null,null,null,null,null,null,{"$f":"#NAME?","v":{"$error":"#NAME?"}},null,null,null,null,null,null,"- to -",null,{"$f":"#NAME?","v":{"$error":"#NAME?"}}]
[]
[null,null,null,null,null,null,null,null,null,null,null,null,null,null,null,null,null,null,null,null,null,null,null,null,null,null,null,null,null,null,null,null,null,null,null,null,null,null,null,null,null,null,null,null,null,null,null,null,null,null,null,null,null,null,null,null,null,null,null,null,null,null,null,null,null,null,null,null,null,null,null,null,null,null,null,null,null,null,null,null,null,null,null,"Ambient Conditions",null,null,null,null,null,null,null,null,null,null,null,null,null,null,null,null,null,null,null,null,null,null,null,null,null,{"$f":"DF95","v":{"$error":"#REF!"}}]
[]
[]
[null,null,null,null,null,null,null,null,null,null,null,null,null,null,null,null,null,null,null,null,null,null,null,null,null,null,null,null,null,null,null,null,null,null,null,null,null,null,null,null,null,null,null,null,null,null,null,null,null,null,null,null,null,null,null,null,null,null,null,null,null,null,null,null,null,null,null,null,null,null,null,null,null,null,null,null,null,null,null,null,null,null,null,"Image Nits ",null,null,null,null,null,null,null,null,null,{"$f":"#NAME?","v":{"$error":"#NAME?"}},null,null,null,null,null,null,"- to -",null,{"$f":"#NAME?","v":{"$error":"#NAME?"}},null,null,null,null,null,null,{"$f":"#REF!","v":{"$error":"#REF!"}}]
[null,null,null,null,null,null,null,null,null,null,null,null,null,null,null,null,null,null,null,null,null,null,null,null,null,null,null,null,null,null,null,null,null,null,null,null,null,null,null,null,null,null,null,null,null,null,null,null,null,null,null,null,null,null,null,null,null,null,null,null,null,null,null,null,null,null,null,null,null,null,null,null,null,null,null,null,null,null,null,null,null,null,null,"Projected Lumens",null,null,null,null,null,null,null,null,null,{"$f":"#NAME?","v":{"$error":"#NAME?"}},null,null,null,null,null,null,"- to -",null,{"$f":"#NAME?","v":{"$error":"#NAME?"}},null,null,null,null,null,null,{"$f":"#REF!","v":{"$error":"#REF!"}}]
[]
[null,null,null,null,null,null,null,null,null,null,null,null,null,null,null,null,null,null,null,null,null,null,null,null,null,null,null,null,null,null,null,null,null,null,null,null,null,null,null,null,null,null,null,null,null,null,null,null,null,null,null,null,null,null,null,null,null,null,null,null,null,null,null,null,null,null,null,null,null,null,null,null,null,null,null,null,null,null,null,null,null,null,null,"Projected Image Width",null,null,null,null,null,null,null,null,null,{"$f":"#NAME?","v":{"$error":"#NAME?"}},null,null,null,null,null,null,"- to -",null,{"$f":"#NAME?","v":{"$error":"#NAME?"}},null,null,null,null,null,null,{"$f":"#REF!","v":{"$error":"#REF!"}}]
[null,null,null,null,null,null,null,null,null,null,null,null,null,null,null,null,null,null,null,null,null,null,null,null,null,null,null,null,null,null,null,null,null,null,null,null,null,null,null,null,null,null,null,null,null,null,null,null,null,null,null,null,null,null,null,null,null,null,null,null,null,null,null,null,null,null,null,null,null,null,null,null,null,null,null,null,null,null,null,null,null,null,null,"Projected Image Height",null,null,null,null,null,null,null,null,null,{"$f":"#NAME?","v":{"$error":"#NAME?"}},null,null,null,null,null,null,"- to -",null,{"$f":"#NAME?","v":{"$error":"#NAME?"}},null,null,null,null,null,null,{"$f":"#REF!","v":{"$error":"#REF!"}}]
[null,null,null,null,null,null,null,null,null,null,null,null,null,null,null,null,null,null,null,null,null,null,null,null,null,null,null,null,null,null,null,null,null,null,null,null,null,null,null,null,null,null,null,null,null,null,null,null,null,null,null,null,null,null,null,null,null,null,null,null,null,null,null,null,null,null,null,null,null,null,null,null,null,null,null,null,null,null,null,null,null,null,null,"Projected Image Diagonal",null,null,null,null,null,null,null,null,null,{"$f":"#NAME?","v":{"$error":"#NAME?"}},null,null,null,null,null,null,"- to -",null,{"$f":"#NAME?","v":{"$error":"#NAME?"}},null,null,null,null,null,null,{"$f":"#REF!","v":{"$error":"#REF!"}}]
[null,null,null,null,null,null,null,null,null,null,null,null,null,null,null,null,null,null,null,null,null,null,null,null,null,null,null,null,null,null,null,null,null,null,null,null,null,null,null,null,null,null,null,null,null,null,null,null,null,null,null,null,null,null,null,null,null,null,null,null,null,null,null,null,null,null,null,null,null,null,null,null,null,null,null,null,null,null,null,null,null,null,null,"Projected Image Aspect Ratio",null,null,null,null,null,null,null,null,null,{"$f":"#NAME?","v":{"$error":"#NAME?"}},null,null,null,null,null,null,"- to -",null,{"$f":"#NAME?","v":{"$error":"#NAME?"}},null,null,null,null,null,null,{"$f":"#REF!","v":{"$error":"#REF!"}}]
[null,null,null,null,null,null,null,null,null,null,null,null,null,null,null,null,null,null,null,null,null,null,null,null,null,null,null,null,null,null,null,null,null,null,null,null,null,null,null,null,null,null,null,null,null,null,null,null,null,null,null,null,null,null,null,null,null,null,null,null,null,null,null,null,null,null,null,null,null,null,null,null,null,null,null,null,null,null,null,null,null,null,null,"Projected Image Area",null,null,null,null,null,null,null,null,null,{"$f":"#NAME?","v":{"$error":"#NAME?"}},null,null,null,null,null,null,"- to -",null,{"$f":"#NAME?","v":{"$error":"#NAME?"}},null,null,null,null,null,null,{"$f":"#REF!","v":{"$error":"#REF!"}}]
[]
[null,null,null,null,null,null,null,null,null,null,null,null,null,null,null,null,null,null,null,null,null,null,null,null,null,null,null,null,null,null,null,null,null,null,null,null,null,null,null,null,null,null,null,null,null,null,null,null,null,null,null,null,null,null,null,null,null,null,null,null,null,null,null,null,null,null,null,null,null,null,null,null,null,null,null,null,null,null,null,null,null,null,null,"Viewing Distance",null,null,null,null,null,null,null,null,null,{"$f":"#NAME?","v":{"$error":"#NAME?"}},null,null,null,null,null,null,"- to -",null,{"$f":"#NAME?","v":{"$error":"#NAME?"}},null,null,null,null,null,null,{"$f":"#REF!","v":{"$error":"#REF!"}}]
[null,null,null,null,null,null,null,null,null,null,null,null,null,null,null,null,null,null,null,null,null,null,null,null,null,null,null,null,null,null,null,null,null,null,null,null,null,null,null,null,null,null,null,null,null,null,null,null,null,null,null,null,null,null,null,null,null,null,null,null,null,null,null,null,null,null,null,null,null,null,null,null,null,null,null,null,null,null,null,null,null,null,null,"Horizontal Image FOV",null,null,null,null,null,null,null,null,null,{"$f":"#NAME?","v":{"$error":"#NAME?"}},null,null,null,null,null,null,"- to -",null,{"$f":"#NAME?","v":{"$error":"#NAME?"}},null,null,null,null,null,null,{"$f":"#REF!","v":{"$error":"#REF!"}}]
[]
[null,null,null,null,null,null,null,null,null,null,null,null,null,null,null,null,null,null,null,null,null,null,null,null,null,null,null,null,null,null,null,null,null,null,null,null,null,null,null,null,null,null,null,null,null,null,null,null,null,null,null,null,null,null,null,null,null,null,null,null,null,null,null,null,null,null,null,null,null,null,null,null,null,null,null,null,null,null,null,null,null,null,null,"Pixels Per Degree",null,null,null,null,null,null,null,null,null,{"$f":"#NAME?","v":{"$error":"#NAME?"}},null,null,null,null,null,null,"- to -",null,{"$f":"#NAME?","v":{"$error":"#NAME?"}},null,null,null,null,null,null,{"$f":"#REF!","v":{"$error":"#REF!"}}]
[null,null,null,null,null,null,null,null,null,null,null,null,null,null,null,null,null,null,null,null,null,null,null,null,null,null,null,null,null,null,null,null,null,null,null,null,null,null,null,null,null,null,null,null,null,null,null,null,null,null,null,null,null,null,null,null,null,null,null,null,null,null,null,null,null,null,null,null,null,null,null,null,null,null,null,null,null,null,null,null,null,null,null,"Pixels Per inch",null,null,null,null,null,null,null,null,null,{"$f":"#NAME?","v":{"$error":"#NAME?"}},null,null,null,null,null,null,"- to -",null,{"$f":"#NAME?","v":{"$error":"#NAME?"}},null,null,null,null,null,null,{"$f":"#REF!","v":{"$error":"#REF!"}}]
[null,null,null,null,null,null,null,null,null,null,null,null,null,null,null,null,null,null,null,null,null,null,null,null,null,null,null,null,null,null,null,null,null,null,null,null,null,null,null,null,null,null,null,null,null,null,null,null,null,null,null,null,null,null,null,null,null,null,null,null,null,null,null,null,null,null,null,null,null,null,null,null,null,null,null,null,null,null,null,null,null,null,null,"Pixels per mm",null,null,null,null,null,null,null,null,null,{"$f":"#NAME?","v":{"$error":"#NAME?"}},null,null,null,null,null,null,"- to -",null,{"$f":"#NAME?","v":{"$error":"#NAME?"}},null,null,null,null,null,null,{"$f":"#REF!","v":{"$error":"#REF!"}}]
[]
[null,null,null,null,null,null,null,null,null,null,null,null,null,null,null,null,null,null,null,null,null,null,null,null,null,null,null,null,null,null,null,null,null,null,null,null,null,null,null,null,null,null,null,null,null,null,null,null,null,null,null,null,null,null,null,null,null,null,null,null,null,null,null,null,null,null,null,null,null,null,null,null,null,null,null,null,null,null,null,null,null,null,null,"Text Height",null,null,null,null,null,null,null,null,null,{"$f":"Target!#REF!","v":{"$error":"#REF!"}},null,null,null,null,null,null,"- to -",null,{"$f":"Target!#REF!","v":{"$error":"#REF!"}},null,null,null,null,null,null,"Values are from the Text Size Calculator\non the Application Parameters screen."]
[null,null,null,null,null,null,null,null,null,null,null,null,null,null,null,null,null,null,null,null,null,null,null,null,null,null,null,null,null,null,null,null,null,null,null,null,null,null,null,null,null,null,null,null,null,null,null,null,null,null,null,null,null,null,null,null,null,null,null,null,null,null,null,null,null,null,null,null,null,null,null,null,null,null,null,null,null,null,null,null,null,null,null,"Vert ArcMin per Character",null,null,null,null,null,null,null,null,null,{"$f":"CONCATENATE( Target!#REF!, \" arc-min\" )","v":{"$error":"#REF!"}},null,null,null,null,null,null,"- to -",null,{"$f":"CONCATENATE( Target!#REF!, \" arc-min\" )","v":{"$error":"#REF!"}}]
[null,null,null,null,null,null,null,null,null,null,null,null,null,null,null,null,null,null,null,null,null,null,null,null,null,null,null,null,null,null,null,null,null,null,null,null,null,null,null,null,null,null,null,null,null,null,null,null,null,null,null,null,null,null,null,null,null,null,null,null,null,null,null,null,null,null,null,null,null,null,null,null,null,null,null,null,null,null,null,null,null,null,null,"Text Size",null,null,null,null,null,null,null,null,null,{"$f":"CONCATENATE( Target!#REF!, \" points\" )","v":{"$error":"#REF!"}},null,null,null,null,null,null,"- to -",null,{"$f":"CONCATENATE( Target!#REF!, \" points\" )","v":{"$error":"#REF!"}}]
[null,null,null,null,null,null,null,null,null,null,null,null,null,null,null,null,null,null,null,null,null,null,null,null,null,null,null,null,null,null,null,null,null,null,null,null,null,null,null,null,null,null,null,null,null,null,null,null,null,null,null,null,null,null,null,null,null,null,null,null,null,null,null,null,null,null,null,null,null,null,null,null,null,null,null,null,null,null,null,null,null,null,null,"Rows of Text  ( at given point size )",null,null,null,null,null,null,null,null,null,{"$f":"CONCATENATE( Target!#REF!, \" rows\" )","v":{"$error":"#REF!"}},null,null,null,null,null,null,"- to -",null,{"$f":"CONCATENATE( Target!#REF!, \" rows\" )","v":{"$error":"#REF!"}}]
[]
[]
[]
[]
[]
[]
[]
[]
[]
[]
[]
[]
[]
[]
[]
[]
[]
[]
[]
[]
[]
[]
[]
[]
[]
[]
[]
[]
[]
[]
[]
[]
[]
[]
[]
[]
[]
[]
[]
[]
[]
[]
[]
[]
[]
[]
[null,null,null,null,null,null,null,null,null,null,null,null,null,null,null,null,null,null,null,null,null,null,null,null,null,null,null,null,null,null,null,null,null,null,null,null,null,null,null,null,null,null,null,null,null,null,null,null,null,null,null,null,null,{"$f":"ROW(BB161)","v":161}]

{"sheet":"xSummaryMap","index":13,"n_rows":270,"n_cols":83,"rows_kept":270,"cut":false,"hidden":true,"merged":[[103,1,107,1],[1,8,1,13],[1,36,1,41],[1,55,1,60],[1,73,1,78],[15,1,21,1],[22,1,32,1],[33,1,38,1],[40,1,54,1],[55,1,63,1],[64,1,92,1],[94,1,102,1],[202,1,220,1],[221,1,229,1],[108,1,113,1],[114,1,120,1],[121,1,149,1],[150,1,179,1],[180,1,191,1],[193,1,201,1]]}
[]
[null,null,null,null,null,null,null,null,"App Def",null,null,null,null,null,null,null,null,null,null,null,null,null,null,null,null,null,null,null,null,null,null,null,null,null,null,null,"User Input",null,null,null,null,null,null,null,null,null,null,null,null,null,null,null,null,null,null,"Reverse Calcuated",null,null,null,null,null,null,null,null,null,null,null,null,null,1,{"$f":"IF( Flag_ApplyUserInputs=0, 1, 0 )","v":0},null,null,"Resolved"]
[]
[null,null,null,"Screen Efficiency",null,null,null,null,null,null,null,null,null,null,null,null,null,null,null,null,null,null,null,null,null,null,null,null,null,null,null,null,"Screen Efficiency",null,null,null,null,null,null,null,null,null,null,null,null,null,null,null,"Screen Efficiency",null,null,null,null,null,null,null,null,null,null,null,null,null,null,null,null,null,"Screen Efficiency"]
[]
[null,null,null,null,null,null,null,null,null,null,null,null,null,null,null,null,null,null,null,null,null,null,null,null,null,null,null,null,null,null,null,null,null,null,null,null,null,null,null,null,null,null,null,null,null,null,null,null,null,null,null,null,null,null,null,null,null,null,null,null,null,null,null,null,null,null,null,null,null,null,{"$f":"IsPriority( Resolved_ScreenEff_Min, Resolved_ScreenEff_Max, SetPrecision(BV6), SetPrecision(BZ6) )","v":0},"user screen eff",null,{"$f":" ( TBright_ScreenEff_Min/100 )","v":0},null,null,null,{"$f":" ( TBright_ScreenEff_Max/100 )","v":0},null,{"$f":"InputErrorVerbose(\"App\",\"Value\",BV6,BZ6)","v":4},{"$f":"InputErrorVerbose(\"App\",\"Desc\",BV6,BZ6)","v":"Value is zero"},"User Input"]
[null,null,null,null,null,null,null,null,null,null,null,null,null,null,null,null,null,null,null,null,null,null,null,null,null,null,null,null,null,null,null,null,null,null,null,null,null,null,null,null,null,null,null,null,null,null,null,null,null,null,null,null,null,null,null,null,null,null,null,null,null,null,null,null,null,null,null,null,null,null,null,"user screen eff  ( filtered )",null,{"$f":" Flag_ApplyUserInputs * BV6","v":0},null,null,null,{"$f":" Flag_ApplyUserInputs * BZ6","v":0},null,{"$f":"InputErrorVerbose(\"App\",\"Value\",BV7,BZ7)","v":4},{"$f":"InputErrorVerbose(\"App\",\"Desc\",BV7,BZ7)","v":"Value is zero"},"User Input"]
[null,null,null,null,null,null,null,null,null,null,null,null,null,null,null,null,null,null,null,null,null,null,null,null,null,null,null,null,null,null,null,null,null,null,null,null,null,null,null,null,null,null,null,null,null,null,null,null,null,null,null,null,null,null,null,null,null,null,null,null,null,null,null,null,null,null,null,null,null,null,{"$f":"IsPriority( Resolved_ScreenEff_Min, Resolved_ScreenEff_Max, SetPrecision(BV8), SetPrecision(BZ8) )","v":0},"app screen eff",null,{"$f":"AppDef_ScreenEff_Min","v":"--"},null,null,null,{"$f":"AppDef_ScreenEff_Max","v":"--"},null,{"$f":"InputErrorVerbose(\"App\",\"Value\",BV8,BZ8)","v":1},{"$f":"InputErrorVerbose(\"App\",\"Desc\",BV8,BZ8)","v":"No Default App Value"},"App Default "]
[null,null,null,null,null,null,null,null,null,null,null,null,null,null,null,null,null,null,null,null,null,null,null,null,null,null,null,null,null,null,null,null,null,null,null,null,null,null,null,null,null,null,null,null,null,null,null,null,null,null,null,null,null,null,null,null,null,null,null,null,null,null,null,null,null,null,null,null,null,null,null,"resolved screen eff",null,{"$f":"SetPrecision( ResolvePriority(\"Min\",BV7:BV8,BZ7:BZ8,CB7:CB8) )","v":0},null,null,null,{"$f":"SetPrecision( ResolvePriority(\"Max\",BV7:BV8,BZ7:BZ8,CB7:CB8) )","v":0},null,{"$f":"InputErrorVerbose(\"App\",\"Value\",BV9,BZ9)","v":4},"Value is zero",{"$f":"ResolvePriority(\"Min\",CD2:CD8,CD2:CD8,CB2:CB8)","v":0}]
[]
[null,null,null,null,null,null,null,null,null,null,null,null,null,null,null,null,null,null,null,null,null,null,null,null,null,null,null,null,null,null,null,null,null,null,null,null,null,null,null,null,null,null,null,null,null,null,null,null,null,null,null,null,null,null,null,null,null,null,null,null,null,null,null,null,null,null,null,null,null,null,null,"display user screen eff",null,{"$f":"IF( OR($CB6=0, $CB6=3), CONCATENATE( BV6*100, \"%\"), \"--\" )","v":"--"},null,null,null,{"$f":"IF( OR($CB6=0, $CB6=3), CONCATENATE( BZ6*100, \"%\"), \"--\" )","v":"--"},null,{"$f":"CB6","v":4},{"$f":"IF( CE11=1, CD11, \"\" )","v":""},{"$f":"SanitizedErrorMsg(CB11)","v":""},{"$f":"IF( LEFT(CD11) = \"(\", 0, 1 )","v":1}]
[null,null,null,null,null,null,null,null,null,null,null,null,null,null,null,null,null,null,null,null,null,null,null,null,null,null,null,null,null,null,null,null,null,null,null,null,null,null,null,null,null,null,null,null,null,null,null,null,null,null,null,null,null,null,null,null,null,null,null,null,null,null,null,null,null,null,null,null,null,null,null,"display app screen eff",null,{"$f":"IF( AND($CB9=0, $CB8=0), CONCATENATE( BV8*100, \"%\"), \"--\" )","v":"--"},null,null,null,{"$f":"IF( AND($CB9=0, $CB8=0), CONCATENATE( BZ8*100, \"%\"), \"--\" )","v":"--"},null,{"$f":"CB8","v":1},{"$f":"IF( CE12=1, CD12, \"\" )","v":""},{"$f":"SanitizedErrorMsg(CB12)","v":""},{"$f":"IF( LEFT(CD12) = \"(\", 0, 1 )","v":1}]
[null,null,null,null,null,null,null,null,null,null,null,null,null,null,null,null,null,null,null,null,null,null,null,null,null,null,null,null,null,null,null,null,null,null,null,null,null,null,null,null,null,null,null,null,null,null,null,null,null,null,null,null,null,null,null,null,null,null,null,null,null,null,null,null,null,null,null,null,null,null,null,"display resolved eff",null,{"$f":"IF( $CB9=0, CONCATENATE( BV9*100, \"%\"), \"-- %\" )","v":"-- %"},null,null,null,{"$f":"IF( $CB9=0, CONCATENATE( BZ9*100, \"%\"), \"-- %\" )","v":"-- %"},null,4,{"$f":"IF( CE13=1, CD13, \"\" )","v":""},"",{"$f":"IF( LEFT(CD13) = \"(\", 0, 1 )","v":1}]
[]
[null,null,null,"Lumens",null,null,null,null,null,null,null,null,null,null,null,null,null,null,null,null,null,null,null,null,null,null,null,null,null,null,null,null,"Lumens",null,null,null,null,null,null,null,null,null,null,null,null,null,null,null,"Lumens",null,null,null,null,null,null,null,null,null,null,null,null,null,null,null,null,null,"Lumens"]
[null,"Inputs"]
[null,null,null,null,null,null,"app ambient index",null,{"$f":"Value_AppDefAmbient_Min","v":0},null,null,null,{"$f":"Value_AppDefAmbient_Max","v":0},null,{"$f":"InputErrorVerbose(\"App\",\"Value\",I17,M17)","v":4},{"$f":"InputErrorVerbose(\"App\",\"Desc\",I17,M17)","v":"Value is zero"},null,null,null,null,"--  .vs.  err",null,null,null,null,null,null,null,null,null,null,null,null,null,"user ambient index",null,{"$f":"xLists!G33","v":0},null,null,null,{"$f":"xLists!G32","v":0},null,{"$f":"InputErrorVerbose(\"User\",\"Value\",AK17,AO17)","v":4},{"$f":"InputErrorVerbose(\"User\",\"Desc\",AK17,AO17)","v":"Value is zero"}]
[null,null,null,null,null,null,"app ambient desc",null,{"$f":"Value2_AppDefAmbient_Min","v":"Very Dark"},null,null,null,{"$f":"Value2_AppDefAmbient_Max","v":"Very Dark"},null,"--","--",null,null,null,null,null,null,null,null,null,null,null,null,null,null,null,null,null,null,"user ambient desc",null,{"$f":"Value_Ambient_Min","v":"Very Dark"},null,null,null,{"$f":"Value_Ambient_Max","v":"Very Dark"},null,"--","--"]
[null,null,null,null,null,null,"app ambient nits",null,{"$f":"Value_AppDefNitsFromAmbient_Min","v":0},null,null,null,{"$f":"Value_AppDefNitsFromAmbient_Max","v":0},null,{"$f":"InputErrorVerbose(\"App\",\"Value\",I19,M19)","v":4},{"$f":"InputErrorVerbose(\"App\",\"Desc\",I19,M19)","v":"Value is zero"},null,null,null,null,null,null,null,null,null,null,null,null,null,null,null,null,null,null,"user ambient nits",null,{"$f":"Value_NitsFromAmbient_Min","v":0},null,null,null,{"$f":"Value_NitsFromAmbient_Max","v":0},null,{"$f":"InputErrorVerbose(\"User\",\"Value\",AK19,AO19)","v":4},{"$f":"InputErrorVerbose(\"User\",\"Desc\",AK19,AO19)","v":"Value is zero"}]
[null,null,null,null,null,null,"app nits",null,{"$f":"AppDef_Nits_Min","v":"--"},null,null,null,{"$f":"AppDef_Nits_Max","v":"--"},null,{"$f":"InputErrorVerbose(\"App\",\"Value\",I20,M20)","v":1},{"$f":"InputErrorVerbose(\"App\",\"Desc\",I20,M20)","v":"No Default App Value"},null,null,null,null,"--  .vs.  err",null,null,null,null,null,null,null,null,null,null,null,null,null,"user nits",null,{"$f":"TBright_Nits_Min","v":0},null,null,null,{"$f":"TBright_Nits_Max","v":0},null,{"$f":"InputErrorVerbose(\"User\",\"Value\",AK20,AO20)","v":4},{"$f":"InputErrorVerbose(\"User\",\"Desc\",AK20,AO20)","v":"Value is zero"}]
[null,null,null,null,null,null,"app lumens",null,{"$f":"AppDef_Lumens_Min","v":"--"},null,null,null,{"$f":"AppDef_Lumens_Max","v":"--"},null,{"$f":"InputErrorVerbose(\"App\",\"Value\",I21,M21)","v":1},{"$f":"InputErrorVerbose(\"App\",\"Desc\",I21,M21)","v":"No Default App Value"},null,null,null,null,"--  .vs.  err",null,null,null,null,null,null,null,null,null,null,null,null,null,"user lumens",null,{"$f":"TBright_Lumens_Min","v":0},null,null,null,{"$f":"TBright_Lumens_Max","v":0},null,{"$f":"InputErrorVerbose(\"User\",\"Value\",AK21,AO21)","v":4},{"$f":"InputErrorVerbose(\"User\",\"Desc\",AK21,AO21)","v":"Value is zero"}]
[]
[null,"Calc"]
[null,null,null,null,null,null,"area",null,{"$f":"$BV24","v":{"$error":"#VALUE!"}},null,null,null,{"$f":"$BZ24","v":{"$error":"#VALUE!"}},null,{"$f":"InputErrorVerbose(\"App\",\"Value\",I24,M24)","v":2},{"$f":"InputErrorVerbose(\"App\",\"Desc\",I24,M24)","v":"Error with input value"},null,null,null,null,null,null,null,null,null,null,null,null,null,null,null,null,null,null,"area",null,{"$f":"$BV24","v":{"$error":"#VALUE!"}},null,null,null,{"$f":"$BZ24","v":{"$error":"#VALUE!"}},null,{"$f":"InputErrorVerbose(\"User\",\"Value\",AK24,AO24)","v":2},{"$f":"InputErrorVerbose(\"User\",\"Desc\",AK24,AO24)","v":"Error with input value"},null,null,null,null,null,null,null,null,null,null,null,null,null,null,null,null,null,null,null,null,null,null,null,null,null,null,null,"area",null,{"$f":"BV85","v":{"$error":"#VALUE!"}},null,null,null,{"$f":"BZ85","v":{"$error":"#VALUE!"}},null,{"$f":"InputErrorVerbose(\"App\",\"Value\",BV24,BZ24)","v":2},{"$f":"InputErrorVerbose(\"App\",\"Desc\",BV24,BZ24)","v":"Error with input value"},"--","--"]
[null,null,null,null,null,null,"app lumens",null,{"$f":"SetPrecision( I21 )","v":{"$error":"#VALUE!"}},null,null,null,{"$f":"SetPrecision( M21 )","v":{"$error":"#VALUE!"}},null,{"$f":"InputErrorVerbose(\"App\",\"Value\",I25,M25)","v":2},{"$f":"InputErrorVerbose(\"App\",\"Desc\",I25,M25)","v":"Error with input value"},null,null,null,null,"in  .vs.  calc  .vs.  error",null,null,null,null,null,null,null,null,null,null,null,null,null,"user lumens",null,{"$f":"SetPrecision( AK21 )","v":0},null,null,null,{"$f":"SetPrecision( AO21  )","v":0},null,{"$f":"InputErrorVerbose(\"User\",\"Value\",AK25,AO25)","v":4},{"$f":"InputErrorVerbose(\"User\",\"Desc\",AK25,AO25)","v":"Value is zero"},null,null,null,null,null,null,null,null,null,null,null,null,null,null,null,null,null,null,1.75,"mm",null,null,null,null,null,null,{"$f":"IsPriority( Resolved_Lumens_Min, Resolved_Lumens_Max, SetPrecision(BV25 / IF( $CB$9=0, Resolved_ScreenEff_Min, 1 )), SetPrecision(BZ25 / IF( $CB$9=0, Resolved_ScreenEff_Max, 1 )) )","v":0},"user lumens",null,{"$f":" Flag_ApplyUserInputs * ( AK25 ) * IF( $CB$9=0, Resolved_ScreenEff_Min, 1 )","v":0},null,null,null,{"$f":" Flag_ApplyUserInputs * ( AO25 ) * IF( $CB$9=0, Resolved_ScreenEff_Max, 1 )","v":0},null,{"$f":"InputErrorVerbose(\"App\",\"Value\",BV25,BZ25)","v":4},{"$f":"InputErrorVerbose(\"App\",\"Desc\",BV25,BZ25)","v":"Value is zero"},"User Input  ( Lumens )","type_1"]
[null,null,null,null,null,null,"app lumens from nits",null,{"$f":"SetPrecision( I20*I24*PI() )","v":{"$error":"#VALUE!"}},null,null,null,{"$f":"SetPrecision( M20*M24*PI() )","v":{"$error":"#VALUE!"}},null,{"$f":"InputErrorVerbose(\"App\",\"Value\",I26,M26)","v":2},{"$f":"InputErrorVerbose(\"App\",\"Desc\",I26,M26)","v":"Error with input value"},null,null,null,null,"in  .vs.  calc  .vs.  error",null,null,null,null,null,null,null,null,null,null,null,null,null,"user lumens from nits",null,{"$f":"SetPrecision( AK20*AK24*PI()  )","v":{"$error":"#VALUE!"}},null,null,null,{"$f":"SetPrecision( AO20*AO24*PI()  )","v":{"$error":"#VALUE!"}},null,{"$f":"InputErrorVerbose(\"User\",\"Value\",AK26,AO26)","v":2},{"$f":"InputErrorVerbose(\"User\",\"Desc\",AK26,AO26)","v":"Error with input value"},null,null,null,null,null,null,null,null,null,null,null,null,null,null,null,null,null,null,{"$f":"BK25/6000","v":2.9166666666666669E-4},"ratio",null,null,null,null,null,null,{"$f":"IsPriority( Resolved_Lumens_Min, Resolved_Lumens_Max, SetPrecision(BV26 / IF( $CB$9=0, Resolved_ScreenEff_Min, 1 )), SetPrecision(BZ26 / IF( $CB$9=0, Resolved_ScreenEff_Max, 1 )) )","v":0},"user lumens from nits",null,{"$f":" Flag_ApplyUserInputs * SetPrecision( AK26 )","v":{"$error":"#VALUE!"}},null,null,null,{"$f":" Flag_ApplyUserInputs * SetPrecision( AO26 )","v":{"$error":"#VALUE!"}},null,{"$f":"InputErrorVerbose(\"App\",\"Value\",BV26,BZ26)","v":2},{"$f":"InputErrorVerbose(\"App\",\"Desc\",BV26,BZ26)","v":"Error with input value"},"derived from User Input - Nits","type_2"]
[null,null,null,null,null,null,"app lumens from ambient",null,{"$f":"SetPrecision( I19*I24*PI() )","v":{"$error":"#VALUE!"}},null,null,null,{"$f":"SetPrecision( M19*M24*PI() )","v":{"$error":"#VALUE!"}},null,{"$f":"InputErrorVerbose(\"App\",\"Value\",I27,M27)","v":2},{"$f":"InputErrorVerbose(\"App\",\"Desc\",I27,M27)","v":"Error with input value"},null,null,null,null,"in  .vs.  calc  .vs.  error",null,null,null,null,null,null,null,null,null,null,null,null,null,"user lumens from ambient",null,{"$f":"SetPrecision( AK19*AK24*PI()  )","v":{"$error":"#VALUE!"}},null,null,null,{"$f":"SetPrecision( AO19*AO24*PI() )","v":{"$error":"#VALUE!"}},null,{"$f":"InputErrorVerbose(\"User\",\"Value\",AK27,AO27)","v":2},{"$f":"InputErrorVerbose(\"User\",\"Desc\",AK27,AO27)","v":"Error with input value"},null,null,null,null,null,null,null,null,null,null,null,null,null,null,null,null,null,null,{"$f":"ATAN(BK26)","v":2.9166665839602666E-4},"atan",null,null,null,null,null,null,{"$f":"IsPriority( Resolved_Lumens_Min, Resolved_Lumens_Max, SetPrecision(BV27 / IF( $CB$9=0, Resolved_ScreenEff_Min, 1 )), SetPrecision(BZ27 / IF( $CB$9=0, Resolved_ScreenEff_Max, 1 )) )","v":0},"user lumens from ambient",null,{"$f":" Flag_ApplyUserInputs * SetPrecision( AK27 )","v":{"$error":"#VALUE!"}},null,null,null,{"$f":" Flag_ApplyUserInputs * SetPrecision( AO27 )","v":{"$error":"#VALUE!"}},null,{"$f":"InputErrorVerbose(\"App\",\"Value\",BV27,BZ27)","v":2},{"$f":"InputErrorVerbose(\"App\",\"Desc\",BV27,BZ27)","v":"Error with input value"},"derived from User Input - Ambient Light Level","type_3"]
[null,null,null,null,null,null,"resolved lumens",null,{"$f":"SetPrecision( ResolvePriority(\"Min\",I25:I27,M25:M27,O25:O27) )","v":0},null,null,null,{"$f":"SetPrecision( ResolvePriority(\"Max\",I25:I27,M25:M27,O25:O27) )","v":0},null,{"$f":"InputErrorVerbose(\"App\",\"Value\",I28,M28)","v":4},{"$f":"InputErrorVerbose(\"App\",\"Desc\",I28,M28)","v":"Value is zero"},null,null,null,null,"from …",null,null,null,null,null,null,null,null,null,null,null,null,null,"resolved lumens",null,{"$f":"SetPrecision( ResolvePriority(\"Min\",AK25:AK27,AO25:AO27,AQ25:AQ27) )","v":0},null,null,null,{"$f":"SetPrecision( ResolvePriority(\"Max\",AK25:AK27,AO25:AO27,AQ25:AQ27) )","v":0},null,{"$f":"InputErrorVerbose(\"User\",\"Value\",AK28,AO28) + Flag_ApplyUserInputs_Inv","v":4},{"$f":"InputErrorVerbose(\"User\",\"Desc\",AK28,AO28)","v":"Value is zero"},null,null,null,null,null,null,null,null,null,null,null,null,null,null,null,null,null,null,{"$f":"DEGREES(BK27)","v":1.6711268550776245E-2},"deg",null,null,null,null,null,null,{"$f":"IsPriority( Resolved_Lumens_Min, Resolved_Lumens_Max, SetPrecision(BV28 / IF( $CB$9=0, Resolved_ScreenEff_Min, 1 )), SetPrecision(BZ28 / IF( $CB$9=0, Resolved_ScreenEff_Max, 1 )) )","v":0},"app lumens",null,{"$f":"I25","v":{"$error":"#VALUE!"}},null,null,null,{"$f":"M25","v":{"$error":"#VALUE!"}},null,{"$f":"InputErrorVerbose(\"App\",\"Value\",BV28,BZ28)","v":2},{"$f":"InputErrorVerbose(\"App\",\"Desc\",BV28,BZ28)","v":"Error with input value"},"App Default   ( Lumens )","type_1"]
[null,null,null,null,null,null,null,null,null,null,null,null,null,null,null,null,null,null,null,null,null,null,null,null,null,null,null,null,null,null,null,null,null,null,null,null,null,null,null,null,null,null,null,null,null,null,null,null,null,null,null,null,null,null,null,null,null,null,null,null,null,null,{"$f":"BK28*60","v":1.0026761130465747},"arcmin",null,null,null,null,null,null,{"$f":"IsPriority( Resolved_Lumens_Min, Resolved_Lumens_Max, SetPrecision(BV29 / IF( $CB$9=0, Resolved_ScreenEff_Min, 1 )), SetPrecision(BZ29 / IF( $CB$9=0, Resolved_ScreenEff_Max, 1 )) )","v":0},"app lumens from nits",null,{"$f":"I26","v":{"$error":"#VALUE!"}},null,null,null,{"$f":"M26","v":{"$error":"#VALUE!"}},null,{"$f":"InputErrorVerbose(\"App\",\"Value\",BV29,BZ29)","v":2},{"$f":"InputErrorVerbose(\"App\",\"Desc\",BV29,BZ29)","v":"Error with input value"},"derived from App Default - Nits","type_2"]
[null,null,null,null,null,null,null,null,null,null,null,null,null,null,null,null,null,null,null,null,null,null,null,null,null,null,null,null,null,null,null,null,null,null,null,null,null,null,null,null,1000000000,null,null,null,null,null,null,null,null,null,null,null,null,null,null,null,null,null,null,null,null,null,null,null,null,null,null,null,null,null,{"$f":"IsPriority( Resolved_Lumens_Min, Resolved_Lumens_Max, SetPrecision(BV30 / IF( $CB$9=0, Resolved_ScreenEff_Min, 1 )), SetPrecision(BZ30 / IF( $CB$9=0, Resolved_ScreenEff_Max, 1 )) )","v":0},"app lumens from ambient",null,{"$f":"I27","v":{"$error":"#VALUE!"}},null,null,null,{"$f":"M27","v":{"$error":"#VALUE!"}},null,{"$f":"InputErrorVerbose(\"App\",\"Value\",BV30,BZ30)","v":2},{"$f":"InputErrorVerbose(\"App\",\"Desc\",BV30,BZ30)","v":"Error with input value"},"derived from App Default - Ambient Light Level","type_3"]
[null,null,null,null,null,null,null,null,null,null,null,null,null,null,null,null,null,null,null,null,null,null,null,null,null,null,null,null,null,null,null,null,null,null,null,null,null,null,null,null,null,null,null,null,null,null,null,null,null,null,null,null,null,null,null,null,null,null,null,null,null,null,"https://en.wikipedia.org/wiki/Visual_acuity#Definition",null,null,null,null,null,null,null,null,"Insufficient Inputs",null,"--","--",null,null,"--","--",0,"--","Insufficient inputs","type_4"]
[null,null,null,null,null,null,null,null,null,null,null,null,null,null,null,null,null,null,null,null,null,null,null,null,null,null,null,null,null,null,null,null,null,null,null,null,null,null,null,null,null,null,null,null,null,null,null,null,null,null,null,null,null,null,null,null,null,null,null,null,null,null,null,null,null,null,null,null,null,null,null,"resolved lumens",null,{"$f":"SetPrecision( ResolvePriority(\"Min\",BV25:BV30,BZ25:BZ30,CB25:CB30) / IF( $CB$9=0, Resolved_ScreenEff_Min, 1 )  )","v":0},null,null,null,{"$f":"SetPrecision( ResolvePriority(\"Max\",BV25:BV30,BZ25:BZ30,CB25:CB30) / IF( $CB$9=0, Resolved_ScreenEff_Max, 1 ) )","v":0},null,{"$f":"InputErrorVerbose(\"App\",\"Value\",BV32,BZ32)","v":4},{"$f":"InputErrorVerbose(\"App\",\"Desc\",BV32,BZ32)","v":"Value is zero"},{"$f":"ResolvePriority(\"Min\",CD25:CD31,CD25:CD31,CB25:CB31)","v":"Insufficient inputs"},{"$f":"ResolvePriority(\"Min\",CE25:CE31,CE25:CE31,CB25:CB31)","v":"type_4"}]
[]
[null,"Display"]
[null,null,null,null,null,null,"display app ambient",null,{"$f":"IF( O$19=0, I18, \"--\" )","v":"--"},null,null,null,{"$f":"IF( O$19=0, M18, \"--\" )","v":"--"},null,{"$f":"O25","v":2},"Error with input value",null,null,null,null,"in  .vs.  calc_from",null,null,null,null,null,null,null,null,null,null,null,null,null,"display user ambient",null,{"$f":"IF( AK17>0, AK18, \"--\" )","v":"--"},null,null,null,{"$f":"IF( AO17>0, AO18, \"--\" )","v":"--"},null,{"$f":"AQ19","v":4},{"$f":"IF( AT35=1, AS35, \"\" )","v":""},{"$f":"SanitizedErrorMsg(AQ35)","v":""},{"$f":"IF( LEFT(AS35) = \"(\", 0, 1 )","v":1},null,null,null,null,null,null,null,null,null,null,null,null,null,null,null,null,null,null,null,null,null,null,null,null,null,"display final ambient",null,{"$f":"IF( $CB32=0, INDEX(List_AmbientLightLevel, MATCH((BV32*Resolved_ScreenEff_Min)/(BV24*PI()), List_AmbientLightNitValue ), 0 ), \"--\" )","v":"--"},null,null,null,{"$f":"IF( $CB32=0, INDEX(List_AmbientLightLevel, MATCH((BZ32*Resolved_ScreenEff_Max)/(BZ24*PI()), List_AmbientLightNitValue ), 0 ), \"--\" )","v":"--"}]
[null,null,null,null,null,null,"display app nits",null,{"$f":"IF( O$20=0, CONCATENATE( I20, \" nits\" ), \"--\" )","v":"--"},null,null,null,{"$f":"IF( O$20=0, CONCATENATE( M20, \" nits\" ), \"--\" )","v":"--"},null,2,"Error with input value",null,null,null,null,"in  .vs.  calc_from",null,null,null,null,null,null,null,null,null,null,null,null,null,"display user nits",null,{"$f":"IF( OR(AQ$20=0, AQ$20=3), CONCATENATE( AK20, \" nits\" ), \"--\" )","v":"--"},null,null,null,{"$f":"IF( OR(AQ$20=0, AQ$20=3), CONCATENATE( AO20, \" nits\" ), \"--\" )","v":"--"},null,{"$f":"AQ20","v":4},{"$f":"IF( AT36=1, AS36, \"\" )","v":""},{"$f":"SanitizedErrorMsg(AQ36)","v":""},{"$f":"IF( LEFT(AS36) = \"(\", 0, 1 )","v":1},null,null,null,null,null,null,null,null,null,null,null,null,null,null,null,null,null,null,null,null,null,null,null,null,null,"display final nits",null,{"$f":"IF( AND($CB32=0, $CB24=0), CONCATENATE( SetPrecision( (BV32*Resolved_ScreenEff_Min)/(BV24*PI()) ), \" nits\" ), \"-- nits\" )","v":"-- nits"},null,null,null,{"$f":"IF( AND($CB32=0, $CB24=0), CONCATENATE( SetPrecision( (BZ32*Resolved_ScreenEff_Max)/(BZ24*PI()) ), \" nits\" ), \"-- nits\" )","v":"-- nits"},null,null,{"$f":"IF( CB32=0,  IF( CE32=\"type_1\", IF( CB24=0, \"derived from lumens value\", \"insufficient inputs\"),\nIF( CE32=\"type_2\", CD32,\nIF( CE32=\"type_3\", IF( CB24=0, CD32, \"insufficient inputs\" ) ) ) ), \"insufficient inputs\"  )","v":"insufficient inputs"}]
[null,null,null,null,null,null,"display app lumens",null,{"$f":"IF( O$21=0, CONCATENATE( I21, \" lm\" ), \"--\" )","v":"--"},null,null,null,{"$f":"IF( O$21=0, CONCATENATE( M21, \" lm\" ), \"--\" )","v":"--"},null,2,"Error with input value",null,null,null,null,"in  .vs.  calc_from",null,null,null,null,null,null,null,null,null,null,null,null,null,"display user lumens",null,{"$f":"IF( OR(AQ$21=0, AQ$21=3), CONCATENATE( AK21, \" lm\" ), \"--\" )","v":"--"},null,null,null,{"$f":"IF( OR(AQ$21=0, AQ$21=3), CONCATENATE( AO21, \" lm\" ), \"--\" )","v":"--"},null,{"$f":"AQ21","v":4},{"$f":"IF( AT37=1, AS37, \"\" )","v":""},"",{"$f":"IF( LEFT(AS37) = \"(\", 0, 1 )","v":1},null,null,null,null,null,null,null,null,null,null,null,null,null,null,null,null,null,null,null,null,null,null,null,null,null,"display final lumens",null,{"$f":"IF( $CB32=0, CONCATENATE( BV32, \" lm\" ), \"-- lm\" )","v":"-- lm"},null,null,null,{"$f":"IF( $CB32=0, CONCATENATE( BZ32, \" lm\" ), \"-- lm\" )","v":"-- lm"},null,null,{"$f":"IF( CB32=0,  IF( CE32=\"type_1\", CD32,  IF( CE32=\"type_2\", \"derived from nits value\",  IF( CE32=\"type_3\", CD32, \"insufficient inputs\" ) ) ), \"insufficient inputs\" )","v":"insufficient inputs"}]
[null,null,null,null,null,null,null,null,"lumens = nits * area * pi()",null,null,null,null,null,null,null,null,null,null,null,null,null,null,null,null,null,null,null,null,null,null,null,null,null,null,null,"lumens = nits * area * pi()",null,null,null,null,null,null,null,null,null,null,null,null,null,null,null,null,null,null,null,null,null,null,null,null,null,null,null,null,null,null,null,null,null,null,null,null,{"$f":"IF( AND($CB32=0, $CB24=0), SetPrecision( (BV32 * IF( $CB$9=0, Resolved_ScreenEff_Min, 1 ))/(BV24*PI()) ), 0 )","v":0},null,null,null,{"$f":"IF( AND($CB32=0, $CB24=0), SetPrecision( (BZ32*IF( $CB$9=0, Resolved_ScreenEff_Max, 1 ))/(BZ24*PI()) ), 0 )","v":0}]
[null,null,null,null,null,null,null,null,null,null,null,null,null,null,null,null,null,null,null,null,null,null,null,null,null,null,null,null,null,null,null,null,null,null,null,null,null,null,null,null,null,null,null,null,null,null,null,null,null,null,null,null,null,null,null,null,null,null,null,null,null,null,null,null,null,null,null,null,null,null,null,null,null,"lumens = nits * area * pi()"]
[null,null,null,"Image Size",null,null,null,null,null,null,null,null,null,null,null,null,null,null,null,null,null,null,null,null,null,null,null,null,null,null,null,null,"Image Size",null,null,null,null,null,null,null,null,null,null,null,null,null,null,null,"Image Size",null,null,null,null,null,null,null,null,null,null,null,null,null,null,null,null,null,"Image Size"]
[null,"Inputs"]
[null,null,null,null,null,null,"app def width",null,{"$f":"AppDef_ImageWidth_Min","v":"--"},null,null,null,{"$f":"AppDef_ImageWidth_Max","v":"--"},null,{"$f":"InputErrorVerbose(\"App\",\"Value\",I42,M42)","v":1},{"$f":"InputErrorVerbose(\"App\",\"Desc\",I42,M42)","v":"No Default App Value"},null,null,null,null,"--  .vs.  err",null,null,null,null,null,null,null,null,null,null,null,null,null,"user width",null,{"$f":"TSize_ImageWidth_Min","v":0},null,null,null,{"$f":"TSize_ImageWidth_Max","v":0},null,{"$f":"InputErrorVerbose(\"User\",\"Value\",AK42,AO42)","v":4},{"$f":"InputErrorVerbose(\"User\",\"Desc\",AK42,AO42)","v":"Value is zero"}]
[null,null,null,null,null,null,"app def height",null,{"$f":"AppDef_ImageHeight_Min","v":"--"},null,null,null,{"$f":"AppDef_ImageHeight_Max","v":"--"},null,1,"No Default App Value",null,null,null,null,"--  .vs.  err",null,null,null,null,null,null,null,null,null,null,null,null,null,"user  height",null,{"$f":"TSize_ImageHeight_Min","v":0},null,null,null,{"$f":"TSize_ImageHeight_Max","v":0},null,{"$f":"InputErrorVerbose(\"User\",\"Value\",AK43,AO43)","v":4},{"$f":"InputErrorVerbose(\"User\",\"Desc\",AK43,AO43)","v":"Value is zero"}]
[null,null,null,null,null,null,"app def diag",null,{"$f":"AppDef_ImageDiag_Min","v":"--"},null,null,null,{"$f":"AppDef_ImageDiag_Max","v":"--"},null,{"$f":"InputErrorVerbose(\"App\",\"Value\",I44,M44)","v":1},{"$f":"InputErrorVerbose(\"App\",\"Desc\",I44,M44)","v":"No Default App Value"},null,null,null,null,"--  .vs.  err",null,null,null,null,null,null,null,null,null,null,null,null,null,"user  diag",null,{"$f":"TSize_ImageDiag_Min","v":0},null,null,null,{"$f":"TSize_ImageDiag_Max","v":0},null,{"$f":"InputErrorVerbose(\"User\",\"Value\",AK44,AO44)","v":4},{"$f":"InputErrorVerbose(\"User\",\"Desc\",AK44,AO44)","v":"Value is zero"}]
[null,null,null,null,null,null,"app def AR num",null,{"$f":"AppDef_ImageARNum_Min","v":"--"},null,null,null,{"$f":"AppDef_ImageARNum_Max","v":"--"},null,1,"No Default App Value",null,null,null,null,"--  .vs.  err",null,null,null,null,null,null,null,null,null,null,null,null,null,"user  AR num",null,{"$f":"TSize_ImageARNum_Min","v":0},null,null,null,{"$f":"TSize_ImageARNum_Max","v":0},null,{"$f":"InputErrorVerbose(\"User\",\"Value\",AK45,AO45)","v":4},{"$f":"InputErrorVerbose(\"User\",\"Desc\",AK45,AO45)","v":"Value is zero"}]
[null,null,null,null,null,null,"app def AR den",null,{"$f":"AppDef_ImageARDenom_Min","v":"--"},null,null,null,{"$f":"AppDef_ImageARDenom_Max","v":"--"},null,1,"No Default App Value",null,null,null,null,null,null,null,null,null,null,null,null,null,null,null,null,null,null,"user  AR den",null,{"$f":"TSize_ImageARDenom_Min","v":0},null,null,null,{"$f":"TSize_ImageARDenom_Max","v":0},null,{"$f":"InputErrorVerbose(\"User\",\"Value\",AK46,AO46)","v":4},"Value is zero"]
[null,null,null,null,null,null,"app def AR",null,{"$f":"SetPrecision( I45/I46 )","v":{"$error":"#VALUE!"}},null,null,null,{"$f":"SetPrecision( M45/M46 )","v":{"$error":"#VALUE!"}},null,2,"Error with input value",null,null,null,null,null,null,null,null,null,null,null,null,null,null,null,null,null,null,"user  AR",null,{"$f":"AK45/AK46","v":{"$error":"#DIV/0!"}},null,null,null,{"$f":"AO45/AO46","v":{"$error":"#DIV/0!"}},null,{"$f":"InputErrorVerbose(\"User\",\"Value\",AK47,AO47)","v":2},"Error with input value"]
[]
[]
[]
[]
[]
[]
[]
[]
[null,"Calc"]
[null,null,null,null,null,null,"calc app width",null,{"$f":"SetPrecision( CalcImageSize( \"W\", \"Val\", I$42,I$43,I$44,I$45,I$46 ) )","v":0},null,null,null,{"$f":"SetPrecision( CalcImageSize( \"W\",  \"Val\", M$42,M$43,M$44,M$45,M$46 ) )","v":0},null,{"$f":"InputErrorVerbose(\"App\",\"Value\",I57,M57)","v":4},{"$f":"InputErrorVerbose(\"App\",\"Desc\",I57,M57)","v":"Value is zero"},{"$f":"CalcImageSize( \"W\", \"Src\", I$42,I$43,I$44,I$45,I$46 )","v":"--"},null,null,null,"in  .vs.  calc  .vs.  error",null,null,null,null,null,null,null,null,null,null,null,null,null,"calc user width",null,{"$f":"SetPrecision( CalcImageSize( \"W\", \"Val\", AK$42,AK$43,AK$44,AK$45,AK$46 ) )","v":0},null,null,null,{"$f":"SetPrecision( CalcImageSize( \"W\",  \"Val\", AO$42,AO$43,AO$44,AO$45,AO$46 ) )","v":0},null,{"$f":"InputErrorVerbose(\"User\",\"Value\",AK57,AO57)","v":4},{"$f":"InputErrorVerbose(\"User\",\"Desc\",AK57,AO57)","v":"Value is zero"},{"$f":"CalcImageSize( \"W\",  \"Src\", AK$42,AK$43,AK$44,AK$45,AK$46 )","v":"--"},null,null,null,null,null,null,null,null,null,null,null,null,null,null,null,null,null,null,null,null,null,null,{"$f":"IsPriority( BV57, 1, I57, 1 )","v":0},{"$f":"IsPriority( BZ57, 1, M57, 1 )","v":0},{"$f":"IsPriority( BV57, 1, AK57, 1 )","v":0},{"$f":"IsPriority( BZ57, 1, AO57, 1 )","v":0},"resolved width",null,{"$f":"IF( $AQ$62=0,  Flag_ApplyUserInputs * AK57, IF( $O$62=0, I57, \"--\" ) )","v":"--"},null,null,null,{"$f":"IF( $AQ$62=0,  Flag_ApplyUserInputs * AO57, IF( $O$62=0, M57, \"--\" ) )","v":"--"},null,{"$f":"InputErrorVerbose(\"App\",\"Value\",BV57,BZ57)","v":1},{"$f":"InputErrorVerbose(\"App\",\"Desc\",BV57,BZ57)","v":"No Default App Value"},{"$f":"IF( AND( $AQ$62=0, AQ57=0 ),\n   IF( AS57=\"\", AS$62, CONCATENATE( \"User Input\") ), IF( AND( $O$62=0, O57=0 ), IF( Q57=\"\", Q$62, CONCATENATE( \"App Default value\") ), \"insufficient inputs\" ) )","v":"insufficient inputs"}]
[null,null,null,null,null,null,"calc app height",null,{"$f":"SetPrecision( CalcImageSize( \"H\",  \"Val\", I$42,I$43,I$44,I$45,I$46 ) )","v":0},null,null,null,{"$f":"SetPrecision( CalcImageSize( \"H\",  \"Val\", M$42,M$43,M$44,M$45,M$46 ) )","v":0},null,{"$f":"InputErrorVerbose(\"App\",\"Value\",I58,M58)","v":4},{"$f":"InputErrorVerbose(\"App\",\"Desc\",I58,M58)","v":"Value is zero"},{"$f":"CalcImageSize( \"H\",  \"Src\", I$42,I$43,I$44,I$45,I$46 )","v":"--"},null,null,null,"in  .vs.  calc  .vs.  error",null,null,null,null,null,null,null,null,null,null,null,null,null,"calc user height",null,{"$f":"SetPrecision( CalcImageSize( \"H\",  \"Val\", AK$42,AK$43,AK$44,AK$45,AK$46 ) )","v":0},null,null,null,{"$f":"SetPrecision( CalcImageSize( \"H\",  \"Val\", AO$42,AO$43,AO$44,AO$45,AO$46 ) )","v":0},null,{"$f":"InputErrorVerbose(\"User\",\"Value\",AK58,AO58)","v":4},{"$f":"InputErrorVerbose(\"User\",\"Desc\",AK58,AO58)","v":"Value is zero"},{"$f":"CalcImageSize( \"H\",  \"Src\", AK$42,AK$43,AK$44,AK$45,AK$46 )","v":"--"},null,null,null,null,null,null,null,null,null,null,null,null,null,null,null,null,null,null,null,null,null,null,{"$f":"IsPriority( BV58, 1, I58, 1 )","v":0},{"$f":"IsPriority( BZ58, 1, M58, 1 )","v":0},{"$f":"IsPriority( BV58, 1, AK58, 1 )","v":0},{"$f":"IsPriority( BZ58, 1, AO58, 1 )","v":0},"resolved height",null,{"$f":"IF( $AQ$62=0,  Flag_ApplyUserInputs * AK58, IF( $O$62=0, I58, \"--\" ) )","v":"--"},null,null,null,{"$f":"IF( $AQ$62=0,  Flag_ApplyUserInputs * AO58, IF( $O$62=0, M58, \"--\" ) )","v":"--"},null,{"$f":"InputErrorVerbose(\"App\",\"Value\",BV58,BZ58)","v":1},{"$f":"InputErrorVerbose(\"App\",\"Desc\",BV58,BZ58)","v":"No Default App Value"},{"$f":"IF( AND( $AQ$62=0, AQ58=0 ),\n   IF( AS58=\"\", AS$62, CONCATENATE( \"User Input\") ), IF( AND( $O$62=0, O58=0 ), IF( Q58=\"\", Q$62, CONCATENATE( \"App Default value\") ), \"insufficient inputs\" ) )","v":"insufficient inputs"}]
[null,null,null,null,null,null,"calc app diag",null,{"$f":"SetPrecision( CalcImageSize( \"D\",  \"Val\", I$42,I$43,I$44,I$45,I$46 ) )","v":0},null,null,null,{"$f":"SetPrecision( CalcImageSize( \"D\",  \"Val\", M$42,M$43,M$44,M$45,M$46 ) )","v":0},null,{"$f":"InputErrorVerbose(\"App\",\"Value\",I59,M59)","v":4},{"$f":"InputErrorVerbose(\"App\",\"Desc\",I59,M59)","v":"Value is zero"},{"$f":"CalcImageSize( \"D\",  \"Src\", I$42,I$43,I$44,I$45,I$46 )","v":"--"},null,null,null,"in  .vs.  calc  .vs.  error",null,null,null,null,null,null,null,null,null,null,null,null,null,"calc user diag",null,{"$f":"SetPrecision( CalcImageSize( \"D\",  \"Val\", AK$42,AK$43,AK$44,AK$45,AK$46 ) )","v":0},null,null,null,{"$f":"SetPrecision( CalcImageSize( \"D\",  \"Val\", AO$42,AO$43,AO$44,AO$45,AO$46 ) )","v":0},null,{"$f":"InputErrorVerbose(\"User\",\"Value\",AK59,AO59)","v":4},{"$f":"InputErrorVerbose(\"User\",\"Desc\",AK59,AO59)","v":"Value is zero"},{"$f":"CalcImageSize( \"D\",  \"Src\", AK$42,AK$43,AK$44,AK$45,AK$46 )","v":"--"},null,null,null,null,null,null,null,null,null,null,null,null,null,null,null,null,null,null,null,null,null,null,{"$f":"IsPriority( BV59, 1, I59, 1 )","v":0},{"$f":"IsPriority( BZ59, 1, M59, 1 )","v":0},{"$f":"IsPriority( BV59, 1, AK59, 1 )","v":0},{"$f":"IsPriority( BZ59, 1, AO59, 1 )","v":0},"resolved diag",null,{"$f":"IF( $AQ$62=0,  Flag_ApplyUserInputs * AK59, IF( $O$62=0, I59, \"--\" ) )","v":"--"},null,null,null,{"$f":"IF( $AQ$62=0,  Flag_ApplyUserInputs * AO59, IF( $O$62=0, M59, \"--\" ) )","v":"--"},null,{"$f":"InputErrorVerbose(\"App\",\"Value\",BV59,BZ59)","v":1},{"$f":"InputErrorVerbose(\"App\",\"Desc\",BV59,BZ59)","v":"No Default App Value"},{"$f":"IF( AND( $AQ$62=0, AQ59=0 ),\n   IF( AS59=\"\", AS$62, CONCATENATE( \"User Input\") ), IF( AND( $O$62=0, O59=0 ), IF( Q59=\"\", Q$62, CONCATENATE( \"App Default value\") ), \"insufficient inputs\" ) )","v":"insufficient inputs"}]
[null,null,null,null,null,null,"calc app AR",null,{"$f":"SetPrecision( CalcImageSize( \"AR\",  \"Val\", I$42,I$43,I$44,I$45,I$46 ) )","v":0},null,null,null,{"$f":"SetPrecision( CalcImageSize( \"AR\",  \"Val\", M$42,M$43,M$44,M$45,M$46 ) )","v":0},null,{"$f":"InputErrorVerbose(\"App\",\"Value\",I60,M60)","v":4},{"$f":"InputErrorVerbose(\"App\",\"Desc\",I60,M60)","v":"Value is zero"},{"$f":"CalcImageSize( \"AR\",  \"Src\", I$42,I$43,I$44,I$45,I$46 )","v":"--"},null,null,null,"in  .vs.  calc  .vs.  error",null,null,null,null,null,null,null,null,null,null,null,null,null,"calc user AR",null,{"$f":"SetPrecision( CalcImageSize( \"AR\",  \"Val\", AK$42,AK$43,AK$44,AK$45,AK$46 ) )","v":0},null,null,null,{"$f":"SetPrecision( CalcImageSize( \"AR\",  \"Val\", AO$42,AO$43,AO$44,AO$45,AO$46 ) )","v":0},null,{"$f":"InputErrorVerbose(\"User\",\"Value\",AK60,AO60)","v":4},{"$f":"InputErrorVerbose(\"User\",\"Desc\",AK60,AO60)","v":"Value is zero"},{"$f":"CalcImageSize( \"AR\",  \"Src\", AK$42,AK$43,AK$44,AK$45,AK$46 )","v":"--"},null,null,null,null,null,null,null,null,null,null,null,null,null,null,null,null,null,null,null,null,null,null,{"$f":"IsPriority( BV60, 1, I60, 1 )","v":0},{"$f":"IsPriority( BZ60, 1, M60, 1 )","v":0},{"$f":"IsPriority( BV60, 1, AK60, 1 )","v":0},{"$f":"IsPriority( BZ60, 1, AO60, 1 )","v":0},"resolved AR",null,{"$f":"IF( $AQ$62=0,  Flag_ApplyUserInputs * AK60, IF( $O$62=0, I60, \"--\" ) )","v":"--"},null,null,null,{"$f":"IF( $AQ$62=0,  Flag_ApplyUserInputs * AO60, IF( $O$62=0, M60, \"--\" ) )","v":"--"},null,{"$f":"InputErrorVerbose(\"App\",\"Value\",BV60,BZ60)","v":1},{"$f":"InputErrorVerbose(\"App\",\"Desc\",BV60,BZ60)","v":"No Default App Value"},{"$f":"IF( AND( $AQ$62=0, AQ60=0 ),\n   IF( AS60=\"\", AS$62, CONCATENATE( \"User Input\") ), IF( AND( $O$62=0, O60=0 ), IF( Q60=\"\", Q$62, CONCATENATE( \"App Default value\") ), \"insufficient inputs\" ) )","v":"insufficient inputs"}]
[null,null,null,null,null,null,"calc app area",null,{"$f":"SetPrecision( I57*I58 )","v":0},null,null,null,{"$f":"SetPrecision( M57*M58 )","v":0},null,{"$f":"InputErrorVerbose(\"App\",\"Value\",I61,M61)","v":4},{"$f":"InputErrorVerbose(\"App\",\"Desc\",I61,M61)","v":"Value is zero"},null,null,null,null,"from …",null,null,null,null,null,null,null,null,null,null,null,null,null,"calc user area",null,{"$f":"SetPrecision( AK57*AK58 )","v":0},null,null,null,{"$f":"SetPrecision( AO57*AO58 )","v":0},null,{"$f":"InputErrorVerbose(\"User\",\"Value\",AK61,AO61)","v":4},{"$f":"InputErrorVerbose(\"User\",\"Desc\",AK61,AO61)","v":"Value is zero"},null,null,null,null,null,null,null,null,null,null,null,null,null,null,null,null,null,null,null,null,null,null,null,{"$f":"IsPriority( BV61, 1, I61, 1 )","v":0},{"$f":"IsPriority( BZ61, 1, M61, 1 )","v":0},{"$f":"IsPriority( BV61, 1, AK61, 1 )","v":0},{"$f":"IsPriority( BZ61, 1, AO61, 1 )","v":0},"resolved area",null,{"$f":"IF( $AQ$62=0, AK61, IF( $O$62=0, I61, \"--\" ) )","v":"--"},null,null,null,{"$f":"IF( $AQ$62=0, AO61, IF( $O$62=0, M61, \"--\" ) )","v":"--"},null,{"$f":"InputErrorVerbose(\"App\",\"Value\",BV61,BZ61)","v":1},{"$f":"InputErrorVerbose(\"App\",\"Desc\",BV61,BZ61)","v":"No Default App Value"},{"$f":"IF( AND( $AQ$62=0, AQ61=0 ),\n   IF( AS61=\"\", AS$62, CONCATENATE( \"User Input\") ), IF( AND( $O$62=0, O61=0 ), IF( Q61=\"\", Q$62, CONCATENATE( \"App Default value\") ), \"insufficient inputs\" ) )","v":"insufficient inputs"}]
[null,null,null,null,null,null,"total app error",null,null,null,null,null,null,null,{"$f":"SUM(O57:O61)","v":20},null,{"$f":"CONCATENATE( \"derived from \", BuildComment( Q57, Q58, Q59, Q60 ) )","v":"derived from -- & ------"},null,null,null,null,null,null,null,null,null,null,null,null,null,null,null,null,null,"total user error",null,null,null,null,null,null,null,{"$f":"SUM(AQ57:AQ61) + Flag_ApplyUserInputs_Inv","v":20},null,{"$f":"CONCATENATE( \"derived from \", BuildComment( AS57, AS58, AS59, AS60 ) )","v":"derived from -- & ------"},null,null,null,null,null,null,null,null,null,null,null,null,null,null,null,null,null,null,null,null,null,null,null,null,null,null,"Insufficient Inputs",null,"--","--",null,null,"--","--",0,"--","Insufficient inputs"]
[null,null,null,null,null,null,null,null,null,null,null,null,null,null,null,null,null,null,null,null,null,null,null,null,null,null,null,null,null,null,null,null,null,null,null,null,null,null,null,null,null,null,null,null,null,null,null,null,null,null,null,null,null,null,null,null,null,null,null,null,null,null,null,null,null,null,null,null,null,null,null,"total resolved error",null,null,null,null,null,null,null,{"$f":"SUM(CB57:CB61)","v":5}]
[]
[null,"Display"]
[null,null,null,null,null,null,null,null,null,null,null,null,null,null,null,null,null,null,null,null,null,null,null,null,null,null,null,null,null,null,null,null,null,null,null,null,null,null,null,null,null,null,null,null,null,null,null,null,null,null,null,null,null,null,null,null,null,null,null,null,null,null,null,null,null,null,null,null,null,null,null,"Multiplying Factor",null,1,null,null,null,1,null,null,null,{"$f":"IF( Value_UnitsOfMeasure_Short = \" in\", 1,  IF( Value_UnitsOfMeasure_Short=\" ft\", 12, IF( Value_UnitsOfMeasure_Short=\" m\", 39.37008, 0 ) ) )","v":1}]
[null,null,null,null,null,null,null,null,null,null,null,null,null,null,null,null,null,null,null,null,null,null,null,null,null,null,null,null,null,null,null,null,null,null,null,null,null,null,null,null,null,null,null,null,null,null,null,null,null,null,null,null,null,null,null,null,null,null,null,null,null,null,null,null,null,null,null,null,null,null,null,"Width for calculations (inch)",null,{"$f":"BV$66*BV57","v":{"$error":"#VALUE!"}},null,null,null,{"$f":"BZ$66*BZ57","v":{"$error":"#VALUE!"}}]
[null,null,null,null,null,null,null,null,null,null,null,null,null,null,null,null,null,null,null,null,null,null,null,null,null,null,null,null,null,null,null,null,null,null,null,null,null,null,null,null,null,null,null,null,null,null,null,null,null,null,null,null,null,null,null,null,null,null,null,null,null,null,null,null,null,null,null,null,null,null,null,"Height for calculations (inch)",null,{"$f":"BV$66*BV58","v":{"$error":"#VALUE!"}},null,null,null,{"$f":"BZ$66*BZ58","v":{"$error":"#VALUE!"}}]
[null,null,null,null,null,null,null,null,null,null,null,null,null,null,null,null,null,null,null,null,null,null,null,null,null,null,null,null,null,null,null,null,null,null,null,null,null,null,null,null,null,null,null,null,null,null,null,null,null,null,null,null,null,null,null,null,null,null,null,null,null,null,null,null,null,null,null,null,null,null,null,"Diag for calculations (inch)",null,{"$f":"BV$66*BV59","v":{"$error":"#VALUE!"}},null,null,null,{"$f":"BZ$66*BZ59","v":{"$error":"#VALUE!"}}]
[null,null,null,null,null,null,null,null,null,null,null,null,null,null,null,null,null,null,null,null,null,null,null,null,null,null,null,null,null,null,null,null,null,null,null,null,null,null,null,null,null,null,null,null,null,null,null,null,null,null,null,null,null,null,null,null,null,null,null,null,null,null,null,null,null,null,null,null,null,null,null,"AR for calculations (inch)",null,{"$f":"BV$60","v":"--"},null,null,null,{"$f":"BZ$60","v":"--"}]
[null,null,null,null,null,null,null,null,null,null,null,null,null,null,null,null,null,null,null,null,null,null,null,null,null,null,null,null,null,null,null,null,null,null,null,null,null,null,null,null,null,null,null,null,null,null,null,null,null,null,null,null,null,null,null,null,null,null,null,null,null,null,null,null,null,null,null,null,null,null,null,"Area for calculations (inch)",null,{"$f":"BV67*BV68","v":{"$error":"#VALUE!"}},null,null,null,{"$f":"BZ67*BZ68","v":{"$error":"#VALUE!"}}]
[]
[null,null,null,null,null,null,null,null,null,null,null,null,null,null,null,null,null,null,null,null,null,null,null,null,null,null,null,null,null,null,null,null,null,null,null,null,null,null,null,null,null,null,null,null,null,null,null,null,null,null,null,null,null,null,null,null,null,null,null,null,null,null,null,null,null,null,null,null,null,null,null,"Multiplying Factor",null,{"$f":"1/12","v":8.3333333333333329E-2},null,null,null,{"$f":"1/12","v":8.3333333333333329E-2}]
[null,null,null,null,null,null,null,null,null,null,null,null,null,null,null,null,null,null,null,null,null,null,null,null,null,null,null,null,null,null,null,null,null,null,null,null,null,null,null,null,null,null,null,null,null,null,null,null,null,null,null,null,null,null,null,null,null,null,null,null,null,null,null,null,null,null,null,null,null,null,null,"Width for calculations (ft)",null,{"$f":"SetPrecision( BV$73*BV57 )","v":{"$error":"#VALUE!"}},null,null,null,{"$f":"SetPrecision( BZ$73*BZ57 )","v":{"$error":"#VALUE!"}}]
[null,null,null,null,null,null,null,null,null,null,null,null,null,null,null,null,null,null,null,null,null,null,null,null,null,null,null,null,null,null,null,null,null,null,null,null,null,null,null,null,null,null,null,null,null,null,null,null,null,null,null,null,null,null,null,null,null,null,null,null,null,null,null,null,null,null,null,null,null,null,null,"Height for calculations (ft)",null,{"$f":"SetPrecision( BV$73*BV58 )","v":{"$error":"#VALUE!"}},null,null,null,{"$f":"SetPrecision( BZ$73*BZ58 )","v":{"$error":"#VALUE!"}}]
[null,null,null,null,null,null,null,null,null,null,null,null,null,null,null,null,null,null,null,null,null,null,null,null,null,null,null,null,null,null,null,null,null,null,null,null,null,null,null,null,null,null,null,null,null,null,null,null,null,null,null,null,null,null,null,null,null,null,null,null,null,null,null,null,null,null,null,null,null,null,null,"Diag for calculations (ft)",null,{"$f":"SetPrecision( BV$73*BV59 )","v":{"$error":"#VALUE!"}},null,null,null,{"$f":"SetPrecision( BZ$73*BZ59 )","v":{"$error":"#VALUE!"}}]
[null,null,null,null,null,null,null,null,null,null,null,null,null,null,null,null,null,null,null,null,null,null,null,null,null,null,null,null,null,null,null,null,null,null,null,null,null,null,null,null,null,null,null,null,null,null,null,null,null,null,null,null,null,null,null,null,null,null,null,null,null,null,null,null,null,null,null,null,null,null,null,"AR for calculations (ft)",null,{"$f":"BV$60","v":"--"},null,null,null,{"$f":"BZ$60","v":"--"}]
[null,null,null,null,null,null,null,null,null,null,null,null,null,null,null,null,null,null,null,null,null,null,null,null,null,null,null,null,null,null,null,null,null,null,null,null,null,null,null,null,null,null,null,null,null,null,null,null,null,null,null,null,null,null,null,null,null,null,null,null,null,null,null,null,null,null,null,null,null,null,null,"Area for calculations (ft)",null,{"$f":"SetPrecision( BV74*BV75 )","v":{"$error":"#VALUE!"}},null,null,null,{"$f":"SetPrecision( BZ74*BZ75 )","v":{"$error":"#VALUE!"}}]
[]
[null,null,null,null,null,null,null,null,null,null,null,null,null,null,null,null,null,null,null,null,null,null,null,null,null,null,null,null,null,null,null,null,null,null,null,null,null,null,null,null,null,null,null,null,null,null,null,null,null,null,null,null,null,null,null,null,null,null,null,null,null,null,null,null,null,null,null,null,null,null,null,"Multiplying Factor",null,{"$f":"1/39.37008","v":2.5399999187200026E-2},null,null,null,{"$f":"1/39.37008","v":2.5399999187200026E-2}]
[null,null,null,null,null,null,null,null,null,null,null,null,null,null,null,null,null,null,null,null,null,null,null,null,null,null,null,null,null,null,null,null,null,null,null,null,null,null,null,null,null,null,null,null,null,null,null,null,null,null,null,null,null,null,null,null,null,null,null,null,null,null,null,null,null,null,null,null,null,null,null,"Width for calculations (m)",null,{"$f":"SetPrecision( BV$80*BV57 )","v":{"$error":"#VALUE!"}},null,null,null,{"$f":"SetPrecision( BZ$80*BZ57 )","v":{"$error":"#VALUE!"}}]
[null,null,null,null,null,null,null,null,null,null,null,null,null,null,null,null,null,null,null,null,null,null,null,null,null,null,null,null,null,null,null,null,null,null,null,null,null,null,null,null,null,null,null,null,null,null,null,null,null,null,null,null,null,null,null,null,null,null,null,null,null,null,null,null,null,null,null,null,null,null,null,"Height for calculations (m)",null,{"$f":"SetPrecision( BV$80*BV58 )","v":{"$error":"#VALUE!"}},null,null,null,{"$f":"SetPrecision( BZ$80*BZ58 )","v":{"$error":"#VALUE!"}}]
[null,null,null,null,null,null,null,null,null,null,null,null,null,null,null,null,null,null,null,null,null,null,null,null,null,null,null,null,null,null,null,null,null,null,null,null,null,null,null,null,null,null,null,null,null,null,null,null,null,null,null,null,null,null,null,null,null,null,null,null,null,null,null,null,null,null,null,null,null,null,null,"Diag for calculations (m)",null,{"$f":"SetPrecision( BV$80*BV59 )","v":{"$error":"#VALUE!"}},null,null,null,{"$f":"SetPrecision( BZ$80*BZ59 )","v":{"$error":"#VALUE!"}}]
[null,null,null,null,null,null,null,null,null,null,null,null,null,null,null,null,null,null,null,null,null,null,null,null,null,null,null,null,null,null,null,null,null,null,null,null,null,null,null,null,null,null,null,null,null,null,null,null,null,null,null,null,null,null,null,null,null,null,null,null,null,null,null,null,null,null,null,null,null,null,null,"AR for calculations (m)",null,{"$f":"BV$60","v":"--"},null,null,null,{"$f":"BZ$60","v":"--"}]
[null,null,null,null,null,null,null,null,null,null,null,null,null,null,null,null,null,null,null,null,null,null,null,null,null,null,null,null,null,null,null,null,null,null,null,null,null,null,null,null,null,null,null,null,null,null,null,null,null,null,null,null,null,null,null,null,null,null,null,null,null,null,null,null,null,null,null,null,null,null,null,"Area for calculations (m)",null,{"$f":"SetPrecision( BV81*BV82 )","v":{"$error":"#VALUE!"}},null,null,null,{"$f":"SetPrecision( BZ81*BZ82 )","v":{"$error":"#VALUE!"}}]
[]
[]
[null,null,null,null,null,{"$f":"IsPriority( SetPrecision(I$57), SetPrecision(M$57), SetPrecision(I$42), SetPrecision(M$42) )","v":0},"display app width",null,{"$f":"IF( $O42=0, CONCATENATE( SetPrecision(I42 * Value_UnitsOfMeasure_Convert), Value_UnitsOfMeasure_Short ), \"--\" )","v":"--"},null,null,null,{"$f":"IF( $O42=0, CONCATENATE( SetPrecision(M42 * Value_UnitsOfMeasure_Convert), Value_UnitsOfMeasure_Short ), \"--\" )","v":"--"},null,null,null,null,null,null,null,null,null,null,null,null,null,null,null,null,null,null,null,null,{"$f":"IsPriority( SetPrecision(AK$57), SetPrecision(AO$57), SetPrecision(AK$42), SetPrecision(AO$42) )","v":0},"display user width",null,{"$f":"IF( OR( $AQ42=0, $AQ42=3), CONCATENATE( SetPrecision(AK42 * Value_UnitsOfMeasure_Convert), Value_UnitsOfMeasure_Short ), \"--\" )","v":"--"},null,null,null,{"$f":"IF( OR($AQ42=0, $AQ42=3), CONCATENATE( SetPrecision(AO42 * Value_UnitsOfMeasure_Convert), Value_UnitsOfMeasure_Short ), \"--\" )","v":"--"},null,{"$f":"AQ42","v":4},{"$f":"IF( AT88=1, AS88, \"\" )","v":""},{"$f":"SanitizedErrorMsg(AQ88)","v":""},{"$f":"IF( LEFT(AS88) = \"(\", 0, 1 )","v":1},null,null,null,null,null,null,null,null,null,null,null,null,null,null,null,null,null,null,null,null,null,null,null,null,null,"display  final width",null,{"$f":" IF( $CB$63=0,  IF( Value_UnitsOfMeasure_Short = \" in\", CONCATENATE( BV67, Value_UnitsOfMeasure_Short ),\nIF( Value_UnitsOfMeasure_Short=\" ft\", CONCATENATE( BV74, Value_UnitsOfMeasure_Short ),\nIF( Value_UnitsOfMeasure_Short=\" m\", CONCATENATE( BV81, Value_UnitsOfMeasure_Short ), Value_UnitsOfMeasure_Null ) ) ), Value_UnitsOfMeasure_Null )","v":"-- in"},null,null,null,{"$f":" IF( $CB$63=0,  IF( Value_UnitsOfMeasure_Short = \" in\", CONCATENATE( BZ67, Value_UnitsOfMeasure_Short ),\nIF( Value_UnitsOfMeasure_Short=\" ft\", CONCATENATE( BZ74, Value_UnitsOfMeasure_Short ),\nIF( Value_UnitsOfMeasure_Short=\" m\", CONCATENATE( BZ81, Value_UnitsOfMeasure_Short ), Value_UnitsOfMeasure_Null ) ) ), Value_UnitsOfMeasure_Null )","v":"-- in"}]
[null,null,null,null,null,{"$f":"IsPriority( SetPrecision(I$58), SetPrecision(M$58), SetPrecision(I$43), SetPrecision(M$43) )","v":0},"display app height",null,{"$f":"IF( $O43=0, CONCATENATE( SetPrecision(I43 * Value_UnitsOfMeasure_Convert), Value_UnitsOfMeasure_Short ), \"--\" )","v":"--"},null,null,null,{"$f":"IF( $O43=0, CONCATENATE( SetPrecision(M43 * Value_UnitsOfMeasure_Convert), Value_UnitsOfMeasure_Short ), \"--\" )","v":"--"},null,null,null,null,null,null,null,null,null,null,null,null,null,null,null,null,null,null,null,null,{"$f":"IsPriority( SetPrecision(AK$58), SetPrecision(AO$58), SetPrecision(AK$43), SetPrecision(AO$43) )","v":0},"display user height",null,{"$f":"IF( OR($AQ43=0, $AQ43=3), CONCATENATE( SetPrecision(AK43 * Value_UnitsOfMeasure_Convert), Value_UnitsOfMeasure_Short ), \"--\" )","v":"--"},null,null,null,{"$f":"IF( OR( $AQ43=0, $AQ43=3), CONCATENATE( SetPrecision(AO43 * Value_UnitsOfMeasure_Convert), Value_UnitsOfMeasure_Short ), \"--\" )","v":"--"},null,{"$f":"AQ43","v":4},{"$f":"IF( AT89=1, AS89, \"\" )","v":""},{"$f":"SanitizedErrorMsg(AQ89)","v":""},{"$f":"IF( LEFT(AS89) = \"(\", 0, 1 )","v":1},null,null,null,null,null,null,null,null,null,null,null,null,null,null,null,null,null,null,null,null,null,null,null,null,null,"display  final height",null,{"$f":" IF( $CB$63=0,  IF( Value_UnitsOfMeasure_Short = \" in\", CONCATENATE( BV68, Value_UnitsOfMeasure_Short ),\nIF( Value_UnitsOfMeasure_Short=\" ft\", CONCATENATE( BV75, Value_UnitsOfMeasure_Short ),\nIF( Value_UnitsOfMeasure_Short=\" m\", CONCATENATE( BV82, Value_UnitsOfMeasure_Short ), Value_UnitsOfMeasure_Null ) ) ), Value_UnitsOfMeasure_Null )","v":"-- in"},null,null,null,{"$f":" IF( $CB$63=0,  IF( Value_UnitsOfMeasure_Short = \" in\", CONCATENATE( BZ68, Value_UnitsOfMeasure_Short ),\nIF( Value_UnitsOfMeasure_Short=\" ft\", CONCATENATE( BZ75, Value_UnitsOfMeasure_Short ),\nIF( Value_UnitsOfMeasure_Short=\" m\", CONCATENATE( BZ82, Value_UnitsOfMeasure_Short ), Value_UnitsOfMeasure_Null ) ) ), Value_UnitsOfMeasure_Null )","v":"-- in"}]
[null,null,null,null,null,{"$f":"IsPriority( SetPrecision(I$59), SetPrecision(M$59), SetPrecision(I$44), SetPrecision(M$44) )","v":0},"display app diag",null,{"$f":"IF( $O44=0, CONCATENATE( SetPrecision(I44 * Value_UnitsOfMeasure_Convert), Value_UnitsOfMeasure_Short ), \"--\" )","v":"--"},null,null,null,{"$f":"IF( $O44=0, CONCATENATE( SetPrecision(M44 * Value_UnitsOfMeasure_Convert), Value_UnitsOfMeasure_Short ), \"--\" )","v":"--"},null,null,null,null,null,null,null,null,null,null,null,null,null,null,null,null,null,null,null,null,{"$f":"IsPriority( SetPrecision(AK$59), SetPrecision(AO$59), SetPrecision(AK$44), SetPrecision(AO$44) )","v":0},"display user diag",null,{"$f":"IF( OR( $AQ44=0, $AQ44=3), CONCATENATE( SetPrecision(AK44 * Value_UnitsOfMeasure_Convert), Value_UnitsOfMeasure_Short ), \"--\" )","v":"--"},null,null,null,{"$f":"IF( OR( $AQ44=0, $AQ44=3), CONCATENATE( SetPrecision(AO44 * Value_UnitsOfMeasure_Convert), Value_UnitsOfMeasure_Short ), \"--\" )","v":"--"},null,{"$f":"MAX( AQ44, AQ59)","v":4},{"$f":"IF( AT90=1, AS90, \"\" )","v":""},{"$f":"SanitizedErrorMsg(AQ90)","v":""},{"$f":"IF( LEFT(AS90) = \"(\", 0, 1 )","v":1},null,null,null,null,null,null,null,null,null,null,null,null,null,null,null,null,null,null,null,null,null,null,null,null,null,"display  final diag",null,{"$f":" IF( $CB$63=0,  IF( Value_UnitsOfMeasure_Short = \" in\", CONCATENATE( BV69, Value_UnitsOfMeasure_Short ),\nIF( Value_UnitsOfMeasure_Short=\" ft\", CONCATENATE( BV76, Value_UnitsOfMeasure_Short ),\nIF( Value_UnitsOfMeasure_Short=\" m\", CONCATENATE( BV83, Value_UnitsOfMeasure_Short ), Value_UnitsOfMeasure_Null ) ) ), Value_UnitsOfMeasure_Null )","v":"-- in"},null,null,null,{"$f":" IF( $CB$63=0,  IF( Value_UnitsOfMeasure_Short = \" in\", CONCATENATE( BZ69, Value_UnitsOfMeasure_Short ),\nIF( Value_UnitsOfMeasure_Short=\" ft\", CONCATENATE( BZ76, Value_UnitsOfMeasure_Short ),\nIF( Value_UnitsOfMeasure_Short=\" m\", CONCATENATE( BZ83, Value_UnitsOfMeasure_Short ), Value_UnitsOfMeasure_Null ) ) ), Value_UnitsOfMeasure_Null )","v":"-- in"}]
[null,null,null,null,null,{"$f":"IsPriority( SetPrecision(I$60), SetPrecision(M$60), SetPrecision(I$47), SetPrecision(M$47) )","v":0},"display app AR",null,{"$f":"IF( SUM($O45:$O47)=0, CONCATENATE( I45, \":\", I46, \"  ( \", SetPrecision(I47), \" )\"), \"--\" )","v":"--"},null,null,null,{"$f":"IF( SUM($O45:$O47)=0, CONCATENATE( M45, \":\", M46, \"  ( \", SetPrecision(M47), \" )\"), \"--\" )","v":"--"},null,null,null,null,null,null,null,null,null,null,null,null,null,null,null,null,null,null,null,null,{"$f":"IsPriority( SetPrecision(AK$60), SetPrecision(AO$60), SetPrecision(AK$47), SetPrecision(AO$47) )","v":0},"display user AR",null,{"$f":"IF( SUM($AQ45:$AQ47)=0, CONCATENATE( AK45, \":\", AK46, \"  ( \", SetPrecision(AK47), \" )\"), \"--\" )","v":"--"},null,null,null,{"$f":"IF( SUM($AQ45:$AQ47)=0, CONCATENATE( AO45, \":\", AO46, \"  ( \", SetPrecision(AO47), \" )\"), \"--\" )","v":"--"},null,{"$f":"IF( OR( AQ45=3, AQ46=3), 3, MAX(AQ45:AQ46) )","v":4},{"$f":"IF( AT91=1, AS91, \"\" )","v":""},{"$f":"SanitizedErrorMsg(AQ91)","v":""},{"$f":"IF( LEFT(AS91) = \"(\", 0, 1 )","v":1},null,null,null,null,null,null,null,null,null,null,null,null,null,null,null,null,null,null,null,null,null,null,null,null,null,"display  final AR",null,{"$f":" IF( $CB$63=0,  IF( Value_UnitsOfMeasure_Short = \" in\", BV70,\nIF( Value_UnitsOfMeasure_Short=\" ft\", BV77,\nIF( Value_UnitsOfMeasure_Short=\" m\", BV84, \"--\" ) ) ), \"--\" )","v":"--"},null,null,null,{"$f":" IF( $CB$63=0,  IF( Value_UnitsOfMeasure_Short = \" in\", BZ70,\nIF( Value_UnitsOfMeasure_Short=\" ft\", BZ77,\nIF( Value_UnitsOfMeasure_Short=\" m\", BZ84, \"--\" ) ) ), \"--\" )","v":"--"}]
[null,null,null,null,null,null,"display app area",null,{"$f":"IF( $O$62=0, CONCATENATE( SetPrecision(I61), Value_UnitsOfMeasure_AreaShort ), \"--\" )","v":"--"},null,null,null,{"$f":"IF( $O$62=0, CONCATENATE( SetPrecision(M61), Value_UnitsOfMeasure_AreaShort ), \"--\" )","v":"--"},null,null,null,null,null,null,null,null,null,null,null,null,null,null,null,null,null,null,null,null,null,"display user area",null,{"$f":"IF( $O$62=0, CONCATENATE( SetPrecision(AK61), Value_UnitsOfMeasure_AreaShort ), \"--\" )","v":"--"},null,null,null,{"$f":"IF( $AQ$62=0, CONCATENATE( SetPrecision(AO61), Value_UnitsOfMeasure_AreaShort ), \"--\" )","v":"--"},null,{"$f":"AQ61","v":4},{"$f":"IF( AT92=1, AS92, \"\" )","v":""},{"$f":"SanitizedErrorMsg(AQ92)","v":""},{"$f":"IF( LEFT(AS92) = \"(\", 0, 1 )","v":1},null,null,null,null,null,null,null,null,null,null,null,null,null,null,null,null,null,null,null,null,null,null,null,null,null,"display  final area",null,{"$f":" IF( $CB$63=0,  IF( Value_UnitsOfMeasure_Short = \" in\", CONCATENATE( SetPrecision(BV71), Value_UnitsOfMeasure_AreaShort ),\nIF( Value_UnitsOfMeasure_Short=\" ft\", CONCATENATE( BV78, Value_UnitsOfMeasure_AreaShort ),\nIF( Value_UnitsOfMeasure_Short=\" m\", CONCATENATE( BV85, Value_UnitsOfMeasure_AreaShort ), Value_UnitsOfMeasure_AreaNull ) ) ), Value_UnitsOfMeasure_AreaNull )","v":"-- sqr in"},null,null,null,{"$f":" IF( $CB$63=0,  IF( Value_UnitsOfMeasure_Short = \" in\", CONCATENATE( SetPrecision(BZ71), Value_UnitsOfMeasure_AreaShort ),\nIF( Value_UnitsOfMeasure_Short=\" ft\", CONCATENATE( BZ78, Value_UnitsOfMeasure_AreaShort ),\nIF( Value_UnitsOfMeasure_Short=\" m\", CONCATENATE( BZ85, Value_UnitsOfMeasure_AreaShort ), Value_UnitsOfMeasure_AreaNull ) ) ), Value_UnitsOfMeasure_AreaNull )","v":"-- sqr in"}]
[]
[null,null,null,"Resolution",null,null,null,null,null,null,null,null,null,null,null,null,null,null,null,null,null,null,null,null,null,null,null,null,null,null,null,null,"Resolution",null,null,null,null,null,null,null,null,null,null,null,null,null,null,null,"Resolution",null,null,null,null,null,null,null,null,null,null,null,null,null,null,null,null,null,"Resolution"]
[null,"Input"]
[null,null,null,null,null,null,null,null,null,null,null,null,null,null,null,null,null,null,null,null,null,null,null,null,null,null,null,null,null,null,null,null,null,null,null,null,null,null,null,null,null,null,null,null,null,null,null,null,null,null,null,null,null,null,null,null,null,null,null,null,null,null,null,null,null,null,null,null,null,null,null,"Resolved Source",null,{"$f":"IF( AND( Flag_ApplyUserInputs=1, ( (MIN(AQ98:AQ99) + MIN(AQ105:AQ112)) = 0) ), \"User\", IF( (MIN(O98:O99) + MIN(O105:O112)) = 0, \"AppDef\", \"--\" ) )","v":"--"}]
[]
[null,null,null,null,null,null,"App Viewing Distance",null,{"$f":"AppDef_ViewDist_Min","v":"--"},null,null,null,{"$f":"AppDef_ViewDist_Max","v":"--"},null,{"$f":"InputErrorVerbose(\"App\",\"Value\",I98,M98)","v":1},{"$f":"InputErrorVerbose(\"App\",\"Desc\",I98,M98)","v":"No Default App Value"},null,null,null,null,null,null,null,null,null,null,null,null,null,null,null,null,null,null,"User Viewing Distance",null,{"$f":"TRes_ViewDist_xMin","v":0},null,null,null,{"$f":"TRes_ViewDist_xMax","v":0},null,{"$f":"InputErrorVerbose(\"User\",\"Value\",AK98,AO98)","v":4},{"$f":"InputErrorVerbose(\"User\",\"Desc\",AK98,AO98)","v":"Value is zero"}]
[null,null,null,null,null,null,"App Horizontal Image FOV",null,{"$f":"AppDef_FOV_Min","v":"--"},null,null,null,{"$f":"AppDef_FOV_Max","v":"--"},null,{"$f":"InputErrorVerbose(\"App\",\"Value\",I99,M99)","v":1},{"$f":"InputErrorVerbose(\"App\",\"Desc\",I99,M99)","v":"No Default App Value"},null,null,null,null,null,null,null,null,null,null,null,null,null,null,null,null,null,null,"User Horizontal Image FOV",null,{"$f":"TRes_FOV_Min","v":0},null,null,null,{"$f":"TRes_FOV_Max","v":0},null,{"$f":"InputErrorVerbose(\"User\",\"Value\",AK99,AO99)","v":4},{"$f":"InputErrorVerbose(\"User\",\"Desc\",AK99,AO99)","v":"Value is zero"}]
[]
[null,null,null,null,null,{"$f":"IsPriority( SetPrecision(I101), SetPrecision(M101), SetPrecision(I98), SetPrecision(M98) )","v":0},"Calc Viewing Distance",null,{"$f":"SetPrecision( CalcVDistFOV( \"VDist\", \"Val\", I98, I99, I133 ) )","v":0},null,null,null,{"$f":"SetPrecision( CalcVDistFOV( \"VDist\", \"Val\", M98, M99, M133 ) )","v":0},null,{"$f":"InputErrorVerbose(\"App\",\"Value\",I101,M101)","v":4},{"$f":"InputErrorVerbose(\"App\",\"Desc\",I101,M101)","v":"Value is zero"},{"$f":"CalcVDistFOV( \"VDist\", \"Src\", I98, I99, I133 )","v":"--"},null,null,null,null,null,null,null,null,null,null,null,null,null,null,null,null,{"$f":"IsPriority( SetPrecision(AK101), SetPrecision(AO101), SetPrecision(AK98), SetPrecision(AO98) )","v":0},"Calc Viewing Distance",null,{"$f":"SetPrecision( CalcVDistFOV( \"VDist\", \"Val\", AK98, AK99, AK133 ) )","v":0},null,null,null,{"$f":"SetPrecision( CalcVDistFOV( \"VDist\", \"Val\", AO98, AO99, AO133 ) )","v":0},null,{"$f":"InputErrorVerbose(\"User\",\"Value\",AK101,AO101)","v":4},{"$f":"InputErrorVerbose(\"User\",\"Desc\",AK101,AO101)","v":"Value is zero"},{"$f":"CalcVDistFOV( \"VDist\", \"Src\", AK98, AK99, AK133 )","v":"--"},null,null,null,null,null,null,null,null,null,null,null,null,null,null,null,null,null,null,null,null,null,null,null,null,null,null,"Resolved Viewing Distance",null,{"$f":"IF( $BV$96=\"User\", AK101, IF( $BV$96=\"AppDef\", I101, \"--\") )","v":"--"},null,null,null,{"$f":"IF( $BV$96=\"User\", AO101, IF( $BV$96=\"AppDef\", M101, \"--\") )","v":"--"},null,{"$f":"InputErrorVerbose(\"App\",\"Value\",BV101,BZ101)","v":1},{"$f":"InputErrorVerbose(\"App\",\"Desc\",BV101,BZ101)","v":"No Default App Value"}]
[null,null,null,null,null,{"$f":"IsPriority( SetPrecision(I102), SetPrecision(M102), SetPrecision(I99), SetPrecision(M99) )","v":0},"Calc Horizontal Image FOV",null,{"$f":"SetPrecision( CalcVDistFOV( \"FOV\", \"Val\", I98, I99, I133 ) )","v":0},null,null,null,{"$f":"SetPrecision( CalcVDistFOV( \"FOV\", \"Val\", M98, M99, M133 ) )","v":0},null,{"$f":"InputErrorVerbose(\"App\",\"Value\",I102,M102)","v":4},{"$f":"InputErrorVerbose(\"App\",\"Desc\",I102,M102)","v":"Value is zero"},{"$f":" CalcVDistFOV( \"FOV\", \"Src\", I98, I99, I133 )","v":"--"},null,null,null,null,null,null,null,null,null,null,null,null,null,null,null,null,{"$f":"IsPriority( SetPrecision(AK102), SetPrecision(AO102), SetPrecision(AK99), SetPrecision(AO99) )","v":0},"Calc Horizontal Image FOV",null,{"$f":"SetPrecision( CalcVDistFOV( \"FOV\", \"Val\", AK98, AK99, AK133 ) )","v":0},null,null,null,{"$f":"SetPrecision( CalcVDistFOV( \"FOV\", \"Val\", AO98, AO99, AO133 ) )","v":0},null,{"$f":"InputErrorVerbose(\"User\",\"Value\",AK102,AO102)","v":4},{"$f":"InputErrorVerbose(\"User\",\"Desc\",AK102,AO102)","v":"Value is zero"},{"$f":" CalcVDistFOV( \"FOV\", \"Src\", AK98, AK99, AK133 )","v":"--"},null,null,null,null,null,null,null,null,null,null,null,null,null,null,null,null,null,null,null,null,null,null,null,null,null,null,"Resolved Horizontal Image FOV",null,{"$f":"IF( $BV$96=\"User\", AK102, IF( $BV$96=\"AppDef\", I102, \"--\") )","v":"--"},null,null,null,{"$f":"IF( $BV$96=\"User\", AO102, IF( $BV$96=\"AppDef\", M102, \"--\") )","v":"--"},null,{"$f":"InputErrorVerbose(\"App\",\"Value\",BV102,BZ102)","v":1},{"$f":"InputErrorVerbose(\"App\",\"Desc\",BV102,BZ102)","v":"No Default App Value"}]
[]
[null,"Calc"]
[null,null,null,null,null,null,"App Pixels Per Degree",null,{"$f":"AppDef_PxPerDeg_Min","v":"--"},null,null,null,{"$f":"AppDef_PxPerDeg_Max","v":"--"},null,{"$f":"InputErrorVerbose(\"App\",\"Value\",I105,M105)","v":1},{"$f":"InputErrorVerbose(\"App\",\"Desc\",I105,M105)","v":"No Default App Value"},null,null,null,null,null,null,null,null,null,null,null,null,null,null,null,null,null,null,"User Pixels Per Degree",null,{"$f":"TRes_PxPerDeg_Min","v":0},null,null,null,{"$f":"TRes_PxPerDeg_Max","v":0},null,{"$f":"InputErrorVerbose(\"User\",\"Value\",AK105,AO105)","v":4},{"$f":"InputErrorVerbose(\"User\",\"Desc\",AK105,AO105)","v":"Value is zero"},null,null,null,null,null,null,null,null,null,null,null,null,null,null,null,null,null,null,null,null,null,null,null,null,null,null,null,"Resolved Pixels Per Degree",null,{"$f":"IF( $BV$96=\"User\", AK105, IF( $BV$96=\"AppDef\", I105, \"--\") )","v":"--"},null,null,null,{"$f":"IF( $BV$96=\"User\", AO105, IF( $BV$96=\"AppDef\", M105, \"--\") )","v":"--"},null,{"$f":"InputErrorVerbose(\"App\",\"Value\",BV105,BZ105)","v":1},{"$f":"InputErrorVerbose(\"App\",\"Desc\",BV105,BZ105)","v":"No Default App Value"}]
[null,null,null,null,null,null,"App Pixels per inch",null,{"$f":"AppDef_PxPerInch_Min","v":"--"},null,null,null,{"$f":"AppDef_PxPerInch_Max","v":"--"},null,{"$f":"InputErrorVerbose(\"App\",\"Value\",I106,M106)","v":1},{"$f":"InputErrorVerbose(\"App\",\"Desc\",I106,M106)","v":"No Default App Value"},null,null,null,null,null,null,null,null,null,null,null,null,null,null,null,null,null,null,"User Pixels per inch",null,{"$f":"TRes_PxDens_Min","v":0},null,null,null,{"$f":"TRes_PxDens_Max","v":0},null,{"$f":"InputErrorVerbose(\"User\",\"Value\",AK106,AO106)","v":4},{"$f":"InputErrorVerbose(\"User\",\"Desc\",AK106,AO106)","v":"Value is zero"},null,null,null,null,null,null,null,null,null,null,null,null,null,null,null,null,null,null,null,null,null,null,null,null,null,null,null,"Resolved Pixels per inch",null,{"$f":"IF( $BV$96=\"User\", AK106, IF( $BV$96=\"AppDef\", I106, \"--\") )","v":"--"},null,null,null,{"$f":"IF( $BV$96=\"User\", AO106, IF( $BV$96=\"AppDef\", M106, \"--\") )","v":"--"},null,{"$f":"InputErrorVerbose(\"App\",\"Value\",BV106,BZ106)","v":1},{"$f":"InputErrorVerbose(\"App\",\"Desc\",BV106,BZ106)","v":"No Default App Value"}]
[null,null,null,null,null,null,"App Pixels per mm",null,{"$f":"AppDef_PxPerMM_Min","v":"--"},null,null,null,{"$f":"AppDef_PxPerMM_Max","v":"--"},null,{"$f":"InputErrorVerbose(\"App\",\"Value\",I107,M107)","v":1},{"$f":"InputErrorVerbose(\"App\",\"Desc\",I107,M107)","v":"No Default App Value"},null,null,null,null,null,null,null,null,null,null,null,null,null,null,null,null,null,null,"User Pixels per mm",null,null,null,null,null,null,null,null,null,null,null,null,null,null,null,null,null,null,null,null,null,null,null,null,null,null,null,null,null,null,null,null,null,null,null,null,"Resolved Pixels per mm",null,{"$f":"IF( $BV$96=\"User\", AK107, IF( $BV$96=\"AppDef\", I107, \"--\") )","v":"--"},null,null,null,{"$f":"IF( $BV$96=\"User\", AO107, IF( $BV$96=\"AppDef\", M107, \"--\") )","v":"--"},null,{"$f":"InputErrorVerbose(\"App\",\"Value\",BV107,BZ107)","v":1},{"$f":"InputErrorVerbose(\"App\",\"Desc\",BV107,BZ107)","v":"No Default App Value"}]
[]
[null,"Input"]
[null,null,null,null,null,null,"App Text Height",null,1,null,null,null,1,null,{"$f":"InputErrorVerbose(\"App\",\"Value\",I110,M110)","v":0},{"$f":"InputErrorVerbose(\"App\",\"Desc\",I110,M110)","v":"No Error"},null,null,null,null,null,null,null,null,null,null,null,null,null,null,null,null,null,null,"User Text Height"]
[null,null,null,null,null,null,"App Text Arcmin",null,{"$f":"AppDef_TextArcmin_Min","v":"--"},null,null,null,{"$f":"AppDef_TextArcmin_Max","v":"--"},null,1,"No Default App Value",null,null,null,null,null,null,null,null,null,null,null,null,null,null,null,null,null,null,"User Text Arcmin"]
[null,null,null,null,null,null,"App Points-to-Px Conv Factor",null,{"$f":"AppDef_PointsToPixelsFactor_Min","v":"--"},null,null,null,{"$f":"AppDef_PointsToPixelsFactor_Max","v":"--"},null,{"$f":"InputErrorVerbose(\"App\",\"Value\",I112,M112)","v":1},{"$f":"InputErrorVerbose(\"App\",\"Desc\",I112,M112)","v":"No Default App Value"},null,null,null,null,null,null,null,null,null,null,null,null,null,null,null,null,null,null,"User Points-to-Px Conv Factor",null,{"$f":"TRes_PointsToPixelsFactor_Min","v":0},null,null,null,{"$f":"TRes_PointsToPixelsFactor_Max","v":0},null,{"$f":"InputErrorVerbose(\"User\",\"Value\",AK112,AO112)","v":4},{"$f":"InputErrorVerbose(\"User\",\"Desc\",AK112,AO112)","v":"Value is zero"}]
[null,null,null,null,null,null,"total app error",null,null,null,null,null,null,null,{"$f":"MIN(O98:O99) + MIN(O105:O111) + O112 + Flag_ApplyUserInputs_Inv","v":2},null,null,null,null,null,null,null,null,null,null,null,null,null,null,null,null,null,null,null,"total app error",null,null,null,null,null,null,null,{"$f":"MIN(AQ98:AQ99) + MIN(AQ105:AQ107) + MIN(AQ110:AQ111) + AQ112 + Flag_ApplyUserInputs_Inv","v":12}]
[]
[null,"Calc"]
[null,null,null,null,null,null,"Resolved Viewing Distance ( selected units )",null,{"$f":"BV101","v":"--"},null,null,null,{"$f":"BZ101","v":"--"},null,{"$f":"InputErrorVerbose(\"App\",\"Value\",I116,M116)","v":1},{"$f":"InputErrorVerbose(\"App\",\"Desc\",I116,M116)","v":"No Default App Value"},null,null,null,null,null,null,null,null,null,null,null,null,null,null,null,null,null,null,"Resolved Viewing Distance ( selected units )",null,{"$f":"BV101","v":"--"},null,null,null,{"$f":"BZ101","v":"--"},null,{"$f":"InputErrorVerbose(\"App\",\"Value\",AK116,AO116)","v":1},{"$f":"InputErrorVerbose(\"App\",\"Desc\",AK116,AO116)","v":"No Default App Value"}]
[null,null,null,null,null,null,"Calc Text Height",null,{"$f":"SetPrecision( CalcTextHeightArcmin( \"THeight\", \"Val\", I116, I110, I111 ) )","v":0},null,null,null,{"$f":"SetPrecision( CalcTextHeightArcmin( \"THeight\", \"Val\", M116, M110, M111 ) )","v":0},null,{"$f":"InputErrorVerbose(\"App\",\"Value\",I117,M117)","v":4},{"$f":"InputErrorVerbose(\"App\",\"Desc\",I117,M117)","v":"Value is zero"},{"$f":"CalcTextHeightArcmin( \"THeight\", \"Src\", I116, I110, I111 )","v":"--"},null,null,null,null,null,null,null,null,null,null,null,null,null,null,null,null,null,"Calc Text Height",null,{"$f":"SetPrecision( CalcTextHeightArcmin( \"THeight\", \"Val\", AK116, AK110, AK111 ) )","v":0},null,null,null,{"$f":"SetPrecision( CalcTextHeightArcmin( \"THeight\", \"Val\", AO116, AO110, AO111 ) )","v":0},null,{"$f":"InputErrorVerbose(\"User\",\"Value\",AK117,AO117)","v":4},{"$f":"InputErrorVerbose(\"User\",\"Desc\",AK117,AO117)","v":"Value is zero"},{"$f":"CalcTextHeightArcmin( \"THeight\", \"Src\", AK116, AK110, AK111 )","v":"--"},null,null,null,null,null,null,null,null,null,null,null,null,null,null,null,null,null,null,null,null,null,null,null,null,null,null,"Resolved Text Height",null,{"$f":"IF( $BV$96=\"User\", AK117, IF( $BV$96=\"AppDef\", I117, \"--\") )","v":"--"},null,null,null,{"$f":"IF( $BV$96=\"User\", AO117, IF( $BV$96=\"AppDef\", M117, \"--\") )","v":"--"},null,{"$f":"InputErrorVerbose(\"App\",\"Value\",BV117,BZ117)","v":1},{"$f":"InputErrorVerbose(\"App\",\"Desc\",BV117,BZ117)","v":"No Default App Value"},{"$f":"IF( AND( $AQ$120=0, AQ117=0 ),\n   IF( AS117=\"\", AS$120, CONCATENATE( \"User Input\") ), IF( AND( $O$120=0, O117=0 ), IF( Q117=\"\", Q$120, CONCATENATE( \"App Default value\") ), \"( only valid when specifying text size )\" ) )","v":"( only valid when specifying text size )"}]
[null,null,null,null,null,null,"Calc Text Arcmin",null,{"$f":"SetPrecision( CalcTextHeightArcmin( \"TArcmin\", \"Val\", I116, I110, I111 ) )","v":0},null,null,null,{"$f":"SetPrecision( CalcTextHeightArcmin( \"TArcmin\", \"Val\", M116, M110, M111 ) )","v":0},null,{"$f":"InputErrorVerbose(\"App\",\"Value\",I118,M118)","v":4},{"$f":"InputErrorVerbose(\"App\",\"Desc\",I118,M118)","v":"Value is zero"},{"$f":"CalcTextHeightArcmin( \"TArcmin\", \"Src\", I116, I110, I111 )","v":"--"},null,null,null,null,null,null,null,null,null,null,null,null,null,null,null,null,null,"Calc Text Arcmin",null,{"$f":"SetPrecision( CalcTextHeightArcmin( \"TArcmin\", \"Val\", AK116, AK110, AK111 ) )","v":0},null,null,null,{"$f":"SetPrecision( CalcTextHeightArcmin( \"TArcmin\", \"Val\", AO116, AO110, AO111 ) )","v":0},null,{"$f":"InputErrorVerbose(\"User\",\"Value\",AK118,AO118)","v":4},{"$f":"InputErrorVerbose(\"User\",\"Desc\",AK118,AO118)","v":"Value is zero"},{"$f":"CalcTextHeightArcmin( \"TArcmin\", \"Src\", AK116, AK110, AK111 )","v":"--"},null,null,null,null,null,null,null,null,null,null,null,null,null,null,null,null,null,null,null,null,null,null,null,null,null,null,"Resolved Text Arcmin",null,{"$f":"IF( $BV$96=\"User\", AK118, IF( $BV$96=\"AppDef\", I118, \"--\") )","v":"--"},null,null,null,{"$f":"IF( $BV$96=\"User\", AO118, IF( $BV$96=\"AppDef\", M118, \"--\") )","v":"--"},null,{"$f":"InputErrorVerbose(\"App\",\"Value\",BV118,BZ118)","v":1},{"$f":"InputErrorVerbose(\"App\",\"Desc\",BV118,BZ118)","v":"No Default App Value"},{"$f":"IF( AND( $AQ$120=0, AQ118=0 ),\n   IF( AS118=\"\", AS$120, CONCATENATE( \"User Input\") ), IF( AND( $O$120=0, O118=0 ), IF( Q118=\"\", Q$120, CONCATENATE( \"App Default value\") ), \"( only valid when specifying text size )\" ) )","v":"( only valid when specifying text size )"}]
[null,null,null,null,null,null,"Calc Points-to-Px Conv Factor",null,{"$f":"IF( O112=0, I112, \"--\" )","v":"--"},null,null,null,{"$f":"IF( S112=0, M112, \"--\" )","v":"--"},null,{"$f":"InputErrorVerbose(\"App\",\"Value\",I119,M119)","v":1},{"$f":"InputErrorVerbose(\"App\",\"Desc\",I119,M119)","v":"No Default App Value"},null,null,null,null,null,null,null,null,null,null,null,null,null,null,null,null,null,null,"Calc Points-to-Px Conv Factor",null,{"$f":"IF( AQ112=0, AK112, \"--\" )","v":"--"},null,null,null,{"$f":"IF( AU112=0, AO112, \"--\" )","v":0},null,{"$f":"InputErrorVerbose(\"User\",\"Value\",AK119,AO119)","v":2},{"$f":"InputErrorVerbose(\"User\",\"Desc\",AK119,AO119)","v":"Invalid value"},null,null,null,null,null,null,null,null,null,null,null,null,null,null,null,null,null,null,null,null,null,null,null,null,null,null,null,"Resolved Points-to-Px Conv Factor",null,{"$f":"IF( $BV$96=\"User\", AK119, IF( $BV$96=\"AppDef\", I119, \"--\") )","v":"--"},null,null,null,{"$f":"IF( $BV$96=\"User\", AO119, IF( $BV$96=\"AppDef\", M119, \"--\") )","v":"--"},null,{"$f":"InputErrorVerbose(\"App\",\"Value\",BV119,BZ119)","v":1},{"$f":"InputErrorVerbose(\"App\",\"Desc\",BV119,BZ119)","v":"No Default App Value"},{"$f":"IF( AND( $AQ$120=0, AQ119=0 ), \"User Input\",  IF( AND( $O$120=0, O119=0 ), \"App Default value\", \"--\" ) )","v":"--"}]
[null,null,null,null,null,null,"total app error",null,null,null,null,null,null,null,{"$f":"MIN(O98:O99) + MIN(O105:O111) + O112","v":2},null,{"$f":"CONCATENATE( \"derived from \", IF( Q117<>\"--\", Q117, \"\"), IF( Q118<>\"--\", Q118, \"\") )","v":"derived from "},null,null,null,null,null,null,null,null,null,null,null,null,null,null,null,null,null,"total app error",null,null,null,null,null,null,null,{"$f":"MIN(AQ98:AQ99) + MIN(AQ105:AQ111) + AQ112 + Flag_ApplyUserInputs_Inv","v":12},null,{"$f":"CONCATENATE( \"derived from \", IF( AS117<>\"--\", AS117, \"\"), IF( AS118<>\"--\", AS118, \"\") )","v":"derived from "}]
[]
[null,"Calc"]
[null,null,null,null,null,null,"Multiplying Factor",null,1,null,null,null,1,null,null,null,null,null,null,null,null,null,null,null,null,null,null,null,null,null,null,null,null,null,"Multiplying Factor",null,1,null,null,null,1]
[null,null,null,null,null,null,"Text Height for calculations (inch)",null,{"$f":"SetPrecision( I117*I123 )","v":0},null,null,null,{"$f":"SetPrecision( M117*M123 )","v":0},null,{"$f":"InputErrorVerbose(\"App\",\"Value\",I124,M124)","v":4},{"$f":"InputErrorVerbose(\"App\",\"Desc\",I124,M124)","v":"Value is zero"},null,null,null,null,null,null,null,null,null,null,null,null,null,null,null,null,null,null,"Text Height for calculations (inch)",null,1,null,null,null,1,null,{"$f":"InputErrorVerbose(\"User\",\"Value\",AK124,AO124)","v":0},{"$f":"InputErrorVerbose(\"User\",\"Desc\",AK124,AO124)","v":"No Error"}]
[]
[null,null,null,null,null,null,"Multiplying Factor",null,{"$f":"1/12","v":8.3333333333333329E-2},null,null,null,{"$f":"1/12","v":8.3333333333333329E-2},null,null,null,null,null,null,null,null,null,null,null,null,null,null,null,null,null,null,null,null,null,"Multiplying Factor",null,{"$f":"1/12","v":8.3333333333333329E-2},null,null,null,{"$f":"1/12","v":8.3333333333333329E-2}]
[null,null,null,null,null,null,"Text Height for calculations (ft)",null,{"$f":"SetPrecision( I117*I126 )","v":0},null,null,null,{"$f":"SetPrecision( M117*M126 )","v":0},null,{"$f":"InputErrorVerbose(\"App\",\"Value\",I127,M127)","v":4},{"$f":"InputErrorVerbose(\"App\",\"Desc\",I127,M127)","v":"Value is zero"},null,null,null,null,null,null,null,null,null,null,null,null,null,null,null,null,null,null,"Text Height for calculations (ft)",null,{"$f":"SetPrecision( AK117*AK126 )","v":0},null,null,null,{"$f":"SetPrecision( AO117*AO126 )","v":0},null,{"$f":"InputErrorVerbose(\"User\",\"Value\",AK127,AO127)","v":4},{"$f":"InputErrorVerbose(\"User\",\"Desc\",AK127,AO127)","v":"Value is zero"}]
[]
[null,null,null,null,null,null,"Multiplying Factor",null,{"$f":"1/39.37008","v":2.5399999187200026E-2},null,null,null,{"$f":"1/39.37008","v":2.5399999187200026E-2},null,null,null,null,null,null,null,null,null,null,null,null,null,null,null,null,null,null,null,null,null,"Multiplying Factor",null,{"$f":"1/39.37008","v":2.5399999187200026E-2},null,null,null,{"$f":"1/39.37008","v":2.5399999187200026E-2}]
[null,null,null,null,null,null,"Text Height for calculations (m)",null,{"$f":"SetPrecision( I117*I129 )","v":0},null,null,null,{"$f":"SetPrecision( M117*M129 )","v":0},null,{"$f":"InputErrorVerbose(\"App\",\"Value\",I130,M130)","v":4},{"$f":"InputErrorVerbose(\"App\",\"Desc\",I130,M130)","v":"Value is zero"},null,null,null,null,null,null,null,null,null,null,null,null,null,null,null,null,null,null,"Text Height for calculations (m)",null,{"$f":"SetPrecision( AK117*AK129 )","v":0},null,null,null,{"$f":"SetPrecision( AO117*AO129 )","v":0},null,{"$f":"InputErrorVerbose(\"User\",\"Value\",AK130,AO130)","v":4},{"$f":"InputErrorVerbose(\"User\",\"Desc\",AK130,AO130)","v":"Value is zero"}]
[]
[null,null,null,null,null,null,"Image Height (in)",null,{"$f":" IF( $CB$63=0,  BV68, \"--\" )","v":"--"},null,null,null,{"$f":" IF( $CB$63=0,  BZ68, \"--\" )","v":"--"},null,{"$f":"InputErrorVerbose(\"App\",\"Value\",I132,M132)","v":1},{"$f":"InputErrorVerbose(\"App\",\"Desc\",I132,M132)","v":"No Default App Value"},null,null,null,null,null,null,null,null,null,null,null,null,null,null,null,null,null,null,"Image Height (in)",null,{"$f":" IF( $CB$63=0,  BV68, \"--\" )","v":"--"},null,null,null,{"$f":" IF( $CB$63=0,  BZ68, \"--\" )","v":"--"},null,{"$f":"InputErrorVerbose(\"User\",\"Value\",AK132,AO132)","v":1},{"$f":"InputErrorVerbose(\"User\",\"Desc\",AK132,AO132)","v":"No User Input"}]
[null,null,null,null,null,null,"Image Width (in)",null,{"$f":" IF( $CB$63=0,  BV67, \"--\" )","v":"--"},null,null,null,{"$f":" IF( $CB$63=0,  BZ67, \"--\" )","v":"--"},null,1,"No Default App Value",null,null,null,null,null,null,null,null,null,null,null,null,null,null,null,null,null,null,"Image Width (in)",null,{"$f":" IF( $CB$63=0,  IF( Value_UnitsOfMeasure_Short = \" in\", BV67,\nIF( Value_UnitsOfMeasure_Short=\" ft\", BV74,\nIF( Value_UnitsOfMeasure_Short=\" m\", BV81, \"--\" ) ) ), \"--\" )","v":"--"},null,null,null,{"$f":" IF( $CB$63=0,  BZ67, \"--\" )","v":"--"},null,{"$f":"InputErrorVerbose(\"User\",\"Value\",AK133,AO133)","v":1},{"$f":"InputErrorVerbose(\"User\",\"Desc\",AK133,AO133)","v":"No User Input"}]
[null,null,null,null,null,null,"Image Width (m)",null,{"$f":"SetPrecision( I133*0.0254 )","v":{"$error":"#VALUE!"}},null,null,null,{"$f":"SetPrecision( M133*0.0254 )","v":{"$error":"#VALUE!"}},null,2,"Error with input value",null,null,null,null,null,null,null,null,null,null,null,null,null,null,null,null,null,null,"Image Width (m)",null,{"$f":"SetPrecision( AK133*0.0254 )","v":{"$error":"#VALUE!"}},null,null,null,{"$f":"SetPrecision( AO133*0.0254 )","v":{"$error":"#VALUE!"}},null,{"$f":"InputErrorVerbose(\"User\",\"Value\",AK134,AO134)","v":2},{"$f":"InputErrorVerbose(\"User\",\"Desc\",AK134,AO134)","v":"Error with input value"}]
[null,null,null,null,null,null,"Aspect Ratio",null,{"$f":"BV60","v":"--"},null,null,null,{"$f":"BZ60","v":"--"},null,1,"No Default App Value",null,null,null,null,null,null,null,null,null,null,null,null,null,null,null,null,null,null,"Aspect Ratio",null,{"$f":"BV60","v":"--"},null,null,null,{"$f":"BZ60","v":"--"},null,{"$f":"InputErrorVerbose(\"User\",\"Value\",AK135,AO135)","v":1},{"$f":"InputErrorVerbose(\"User\",\"Desc\",AK135,AO135)","v":"No User Input"}]
[null,null,null,null,null,null,"TextPoints from TextHeight",null,{"$f":"IF( O124=0, SetPrecision( I124*72.727 ), \"--\")","v":"--"},null,null,null,{"$f":"IF( O124=0, SetPrecision( M124*72.727 ), \"--\")","v":"--"},null,1,"No Default App Value",null,null,null,null,null,null,null,null,null,null,null,null,null,null,null,null,null,null,"TextPoints from TextHeight",null,{"$f":"IF( AQ124=0, SetPrecision( AK124*72.727 ), \"--\")","v":72.73},null,null,null,{"$f":"IF( AQ124=0, SetPrecision( AO124*72.727 ), \"--\")","v":72.73},null,{"$f":"InputErrorVerbose(\"User\",\"Value\",AK136,AO136)","v":0},{"$f":"InputErrorVerbose(\"User\",\"Desc\",AK136,AO136)","v":"No Error"}]
[null,null,null,null,null,null,"TextPixels from Pixels per Point",null,{"$f":"IF( AND( O119=0, O136=0 ), ROUNDUP(SetPrecision((I119*I136)+0.2606),0), \"--\" )","v":"--"},null,null,null,{"$f":"IF( AND( O119=0, O136=0 ), ROUNDUP(SetPrecision((M119*M136)+0.2606),0), \"--\" )","v":"--"},null,1,"No Default App Value",null,null,null,null,null,null,null,null,null,null,null,null,null,null,null,null,null,null,"TextPixels from Pixels per Point",null,{"$f":"IF( AND( AQ119=0, AQ136=0 ), ROUNDUP(SetPrecision((AK119*AK136)+0.2606),0), \"--\" )","v":"--"},null,null,null,{"$f":"IF( AND( AQ119=0, AQ136=0 ), ROUNDUP(SetPrecision((AO119*AO136)+0.2606),0), \"--\" )","v":"--"},null,1,"No User Input"]
[null,null,null,null,null,null,"TextRows from TextHeight",null,{"$f":"IF( AND( O132=0, O124=0 ), SetPrecision( I132/I124 ), \"--\" )","v":"--"},null,null,null,{"$f":"IF( AND( O132=0, O124=0 ), SetPrecision( M132/M124 ), \"--\" )","v":"--"},null,1,"No Default App Value",null,null,null,null,null,null,null,null,null,null,null,null,null,null,null,null,null,null,"TextRows from TextHeight",null,{"$f":"IF( AND( AQ132=0, AQ124=0 ), SetPrecision( AK132/AK124 ), \"--\" )","v":"--"},null,null,null,{"$f":"IF( AND( AQ132=0, AQ124=0 ), SetPrecision( AO132/AO124 ), \"--\" )","v":"--"},null,{"$f":"InputErrorVerbose(\"User\",\"Value\",AK138,AO138)","v":1},{"$f":"InputErrorVerbose(\"User\",\"Desc\",AK138,AO138)","v":"No User Input"}]
[null,null,null,null,null,null,"TextHeight from TextArcmin",null,"--",null,null,null,"--",null,{"$f":"InputErrorVerbose(\"App\",\"Value\",I139,M139)","v":1},{"$f":"InputErrorVerbose(\"App\",\"Desc\",I139,M139)","v":"No Default App Value"},null,null,null,null,null,null,null,null,null,null,null,null,null,null,null,null,null,null,"TextHeight from TextArcmin",null,"--",null,null,null,"--",null,1,"No User Input"]
[null,null,null,null,null,null,"TextPoints from TextArcmin",null,{"$f":"IF( O139=0, SetPrecision( I139*72.727 ), \"--\")","v":"--"},null,null,null,{"$f":"IF( O139=0, SetPrecision( M139*72.727 ), \"--\")","v":"--"},null,1,"No Default App Value",null,null,null,null,null,null,null,null,null,null,null,null,null,null,null,null,null,null,"TextPoints from TextArcmin",null,{"$f":"IF( AQ139=0, SetPrecision( AK139*72.727 ), \"--\")","v":"--"},null,null,null,{"$f":"IF( AQ139=0, SetPrecision( AO139*72.727 ), \"--\")","v":"--"},null,1,"No User Input"]
[null,null,null,null,null,null,"TextPixels from TextArcmin",null,{"$f":"IF( AND( O119=0, O140=0 ), ROUNDUP(SetPrecision((I119*I140)+0.2606),0), \"--\" )","v":"--"},null,null,null,{"$f":"IF( AND( O119=0, O140=0 ), ROUNDUP(SetPrecision((M119*M140)+0.2606),0), \"--\" )","v":"--"},null,1,"No Default App Value",null,null,null,null,null,null,null,null,null,null,null,null,null,null,null,null,null,null,"TextPixels from TextArcmin",null,{"$f":"IF( AND( AQ119=0, AQ140=0 ), ROUNDUP(SetPrecision((AK119*AK140)+0.2606),0), \"--\" )","v":"--"},null,null,null,{"$f":"IF( AND( AQ119=0, AQ140=0 ), ROUNDUP(SetPrecision((AO119*AO140)+0.2606),0), \"--\" )","v":"--"},null,1,"No User Input"]
[null,null,null,null,null,null,"TextRows from TextArcmin",null,{"$f":"IF( AND( O132=0, O139=0 ), SetPrecision( I132/I139 ), \"--\" )","v":"--"},null,null,null,{"$f":"IF( AND( O132=0, O139=0 ), SetPrecision( M132/M139 ), \"--\" )","v":"--"},null,{"$f":"InputErrorVerbose(\"App\",\"Value\",I142,M142)","v":1},{"$f":"InputErrorVerbose(\"App\",\"Desc\",I142,M142)","v":"No Default App Value"},null,null,null,null,null,null,null,null,null,null,null,null,null,null,null,null,null,null,"TextRows from TextArcmin",null,{"$f":"IF( AND( AQ132=0, AQ139=0 ), SetPrecision( AK132/AK139 ), \"--\" )","v":"--"},null,null,null,{"$f":"IF( AND( AQ132=0, AQ139=0 ), SetPrecision( AO132/AO139 ), \"--\" )","v":"--"},null,{"$f":"InputErrorVerbose(\"User\",\"Value\",AK142,AO142)","v":1},{"$f":"InputErrorVerbose(\"User\",\"Desc\",AK142,AO142)","v":"No User Input"}]
[]
[null,null,null,null,null,null,"Calc Resolution from Pixels Per Degree",null,{"$f":"IF( ISNUMBER( I105 ), SetPrecision( I102*I105 ), \"--\" )","v":"--"},{"$f":"IF( ISNUMBER(I144), SetPrecision(I144/$I$135), \"--\" )","v":"--"},null,null,{"$f":"IF( ISNUMBER( M105 ), SetPrecision( M102*M105 ), \"--\" )","v":"--"},{"$f":"IF( ISNUMBER(M144), SetPrecision(M144/$M$135), \"--\" )","v":"--"},{"$f":"InputErrorVerbose(\"App\",\"Value\",I144,M144) + InputErrorVerbose(\"App\",\"Value\",J144,N144)","v":2},{"$f":"InputErrorVerbose(\"App\",\"Desc\",I144,M144)","v":"No Default App Value"},"blah blah blah",null,null,null,null,null,null,null,null,null,null,null,null,null,null,null,null,null,"Calc Resolution from Pixels Per Degree",null,{"$f":"IF( ISNUMBER( AK105 ), SetPrecision( AK102*AK105 ), \"--\" )","v":0},{"$f":"IF( ISNUMBER(AK144), SetPrecision(AK144/$AK$135), \"--\" )","v":{"$error":"#VALUE!"}},null,null,{"$f":"IF( ISNUMBER( AO105 ), SetPrecision( AO102*AO105 ), \"--\" )","v":0},{"$f":"IF( ISNUMBER(AO144), SetPrecision(AO144/$AO$135), \"--\" )","v":{"$error":"#VALUE!"}},{"$f":"InputErrorVerbose(\"User\",\"Value\",AK144,AO144) + InputErrorVerbose(\"User\",\"Value\",AL144,AP144)","v":6},{"$f":"InputErrorVerbose(\"User\",\"Desc\",AK144,AO144)","v":"Value is zero"}]
[null,null,null,null,null,null,"Calc Resolution from Pixels per inch",null,{"$f":"IF( ISNUMBER( I106 ), SetPrecision( I133*I106 ), \"--\" )","v":"--"},{"$f":"IF( ISNUMBER(I145), SetPrecision(I145/$I$135), \"--\" )","v":"--"},null,null,{"$f":"IF( ISNUMBER( M106 ), SetPrecision( M133*M106 ), \"--\" )","v":"--"},{"$f":"IF( ISNUMBER(M145), SetPrecision(M145/$M$135), \"--\" )","v":"--"},{"$f":"InputErrorVerbose(\"App\",\"Value\",I145,M145) + InputErrorVerbose(\"App\",\"Value\",J145,N145)","v":2},"No Default App Value",null,null,null,null,null,null,null,null,null,null,null,null,null,null,null,null,null,null,"Calc Resolution from Pixels per inch",null,{"$f":"IF( ISNUMBER( AK106 ), SetPrecision( AK133*AK106 ), \"--\" )","v":{"$error":"#VALUE!"}},{"$f":"IF( ISNUMBER(AK145), SetPrecision(AK145/$AK$135), \"--\" )","v":"--"},null,null,{"$f":"IF( ISNUMBER( AO106 ), SetPrecision( AO133*AO106 ), \"--\" )","v":{"$error":"#VALUE!"}},{"$f":"IF( ISNUMBER(AO145), SetPrecision(AO145/$AO$135), \"--\" )","v":"--"},{"$f":"InputErrorVerbose(\"User\",\"Value\",AK145,AO145) + InputErrorVerbose(\"User\",\"Value\",AL145,AP145)","v":3},{"$f":"InputErrorVerbose(\"User\",\"Desc\",AK145,AO145)","v":"Error with input value"}]
[null,null,null,null,null,null,"Calc Resolution from Pixels per mm",null,{"$f":"IF( ISNUMBER( I107 ), SetPrecision( I134*1000*I107 ), \"--\" )","v":"--"},{"$f":"IF( ISNUMBER(I146), SetPrecision(I146/$I$135), \"--\" )","v":"--"},null,null,{"$f":"IF( ISNUMBER( M107 ), SetPrecision( M134*1000*M107 ), \"--\" )","v":"--"},{"$f":"IF( ISNUMBER(M146), SetPrecision(M146/$M$135), \"--\" )","v":"--"},{"$f":"InputErrorVerbose(\"App\",\"Value\",I146,M146) + InputErrorVerbose(\"App\",\"Value\",J146,N146)","v":2},"No Default App Value",null,null,null,null,null,null,null,null,null,null,null,null,null,null,null,null,null,null,"Calc Resolution from Pixels per mm",null,{"$f":"IF( ISNUMBER( AK107 ), SetPrecision( AK134*1000*AK107 ), \"--\" )","v":"--"},{"$f":"IF( ISNUMBER(AK146), SetPrecision(AK146/$AK$135), \"--\" )","v":"--"},null,null,{"$f":"IF( ISNUMBER( AO107 ), SetPrecision( AO134*1000*AO107 ), \"--\" )","v":"--"},{"$f":"IF( ISNUMBER(AO146), SetPrecision(AO146/$AO$135), \"--\" )","v":"--"},{"$f":"InputErrorVerbose(\"User\",\"Value\",AK146,AO146) + InputErrorVerbose(\"User\",\"Value\",AL146,AP146)","v":2},{"$f":"InputErrorVerbose(\"User\",\"Desc\",AK146,AO146)","v":"No User Input"}]
[null,null,null,null,null,null,"Calc Resolution from Pixels per Point",null,{"$f":"IF( AND( O135=0, ISNUMBER(J147) ), ROUND( J147*I135, 0 ), \"--\" )","v":"--"},{"$f":"IF( AND( O137=0, O138=0 ), I138*I137, \"--\" )","v":"--"},null,null,{"$f":"IF( AND( O135=0, ISNUMBER(N147) ), ROUND( N147*M135, 0 ), \"--\" )","v":"--"},{"$f":"IF( AND( O137=0, O138=0 ), M138*M137, \"--\" )","v":"--"},{"$f":"InputErrorVerbose(\"App\",\"Value\",I147,M147) + InputErrorVerbose(\"App\",\"Value\",J147,N147)","v":2},{"$f":"InputErrorVerbose(\"App\",\"Desc\",I147,M147)","v":"No Default App Value"},null,null,null,null,null,null,null,null,null,null,null,null,null,null,null,null,null,null,"Calc Resolution from Pixels per Point",null,{"$f":"IF( AND( AQ135=0, ISNUMBER(AL147) ), ROUND( AL147*AK135, 0 ), \"--\" )","v":"--"},{"$f":"IF( AND( AQ110=0, AQ137=0, AQ138=0 ), AK138*AK137, \"--\" )","v":"--"},null,null,{"$f":"IF( AND( AQ135=0, ISNUMBER(AP147) ), ROUND( AP147*AO135, 0 ), \"--\" )","v":"--"},{"$f":"IF( AND( AQ110=0, AQ137=0, AQ138=0 ), AO138*AO137, \"--\" )","v":"--"},{"$f":"InputErrorVerbose(\"User\",\"Value\",AK147,AO147) + InputErrorVerbose(\"User\",\"Value\",AL147,AP147)","v":2},{"$f":"InputErrorVerbose(\"User\",\"Desc\",AK147,AO147)","v":"No User Input"}]
[null,null,null,null,null,null,"Calc Resolution from TextArcmin",null,{"$f":"IF( AND( O135=0, ISNUMBER(J148) ), ROUND( J148*I135, 0 ), \"--\" )","v":"--"},{"$f":"IF( AND( O142=0, O141=0 ), ROUND( I141*I142, 0 ), \"--\" )","v":"--"},null,null,{"$f":"IF( AND( O135=0, ISNUMBER(N148) ), ROUND( N148*M135, 0 ), \"--\" )","v":"--"},{"$f":"IF( AND( O142=0, O141=0 ), ROUND( M141*M142, 0 ), \"--\" )","v":"--"},{"$f":"InputErrorVerbose(\"App\",\"Value\",I148,M148) + InputErrorVerbose(\"App\",\"Value\",J148,N148)","v":2},{"$f":"InputErrorVerbose(\"App\",\"Desc\",I148,M148)","v":"No Default App Value"},null,null,null,null,null,null,null,null,null,null,null,null,null,null,null,null,null,null,"Calc Resolution from TextArcmin",null,{"$f":"IF( AND( AQ135=0, ISNUMBER(AL148) ), ROUND( AL148*AK135, 0 ), \"--\" )","v":"--"},{"$f":"IF( AND( AQ111=0, AQ142=0, AQ141=0 ), ROUND( AK141*AK142, 0 ), \"--\" )","v":"--"},null,null,{"$f":"IF( AND( AQ135=0, ISNUMBER(AP148) ), ROUND( AP148*AO135, 0 ), \"--\" )","v":"--"},{"$f":"IF( AND( AQ111=0, AQ142=0, AQ141=0 ), ROUND( AO141*AO142, 0 ), \"--\" )","v":"--"},{"$f":"InputErrorVerbose(\"User\",\"Value\",AK148,AO148) + InputErrorVerbose(\"User\",\"Value\",AL148,AP148)","v":2},{"$f":"InputErrorVerbose(\"User\",\"Desc\",AK148,AO148)","v":"No User Input"}]
[null,null,null,null,null,null,"total app error",null,null,null,null,null,null,null,{"$f":"MIN(O144:O148)","v":2},null,null,null,null,null,null,null,null,null,null,null,null,null,null,null,null,null,null,null,"total user error",null,null,null,null,null,null,null,{"$f":"MIN(AQ144:AQ148) + Flag_ApplyUserInputs_Inv","v":2}]
[]
[null,"Calc"]
[null,null,null,null,null,null,null,null,null,null,null,null,null,null,null,null,null,null,null,null,null,null,null,null,null,null,null,null,null,null,null,null,null,null,null,null,null,null,null,null,null,null,null,null,null,null,null,null,null,null,null,null,null,"Resolved Resolution",null,{"$f":"BV219","v":0},{"$f":"BW219","v":0},null,null,{"$f":"BZ219","v":0},{"$f":"CA219","v":0},{"$f":"InputErrorVerbose(\"App\",\"Value\",BD152,BH152) + InputErrorVerbose(\"App\",\"Value\",BE152,BI152)","v":8},{"$f":"InputErrorVerbose(\"App\",\"Desc\",BD152,BH152)","v":"Value is zero"}]
[null,null,null,null,null,null,null,null,null,null,null,null,null,null,null,null,null,null,null,null,null,null,null,null,null,null,null,null,null,null,null,null,null,null,null,null,null,null,null,null,null,null,null,null,null,null,null,null,null,null,null,null,null,"Resolved Image Width (in)",null,{"$f":"$BV$67","v":{"$error":"#VALUE!"}},null,null,null,{"$f":"$BZ$67","v":{"$error":"#VALUE!"}},null,{"$f":"InputErrorVerbose(\"App\",\"Value\",BD153,BH153)","v":2},{"$f":"InputErrorVerbose(\"App\",\"Desc\",BD153,BH153)","v":"Error with input value"}]
[null,null,null,null,null,null,null,null,null,null,null,null,null,null,null,null,null,null,null,null,null,null,null,null,null,null,null,null,null,null,null,null,null,null,null,null,null,null,null,null,null,null,null,null,null,null,null,null,null,null,null,null,null,"Resolved Image Width (m)",null,{"$f":"BV81","v":{"$error":"#VALUE!"}},null,null,null,{"$f":"BZ81","v":{"$error":"#VALUE!"}},null,{"$f":"InputErrorVerbose(\"App\",\"Value\",BD154,BH154)","v":2},{"$f":"InputErrorVerbose(\"App\",\"Desc\",BD154,BH154)","v":"Error with input value"}]
[null,null,null,null,null,null,null,null,null,null,null,null,null,null,null,null,null,null,null,null,null,null,null,null,null,null,null,null,null,null,null,null,null,null,null,null,null,null,null,null,null,null,null,null,null,null,null,null,null,null,null,null,null,"Resolved Image Height (in)",null,{"$f":"BV68","v":{"$error":"#VALUE!"}},null,null,null,{"$f":"BZ68","v":{"$error":"#VALUE!"}},null,{"$f":"InputErrorVerbose(\"App\",\"Value\",BD155,BH155)","v":2},{"$f":"InputErrorVerbose(\"App\",\"Desc\",BD155,BH155)","v":"Error with input value"}]
[null,null,null,null,null,null,null,null,null,null,null,null,null,null,null,null,null,null,null,null,null,null,null,null,null,null,null,null,null,null,null,null,null,null,null,null,null,null,null,null,null,null,null,null,null,null,null,null,null,null,null,null,null,"Resolved Image Height (selected units)",null,{"$f":"BV58","v":"--"},null,null,null,{"$f":"BZ58","v":"--"}]
[null,null,null,null,null,null,null,null,null,null,null,null,null,null,null,null,null,null,null,null,null,null,null,null,null,null,null,null,null,null,null,null,null,null,null,null,null,null,null,null,null,null,null,null,null,null,null,null,null,null,null,null,null,"Resovled Aspect Ratio",null,{"$f":"BV60","v":"--"},null,null,null,{"$f":"BZ60","v":"--"},null,{"$f":"InputErrorVerbose(\"App\",\"Value\",BD157,BH157)","v":1},{"$f":"InputErrorVerbose(\"App\",\"Desc\",BD157,BH157)","v":"No Default App Value"}]
[null,null,null,null,null,null,null,null,null,null,null,null,null,null,null,null,null,null,null,null,null,null,null,null,null,null,null,null,null,null,null,null,null,null,null,null,null,null,null,null,null,null,null,null,null,null,null,null,null,null,null,null,null,"Viewing Distance ( in )",null,{"$f":"BV135","v":0},null,null,null,{"$f":"BZ135","v":0},null,4,"Value is zero"]
[null,null,null,null,null,null,null,null,null,null,null,null,null,null,null,null,null,null,null,null,null,null,null,null,null,null,null,null,null,null,null,null,null,null,null,null,null,null,null,null,null,null,null,null,null,null,null,null,null,{"$f":"IsPriority( BD159, 1, I98, 1 )","v":0},{"$f":"IsPriority( BH159, 1, M98, 1 )","v":0},{"$f":"IsPriority( BD159, 1, AK98, 1 )","v":0},{"$f":"IsPriority( BH159, 1, AO98, 1 )","v":0},"Resolved Viewing Distance ( selected units )",null,{"$f":"BV101","v":"--"},null,null,null,{"$f":"BZ101","v":"--"},null,1,"No Default App Value",{"$f":"IF( AND( $AQ$149=0, AQ101=0), IF( AS101=\"\", \"derived from FOV (and image size)\", \"User Input\" ),\n   IF( AND( $O$149=0, O101=0 ), IF( Q101=\"\", \"derived from FOV (and image size)\", \"App Default value\" ), \"insufficient input\" ) )","v":"insufficient input"}]
[null,null,null,null,null,null,null,null,null,null,null,null,null,null,null,null,null,null,null,null,null,null,null,null,null,null,null,null,null,null,null,null,null,null,null,null,null,null,null,null,null,null,null,null,null,null,null,null,null,{"$f":"IsPriority( BD160, 1, I99, 1 )","v":0},{"$f":"IsPriority( BH160, 1, M99, 1 )","v":0},{"$f":"IsPriority( BD160, 1, AK99, 1 )","v":0},{"$f":"IsPriority( BH160, 1, AO99, 1 )","v":0},"Resolved Horizontal Image FOV",null,{"$f":"BV102","v":"--"},null,null,null,{"$f":"BZ102","v":"--"},null,1,"No Default App Value",{"$f":"IF( AND( $AQ$149=0, AQ102=0),\n   IF( AS102=\"\", \"derived from Viewing Distance (and image size)\", \"User Input\" ),\n   IF( AND( $O$149=0, O102=0 ), IF( Q102=\"\", \"derived from Viewing Distance (and image size)\", \"App Default value\" ), \"insufficient input\" ) )","v":"insufficient input"}]
[null,null,null,null,null,null,null,null,null,null,null,null,null,null,null,null,null,null,null,null,null,null,null,null,null,null,null,null,null,null,null,null,null,null,null,null,null,null,null,null,null,null,null,null,null,null,null,null,null,null,null,null,null,"Calc Pixels Per Degree",null,{"$f":"IF( AND( $BJ152=0, $BJ160=0),  SetPrecision( BD152/BD160, 0.1 ),  \"--\" )","v":"--"},null,null,null,{"$f":"IF( AND( $BJ152=0, $BJ160=0),  SetPrecision( BH152/BH160, 0.1 ),  \"--\" )","v":"--"},null,1,"No Default App Value",{"$f":"IF( $AQ$144=0, \"User Input\", IF( $O$144=0, \"App Default value\",  IF( BJ161=0, \"derived from other inputs\", \"insufficient input\" ) ) )","v":"insufficient input"}]
[null,null,null,null,null,null,null,null,null,null,null,null,null,null,null,null,null,null,null,null,null,null,null,null,null,null,null,null,null,null,null,null,null,null,null,null,null,null,null,null,null,null,null,null,null,null,null,null,null,null,null,null,null,"Calc Pixels per inch",null,{"$f":"IF( AND( $BJ152=0, $BJ153=0),  SetPrecision( BD152/BD153, 0.1 ), \"--\" )","v":"--"},null,null,null,{"$f":"IF( AND( $BJ152=0, $BJ153=0),  SetPrecision( BH152/BH153, 0.1 ), \"--\" )","v":"--"},null,1,"No Default App Value",{"$f":"IF( $AQ$145=0, \"User Input\", IF( $O$145=0, \"App Default value\",  IF( BJ162=0, \"derived from other inputs\", \"insufficient input\" ) ) )","v":"insufficient input"}]
[null,null,null,null,null,null,null,null,null,null,null,null,null,null,null,null,null,null,null,null,null,null,null,null,null,null,null,null,null,null,null,null,null,null,null,null,null,null,null,null,null,null,null,null,null,null,null,null,null,null,null,null,null,"Calc Pixels per mm",null,{"$f":"IF( AND( $BJ152=0, $BJ154=0 ),  SetPrecision( BD152/(BD154*1000), 0.1 ),  \"--\" )","v":"--"},null,null,null,{"$f":"IF( AND( $BJ152=0, $BJ154=0 ),  SetPrecision( BH152/(BH154*1000), 0.1 ),  \"--\" )","v":"--"},null,1,"No Default App Value",{"$f":"IF( $AQ$146=0, \"User Input\", IF( $O$146=0, \"App Default value\",  IF( BJ163=0, \"derived from other inputs\", \"insufficient input\" ) ) )","v":"insufficient input"}]
[]
[null,null,null,null,null,null,null,null,null,null,null,null,null,null,null,null,null,null,null,null,null,null,null,null,null,null,null,null,null,null,null,null,null,null,null,null,null,null,null,null,null,null,null,null,null,null,null,null,null,null,null,null,null,"Calc Text Height",null,{"$f":"SetPrecision( CalcTextHeightArcmin( \"THeight\", \"Val\", BD159, BV117, BV118 ), 0.1 )","v":0},null,null,null,{"$f":"SetPrecision( CalcTextHeightArcmin( \"THeight\", \"Val\", BH159, BZ117, BZ118 ), 0.1 )","v":0},null,{"$f":"InputErrorVerbose(\"App\",\"Value\",BD165,BH165)","v":4},{"$f":"InputErrorVerbose(\"App\",\"Desc\",BD165,BH165)","v":"Value is zero"},{"$f":"IF( $AQ$110= 0, \"User Input\", IF( $O$110= 0, CONCATENATE( \"App Default value\"),  \"( only valid when specifying text size )\" ) )","v":"User Input"}]
[null,null,null,null,null,null,null,null,null,null,null,null,null,null,null,null,null,null,null,null,null,null,null,null,null,null,null,null,null,null,null,null,null,null,null,null,null,null,null,null,null,null,null,null,null,null,null,null,null,null,null,null,null,"Calc Text Arcmin",null,{"$f":"SetPrecision( CalcTextHeightArcmin( \"TArcmin\", \"Val\", BD159, BV117, BV118 ), 0.1 )","v":0},null,null,null,{"$f":"SetPrecision( CalcTextHeightArcmin( \"TArcmin\", \"Val\", BH159, BZ117, BZ118 ), 0.1 )","v":0},null,{"$f":"InputErrorVerbose(\"App\",\"Value\",BD166,BH166)","v":4},{"$f":"InputErrorVerbose(\"App\",\"Desc\",BD166,BH166)","v":"Value is zero"},{"$f":"IF( $AQ$111= 0, \"User Input\", IF( $O$111= 0, CONCATENATE( \"App Default value\"),  \"( only valid when specifying text size )\" ) )","v":"User Input"}]
[null,null,null,null,null,null,null,null,null,null,null,null,null,null,null,null,null,null,null,null,null,null,null,null,null,null,null,null,null,null,null,null,null,null,null,null,null,null,null,null,null,null,null,null,null,null,null,null,null,null,null,null,null,"Resolved Pixel Points Conversion",null,{"$f":"BV119","v":"--"},null,null,null,{"$f":"BZ119","v":"--"},null,{"$f":"InputErrorVerbose(\"App\",\"Value\",BD167,BH167)","v":1},{"$f":"InputErrorVerbose(\"App\",\"Desc\",BD167,BH167)","v":"No Default App Value"},{"$f":"IF( $AQ$112= 0, \"User Input\", IF( $O$112= 0, CONCATENATE( \"App Default value\"),  \"( only valid when specifying text size )\" ) )","v":"( only valid when specifying text size )"}]
[null,null,null,null,null,null,null,null,null,null,null,null,null,null,null,null,null,null,null,null,null,null,null,null,null,null,null,null,null,null,null,null,null,null,null,null,null,null,null,null,null,null,null,null,null,null,null,null,null,null,null,null,null,"Calc Text Points",null,{"$f":"SetPrecision( (BD165 * 72.727), 0.1 )","v":0},null,null,null,{"$f":"SetPrecision( (BH165 * 72.727), 0.1 )","v":0},null,{"$f":"InputErrorVerbose(\"App\",\"Value\",BD168,BH168)","v":4},{"$f":"InputErrorVerbose(\"App\",\"Desc\",BD168,BH168)","v":"Value is zero"},{"$f":"IF( BJ168=0, \"derived value\", \"( only valid when specifying text size )\" )","v":"( only valid when specifying text size )"}]
[null,null,null,null,null,null,null,null,null,null,null,null,null,null,null,null,null,null,null,null,null,null,null,null,null,null,null,null,null,null,null,null,null,null,null,null,null,null,null,null,null,null,null,null,null,null,null,null,null,null,null,null,null,"Calc Rows of Text",null,{"$f":"ROUND( (BD156/BD165) * 0.75, 0 )","v":{"$error":"#VALUE!"}},null,null,null,{"$f":"ROUND( (BH156/BH165) * 0.75, 0 )","v":{"$error":"#VALUE!"}},null,{"$f":"InputErrorVerbose(\"App\",\"Value\",BD169,BH169)","v":2},{"$f":"InputErrorVerbose(\"App\",\"Desc\",BD169,BH169)","v":"Error with input value"},{"$f":"IF( BJ169=0, \"derived value\", \"( only valid when specifying text size )\" )","v":"( only valid when specifying text size )"}]
[null,null,null,null,null,null,null,null,null,null,null,null,null,null,null,null,null,null,null,null,null,null,null,null,null,null,null,null,null,null,null,null,null,null,null,null,null,null,null,null,null,null,null,null,null,null,null,null,null,null,null,null,null,"total error",null,null,null,null,null,null,null,{"$f":"MIN(BJ161:BJ163)","v":1}]
[]
[null,null,null,null,null,null,null,null,null,null,null,null,null,null,null,null,null,null,null,null,null,null,null,null,null,null,null,null,null,null,null,null,null,null,null,null,null,null,null,null,null,null,null,null,null,null,null,null,null,null,null,null,null,"Multiplying Factor",null,1,null,null,null,1]
[null,null,null,null,null,null,null,null,null,null,null,null,null,null,null,null,null,null,null,null,null,null,null,null,null,null,null,null,null,null,null,null,null,null,null,null,null,null,null,null,null,null,null,null,null,null,null,null,null,null,null,null,null,"View Dist for calculations (inch)",null,{"$f":"SetPrecision( BD$159*BD172 )","v":{"$error":"#VALUE!"}},null,null,null,{"$f":"SetPrecision( BH$159*BH172 )","v":{"$error":"#VALUE!"}}]
[]
[null,null,null,null,null,null,null,null,null,null,null,null,null,null,null,null,null,null,null,null,null,null,null,null,null,null,null,null,null,null,null,null,null,null,null,null,null,null,null,null,null,null,null,null,null,null,null,null,null,null,null,null,null,"Multiplying Factor",null,{"$f":"1/12","v":8.3333333333333329E-2},null,null,null,{"$f":"1/12","v":8.3333333333333329E-2}]
[null,null,null,null,null,null,null,null,null,null,null,null,null,null,null,null,null,null,null,null,null,null,null,null,null,null,null,null,null,null,null,null,null,null,null,null,null,null,null,null,null,null,null,null,null,null,null,null,null,null,null,null,null,"View Dist for calculations (ft)",null,{"$f":"SetPrecision( BD$159*BD175 )","v":{"$error":"#VALUE!"}},null,null,null,{"$f":"SetPrecision( BH$159*BH175 )","v":{"$error":"#VALUE!"}}]
[]
[null,null,null,null,null,null,null,null,null,null,null,null,null,null,null,null,null,null,null,null,null,null,null,null,null,null,null,null,null,null,null,null,null,null,null,null,null,null,null,null,null,null,null,null,null,null,null,null,null,null,null,null,null,"Multiplying Factor",null,{"$f":"1/39.37008","v":2.5399999187200026E-2},null,null,null,{"$f":"1/39.37008","v":2.5399999187200026E-2}]
[null,null,null,null,null,null,null,null,null,null,null,null,null,null,null,null,null,null,null,null,null,null,null,null,null,null,null,null,null,null,null,null,null,null,null,null,null,null,null,null,null,null,null,null,null,null,null,null,null,null,null,null,null,"Viewing Dist for calculations (m)",null,{"$f":"SetPrecision( BD$159*BD178 )","v":{"$error":"#VALUE!"}},null,null,null,{"$f":"SetPrecision( BH$159*BH178 )","v":{"$error":"#VALUE!"}}]
[]
[null,"Display"]
[null,null,null,null,null,null,"display app view distance",null,{"$f":"IF( $O98=0, CONCATENATE( SetPrecision(I98 * Value_UnitsOfMeasure_Convert), Value_UnitsOfMeasure_Short ), \"--\" )","v":"--"},null,null,null,{"$f":"IF( $O98=0, CONCATENATE( SetPrecision(M98 * Value_UnitsOfMeasure_Convert), Value_UnitsOfMeasure_Short ), \"--\" )","v":"--"},null,null,null,null,null,null,null,null,null,null,null,null,null,null,null,null,null,null,null,null,null,"display app view distance",null,{"$f":"IF( $AQ98=0, CONCATENATE( SetPrecision(AK98 * Value_UnitsOfMeasure_Convert), Value_UnitsOfMeasure_Short ), \"--\" )","v":"--"},null,null,null,{"$f":"IF( $AQ98=0, CONCATENATE( SetPrecision(AO98 * Value_UnitsOfMeasure_Convert), Value_UnitsOfMeasure_Short ), \"--\" )","v":"--"},null,{"$f":"AQ98","v":4},{"$f":"IF( AT182=1, AS182, \"\" )","v":""},{"$f":"SanitizedErrorMsg(AQ182)","v":""},{"$f":"IF( LEFT(AS182) = \"(\", 0, 1 )","v":1},null,null,null,null,null,null,null,"display  Viewing Dist",null,{"$f":" IF( BJ159=0,  IF( Value_UnitsOfMeasure_Short = \" in\", CONCATENATE( BD173, Value_UnitsOfMeasure_Short ),\nIF( Value_UnitsOfMeasure_Short=\" ft\", CONCATENATE( BD176, Value_UnitsOfMeasure_Short ),\nIF( Value_UnitsOfMeasure_Short=\" m\", CONCATENATE( BD179, Value_UnitsOfMeasure_Short ), Value_UnitsOfMeasure_Null ) ) ), Value_UnitsOfMeasure_Null )","v":"-- in"},null,null,null,{"$f":" IF( BJ159=0,  IF( Value_UnitsOfMeasure_Short = \" in\", CONCATENATE( BH173, Value_UnitsOfMeasure_Short ),\nIF( Value_UnitsOfMeasure_Short=\" ft\", CONCATENATE( BH176, Value_UnitsOfMeasure_Short ),\nIF( Value_UnitsOfMeasure_Short=\" m\", CONCATENATE( BH179, Value_UnitsOfMeasure_Short ), Value_UnitsOfMeasure_Null ) ) ), Value_UnitsOfMeasure_Null )","v":"-- in"}]
[null,null,null,null,null,null,"display app FOV",null,{"$f":"IF( $O99=0, CONCATENATE( SetPrecision(I99), \" deg\"), \"--\" )","v":"--"},null,null,null,{"$f":"IF( $O99=0, CONCATENATE( SetPrecision(M99), \" deg\"), \"--\" )","v":"--"},null,null,null,null,null,null,null,null,null,null,null,null,null,null,null,null,null,null,null,null,null,"display app FOV",null,{"$f":"IF( $AQ99=0, CONCATENATE( SetPrecision(AK99), \" deg\"), \"--\" )","v":"--"},null,null,null,{"$f":"IF( $AQ99=0, CONCATENATE( SetPrecision(AO99), \" deg\"), \"--\" )","v":"--"},null,{"$f":"AQ99","v":4},{"$f":"IF( AT183=1, AS183, \"\" )","v":""},{"$f":"SanitizedErrorMsg(AQ183)","v":""},{"$f":"IF( LEFT(AS183) = \"(\", 0, 1 )","v":1},null,null,null,null,null,null,null,"display  FOV",null,{"$f":" IF( BJ160=0,  CONCATENATE( SetPrecision(BD160), \" deg\" ), \"--\" )","v":"--"},null,null,null,{"$f":" IF( BJ160=0,  CONCATENATE( SetPrecision(BH160), \" deg\" ), \"--\" )","v":"--"}]
[null,null,null,null,null,null,"display app ppd",null,{"$f":"IF( $O105=0, CONCATENATE( SetPrecision(I105), \" px/deg\" ), \"--\" )","v":"--"},null,null,null,{"$f":"IF( $O105=0, CONCATENATE( SetPrecision(M105), \" px/deg\" ), \"--\" )","v":"--"},null,null,null,null,null,null,null,null,null,null,null,null,null,null,null,null,null,null,null,null,null,"display app ppd",null,{"$f":"IF( $AQ105=0, CONCATENATE( SetPrecision(AK105), \" px/deg\" ), \"--\" )","v":"--"},null,null,null,{"$f":"IF( $AQ105=0, CONCATENATE( SetPrecision(AO105), \" px/deg\" ), \"--\" )","v":"--"},null,{"$f":"AQ105","v":4},"",{"$f":"SanitizedErrorMsg(AQ184)","v":""},{"$f":"IF( LEFT(AS184) = \"(\", 0, 1 )","v":1},null,null,null,null,null,null,null,"display  ppd",null,{"$f":" IF( $BJ161=0,  CONCATENATE( SetPrecision(BD161), \" px/deg\" ), \"--\" )","v":"--"},null,null,null,{"$f":" IF( $BJ161=0,  CONCATENATE( SetPrecision(BH161), \" px/deg\" ), \"--\" )","v":"--"}]
[null,null,null,null,null,null,"display app ppin",null,{"$f":"IF( $O106=0, CONCATENATE( SetPrecision(I106), \" px/in\" ), \"--\" )","v":"--"},null,null,null,{"$f":"IF( $O106=0, CONCATENATE( SetPrecision(M106), \" px/in\" ), \"--\" )","v":"--"},null,null,null,null,null,null,null,null,null,null,null,null,null,null,null,null,null,null,null,null,null,"display app ppin",null,{"$f":"IF( $AQ106=0, CONCATENATE( SetPrecision(AK106), \" px/\", Value_UnitsOfMeasure_Short ), \"--\" )","v":"--"},null,null,null,{"$f":"IF( $AQ106=0, CONCATENATE( SetPrecision(AO106), \" px/\",Value_UnitsOfMeasure_Short ), \"--\" )","v":"--"},null,{"$f":"AQ106","v":4},"","",1,null,null,null,null,null,null,null,"display  ppi",null,{"$f":" IF( $BJ162=0,  CONCATENATE( SetPrecision(BD162), \" px/inch\" ), \"--\" )","v":"--"},null,null,null,{"$f":" IF( $BJ162=0,  CONCATENATE( SetPrecision(BH162), \" px/inch\" ), \"--\" )","v":"--"}]
[null,null,null,null,null,null,"display app ppmm",null,{"$f":"IF( $O107=0, CONCATENATE( SetPrecision(I107), \" px/mm\" ), \"--\" )","v":"--"},null,null,null,{"$f":"IF( $O107=0, CONCATENATE( SetPrecision(M107), \" px/mm\" ), \"--\" )","v":"--"},null,null,null,null,null,null,null,null,null,null,null,null,null,null,null,null,null,null,null,null,null,"display app ppmm",null,{"$f":"IF( $AQ107=0, CONCATENATE( SetPrecision(AK107), \" px/mm\" ), \"--\" )","v":"0 px/mm"},null,null,null,{"$f":"IF( $AQ107=0, CONCATENATE( SetPrecision(AO107), \" px/mm\" ), \"--\" )","v":"0 px/mm"},null,{"$f":"AQ107","v":0},"","",1,null,null,null,null,null,null,null,"display  ppmm",null,{"$f":" IF( $BJ163=0,  CONCATENATE( SetPrecision(BD163), \" px/mm\" ), \"--\" )","v":"--"},null,null,null,{"$f":" IF( $BJ163=0,  CONCATENATE( SetPrecision(BH163), \" px/mm\" ), \"--\" )","v":"--"}]
[null,null,null,null,null,null,"display app text height",null,{"$f":"IF(O110= 0, CONCATENATE( SetPrecision(I110 * Value_UnitsOfMeasure_Convert), Value_UnitsOfMeasure_Short ), \"--\" )","v":"1 in"},null,null,null,{"$f":"IF(O110= 0, CONCATENATE( SetPrecision(M110 * Value_UnitsOfMeasure_Convert), Value_UnitsOfMeasure_Short ), \"--\" )","v":"1 in"},null,null,null,null,null,null,null,null,null,null,null,null,null,null,null,null,null,null,null,null,null,"display app text height",null,{"$f":"IF( OR(AQ110= 0, AQ110= 3), CONCATENATE( SetPrecision(AK110 * Value_UnitsOfMeasure_Convert), Value_UnitsOfMeasure_Short ), \"--\" )","v":"0 in"},null,null,null,{"$f":"IF( OR(AQ110= 0, AQ110=3), CONCATENATE( SetPrecision(AO110 * Value_UnitsOfMeasure_Convert), Value_UnitsOfMeasure_Short ), \"--\" )","v":"0 in"},null,{"$f":"AQ110","v":0},"",{"$f":"SanitizedErrorMsg(AQ187)","v":""},1,null,null,null,null,null,null,null,"display  text height",null,{"$f":" IF( $BJ165=0,  CONCATENATE( \"~\",  SetPrecision(BD165 * Value_UnitsOfMeasure_Convert), Value_UnitsOfMeasure_Short ), \"--\" )","v":"--"},null,null,null,{"$f":" IF( $BJ165=0,  CONCATENATE( \"~\", SetPrecision(BH165 * Value_UnitsOfMeasure_Convert), Value_UnitsOfMeasure_Short ), \"--\" )","v":"--"}]
[null,null,null,null,null,null,"display app text archmin",null,{"$f":"IF(O111= 0, CONCATENATE( SetPrecision(I111), \" arcmin\" ), \"--\" )","v":"--"},null,null,null,{"$f":"IF(O111= 0, CONCATENATE( SetPrecision(M111), \" arcmin\" ), \"--\" )","v":"--"},null,null,null,null,null,null,null,null,null,null,null,null,null,null,null,null,null,null,null,null,null,"display app text archmin",null,{"$f":"IF( OR(AQ111= 0, AQ111=3),  CONCATENATE( SetPrecision(AK111), \" arcmin\" ), \"--\" )","v":"0 arcmin"},null,null,null,{"$f":"IF( OR(AQ111= 0, AQ111= 3), CONCATENATE( SetPrecision(AO111), \" arcmin\" ), \"--\" )","v":"0 arcmin"},null,{"$f":"AQ111","v":0},"","",1,null,null,null,null,null,null,null,"display  arc-min per text row",null,{"$f":" IF( $BJ166=0,  CONCATENATE( \"~\", BD166, \" arcmin\" ), \"--\" )","v":"--"},null,null,null,{"$f":" IF( $BJ166=0,  CONCATENATE( \"~\", BH166, \" arcmin\" ), \"--\" )","v":"--"}]
[null,null,null,null,null,null,"display app convert factor",null,{"$f":"IF( $O112=0, CONCATENATE( SetPrecision(I112) ), \"--\" )","v":"--"},null,null,null,{"$f":"IF( $O112=0, CONCATENATE( SetPrecision(M112) ), \"--\" )","v":"--"},null,null,null,null,null,null,null,null,null,null,null,null,null,null,null,null,null,null,null,null,null,"display app convert factor",null,{"$f":"IF( $AQ112=0, CONCATENATE( SetPrecision(AK112) ), \"--\" )","v":"--"},null,null,null,{"$f":"IF( $AQ112=0, CONCATENATE( SetPrecision(AO112) ), \"--\" )","v":"--"},null,{"$f":"AQ112","v":4},"","",1,null,null,null,null,null,null,null,"display  conversion factor",null,{"$f":" IF( $BJ169=0,  CONCATENATE( BD167 ), \"--\" )","v":"--"},null,null,null,{"$f":" IF( $BJ169=0,  CONCATENATE( BH167 ), \"--\" )","v":"--"}]
[null,null,null,null,null,null,null,null,null,null,null,null,null,null,null,null,null,null,null,null,null,null,null,null,null,null,null,null,null,null,null,null,null,null,null,null,null,null,null,null,null,null,null,null,null,null,null,null,null,null,null,null,null,"display text points",null,{"$f":" IF( $BJ168=0,  CONCATENATE( \"~\", BD168, \" points\" ), \"--\" )","v":"--"},null,null,null,{"$f":" IF( $BJ168=0,  CONCATENATE( \"~\", BH168, \" points\" ), \"--\" )","v":"--"}]
[null,null,null,null,null,null,null,null,null,null,null,null,null,null,null,null,null,null,null,null,null,null,null,null,null,null,null,null,null,null,null,null,null,null,null,null,null,null,null,null,null,null,null,null,null,null,null,null,null,null,null,null,null," display rows of text",null,{"$f":" IF( $BJ169=0,  CONCATENATE( \"~\", BD169, \" rows\" ), \"--\" )","v":"--"},null,null,null,{"$f":" IF( $BJ169=0,  CONCATENATE( \"~\", BH169, \" rows\" ), \"--\" )","v":"--"}]
[]
[]
[null,"Input"]
[null,null,null,null,null,null,"Industry Std Res Index",null,{"$f":"AppDef_StdRes_Min","v":"--"},null,null,null,{"$f":"AppDef_StdRes_Max","v":"--"},null,{"$f":"InputErrorVerbose(\"App\",\"Value\",I195,M195)","v":1},{"$f":"InputErrorVerbose(\"App\",\"Desc\",I195,M195)","v":"No Default App Value"},null,null,null,null,null,null,null,null,null,null,null,null,null,null,null,null,null,null,"Industry Std Res Index",null,{"$f":"Value_UserIndyRes_Min","v":0},null,null,null,{"$f":"Value_UserIndyRes_Max","v":0},null,{"$f":"InputErrorVerbose(\"User\",\"Value\",AK195,AO195)","v":4},{"$f":"InputErrorVerbose(\"User\",\"Desc\",AK195,AO195)","v":"Value is zero"},null,null,null,null,null,null,null,null,null,null,null,null,null,null,null,null,null,null,null,null,null,null,null,null,null,null,null,"User Industry Std Resolution",null,{"$f":" Flag_ApplyUserInputs * AK196","v":0},{"$f":" Flag_ApplyUserInputs * AL196","v":0},null,null,{"$f":" Flag_ApplyUserInputs * AO196","v":0},{"$f":" Flag_ApplyUserInputs * AP196","v":0},{"$f":"InputErrorVerbose(\"App\",\"Value\",BV195,BZ195) + InputErrorVerbose(\"App\",\"Value\",BW195,CA195)","v":8},{"$f":"InputErrorVerbose(\"App\",\"Desc\",BV195,BZ195)","v":"Value is zero"}]
[null,null,null,null,null,null,"Industry Std Resolution",null,{"$f":"Value_AppIndyResCol_Min","v":0},{"$f":"Value_AppIndyResRow_Min","v":0},null,null,{"$f":"Value_AppIndyResCol_Max","v":0},{"$f":"Value_AppIndyResRow_Max","v":0},{"$f":"InputErrorVerbose(\"App\",\"Value\",I196,M196) + InputErrorVerbose(\"App\",\"Value\",J196,N196)","v":8},{"$f":"InputErrorVerbose(\"App\",\"Desc\",I196,M196)","v":"Value is zero"},null,null,null,null,null,null,null,null,null,null,null,null,null,null,null,null,null,null,"Industry Std Resolution",null,{"$f":"xLists!Z33","v":0},{"$f":"xLists!AA33","v":0},null,null,{"$f":"xLists!Z32","v":0},{"$f":"xLists!AA32","v":0},{"$f":"MAX( InputErrorVerbose(\"User\",\"Value\",AK196,AO196), InputErrorVerbose(\"User\",\"Value\",AL196,AP196) )","v":4},{"$f":"InputErrorVerbose(\"User\",\"Desc\",AK196,AO196)","v":"Value is zero"},null,null,null,null,null,null,null,null,null,null,null,null,null,null,null,null,null,null,null,null,null,null,null,null,null,null,null,"App Industry Std Resolution",null,{"$f":"I196","v":0},{"$f":"J196","v":0},null,null,{"$f":"M196","v":0},{"$f":"N196","v":0},{"$f":"InputErrorVerbose(\"App\",\"Value\",BV196,BZ196) + InputErrorVerbose(\"App\",\"Value\",BW196,CA196)","v":8},{"$f":"InputErrorVerbose(\"App\",\"Desc\",BV196,BZ196)","v":"Value is zero"}]
[null,null,null,null,null,null,"total app error",null,null,null,null,null,null,null,{"$f":"MIN(O195:O196)","v":1},null,null,null,null,null,null,null,null,null,null,null,null,null,null,null,null,null,null,null,"total user error",null,null,null,null,null,null,null,{"$f":"MIN(AQ195:AQ196) + Flag_ApplyUserInputs_Inv","v":4},null,null,null,null,null,null,null,null,null,null,null,null,null,null,null,null,null,null,null,null,null,null,null,null,null,null,null,null,"Resolved Resolution",null,{"$f":"SetPrecision( ResolvePriority(\"Min\",BV195:BV196,BZ195:BZ196,CB195:CB196) )","v":0},{"$f":"SetPrecision( ResolvePriority(\"Min\",BW195:BW196,CA195:CA196,CB195:CB196) )","v":0},null,null,{"$f":"SetPrecision( ResolvePriority(\"Max\",BV195:BV196,BZ195:BZ196,CB195:CB196) )","v":0},{"$f":"SetPrecision( ResolvePriority(\"Max\",BW195:BW196,CA195:CA196,CB195:CB196) )","v":0}]
[]
[null,null,null,null,null,null,"Manual Resolution",null,{"$f":"AppDef_ManCol_Min","v":"--"},{"$f":"AppDef_ManRow_Min","v":"--"},null,null,{"$f":"AppDef_ManCol_Max","v":"--"},{"$f":"AppDef_ManRow_Max","v":"--"},{"$f":"InputErrorVerbose(\"App\",\"Value\",I199,M199) + InputErrorVerbose(\"App\",\"Value\",J199,N199)","v":2},{"$f":"InputErrorVerbose(\"App\",\"Desc\",I199,M199)","v":"No Default App Value"},null,null,null,null,null,null,null,null,null,null,null,null,null,null,null,null,null,null,"Manual Resolution",null,{"$f":"TRes_ManResCol_Min","v":0},{"$f":"TRes_ManResRow_Min","v":0},null,null,{"$f":"TRes_ManResCol_Max","v":0},{"$f":"TRes_ManResRow_Max","v":0},{"$f":"IF( OR( InputErrorVerbose(\"User\",\"Value\",AK199,AO199)=3, InputErrorVerbose(\"User\",\"Value\",AL199,AP199)=3 ), 3, MAX( InputErrorVerbose(\"User\",\"Value\",AK199,AO199), InputErrorVerbose(\"User\",\"Value\",AL199,AP199) ) )","v":4},{"$f":"InputErrorVerbose(\"User\",\"Desc\",AK199,AO199)","v":"Value is zero"},null,null,null,null,null,null,null,null,null,null,null,null,null,null,null,null,null,null,null,null,null,null,null,null,null,null,null,"User Manual Resolution",null,{"$f":" Flag_ApplyUserInputs * AK199","v":0},{"$f":" Flag_ApplyUserInputs * AL199","v":0},null,null,{"$f":" Flag_ApplyUserInputs * AO199","v":0},{"$f":" Flag_ApplyUserInputs * AP199","v":0},{"$f":"InputErrorVerbose(\"App\",\"Value\",BV199,BZ199) + InputErrorVerbose(\"App\",\"Value\",BW199,CA199)","v":8},{"$f":"InputErrorVerbose(\"App\",\"Desc\",BV199,BZ199)","v":"Value is zero"}]
[null,null,null,null,null,null,null,null,null,null,null,null,null,null,null,null,null,null,null,null,null,null,null,null,null,null,null,null,null,null,null,null,null,null,null,null,null,null,null,null,null,null,null,null,null,null,null,null,null,null,null,null,null,null,null,null,null,null,null,null,null,null,null,null,null,null,null,null,null,null,null,"App Manual Resolution",null,{"$f":"I199","v":"--"},{"$f":"J199","v":"--"},null,null,{"$f":"M199","v":"--"},{"$f":"N199","v":"--"},{"$f":"InputErrorVerbose(\"App\",\"Value\",BV200,BZ200) + InputErrorVerbose(\"App\",\"Value\",BW200,CA200)","v":2},{"$f":"InputErrorVerbose(\"App\",\"Desc\",BV200,BZ200)","v":"No Default App Value"}]
[null,null,null,null,null,null,null,null,null,null,null,null,null,null,null,null,null,null,null,null,null,null,null,null,null,null,null,null,null,null,null,null,null,null,null,null,null,null,null,null,null,null,null,null,null,null,null,null,null,null,null,null,null,null,null,null,null,null,null,null,null,null,null,null,null,null,null,null,null,null,null,"Resolved Resolution",null,{"$f":"SetPrecision( ResolvePriority(\"Min\",BV199:BV200,BZ199:BZ200,CB199:CB200) )","v":0},{"$f":"SetPrecision( ResolvePriority(\"Min\",BW199:BW200,CA199:CA200,CB199:CB200) )","v":0},null,null,{"$f":"SetPrecision( ResolvePriority(\"Max\",BV199:BV200,BZ199:BZ200,CB199:CB200) )","v":0},{"$f":"SetPrecision( ResolvePriority(\"Max\",BW199:BW200,CA199:CA200,CB199:CB200) )","v":0}]
[]
[null,"Calc"]
[null,null,null,null,null,null,null,null,null,null,null,null,null,null,null,null,null,null,null,null,null,null,null,null,null,null,null,null,null,null,null,null,null,null,null,null,null,null,null,null,null,null,null,null,null,null,null,null,null,null,null,null,null,null,null,null,null,null,null,null,null,null,null,null,null,null,null,null,null,{"$f":"IsPriority( BV$219, BW$219, BV$204, BW$204 )","v":0},{"$f":"IsPriority( BZ$219, CA$219, BZ$204, CA$204 )","v":0},"User Manual Resolution",null,{"$f":" ROUND( Flag_ApplyUserInputs * AK199, 0 )","v":0},{"$f":" ROUND( Flag_ApplyUserInputs * AL199, 0 )","v":0},null,null,{"$f":" ROUND( Flag_ApplyUserInputs * AO199, 0 )","v":0},{"$f":" ROUND( Flag_ApplyUserInputs * AP199, 0 )","v":0},{"$f":"InputErrorVerbose(\"App\",\"Value\",BV204,BZ204) + InputErrorVerbose(\"App\",\"Value\",BW204,CA204)","v":8},{"$f":"InputErrorVerbose(\"App\",\"Desc\",BV204,BZ204)","v":"Value is zero"},"User Input  ( manual resolution )"]
[null,null,null,null,null,null,null,null,null,null,null,null,null,null,null,null,null,null,null,null,null,null,null,null,null,null,null,null,null,null,null,null,null,null,null,null,null,null,null,null,null,null,null,null,null,null,null,null,null,null,null,null,null,null,null,null,null,null,null,null,null,null,null,null,null,null,null,null,null,{"$f":"IsPriority( BV$219, BW$219, BV$205, BW$205 )","v":0},{"$f":"IsPriority( BZ$219, CA$219, BZ$205, CA$205 )","v":0},"User Industry Std Resolution",null,{"$f":" ROUND( Flag_ApplyUserInputs * AK196, 0 )","v":0},{"$f":" ROUND( Flag_ApplyUserInputs * AL196, 0 )","v":0},null,null,{"$f":" ROUND( Flag_ApplyUserInputs * AO196, 0 )","v":0},{"$f":" ROUND( Flag_ApplyUserInputs * AP196, 0 )","v":0},{"$f":"InputErrorVerbose(\"App\",\"Value\",BV205,BZ205) + InputErrorVerbose(\"App\",\"Value\",BW205,CA205)","v":8},{"$f":"InputErrorVerbose(\"App\",\"Desc\",BV205,BZ205)","v":"Value is zero"},"User Input  ( industry standard resoluton )"]
[null,null,null,null,null,null,null,null,null,null,null,null,null,null,null,null,null,null,null,null,null,null,null,null,null,null,null,null,null,null,null,null,null,null,null,null,null,null,null,null,null,null,null,null,null,null,null,null,null,null,null,null,null,null,null,null,null,null,null,null,null,null,null,null,null,null,null,null,null,{"$f":"IsPriority( BV$219, BW$219, BV$206, BW$206 )","v":0},{"$f":"IsPriority( BZ$219, CA$219, BZ$206, CA$206 )","v":0},"User Res from Pixels Per Degree",null,{"$f":" ROUND( Flag_ApplyUserInputs * AK144, 0 )","v":0},{"$error":"#VALUE!"},null,null,{"$f":" ROUND( Flag_ApplyUserInputs * AO144, 0 )","v":0},{"$error":"#VALUE!"},{"$f":"InputErrorVerbose(\"App\",\"Value\",BV206,BZ206) + InputErrorVerbose(\"App\",\"Value\",BW206,CA206)","v":6},{"$f":"InputErrorVerbose(\"App\",\"Desc\",BV206,BZ206)","v":"Value is zero"},"derived from User Input - Pixels Per Degree"]
[null,null,null,null,null,null,null,null,null,null,null,null,null,null,null,null,null,null,null,null,null,null,null,null,null,null,null,null,null,null,null,null,null,null,null,null,null,null,null,null,null,null,null,null,null,null,null,null,null,null,null,null,null,null,null,null,null,null,null,null,null,null,null,null,null,null,null,null,null,{"$f":"IsPriority( BV$219, BW$219, BV$207, BW$207 )","v":0},{"$f":"IsPriority( BZ$219, CA$219, BZ$207, CA$207 )","v":0},"User Res  from Pixels per inch",null,{"$error":"#VALUE!"},{"$error":"#VALUE!"},null,null,{"$error":"#VALUE!"},{"$error":"#VALUE!"},{"$f":"InputErrorVerbose(\"App\",\"Value\",BV207,BZ207) + InputErrorVerbose(\"App\",\"Value\",BW207,CA207)","v":4},{"$f":"InputErrorVerbose(\"App\",\"Desc\",BV207,BZ207)","v":"Error with input value"},"derived from User Input - Pixels Per Inch"]
[null,null,null,null,null,null,null,null,null,null,null,null,null,null,null,null,null,null,null,null,null,null,null,null,null,null,null,null,null,null,null,null,null,null,null,null,null,null,null,null,null,null,null,null,null,null,null,null,null,null,null,null,null,null,null,null,null,null,null,null,null,null,null,null,null,null,null,null,null,{"$f":"IsPriority( BV$219, BW$219, BV$208, BW$208 )","v":0},{"$f":"IsPriority( BZ$219, CA$219, BZ$208, CA$208 )","v":0},"User Res from Pixels per mm",null,{"$error":"#VALUE!"},{"$error":"#VALUE!"},null,null,{"$error":"#VALUE!"},{"$error":"#VALUE!"},4,{"$f":"InputErrorVerbose(\"App\",\"Desc\",BV208,BZ208)","v":"Error with input value"},"derived from User Input - Pixels Per mm"]
[null,null,null,null,null,null,null,null,null,null,null,null,null,null,null,null,null,null,null,null,null,null,null,null,null,null,null,null,null,null,null,null,null,null,null,null,null,null,null,null,null,null,null,null,null,null,null,null,null,null,null,null,null,null,null,null,null,null,null,null,null,null,null,null,null,null,null,null,null,{"$f":"IsPriority( BV$219, BW$219, BV$209, BW$209 )","v":0},{"$f":"IsPriority( BZ$219, CA$219, BZ$209, CA$209 )","v":0},"User Res from Pixels per Point",null,{"$error":"#VALUE!"},{"$error":"#VALUE!"},null,null,{"$error":"#VALUE!"},{"$error":"#VALUE!"},{"$f":"InputErrorVerbose(\"App\",\"Value\",BV209,BZ209) + InputErrorVerbose(\"App\",\"Value\",BW209,CA209)","v":4},{"$f":"InputErrorVerbose(\"App\",\"Desc\",BV209,BZ209)","v":"Error with input value"},"derived from User Input - Pixels Per mm"]
[null,null,null,null,null,null,null,null,null,null,null,null,null,null,null,null,null,null,null,null,null,null,null,null,null,null,null,null,null,null,null,null,null,null,null,null,null,null,null,null,null,null,null,null,null,null,null,null,null,null,null,null,null,null,null,null,null,null,null,null,null,null,null,null,null,null,null,null,null,{"$f":"IsPriority( BV$219, BW$219, BV$210, BW$210 )","v":0},{"$f":"IsPriority( BZ$219, CA$219, BZ$210, CA$210 )","v":0},"User Res from Text Arcmin",null,{"$f":" IF( ISNUMBER(AK148), ROUND( Flag_ApplyUserInputs * AK148, 0 ), 0 )","v":0},{"$f":" ROUND( Flag_ApplyUserInputs * AL148, 0 )","v":{"$error":"#VALUE!"}},null,null,{"$error":"#VALUE!"},{"$error":"#VALUE!"},{"$f":"InputErrorVerbose(\"App\",\"Value\",BV210,BZ210) + InputErrorVerbose(\"App\",\"Value\",BW210,CA210)","v":4},{"$f":"InputErrorVerbose(\"App\",\"Desc\",BV210,BZ210)","v":"Error with input value"},"derived from User Input - Pixels Per mm"]
[null,null,null,null,null,null,null,null,null,null,null,null,null,null,null,null,null,null,null,null,null,null,null,null,null,null,null,null,null,null,null,null,null,null,null,null,null,null,null,null,null,null,null,null,null,null,null,null,null,null,null,null,null,null,null,null,null,null,null,null,null,null,null,null,null,null,null,null,null,{"$f":"IsPriority( BV$219, BW$219, BV$211, BW$211 )","v":0},{"$f":"IsPriority( BZ$219, CA$219, BZ$211, CA$211 )","v":0},"App Manual Resolution",null,{"$f":"IF( ISNUMBER(I199), ROUND( I199, 0 ), 0 )","v":0},{"$f":"IF( ISNUMBER(J199), ROUND( J199, 0 ), 0 )","v":0},null,null,{"$f":"IF( ISNUMBER(M199), ROUND( M199, 0 ), 0 )","v":0},{"$f":"IF( ISNUMBER(N199), ROUND( N199, 0 ), 0 )","v":0},8,"Value is zero","App Default  ( manual resolution )"]
[null,null,null,null,null,null,null,null,null,null,null,null,null,null,null,null,null,null,null,null,null,null,null,null,null,null,null,null,null,null,null,null,null,null,null,null,null,null,null,null,null,null,null,null,null,null,null,null,null,null,null,null,null,null,null,null,null,null,null,null,null,null,null,null,null,null,null,null,null,{"$f":"IsPriority( BV$219, BW$219, BV$212, BW$212 )","v":0},{"$f":"IsPriority( BZ$219, CA$219, BZ$212, CA$212 )","v":0},"App Industry Std Resolution",null,{"$f":"IF( ISNUMBER(I196), ROUND( I196, 0 ), 0 )","v":0},{"$f":"IF( ISNUMBER(J196), ROUND( J196, 0 ), 0 )","v":0},null,null,{"$f":"IF( ISNUMBER(M196), ROUND( M196, 0 ), 0 )","v":0},{"$f":"IF( ISNUMBER(N196), ROUND( N196, 0 ), 0 )","v":0},8,"Value is zero","App Default ( industry standard resoluton )"]
[null,null,null,null,null,null,null,null,null,null,null,null,null,null,null,null,null,null,null,null,null,null,null,null,null,null,null,null,null,null,null,null,null,null,null,null,null,null,null,null,null,null,null,null,null,null,null,null,null,null,null,null,null,null,null,null,null,null,null,null,null,null,null,null,null,null,null,null,null,{"$f":"IsPriority( BV$219, BW$219, BV$213, BW$213 )","v":0},{"$f":"IsPriority( BZ$219, CA$219, BZ$213, CA$213 )","v":0},"App Res from Pixels Per Degree",null,{"$f":"IF( ISNUMBER(I144), ROUND( I144, 0 ), 0 )","v":0},{"$f":"IF( ISNUMBER(J144), ROUND( J144, 0 ), 0 )","v":0},null,null,{"$f":"IF( ISNUMBER(M144), ROUND( M144, 0 ), 0 )","v":0},0,8,"Value is zero","derived from App Default - Pixels Per Degree"]
[null,null,null,null,null,null,null,null,null,null,null,null,null,null,null,null,null,null,null,null,null,null,null,null,null,null,null,null,null,null,null,null,null,null,null,null,null,null,null,null,null,null,null,null,null,null,null,null,null,null,null,null,null,null,null,null,null,null,null,null,null,null,null,null,null,null,null,null,null,{"$f":"IsPriority( BV$219, BW$219, BV$214, BW$214 )","v":0},{"$f":"IsPriority( BZ$219, CA$219, BZ$214, CA$214 )","v":0},"App Res  from Pixels per inch",null,{"$f":"IF( ISNUMBER(I145), ROUND( I145, 0 ), 0 )","v":0},{"$f":"IF( ISNUMBER(J145), ROUND( J145, 0 ), 0 )","v":0},null,null,0,0,8,"Value is zero","derived from App Default - Pixels Per Inch"]
[null,null,null,null,null,null,null,null,null,null,null,null,null,null,null,null,null,null,null,null,null,null,null,null,null,null,null,null,null,null,null,null,null,null,null,null,null,null,null,null,null,null,null,null,null,null,null,null,null,null,null,null,null,null,null,null,null,null,null,null,null,null,null,null,null,null,null,null,null,{"$f":"IsPriority( BV$219, BW$219, BV$215, BW$215 )","v":0},{"$f":"IsPriority( BZ$219, CA$219, BZ$215, CA$215 )","v":0},"App Res from Pixels per mm",null,{"$f":"IF( ISNUMBER(I146), ROUND( I146, 0 ), 0 )","v":0},0,null,null,0,0,8,"Value is zero","derived from App Default - Pixels Per mm"]
[null,null,null,null,null,null,null,null,null,null,null,null,null,null,null,null,null,null,null,null,null,null,null,null,null,null,null,null,null,null,null,null,null,null,null,null,null,null,null,null,null,null,null,null,null,null,null,null,null,null,null,null,null,null,null,null,null,null,null,null,null,null,null,null,null,null,null,null,null,{"$f":"IsPriority( BV$219, BW$219, BV$216, BW$216 )","v":0},{"$f":"IsPriority( BZ$219, CA$219, BZ$216, CA$216 )","v":0},"App Res from Pixels per Point",null,{"$f":"IF( ISNUMBER(I147), ROUND( I147, 0 ), 0 )","v":0},0,null,null,0,0,{"$f":"InputErrorVerbose(\"App\",\"Value\",BV216,BZ216) + InputErrorVerbose(\"App\",\"Value\",BW216,CA216)","v":8},{"$f":"InputErrorVerbose(\"App\",\"Desc\",BV216,BZ216)","v":"Value is zero"},"derived from App Default - Pixels Per mm"]
[null,null,null,null,null,null,null,null,null,null,null,null,null,null,null,null,null,null,null,null,null,null,null,null,null,null,null,null,null,null,null,null,null,null,null,null,null,null,null,null,null,null,null,null,null,null,null,null,null,null,null,null,null,null,null,null,null,null,null,null,null,null,null,null,null,null,null,null,null,{"$f":"IsPriority( BV$219, BW$219, BV$217, BW$217 )","v":0},{"$f":"IsPriority( BZ$219, CA$219, BZ$217, CA$217 )","v":0},"App Res from Text Arcmin",null,{"$f":"IF( ISNUMBER(I148), ROUND( I148, 0 ), 0 )","v":0},0,null,null,0,0,{"$f":"InputErrorVerbose(\"App\",\"Value\",BV217,BZ217) + InputErrorVerbose(\"App\",\"Value\",BW217,CA217)","v":8},{"$f":"InputErrorVerbose(\"App\",\"Desc\",BV217,BZ217)","v":"Value is zero"},"derived from App Default - Text Size"]
[null,null,null,null,null,null,null,null,null,null,null,null,null,null,null,null,null,null,null,null,null,null,null,null,null,null,null,null,null,null,null,null,null,null,null,null,null,null,null,null,null,null,null,null,null,null,null,null,null,null,null,null,null,null,null,null,null,null,null,null,null,null,null,null,null,null,null,null,null,null,null,"Insufficient Inputs",null,"--","--",null,null,"--","--",0,"--","Insufficient inputs"]
[null,null,null,null,null,null,null,null,null,null,null,null,null,null,null,null,null,null,null,null,null,null,null,null,null,null,null,null,null,null,null,null,null,null,null,null,null,null,null,null,null,null,null,null,null,null,null,null,null,null,null,null,null,null,null,null,null,null,null,null,null,null,null,null,null,null,null,null,null,null,null,"Resolved Resolution",null,{"$f":"ROUND( ResolvePriority(\"Min\",BV204:BV217,BZ204:BZ217,CB204:CB217), 0 )","v":0},{"$f":"ROUND( ResolvePriority(\"Min\",BW204:BW217,CA204:CA217,CB204:CB217), 0 )","v":0},null,null,{"$f":"SetPrecision( ResolvePriority(\"Max\",BV204:BV217,BZ204:BZ217,CB204:CB217) )","v":0},{"$f":"SetPrecision( ResolvePriority(\"Max\",BW204:BW217,CA204:CA217,CB204:CB217) )","v":0},{"$f":"MIN(CB204:CB217)","v":4},null,{"$f":"ResolvePriority(\"Min\",CD204:CD218,CD204:CD217,CB204:CB218)","v":"Insufficient inputs"}]
[null,null,null,null,null,null,null,null,null,null,null,null,null,null,null,null,null,null,null,null,null,null,null,null,null,null,null,null,null,null,null,null,null,null,null,null,null,null,null,null,null,null,null,null,null,null,null,null,null,null,null,null,null,null,null,null,null,null,null,null,null,null,null,null,null,null,null,null,null,null,null,"Resolved Mpx",null,{"$f":"SetPrecision( (BV219*BW219)/1000000 )","v":0},null,null,null,{"$f":"SetPrecision( (BZ219*CA219)/1000000 )","v":0}]
[]
[null,"Display"]
[null,null,null,null,null,null,null,null,null,null,null,null,null,null,null,null,null,null,null,null,null,null,null,null,null,null,null,null,null,null,null,null,null,null,null,null,null,null,null,null,null,null,null,null,null,null,null,null,null,null,null,null,null,null,null,null,null,null,null,null,null,null,null,null,null,null,null,null,null,null,null,"Min Resolution Index",null,{"$f":"MATCH(BW223, List_StdRes_ID, 0 )","v":{"$error":"#N/A"}},{"$f":"CONCATENATE(\"_\",BV219, \"_\", BW219, \"_\")","v":"_0_0_"},null,null,null,null,{"$f":"IF( ISERROR(BV223), 1, IF( BV223=0, 1, 0)  )","v":1}]
[null,null,null,null,null,null,null,null,null,null,null,null,null,null,null,null,null,null,null,null,null,null,null,null,null,null,null,null,null,null,null,null,null,null,null,null,null,null,null,null,null,null,null,null,null,null,null,null,null,null,null,null,null,null,null,null,null,null,null,null,null,null,null,null,null,null,null,null,null,null,null,"Min Resolution Standard",null,{"$f":"IF( CB223=0, INDEX( List_StdRes, BV223), \"--\" )","v":"--"}]
[null,null,null,null,null,null,null,null,null,null,null,null,null,null,null,null,null,null,null,null,null,null,null,null,null,null,null,null,null,null,null,null,null,null,null,null,null,null,null,null,null,null,null,null,null,null,null,null,null,null,null,null,null,null,null,null,null,null,null,null,null,null,null,null,null,null,null,null,null,null,null,"Max Resolution Index",null,null,null,null,null,{"$f":"MATCH(CA225, List_StdRes_ID, 0 )","v":{"$error":"#N/A"}},{"$f":"CONCATENATE(\"_\",BZ219, \"_\", CA219, \"_\")","v":"_0_0_"},{"$f":"IF( ISERROR(BZ225), 1, IF( BZ225=0, 1, 0)  )","v":1}]
[null,null,null,null,null,null,null,null,null,null,null,null,null,null,null,null,null,null,null,null,null,null,null,null,null,null,null,null,null,null,null,null,null,null,null,null,null,null,null,null,null,null,null,null,null,null,null,null,null,null,null,null,null,null,null,null,null,null,null,null,null,null,null,null,null,null,null,null,null,null,null,"Max Resolution Standard",null,null,null,null,null,{"$f":"IF( CB225=0, INDEX( List_StdRes, BZ225), \"--\" )","v":"--"}]
[null,null,null,null,null,null,"display app industry std res name",null,{"$f":"IF( O195=0, INDEX( List_StdRes, I195+1, 0 ), \"--\" )","v":"--"},null,null,null,{"$f":"IF( O195=0, INDEX( List_StdRes, M195+1, 0 ), \"--\" )","v":"--"},null,null,null,null,null,null,null,null,null,null,null,null,null,null,null,null,null,null,null,null,null,"display user industry std res name",null,{"$f":"IF( AQ195=0, INDEX( List_StdRes, AK195+1, 0 ), \"--\" )","v":"--"},null,null,null,{"$f":"IF( AQ195=0, INDEX( List_StdRes, AO195+1, 0 ), \"--\" )","v":"--"},null,{"$f":"AQ195","v":4},{"$f":"IF( AT227=1, AS227, \"\" )","v":""},{"$f":"SanitizedErrorMsg(AQ227)","v":""},{"$f":"IF( LEFT(AS227) = \"(\", 0, 1 )","v":1},null,null,null,null,null,null,null,null,null,null,null,null,null,null,null,null,null,null,null,null,null,null,null,null,null,"Final Resolution - Simple",null,{"$f":"IF( $CB219=0, CONCATENATE( BV219, \" x \", BW219), \"-- x --\" )","v":"-- x --"},null,null,null,{"$f":"IF( $CB219=0, CONCATENATE( BZ219, \" x \", CA219), \"-- x --\" )","v":"-- x --"},null,{"$f":"CB219","v":4},{"$f":"InputErrorVerbose(\"App\",\"Desc\",BV227,BZ227)","v":"Invalid value"}]
[null,null,null,null,null,null,"display app industry std res",null,{"$f":"IF( $O196=0, CONCATENATE( I196, \" x \", J196), \"--\" )","v":"--"},null,null,null,{"$f":"IF( $O196=0, CONCATENATE( M196, \" x \", N196), \"--\" )","v":"--"},null,null,null,null,null,null,null,null,null,null,null,null,null,null,null,null,null,null,null,null,null,"display user industry std res",null,{"$f":"IF( $AQ196=0, CONCATENATE( AK196, \" x \", AL196), \"--\" )","v":"--"},null,null,null,{"$f":"IF( $AQ196=0, CONCATENATE( AO196, \" x \", AP196), \"--\" )","v":"--"},null,{"$f":"AQ196","v":4},{"$f":"IF( AT228=1, AS228, \"\" )","v":""},{"$f":"SanitizedErrorMsg(AQ228)","v":""},{"$f":"IF( LEFT(AS228) = \"(\", 0, 1 )","v":1},null,null,null,null,null,null,null,null,null,null,null,null,null,null,null,null,null,null,null,null,null,null,null,null,null,"Final Resolution - Verbose",null,{"$f":"IF( AND( $CB219=0, $CB223=0 ), CONCATENATE( BV227, \" ( \", BV224, \" ) \"), \"( -- )\" )","v":"( -- )"},null,null,null,{"$f":"IF( AND( $CB219=0, $CB225=0 ), CONCATENATE( BZ227, \" ( \", BZ226, \" ) \"), \"( -- )\" )","v":"( -- )"},null,{"$f":"CB219+CB223","v":5},{"$f":"InputErrorVerbose(\"App\",\"Desc\",BV228,BZ228)","v":"Invalid value"}]
[null,null,null,null,null,null,"display app manual res",null,{"$f":"IF( $O199=0, CONCATENATE( I199, \" x \", J199), \"--\" )","v":"--"},null,null,null,{"$f":"IF( $O199=0, CONCATENATE( M199, \" x \", N199), \"--\" )","v":"--"},null,null,null,null,null,null,null,null,null,null,null,null,null,null,null,null,null,null,null,null,null,"display user manual res",null,{"$f":"IF( $AQ199=0, CONCATENATE( AK199, \" x \", AL199), \"--\" )","v":"--"},null,null,null,{"$f":"IF( $AQ199=0, CONCATENATE( AO199, \" x \", AP199), \"--\" )","v":"--"},null,{"$f":"AQ199","v":4},"",{"$f":"SanitizedErrorMsg(AQ229)","v":""},{"$f":"IF( LEFT(AS229) = \"(\", 0, 1 )","v":1},null,null,null,null,null,null,null,null,null,null,null,null,null,null,null,null,null,null,null,null,null,null,null,null,null,"Final Mpx",null,{"$f":"IF( $CB219=0, CONCATENATE( BV220, \" Mpx\"), \"-- Mpx\" )","v":"-- Mpx"},null,null,null,{"$f":"IF( $CB219=0, CONCATENATE( BZ220, \" Mpx\"), \"-- Mpx\" )","v":"-- Mpx"},null,{"$f":"InputErrorVerbose(\"App\",\"Value\",BV229,BZ229) + InputErrorVerbose(\"App\",\"Value\",BW229,CA229)","v":6},{"$f":"InputErrorVerbose(\"App\",\"Desc\",BV229,BZ229)","v":"Invalid value"}]
[null,null,null,null,null,null,null,null,null,null,null,null,null,null,null,null,null,null,null,null,null,null,null,null,null,null,null,null,null,null,null,null,null,null,null,null,null,null,null,null,null,null,null,null,null,null,null,null,null,null,null,null,null,null,null,null,null,null,null,null,null,null,null,null,null,null,null,null,null,null,null,"Final Resolution - Name",null,{"$f":"IF( AND( $CB219=0, $CB223=0 ), BV224, \"--\" )","v":"--"},null,null,null,{"$f":"IF( AND( $CB219=0, $CB225=0 ), BZ226, \"--\" )","v":"--"},null,{"$f":"CB219","v":4},{"$f":"InputErrorVerbose(\"App\",\"Desc\",BV227,BZ227)","v":"Invalid value"}]
[]
[]
[null,null,null,null,null,null,null,null,"app VD"]
[null,null,null,null,null,null,null,null,"app FOV"]
[null,null,null,null,null,null,null,null,"app ppd"]
[null,null,null,null,null,null,null,null,"app ppin"]
[null,null,null,null,null,null,null,null,"app ppmm"]
[null,null,null,null,null,null,null,null,"app arcmin"]
[]
[]
[]
[]
[null,null,null,null,null,null,null,null,"app VD"]
[null,null,null,null,null,null,null,null,"app rows"]
[null,null,null,null,null,null,null,null,"app std res"]
[null,null,null,null,null,null,null,null,"app man res"]
[]
[]
[null,null,null,null,null,null,null,null,"xxx"]
[null,null,null,null,null,null,null,null,"app VD"]
[null,null,null,null,null,null,null,null,"app FOV"]
[null,null,null,null,null,null,null,null,"app res from ppd"]
[null,null,null,null,null,null,null,null,"app res from ppin"]
[null,null,null,null,null,null,null,null,"app res from ppmm"]
[null,null,null,null,null,null,null,null,"app res from arcmin/rows"]
[null,null,null,null,null,null,null,null,"app std res"]
[null,null,null,null,null,null,null,null,"app man res"]
[null,null,null,null,null,null,null,null,"resolved"]
[]
[null,null,null,null,null,null,null,null,"display VD"]
[null,null,null,null,null,null,null,null,"display FOV"]
[null,null,null,null,null,null,null,null,"display ppd"]
[null,null,null,null,null,null,null,null,"display ppin"]
[null,null,null,null,null,null,null,null,"display ppmm"]
[null,null,null,null,null,null,null,null,"display arcmin"]
[null,null,null,null,null,null,null,null,"display rows"]
[null,null,null,null,null,null,null,null,"display std res"]
[null,null,null,null,null,null,null,null,"display man res"]
[null,null,null,null,null,null,null,null,"resolved res"]
[null,null,null,null,null,null,null,null,"resolved mpx"]

{"sheet":"xObjects","index":14,"n_rows":397,"n_cols":33,"rows_kept":397,"cut":false,"hidden":true,"merged":[[3,2,3,32],[308,4,308,32],[38,4,38,32],[275,4,275,32],[284,4,284,32],[259,4,259,32],[375,4,375,32],[339,4,339,32],[331,4,331,32],[8,4,8,32],[250,4,250,32]]}
[]
[]
[]
[null,null,"Click Object Table"]
[]
[null,null,1,2,3,4,5,6,7,8,9,10,11,12,13,14,15,16,17,18,19,20,21,22,23,null,null,null,null,null,null,null,29]
[null,null,"Index"]
[null,null,{"$f":"MAX(C50:C398)","v":389}]
[null,null,1,"x","Global - Screen Selects"]
[null,null,2,"x","Sheet","Shape","Description","Action","State","Internal\nOnly","Called\nBy","Arg\nCount","Switch-To\nTab Name","Instruction\nChapter\nNumber"]
[null,null,3,null,"Welcome","BeginButton","Instruction Button","Switch_Tabs","(null)",false,"User",{"$f":"COUNTA(M11:AH11)","v":2},"App",0]
[null,null,4,null,"AnySheet","AppButton","Application Button","Switch_Tabs","(null)",false,"User",2,"App",0]
[null,null,5,null,"AnySheet","TargetButton","Target Button","Switch_Tabs","(null)",false,"User",2,"Target",0]
[null,null,6,null,"AnySheet","SummaryButton","Summary Button","Switch_Tabs","(null)",false,"User",2,"Summary",0]
[null,null,7,null,"AnySheet","MapButton","Summary Button","Switch_Tabs","(null)",false,"User",2,"Map",0]
[null,null,8,null,"AnySheet","GuideButton","Summary Button","Switch_Tabs","(null)",false,"User",2,"Chipsets",0]
[null,null,9,null,"AnySheet","EngineButton","Summary Button","Switch_Tabs","(null)",false,"User",2,"Engines",0]
[null,null,10,null,"AnySheet","SupportButton","Summary Button","Switch_Tabs","(null)",false,"User",2,"Support",0]
[null,null,11,null,"AnySheet","WelcomeButton",null,"Switch_Tabs","(null)",false,"User",2,"Welcome",0]
[null,null,12,null,"App","ApptoWelcome",null,"Switch_Tabs","(null)",false,"User",2,"Welcome",0]
[null,null,13,null,"App","ApptoTarget",null,"Switch_Tabs","(null)",false,"User",2,"Target",0]
[null,null,14,null,"Target","TargettoApp",null,"Switch_Tabs","(null)",false,"User",2,"App",0]
[null,null,15,null,"Target","TargettoSummary",null,"Switch_Tabs","(null)",false,"User",2,"Summary",0]
[null,null,16,null,"Summary","SummarytoTarget",null,"Switch_Tabs","(null)",false,"User",2,"Target",0]
[null,null,17,null,"Summary","SummarytoMap",null,"Switch_Tabs","(null)",false,"User",2,"Map",0]
[null,null,18,null,"Map","MaptoSummary",null,"Switch_Tabs","(null)",false,"User",2,"Summary",0]
[null,null,19,null,"Map","MaptoChipsets",null,"Switch_Tabs","(null)",false,"User",2,"Chipsets",0]
[null,null,20,null,"Chipsets","ChipsetstoMap",null,"Switch_Tabs","(null)",false,"User",2,"Map",0]
[null,null,21,null,"Chipsets","ChipsetstoEngines",null,"Switch_Tabs","(null)",false,"User",2,"Engines",0]
[null,null,22,null,"Engines","EnginestoChipsets",null,"Switch_Tabs","(null)",false,"User",2,"Chipsets",0]
[null,null,23,null,"Engines","EnginestoSupport",null,"Switch_Tabs","(null)",false,"User",2,"Support",0]
[null,null,24,null,"Support","SupporttoEngines",null,"Switch_Tabs","(null)",false,"User",2,"Engines",0]
[null,null,25,null,null,null,null,null,null,null,null,0]
[null,null,26,null,"AnySheet","OptionsButton","Summary Button","Switch_Tabs","(null)",false,"User",2,"Options",0]
[null,null,27,null,"AnySheet","PrintButton","Summary Button","Print","(null)",false,"User",0]
[null,null,28,null,null,null,null,null,null,null,null,0]
[null,null,29,null,"AnySheet","ResetUserInputsButton","Do not show","FunctionCall","(null)",false,"User",1,"ResetDiscreteValues"]
[null,null,30,null,null,null,null,null,null,null,null,0]
[null,null,31,"x","Target Screen"]
[null,null,32,"x","Sheet","Shape","Description","Action","State","Internal\nOnly","Called\nBy","Arg\nCount","Shown\nShape Color","Hidden\nShape Color","Shown\nBorder Color","Hidden\nBorder Color","Shown\nText Color","Hidden\nText Color","Shown\nText","Hidden\nText","First\nRow","Last\nRow","Last \nState","Next Function"]
[null,null,33,null,"Sheets: App, Target, Summary, Map, Chipsets, Engines, Support, Options","DashboardButton","Dashboard","ShowHide_Rows","Hidden",false,"User",{"$f":"COUNTA(M41:AH41)","v":12},"Black","Black","(null)","(null)","White","White","▲","▼",{"$f":"Dashboard_Start","v":7},{"$f":"Dashboard_End","v":11},"Hidden","(null)"]
[null,null,34,null,"Sheets: App, Target, Summary, Map, Chipsets, Engines, Support, Options","DashboardBanner","Dashboard","Mimic","Hidden",true,"User",{"$f":"COUNTA(M42:AH42)","v":11},"(null)","(null)","(null)","(null)","(null)","(null)","(null)","(null)","(null)","(null)","Hidden"]
[null,null,35,null,"Sheets: App, Target, Summary, Map, Chipsets, Engines, Support, Options","DashboardBox","Dashboard","Mimic","Hidden",true,"User",{"$f":"COUNTA(M43:AH43)","v":11},"(null)","(null)","(null)","(null)","(null)","(null)","(null)","(null)","(null)","(null)","Hidden"]
[null,null,36]
[null,null,37,null,null,null,null,null,null,null,null,{"$f":"COUNTA(M45:AH45)","v":0}]
[null,null,38,null,"Summary","TUnits_Expander","Target Brightness","ShowHide_Rows","Hidden",false,"User",12,"DarkAqua","Black","(null)","(null)","White","White","-","+",{"$f":"TUnits_Start","v":43},{"$f":"TUnits_End","v":51},"Hidden","(null)"]
[null,null,39,null,"Summary","TUnits_Banner","Target Brightness","Mimic","Hidden",true,"User",11,"LightAqua","LightGray","(null)","(null)","(null)","(null)","(null)","(null)","(null)","(null)","Hidden"]
[null,null,40,null,null,null,null,null,null,null,null,0]
[null,null,41,null,null,null,null,null,null,null,null,0]
[null,null,42,null,"Target","TBright_Expander","Target Brightness","ShowHide_Rows","Hidden",false,"User",12,"DarkAqua","Black","(null)","(null)","White","White","-","+",{"$f":"TBright_Start","v":24},{"$f":"TBright_End","v":234},"Hidden",{"$f":"C126+2","v":120}]
[null,null,43,null,"Target","TBright_Banner","Target Brightness","Mimic","Hidden",true,"User",11,"LightAqua","LightGray","(null)","(null)","(null)","(null)","(null)","(null)","(null)","(null)","Hidden"]
[null,null,44]
[null,null,45,null,"Target","TBright_Main_InfoButton1",null,"ShowHide_Rows","Hidden",false,"User",11,"DarkAqua","LightAqua","(null)","(null)","LightAqua","DarkAqua","i","i",26,35,"Hidden","(null)"]
[null,null,46,null,"Target","TBright_Ambient_Expander","Target Brightness","ShowHide_Rows","Hidden",false,"User",{"$f":"COUNTA(M54:AH54)","v":12},"DarkAqua","Black","(null)","(null)","White","White","-","+",{"$f":"TBright_Ambient_Start","v":40},{"$f":"TBright_Ambient_End","v":70},"Hidden","(null)"]
[null,null,47,null,"Target","TBright_Ambient_Banner","Target Brightness","ShowHide_Rows","Hidden",true,"User",12,"LightAqua","LightGray","(null)","(null)","(null)","(null)","(null)","(null)","(null)","(null)","Hidden","(null)"]
[null,null,48,null,"Target","TBright_Ambient_InfoButton1","Target Brightness","ShowHide_Rows","Hidden",false,"User",12,"DarkAqua","LightAqua","(null)","(null)","LightAqua","DarkAqua","i","i",{"$f":"TBright_Ambient_HelpStart","v":53},{"$f":"TBright_Ambient_HelpEnd","v":68},"Hidden","(null)"]
[null,null,49,null,null,null,null,null,null,null,null,0]
[null,null,50,null,"Target","TBright_Nits_Expander","xxx","ShowHide_Rows","Hidden",false,"User",12,"DarkAqua","Black","(null)","(null)","White","White","-","+",{"$f":"TBright_Nits_Start","v":74},{"$f":"TBright_Nits_End","v":104},"Hidden","(null)"]
[null,null,51,null,"Target","TBright_Nits_Banner","xxx","ShowHide_Rows","Hidden",true,"User",12,"LightAqua","LightGray","(null)","(null)","(null)","(null)","(null)","(null)","(null)","(null)","Hidden","(null)"]
[null,null,52,null,"Target","TBright_Nits_InfoButton1","xxx","ShowHide_Rows","Hidden",false,"User",12,"DarkAqua","LightAqua","(null)","(null)","LightAqua","DarkAqua","i","i",{"$f":"TBright_Nits_HelpStart","v":83},{"$f":"TBright_Nits_HelpEnd","v":103},"Hidden","(null)"]
[null,null,53,null,null,null,null,null,null,null,null,0]
[null,null,54,null,"Target","TBright_Lumens_Expander","xxx","ShowHide_Rows","Hidden",false,"User",12,"DarkAqua","Black","(null)","(null)","White","White","-","+",{"$f":"TBright_Lumens_Start","v":108},{"$f":"TBright_Lumens_End","v":133},"Hidden","(null)"]
[null,null,55,null,"Target","TBright_Lumens_Banner","xxx","ShowHide_Rows","Hidden",true,"User",12,"LightAqua","LightGray","(null)","(null)","(null)","(null)","(null)","(null)","(null)","(null)","Hidden","(null)"]
[null,null,56,null,"Target","TBright_Lumens_InfoButton1","xxx","ShowHide_Rows","Hidden",false,"User",12,"DarkAqua","LightAqua","(null)","(null)","LightAqua","DarkAqua","i","i",{"$f":"TBright_Lumens_HelpStart","v":117},{"$f":"TBright_Lumens_HelpEnd","v":131},"Hidden","(null)"]
[null,null,57]
[null,null,58,null,"Target","TBright_ScreenEff_InfoButton1","xxx","ShowHide_Rows","Hidden",false,"User",{"$f":"COUNTA(M66:AH66)","v":12},"DarkAqua","LightAqua","(null)","(null)","LightAqua","DarkAqua","i","i",{"$f":"TBright_ScreenEff_HelpStart","v":144},{"$f":"TBright_ScreenEff_HelpEnd","v":232},"Hidden","(null)"]
[null,null,59,"x"]
[null,null,60,"x"]
[null,null,61,null,"Target","TSize_Expander","xxx","ShowHide_Rows","Hidden",false,"User",{"$f":"COUNTA(M69:AH69)","v":12},"DarkAqua","Black","(null)","(null)","White","White","-","+",{"$f":"TSize_Start","v":239},{"$f":"TSize_End","v":288},"Hidden",{"$f":"0","v":0}]
[null,null,62,null,"Target","TSize_Banner","xxx","ShowHide_Rows","Hidden",true,"User",{"$f":"COUNTA(M70:AH70)","v":12},"LightAqua","LightGray","(null)","(null)","(null)","(null)","(null)","(null)","(null)","(null)","Hidden","(null)"]
[null,null,63]
[null,null,64,null,"Target","TSize_ImageHeight_InfoButton1","xxx","ShowHide_Rows","Hidden",false,"User",{"$f":"COUNTA(M72:AH72)","v":12},"DarkAqua","LightAqua","(null)","(null)","LightAqua","DarkAqua","i","i",{"$f":"TSize_ImageDiag_HelpStart","v":256},{"$f":"TSize_ImageDiag_HelpEnd","v":273},"Hidden","(null)"]
[null,null,65,null,"Target","TSize_ImageWidth_InfoButton1","xxx","ShowHide_Rows","Hidden",false,"User",{"$f":"COUNTA(M73:AH73)","v":12},"DarkAqua","LightAqua","(null)","(null)","LightAqua","DarkAqua","i","i",{"$f":"TSize_ImageDiag_HelpStart","v":256},{"$f":"TSize_ImageDiag_HelpEnd","v":273},"Hidden","(null)"]
[null,null,66,null,"Target","TSize_ImageDiag_InfoButton1","xxx","ShowHide_Rows","Hidden",false,"User",{"$f":"COUNTA(M74:AH74)","v":12},"DarkAqua","LightAqua","(null)","(null)","LightAqua","DarkAqua","i","i",{"$f":"TSize_ImageDiag_HelpStart","v":256},{"$f":"TSize_ImageDiag_HelpEnd","v":273},"Hidden","(null)"]
[null,null,67,null,"Target","TSize_ImageAR_InfoButton1","xxx","ShowHide_Rows","Hidden",false,"User",{"$f":"COUNTA(M75:AH75)","v":12},"DarkAqua","LightAqua","(null)","(null)","LightAqua","DarkAqua","i","i",{"$f":"TSize_ImageAR_HelpStart","v":274},{"$f":"TSize_ImageAR_HelpEnd","v":287},"Hidden","(null)"]
[null,null,68]
[null,null,69,null,null,null,null,null,null,null,null,null,"Linked Cell","Linked Objects"]
[null,null,70,null,"Target","TSize_WidthUnitButton1",null,"Cycle_Units","Hidden",false,"User",{"$f":"COUNTA(M78:AH78)","v":2},"TSize_SizeUnitsIndex","TSize_WidthUnitButton1 TSize_WidthUnitButton2 TSize_HeightUnitButton1 TSize_HeightUnitButton2 TSize_DiagUnitButton1 TSize_DiagUnitButton2 END"]
[null,null,71,null,"Target","TSize_WidthUnitButton2",null,"Cycle_Units","Hidden",false,"User",{"$f":"COUNTA(M79:AH79)","v":2},"TSize_SizeUnitsIndex","TSize_WidthUnitButton1 TSize_WidthUnitButton2 TSize_HeightUnitButton1 TSize_HeightUnitButton2 TSize_DiagUnitButton1 TSize_DiagUnitButton2 END"]
[null,null,72]
[null,null,73,null,"Target","TSize_HeightUnitButton1",null,"Cycle_Units","Hidden",false,"User",{"$f":"COUNTA(M81:AH81)","v":2},"TSize_SizeUnitsIndex","TSize_WidthUnitButton1 TSize_WidthUnitButton2 TSize_HeightUnitButton1 TSize_HeightUnitButton2 TSize_DiagUnitButton1 TSize_DiagUnitButton2 END"]
[null,null,74,null,"Target","TSize_HeightUnitButton2",null,"Cycle_Units","Hidden",false,"User",{"$f":"COUNTA(M82:AH82)","v":2},"TSize_SizeUnitsIndex","TSize_WidthUnitButton1 TSize_WidthUnitButton2 TSize_HeightUnitButton1 TSize_HeightUnitButton2 TSize_DiagUnitButton1 TSize_DiagUnitButton2 END"]
[null,null,75]
[null,null,76,null,"Target","TSize_DiagUnitButton1",null,"Cycle_Units","Hidden",false,"User",{"$f":"COUNTA(M84:AH84)","v":2},"TSize_SizeUnitsIndex","TSize_WidthUnitButton1 TSize_WidthUnitButton2 TSize_HeightUnitButton1 TSize_HeightUnitButton2 TSize_DiagUnitButton1 TSize_DiagUnitButton2 END"]
[null,null,77,null,"Target","TSize_DiagUnitButton2",null,"Cycle_Units","Hidden",false,"User",{"$f":"COUNTA(M85:AH85)","v":2},"TSize_SizeUnitsIndex","TSize_WidthUnitButton1 TSize_WidthUnitButton2 TSize_HeightUnitButton1 TSize_HeightUnitButton2 TSize_DiagUnitButton1 TSize_DiagUnitButton2 END"]
[null,null,78,"x"]
[null,null,79,null,"Target","TRes_ViewDistUnitButton1",null,"Cycle_Units","Hidden",false,"User",{"$f":"COUNTA(M87:AH87)","v":2},"TRes_ViewDistUnitsIndex","TRes_ViewDistUnitButton2 END"]
[null,null,80,null,"Target","TRes_ViewDistUnitButton2",null,"Cycle_Units","Hidden",false,"User",{"$f":"COUNTA(M88:AH88)","v":2},"TRes_ViewDistUnitsIndex","TRes_ViewDistUnitButton1 END"]
[null,null,81,"x"]
[null,null,82,null,"Target","TRes_ViewDensUnitButton1",null,"Cycle_Units","Hidden",false,"User",{"$f":"COUNTA(M90:AH90)","v":2},"TRes_ViewDensUnitsIndex","TRes_ViewDensUnitButton2 END"]
[null,null,83,null,"Target","TRes_ViewDensUnitButton2",null,"Cycle_Units","Hidden",false,"User",{"$f":"COUNTA(M91:AH91)","v":2},"TRes_ViewDensUnitsIndex","TRes_ViewDensUnitButton1 END"]
[null,null,84,"x"]
[null,null,85,null,"Target","TRes_TextHeightUnitButton1",null,"Cycle_Units","Hidden",false,"User",{"$f":"COUNTA(M93:AH93)","v":2},"TRes_TextHeightUnitsIndex","TRes_TextHeightUnitButton2 END"]
[null,null,86,null,"Target","TRes_TextHeightUnitButton2",null,"Cycle_Units","Hidden",false,"User",{"$f":"COUNTA(M94:AH94)","v":2},"TRes_TextHeightUnitsIndex","TRes_TextHeightUnitButton1 END"]
[null,null,87]
[null,null,88,null,null,null,null,null,null,null,null,{"$f":"COUNTA(M96:AH96)","v":0}]
[null,null,89,null,"Target","TRes_Expander","Target Brightness","ShowHide_Rows","Hidden",false,"User",{"$f":"COUNTA(M97:AH97)","v":12},"DarkAqua","Black","(null)","(null)","White","White","-","+",{"$f":"TRes_Start","v":293},{"$f":"TRes_End","v":487},"Hidden",{"$f":"C198+2","v":192}]
[null,null,90,null,"Target","TRes_Banner","Target Brightness","ShowHide_Rows","Hidden",true,"User",{"$f":"COUNTA(M98:AH98)","v":12},"LightAqua","LightGray","(null)","(null)","(null)","(null)","(null)","(null)","(null)","(null)","Hidden","(null)"]
[null,null,91]
[null,null,92,null,"Target","TRes_Fundamental_Expander","Target Brightness","ShowHide_Rows","Hidden",false,"User",{"$f":"COUNTA(M100:AH100)","v":12},"DarkAqua","Black","(null)","(null)","White","White","-","+",{"$f":"TRes_Fundamental_Start","v":308},{"$f":"TRes_Fundamental_End","v":409},"Hidden","(null)"]
[null,null,93,null,"Target","TRes_Fundamental_Banner","Target Brightness","ShowHide_Rows","Hidden",true,"User",{"$f":"COUNTA(M101:AH101)","v":12},"LightAqua","LightGray","(null)","(null)","(null)","(null)","(null)","(null)","(null)","(null)","Hidden","(null)"]
[null,null,94]
[null,null,95]
[null,null,96,null,"Target","TRes_FOV_InfoButton1","Target Brightness","ShowHide_Rows","Hidden",false,"User",{"$f":"COUNTA(M104:AH104)","v":12},"DarkAqua","LightAqua","(null)","(null)","LightAqua","DarkAqua","i","i",{"$f":"TRes_ViewDist_HelpStart","v":319},339,"Hidden","(null)"]
[null,null,97,null,"Target","TRes_ViewDist_InfoButton1","Target Brightness","ShowHide_Rows","Hidden",false,"User",{"$f":"COUNTA(M105:AH105)","v":12},"DarkAqua","LightAqua","(null)","(null)","LightAqua","DarkAqua","i","i",{"$f":"TRes_ViewDist_HelpStart","v":319},{"$f":"TRes_ViewDist_HelpEnd","v":341},"Hidden","(null)"]
[null,null,98,null,"Target","TRes_PxPerDeg_InfoButton1","Target Brightness","ShowHide_Rows","Hidden",false,"User",{"$f":"COUNTA(M106:AH106)","v":12},"DarkAqua","LightAqua","(null)","(null)","LightAqua","DarkAqua","i","i",{"$f":"TRes_PxPerDeg_HelpStart","v":352},{"$f":"TRes_PxPerDeg_HelpEnd","v":367},"Hidden","(null)"]
[null,null,99,null,"Target","TRes_PxPerInch_InfoButton1","Target Brightness","ShowHide_Rows","Hidden",false,"User",{"$f":"COUNTA(M107:AH107)","v":12},"DarkAqua","LightAqua","(null)","(null)","LightAqua","DarkAqua","i","i",{"$f":"TRes_PxPerInch_HelpStart","v":371},{"$f":"TRes_PxPerInch_HelpEnd","v":384},"Hidden","(null)"]
[null,null,100]
[null,null,101]
[null,null,102,"x",null,null,null,null,null,null,null,null,"Shown\nShape Color","Hidden\nShape Color","Shown\nBorder Color","Hidden\nBorder Color","Shown\nText Color","Hidden\nText Color","Shown\nText","Hidden\nText","First\nRow","Last\nRow","Last \nState"]
[null,null,103,"x"]
[null,null,104,null,"Target","TRes_Main_InfoButton3",null,"ShowHide_Rows","Hidden",false,"User",11,"DarkAqua","LightAqua","(null)","(null)","LightAqua","DarkAqua","i","i",{"$f":"TRes_HelpStart","v":295},{"$f":"TRes_HelpEnd","v":303},"Hidden","(null)"]
[null,null,105]
[null,null,106,null,"Target","TRes_IndStan_InfoButton","Target Brightness","ShowHide_Rows","Hidden",false,"User",{"$f":"COUNTA(M114:AH114)","v":12},"DarkAqua","LightAqua","(null)","(null)","LightAqua","DarkAqua","i","i",{"$f":"TRes_IndStd_HelpStart","v":446},{"$f":"TRes_IndStd_HelpEnd","v":464},"Hidden","(null)"]
[null,null,107,null,"Target","TRes_TextSize_InfoButton3","Target Brightness","ShowHide_Rows","Hidden",false,"User",{"$f":"COUNTA(M115:AH115)","v":12},"DarkAqua","LightAqua","(null)","(null)","LightAqua","DarkAqua","i","i",{"$f":"TRes_TextConvert_HelpStart","v":388},{"$f":"TRes_TextConvert_HelpEnd","v":406},"Hidden","(null)"]
[null,null,108]
[null,null,109,null,"Target","TRes_IndustryStd_Expander","Target Brightness","ShowHide_Rows","Hidden",false,"User",{"$f":"COUNTA(M117:AH117)","v":12},"DarkAqua","Black","(null)","(null)","White","White","-","+",{"$f":"TRes_IndustryStd_Start","v":413},{"$f":"TRes_IndustryStd_End","v":467},"Hidden","(null)"]
[null,null,110,null,"Target","TRes_IndustryStd_Banner","Target Brightness","ShowHide_Rows","Hidden",true,"User",{"$f":"COUNTA(M118:AH118)","v":12},"LightAqua","LightGray","(null)","(null)","(null)","(null)","(null)","(null)","(null)","(null)","Hidden","(null)"]
[null,null,111]
[null,null,112,null,"Target","TRes_ManualRes_Expander","Target Brightness","ShowHide_Rows","Hidden",false,"User",{"$f":"COUNTA(M120:AH120)","v":12},"DarkAqua","Black","(null)","(null)","White","White","-","+",{"$f":"TRes_ManualRes_Start","v":471},{"$f":"TRes_ManualRes_End","v":485},"Hidden","(null)"]
["x",null,113,null,"Target","TRes_ManualRes_Banner","Target Brightness","ShowHide_Rows","Hidden",true,"User",{"$f":"COUNTA(M121:AH121)","v":12},"LightAqua","LightGray","(null)","(null)","(null)","(null)","(null)","(null)","(null)","(null)","Hidden","(null)"]
[null,null,114,null,"Target","TRes_ManualRes_InfoButton1","Target Brightness","ShowHide_Rows","Hidden",false,"User",{"$f":"COUNTA(M122:AH122)","v":12},"DarkAqua","LightAqua","(null)","(null)","LightAqua","DarkAqua","i","i",{"$f":"TRes_ManualRes_HelpStart","v":480},{"$f":"TRes_ManualRes_HelpEnd","v":483},"Hidden","(null)"]
[null,null,115,null,null,null,null,null,null,null,null,{"$f":"COUNTA(M123:AH123)","v":0}]
[null,null,116,null,null,null,null,null,null,null,null,{"$f":"COUNTA(M124:AH124)","v":0}]
[null,null,117,"x","Sheet","Shape","Description","Action","State","Internal\nOnly","Called\nBy","Arg\nCount","Group","Item","App Select","Min","Max","Row Start 1","Row End 1","Row Start 2","Row End 2","Banner End 1","Banner End 2","Adj Item Number","Other Group"]
[null,null,118,null,"Target","MinAmbientOption1","Target Brightness","OneOfMany","NotFull",false,"User",{"$f":"COUNTA(M126:AH126)","v":13},1,1,0,{"$f":"TBright_Ambient_MinSelect","v":0},{"$f":"TBright_Ambient_MaxSelect","v":0},{"$f":"TBright_Lumens_BannerStart","v":106},{"$f":"TBright_Lumens_End","v":133},{"$f":"TBright_Nits_BannerStart","v":72},{"$f":"TBright_Nits_End","v":104},{"$f":"TBright_Lumens_BannerEnd","v":107},{"$f":"TBright_Nits_BannerEnd","v":73},1,2]
[null,null,119,null,"Target","MinAmbientOption2","Target Brightness","OneOfMany","NotFull",false,"User",13,1,2,0,{"$f":"TBright_Ambient_MinSelect","v":0},{"$f":"TBright_Ambient_MaxSelect","v":0},{"$f":"TBright_Lumens_BannerStart","v":106},{"$f":"TBright_Lumens_End","v":133},{"$f":"TBright_Nits_BannerStart","v":72},{"$f":"TBright_Nits_End","v":104},{"$f":"TBright_Lumens_BannerEnd","v":107},{"$f":"TBright_Nits_BannerEnd","v":73},2,2]
[null,null,120,null,"Target","MinAmbientOption3","Target Brightness","OneOfMany","NotFull",false,"User",13,1,3,0,{"$f":"TBright_Ambient_MinSelect","v":0},{"$f":"TBright_Ambient_MaxSelect","v":0},{"$f":"TBright_Lumens_BannerStart","v":106},{"$f":"TBright_Lumens_End","v":133},{"$f":"TBright_Nits_BannerStart","v":72},{"$f":"TBright_Nits_End","v":104},{"$f":"TBright_Lumens_BannerEnd","v":107},{"$f":"TBright_Nits_BannerEnd","v":73},3,2]
[null,null,121,null,"Target","MinAmbientOption4","Target Brightness","OneOfMany","NotFull",false,"User",13,1,4,0,{"$f":"TBright_Ambient_MinSelect","v":0},{"$f":"TBright_Ambient_MaxSelect","v":0},{"$f":"TBright_Lumens_BannerStart","v":106},{"$f":"TBright_Lumens_End","v":133},{"$f":"TBright_Nits_BannerStart","v":72},{"$f":"TBright_Nits_End","v":104},{"$f":"TBright_Lumens_BannerEnd","v":107},{"$f":"TBright_Nits_BannerEnd","v":73},4,2]
[null,null,122,null,"Target","MinAmbientOption5","Target Brightness","OneOfMany","NotFull",false,"User",13,1,5,0,{"$f":"TBright_Ambient_MinSelect","v":0},{"$f":"TBright_Ambient_MaxSelect","v":0},{"$f":"TBright_Lumens_BannerStart","v":106},{"$f":"TBright_Lumens_End","v":133},{"$f":"TBright_Nits_BannerStart","v":72},{"$f":"TBright_Nits_End","v":104},{"$f":"TBright_Lumens_BannerEnd","v":107},{"$f":"TBright_Nits_BannerEnd","v":73},5,2]
[null,null,123,null,null,null,null,null,null,null,null,0]
[null,null,124,null,"Target","MaxAmbientOption1","Target Brightness","OneOfMany","NotFull",false,"User",13,2,1,0,{"$f":"TBright_Ambient_MinSelect","v":0},{"$f":"TBright_Ambient_MaxSelect","v":0},{"$f":"TBright_Lumens_BannerStart","v":106},{"$f":"TBright_Lumens_End","v":133},{"$f":"TBright_Nits_BannerStart","v":72},{"$f":"TBright_Nits_End","v":104},{"$f":"TBright_Lumens_BannerEnd","v":107},{"$f":"TBright_Nits_BannerEnd","v":73},1,1]
[null,null,125,null,"Target","MaxAmbientOption2","Target Brightness","OneOfMany","NotFull",false,"User",13,2,2,0,{"$f":"TBright_Ambient_MinSelect","v":0},{"$f":"TBright_Ambient_MaxSelect","v":0},{"$f":"TBright_Lumens_BannerStart","v":106},{"$f":"TBright_Lumens_End","v":133},{"$f":"TBright_Nits_BannerStart","v":72},{"$f":"TBright_Nits_End","v":104},{"$f":"TBright_Lumens_BannerEnd","v":107},{"$f":"TBright_Nits_BannerEnd","v":73},2,1]
[null,null,126,null,"Target","MaxAmbientOption3","Target Brightness","OneOfMany","NotFull",false,"User",13,2,3,0,{"$f":"TBright_Ambient_MinSelect","v":0},{"$f":"TBright_Ambient_MaxSelect","v":0},{"$f":"TBright_Lumens_BannerStart","v":106},{"$f":"TBright_Lumens_End","v":133},{"$f":"TBright_Nits_BannerStart","v":72},{"$f":"TBright_Nits_End","v":104},{"$f":"TBright_Lumens_BannerEnd","v":107},{"$f":"TBright_Nits_BannerEnd","v":73},3,1]
[null,null,127,null,"Target","MaxAmbientOption4","Target Brightness","OneOfMany","NotFull",false,"User",13,2,4,0,{"$f":"TBright_Ambient_MinSelect","v":0},{"$f":"TBright_Ambient_MaxSelect","v":0},{"$f":"TBright_Lumens_BannerStart","v":106},{"$f":"TBright_Lumens_End","v":133},{"$f":"TBright_Nits_BannerStart","v":72},{"$f":"TBright_Nits_End","v":104},{"$f":"TBright_Lumens_BannerEnd","v":107},{"$f":"TBright_Nits_BannerEnd","v":73},4,1]
[null,null,128,null,"Target","MaxAmbientOption5","Target Brightness","OneOfMany","NotFull",false,"User",13,2,5,0,{"$f":"TBright_Ambient_MinSelect","v":0},{"$f":"TBright_Ambient_MaxSelect","v":0},{"$f":"TBright_Lumens_BannerStart","v":106},{"$f":"TBright_Lumens_End","v":133},{"$f":"TBright_Nits_BannerStart","v":72},{"$f":"TBright_Nits_End","v":104},{"$f":"TBright_Lumens_BannerEnd","v":107},{"$f":"TBright_Nits_BannerEnd","v":73},5,1]
[null,null,129,null,null,null,null,null,null,null,null,0]
[null,null,130,null,"Summary","TUnit1","Target Brightness","OneOfMany","Hidden",false,"User",3,8,1,0]
[null,null,131,null,"Summary","TUnit2","Target Brightness","OneOfMany","Hidden",false,"User",3,8,2,0]
[null,null,132,null,"Summary","TUnit3","Target Brightness","OneOfMany","Hidden",false,"User",3,8,3,0]
[null,null,133,null,null,null,null,null,null,null,null,0]
[null,null,134,null,"Options","Default_TUnit1","Target Brightness","OneOfMany","Hidden",false,"User",3,9,1,0]
[null,null,135,null,"Options","Default_TUnit2","Target Brightness","OneOfMany","Hidden",false,"User",3,9,2,0]
[null,null,136,null,"Options","Default_TUnit3","Target Brightness","OneOfMany","Hidden",false,"User",3,9,3,0]
[null,null,137,null,null,null,null,null,null,null,null,0]
[null,null,138,null,"Target","TSize_AR_ViewDistUnit1","Target Brightness","OneOfMany","Hidden",false,"User",2,4,null,0]
[null,null,139,null,"Target","TSize_AR_ViewDistUnit2","Target Brightness","OneOfMany","Hidden",false,"User",2,4,null,0]
[null,null,140,null,null,null,null,null,null,null,null,0]
[null,null,141,null,null,null,null,null,null,null,null,0]
[null,null,142,"x","Sheet","Shape","Description","Action","State","Internal\nOnly","Called\nBy","Arg\nCount","Function Name","Arg 1","Arg 2"]
[null,null,143,null,"Target","TBright_SurfaceEff_SortReset",null,"FunctionCall","(null)",false,"User",{"$f":"COUNTA(M151:AH151)","v":3},"SortSurfaceEff","Col0","Up"]
[null,null,144,null,null,null,null,null,null,null,null,0]
[null,null,145,null,"Target","TBright_SurfaceEff_SortUp_Col1",null,"FunctionCall","(null)",false,"User",3,"SortSurfaceEff","Col1","Up"]
[null,null,146,null,"Target","TBright_SurfaceEff_SortDwn_Col1",null,"FunctionCall","(null)",false,"User",3,"SortSurfaceEff","Col1","Dwn"]
[null,null,147,null,null,null,null,null,null,null,null,0]
[null,null,148,null,"Target","TBright_SurfaceEff_SortUp_Col2",null,"FunctionCall","(null)",false,"User",3,"SortSurfaceEff","Col2","Up"]
[null,null,149,null,"Target","TBright_SurfaceEff_SortDwn_Col2",null,"FunctionCall","(null)",false,"User",3,"SortSurfaceEff","Col2","Dwn"]
[null,null,150,null,null,null,null,null,null,null,null,0]
[null,null,151,null,"Target","TBright_SurfaceEff_SortUp_Col3",null,"FunctionCall","(null)",false,"User",3,"SortSurfaceEff","Col3","Up"]
[null,null,152,null,"Target","TBright_SurfaceEff_SortDwn_Col3",null,"FunctionCall","(null)",false,"User",3,"SortSurfaceEff","Col3","Dwn"]
[null,null,153,null,null,null,null,null,null,null,null,0]
[null,null,154,null,"Target","TBright_SurfaceEff_SortUp_Col4",null,"FunctionCall","(null)",false,"User",3,"SortSurfaceEff","Col4","Up"]
[null,null,155,null,"Target","TBright_SurfaceEff_SortDwn_Col4",null,"FunctionCall","(null)",false,"User",3,"SortSurfaceEff","Col4","Dwn"]
[null,null,156,null,null,null,null,null,null,null,null,0]
[null,null,157,null,"Target","TBright_SurfaceEff_SortUp_Col5",null,"FunctionCall","(null)",false,"User",3,"SortSurfaceEff","Col5","Up"]
[null,null,158,null,"Target","TBright_SurfaceEff_SortDwn_Col5",null,"FunctionCall","(null)",false,"User",3,"SortSurfaceEff","Col5","Dwn"]
[null,null,159]
[null,null,160]
[null,null,161,"x","Sheet","Shape","Description","Action","State","Internal\nOnly","Called\nBy","Arg\nCount","Group","Item","App Select"]
[null,null,162,null,"App","AppOption1","App Option","OneOfMany","Hidden",false,"User",{"$f":"COUNTA(M170:AH170)","v":3},5,1,1]
[null,null,163,null,"App","AppOption2","App Option","OneOfMany","Hidden",false,"User",3,5,2,1]
[null,null,164,null,"App","AppOption3","App Option","OneOfMany","Hidden",false,"User",3,5,3,1]
[null,null,165,null,"App","AppOption4","App Option","OneOfMany","Hidden",false,"User",3,5,4,1]
[null,null,166,null,"App","AppOption5","App Option","OneOfMany","Hidden",false,"User",3,5,5,1]
[null,null,167,null,"App","AppOption6","App Option","OneOfMany","Hidden",false,"User",3,5,6,1]
[null,null,168,null,"App","AppOption7","App Option","OneOfMany","Hidden",false,"User",3,5,7,1]
[null,null,169,null,"App","AppOption8","App Option","OneOfMany","Hidden",false,"User",3,5,8,1]
[null,null,170,null,"App","AppOption9","App Option","OneOfMany","Hidden",false,"User",3,5,9,1]
[null,null,171,null,"App","AppOption10","App Option","OneOfMany","Hidden",false,"User",3,5,10,1]
[null,null,172,null,"App","AppOption11","App Option","OneOfMany","Hidden",false,"User",3,5,11,1]
[null,null,173,null,"App","AppOption12","App Option","OneOfMany","Hidden",false,"User",3,5,12,1]
[null,null,174,null,"App","AppOption13","App Option","OneOfMany","Hidden",false,"User",3,5,13,1]
[null,null,175,null,"App","AppOption14","App Option","OneOfMany","Hidden",false,"User",3,5,14,1]
[null,null,176,null,"App","AppOption15","App Option","OneOfMany","Hidden",false,"User",3,5,15,1]
[null,null,177,null,"App","AppOption16","App Option","OneOfMany","Hidden",false,"User",3,5,16,1]
[null,null,178,null,"App","AppOption17","App Option","OneOfMany","Hidden",false,"User",3,5,17,1]
[null,null,179,null,"App","AppOption18","App Option","OneOfMany","Hidden",false,"User",3,5,18,1]
[null,null,180,null,"App","AppOption19","App Option","OneOfMany","Hidden",false,"User",3,5,19,1]
[null,null,181,null,"App","AppOption20","App Option","OneOfMany","Hidden",false,"User",3,5,20,1]
[null,null,182,null,"App","AppOption21","App Option","OneOfMany","Hidden",false,"User",3,5,21,1]
[null,null,183,null,"App","AppOption22","App Option","OneOfMany","Hidden",false,"User",3,5,22,1]
[null,null,184,null,"App","AppOption23","App Option","OneOfMany","Hidden",false,"User",3,5,23,1]
[null,null,185,null,"App","AppOption24","App Option","OneOfMany","Hidden",false,"User",3,5,24,1]
[null,null,186,null,"App","AppOption25","App Option","OneOfMany","Hidden",false,"User",3,5,25,1]
[null,null,187,null,null,null,null,null,null,null,null,0]
[null,null,188,null,null,null,null,null,null,null,null,0]
[null,null,189,"x","Sheet","Shape","Description","Action","State","Internal\nOnly","Called\nBy","Arg\nCount","Group","Item","App Select","Min","Max","Row Start 1","Row End 1","Row Start 2","Row End 2","Banner End 1","Banner End 2","Adj Item Number","Other Group"]
[null,null,190,null,"Target","StdResMin_Option1","App Option","OneOfMany","NotFull",false,"User",{"$f":"COUNTA(M198:AH198)","v":13},6,1,0,{"$f":"26-StdRes_Select_Min","v":26},{"$f":"26-StdRes_Select_Max","v":26},{"$f":"TRes_ManualRes_BannerStart","v":469},{"$f":"TRes_ManualRes_End","v":485},{"$f":"TRes_Fundamental_BannerStart","v":305},{"$f":"TRes_Fundamental_End","v":409},{"$f":"TRes_ManualRes_BannerEnd","v":470},{"$f":"TRes_Fundamental_BannerEnd","v":307},25,7]
[null,null,191,null,"Target","StdResMin_Option2","App Option","OneOfMany","NotFull",false,"User",13,6,2,0,26,26,469,485,305,409,470,307,24,7]
[null,null,192,null,"Target","StdResMin_Option3","App Option","OneOfMany","NotFull",false,"User",13,6,3,0,26,26,469,485,305,409,470,307,23,7]
[null,null,193,null,"Target","StdResMin_Option4","App Option","OneOfMany","NotFull",false,"User",13,6,4,0,26,26,469,485,305,409,470,307,22,7]
[null,null,194,null,"Target","StdResMin_Option5","App Option","OneOfMany","NotFull",false,"User",13,6,5,0,26,26,469,485,305,409,470,307,21,7]
[null,null,195,null,"Target","StdResMin_Option6","App Option","OneOfMany","NotFull",false,"User",13,6,6,0,26,26,469,485,305,409,470,307,20,7]
[null,null,196,null,"Target","StdResMin_Option7","App Option","OneOfMany","NotFull",false,"User",13,6,7,0,26,26,469,485,305,409,470,307,19,7]
[null,null,197,null,"Target","StdResMin_Option8","App Option","OneOfMany","NotFull",false,"User",13,6,8,0,26,26,469,485,305,409,470,307,18,7]
[null,null,198,null,"Target","StdResMin_Option9","App Option","OneOfMany","NotFull",false,"User",13,6,9,0,26,26,469,485,305,409,470,307,17,7]
[null,null,199,null,"Target","StdResMin_Option10","App Option","OneOfMany","NotFull",false,"User",13,6,10,0,26,26,469,485,305,409,470,307,16,7]
[null,null,200,null,"Target","StdResMin_Option11","App Option","OneOfMany","NotFull",false,"User",13,6,11,0,26,26,469,485,305,409,470,307,15,7]
[null,null,201,null,"Target","StdResMin_Option12","App Option","OneOfMany","NotFull",false,"User",13,6,12,0,26,26,469,485,305,409,470,307,14,7]
[null,null,202,null,"Target","StdResMin_Option13","App Option","OneOfMany","NotFull",false,"User",13,6,13,0,26,26,469,485,305,409,470,307,13,7]
[null,null,203,null,"Target","StdResMin_Option14","App Option","OneOfMany","NotFull",false,"User",13,6,14,0,26,26,469,485,305,409,470,307,12,7]
[null,null,204,null,"Target","StdResMin_Option15","App Option","OneOfMany","NotFull",false,"User",13,6,15,0,26,26,469,485,305,409,470,307,11,7]
[null,null,205,null,"Target","StdResMin_Option16","App Option","OneOfMany","NotFull",false,"User",13,6,16,0,26,26,469,485,305,409,470,307,10,7]
[null,null,206,null,"Target","StdResMin_Option17","App Option","OneOfMany","NotFull",false,"User",13,6,17,0,26,26,469,485,305,409,470,307,9,7]
[null,null,207,null,"Target","StdResMin_Option18","App Option","OneOfMany","NotFull",false,"User",13,6,18,0,26,26,469,485,305,409,470,307,8,7]
[null,null,208,null,"Target","StdResMin_Option19","App Option","OneOfMany","NotFull",false,"User",13,6,19,0,26,26,469,485,305,409,470,307,7,7]
[null,null,209,null,"Target","StdResMin_Option20","App Option","OneOfMany","NotFull",false,"User",13,6,20,0,26,26,469,485,305,409,470,307,6,7]
[null,null,210,null,"Target","StdResMin_Option21","App Option","OneOfMany","NotFull",false,"User",13,6,21,0,26,26,469,485,305,409,470,307,5,7]
[null,null,211,null,"Target","StdResMin_Option22",null,"OneOfMany","NotFull",false,"User",13,6,22,0,26,26,469,485,305,409,470,307,4,7]
[null,null,212,null,"Target","StdResMin_Option23",null,"OneOfMany","NotFull",false,"User",13,6,23,0,26,26,469,485,305,409,470,307,3,7]
[null,null,213,null,"Target","StdResMin_Option24",null,"OneOfMany","NotFull",false,"User",13,6,24,0,26,26,469,485,305,409,470,307,2,7]
[null,null,214,null,"Target","StdResMin_Option25",null,"OneOfMany","NotFull",false,"User",13,6,25,0,26,26,469,485,305,409,470,307,1,7]
[null,null,215]
[null,null,216,null,"Target","StdResMax_Option1","App Option","OneOfMany","NotFull",false,"User",{"$f":"COUNTA(M224:AH224)","v":13},7,1,0,{"$f":"26-StdRes_Select_Min","v":26},{"$f":"26-StdRes_Select_Max","v":26},{"$f":"TRes_ManualRes_BannerStart","v":469},{"$f":"TRes_ManualRes_End","v":485},{"$f":"TRes_Fundamental_BannerStart","v":305},{"$f":"TRes_Fundamental_End","v":409},{"$f":"TRes_ManualRes_BannerEnd","v":470},{"$f":"TRes_Fundamental_BannerEnd","v":307},25,6]
[null,null,217,null,"Target","StdResMax_Option2","App Option","OneOfMany","NotFull",false,"User",13,7,2,0,26,26,469,485,305,409,470,307,24,6]
[null,null,218,null,"Target","StdResMax_Option3","App Option","OneOfMany","NotFull",false,"User",13,7,3,0,26,26,469,485,305,409,470,307,23,6]
[null,null,219,null,"Target","StdResMax_Option4","App Option","OneOfMany","NotFull",false,"User",13,7,4,0,26,26,469,485,305,409,470,307,22,6]
[null,null,220,null,"Target","StdResMax_Option5","App Option","OneOfMany","NotFull",false,"User",13,7,5,0,26,26,469,485,305,409,470,307,21,6]
[null,null,221,null,"Target","StdResMax_Option6","App Option","OneOfMany","NotFull",false,"User",13,7,6,0,26,26,469,485,305,409,470,307,20,6]
[null,null,222,null,"Target","StdResMax_Option7","App Option","OneOfMany","NotFull",false,"User",13,7,7,0,26,26,469,485,305,409,470,307,19,6]
[null,null,223,null,"Target","StdResMax_Option8","App Option","OneOfMany","NotFull",false,"User",13,7,8,0,26,26,469,485,305,409,470,307,18,6]
[null,null,224,null,"Target","StdResMax_Option9","App Option","OneOfMany","NotFull",false,"User",13,7,9,0,26,26,469,485,305,409,470,307,17,6]
[null,null,225,null,"Target","StdResMax_Option10","App Option","OneOfMany","NotFull",false,"User",13,7,10,0,26,26,469,485,305,409,470,307,16,6]
[null,null,226,null,"Target","StdResMax_Option11","App Option","OneOfMany","NotFull",false,"User",13,7,11,0,26,26,469,485,305,409,470,307,15,6]
[null,null,227,null,"Target","StdResMax_Option12","App Option","OneOfMany","NotFull",false,"User",13,7,12,0,26,26,469,485,305,409,470,307,14,6]
[null,null,228,null,"Target","StdResMax_Option13","App Option","OneOfMany","NotFull",false,"User",13,7,13,0,26,26,469,485,305,409,470,307,13,6]
[null,null,229,null,"Target","StdResMax_Option14","App Option","OneOfMany","NotFull",false,"User",13,7,14,0,26,26,469,485,305,409,470,307,12,6]
[null,null,230,null,"Target","StdResMax_Option15","App Option","OneOfMany","NotFull",false,"User",13,7,15,0,26,26,469,485,305,409,470,307,11,6]
[null,null,231,null,"Target","StdResMax_Option16","App Option","OneOfMany","NotFull",false,"User",13,7,16,0,26,26,469,485,305,409,470,307,10,6]
[null,null,232,null,"Target","StdResMax_Option17","App Option","OneOfMany","NotFull",false,"User",13,7,17,0,26,26,469,485,305,409,470,307,9,6]
[null,null,233,null,"Target","StdResMax_Option18","App Option","OneOfMany","NotFull",false,"User",13,7,18,0,26,26,469,485,305,409,470,307,8,6]
[null,null,234,null,"Target","StdResMax_Option19","App Option","OneOfMany","NotFull",false,"User",13,7,19,0,26,26,469,485,305,409,470,307,7,6]
[null,null,235,null,"Target","StdResMax_Option20","App Option","OneOfMany","NotFull",false,"User",13,7,20,0,26,26,469,485,305,409,470,307,6,6]
[null,null,236,null,"Target","StdResMax_Option21","App Option","OneOfMany","NotFull",false,"User",13,7,21,0,26,26,469,485,305,409,470,307,5,6]
[null,null,237,null,"Target","StdResMax_Option22",null,"OneOfMany","NotFull",false,"User",13,7,22,0,26,26,469,485,305,409,470,307,4,6]
[null,null,238,null,"Target","StdResMax_Option23",null,"OneOfMany","NotFull",false,"User",13,7,23,0,26,26,469,485,305,409,470,307,3,6]
[null,null,239,null,"Target","StdResMax_Option24",null,"OneOfMany","NotFull",false,"User",13,7,24,0,26,26,469,485,305,409,470,307,2,6]
[null,null,240,null,"Target","StdResMax_Option25",null,"OneOfMany","NotFull",false,"User",13,7,25,0,26,26,469,485,305,409,470,307,1,6]
[null,null,241,null,null,null,null,null,null,null,null,0]
[null,null,242,null,null,null,null,null,null,null,null,0]
[null,null,243,"x","Chipset Guide"]
[null,null,244,"x","Sheet","Shape","Description","Action","State","Internal\nOnly","Called\nBy","Arg\nCount","Shown\nShape Color","Hidden\nShape Color","Shown\nBorder Color","Hidden\nBorder Color","Shown\nText Color","Hidden\nText Color","Shown\nText","Hidden\nText","First\nRow","Last\nRow","Last \nState"]
[null,null,245,"x","Summary","Summary_CalcResult_Expander","Target Brightness","ShowHide_Rows","Hidden",false,"User",{"$f":"COUNTA(M253:AH253)","v":10},"DarkAqua","Black","(null)","(null)","LightGray","LightGray","-","+",null,null,"Hidden","(null)"]
[null,null,246,"x","Summary","Summary_CalcResult_Banner","Target Brightness","ShowHide_Rows","Hidden",false,"User",12,"LightAqua","LightGray","(null)","(null)","DarkAqua","DarkAqua","Calculation Results","Calculation Results","(null)","(null)","Hidden","(null)"]
[null,null,247,null,null,null,null,null,null,null,null,0]
[null,null,248,null,"Summary","Summary_Inputs_Expander","Target Brightness","ShowHide_Rows","Hidden",false,"User",12,"DarkAqua","Black","(null)","(null)","LightGray","LightGray","-","+",{"$f":"Summary_Inputs_Start","v":16},{"$f":"Summary_Inputs_End","v":38},"Hidden","(null)"]
[null,null,249,null,"Summary","Summary_Inputs_Banner","Target Brightness","ShowHide_Rows","Hidden",false,"User",12,"LightAqua","LightGray","(null)","(null)","DarkAqua","DarkAqua","Detailed Inputs","Detailed Inputs","(null)","(null)","Hidden","(null)"]
[null,null,250,"x",null,null,null,null,null,null,null,0]
[null,null,251,"x"]
[null,null,252,"x","Map"]
[null,null,253,"x","Sheet","Shape","Description","Action","State","Internal\nOnly","Called\nBy","Arg\nCount","ToHide\nShape Color","ToShow\nShape Color","Shown\nBorder Color","Hidden\nBorder Color","ToHide\nText Color","ToShow\nText Color","ToHide","ToShow","Mode","Link Sheet","Link Cell","Other Sheet","Other Shape"]
[null,null,254,null,"Summary","BypassUserInputsButton1","Do not show","UserInputToggle","(null)",false,"User",{"$f":"COUNTA(M262:AH262)","v":13},"DarkAqua","BrightYellow","White","Red","LightGray","Red","Click to BYPASS User-Entered \nApplication Parameters","Click to APPLY User-Entered \nApplication Parameters","Toggle","Summary","DisplayDefaults_Toggle","Map","BypassUserInputsButton2"]
[null,null,255,null,"Map","BypassUserInputsButton2","Do not show","UserInputToggle","(null)",false,"User",{"$f":"COUNTA(M263:AH263)","v":13},"DarkAqua","BrightYellow","White","Red","LightGray","Red","Click to BYPASS User-Entered \nApplication Parameters","Click to APPLY User-Entered \nApplication Parameters","Toggle","Summary","DisplayDefaults_Toggle","Summary","BypassUserInputsButton1"]
[null,null,256,null,null,null,null,null,null,null,null,null,"Shown\nShape Color","Hidden\nShape Color","Shown\nBorder Color","Hidden\nBorder Color","Shown\nText Color","Hidden\nText Color","Shown\nText","Hidden\nText","First\nRow","Last\nRow","Last \nState"]
[null,null,257,null,"Map","Map_MatchZone_Expander","Target Brightness","ShowHide_Rows","Hidden",false,"User",{"$f":"COUNTA(M265:AH265)","v":12},"DarkAqua","DarkAqua","(null)","(null)","White","White","-","+",{"$f":"Map_MatchingZone_Start","v":50},{"$f":"Map_MatchingZone_End","v":82},"Hidden","(null)"]
[null,null,258,null,"Map","Map_MatchZone_Banner","Target Brightness","ShowHide_Rows","Hidden",false,"User",12,"LightAqua","LightGray","(null)","(null)","DarkAqua","DarkAqua","Expanded Matching Zone Size","Expanded Matching Zone Size","(null)","(null)","Hidden","(null)"]
[null,null,259,null,"Map","Map_Dummy_Expander",null,"ShowHide_Rows","Hidden",false,"User",12,"Black","Black","(null)","(null)","White","White","-","+",{"$f":"Map_MatchingZone_Start","v":50},{"$f":"Map_MatchingZone_End","v":82},"Hidden","(null)"]
[null,null,260,null,null,null,null,null,null,null,null,0]
[null,null,261,null,"Map","Map_MatchingZone_InfoButton1","Target Brightness","ShowHide_Rows","Hidden",false,"User",12,"DarkAqua","LightAqua","(null)","(null)","LightAqua","DarkAqua","i","i",{"$f":"Map_MatchingZone_HelpStart","v":62},{"$f":"Map_MatchingZone_HelpEnd","v":81},"Hidden","(null)"]
[null,null,262,null,null,null,null,null,null,null,null,0]
[null,null,263,null,null,null,null,null,null,null,null,null,"Group","Item","App Select"]
[null,null,264,null,"Map","Map_MatchingZone_OptionButton1",null,"OneOfMany","Hidden",false,"User",{"$f":"COUNTA(M272:AH272)","v":3},16,1,0]
[null,null,265,null,null,null,null,null,null,null,null,{"$f":"COUNTA(M273:AH273)","v":0}]
[null,null,266,null,null,null,null,null,null,null,null,{"$f":"COUNTA(M274:AH274)","v":0}]
[null,null,267,null,null,null,null,null,null,null,null,{"$f":"COUNTA(M275:AH275)","v":0}]
[null,null,268,"x","Chipset Guide"]
[null,null,269,"x","Sheet","Shape","Description","Action","State","Internal\nOnly","Called\nBy","Arg\nCount","Shown\nShape Color","Hidden\nShape Color","Shown\nBorder Color","Hidden\nBorder Color","Shown\nText Color","Hidden\nText Color","Shown\nText","Hidden\nText","First\nRow","Last\nRow","Last \nState"]
[null,null,270,null,"Chipsets","ChipsetDef_Expander","Target Brightness","ShowHide_Rows","Hidden",false,"User",{"$f":"COUNTA(M278:AH278)","v":12},"DarkAqua","DarkAqua","(null)","(null)","LightGray","LightGray","-","+",{"$f":"ChipsetDef_Start","v":71},{"$f":"ChipsetDef_End","v":141},"Hidden","(null)"]
[null,null,271,null,"Chipsets","ChipsetDef_Banner","Target Brightness","ShowHide_Rows","Hidden",false,"User",{"$f":"COUNTA(M279:AH279)","v":12},"LightAqua","LightGray","(null)","(null)","DarkAqua","DarkAqua","Definitions","Definitions",{"$f":"ChipsetDef_Start","v":71},{"$f":"ChipsetDef_End","v":141},"Hidden","(null)"]
[null,null,272,null,null,null,null,null,null,null,null,{"$f":"COUNTA(M280:AH280)","v":0}]
[null,null,273,null,null,null,null,null,null,null,null,null,"Direction"]
[null,null,274,null,"Chipsets","ChipsetsPrevPageButton","Application Button","ChipsetPage","(null)",false,"User",{"$f":"COUNTA(M282:AH282)","v":1},"Previous"]
[null,null,275,null,"Chipsets","ChipsetsNextPageButton","Application Button","ChipsetPage","(null)",false,"User",{"$f":"COUNTA(M283:AH283)","v":1},"Next"]
[null,null,276,null,null,null,null,null,null,null,null,{"$f":"COUNTA(M284:AH284)","v":0}]
[null,null,277,"x","Optical Engine Guide"]
[null,null,278,"x","Sheet","Shape","Description","Action","State","Internal\nOnly","Called\nBy","Arg\nCount","Shown\nShape Color","Hidden\nShape Color","Shown\nBorder Color","Hidden\nBorder Color","Shown\nText Color","Hidden\nText Color","Shown\nText","Hidden\nText","First\nRow","Last\nRow","Last \nState"]
[null,null,279,null,"Engines","EngineDef_Expander","Target Brightness","ShowHide_Rows","Hidden",false,"User",{"$f":"COUNTA(M287:AH287)","v":12},"DarkAqua","DarkAqua","(null)","(null)","LightGray","LightGray","-","+",{"$f":"EngineDef_Start","v":76},{"$f":"EngineDef_End","v":120},"Hidden","(null)"]
[null,null,280,null,"Engines","EngineDef_Banner","Target Brightness","ShowHide_Rows","Hidden",false,"User",{"$f":"COUNTA(M288:AH288)","v":12},"LightAqua","LightGray","(null)","(null)","DarkAqua","DarkAqua","Definitions","Definitions",{"$f":"EngineDef_Start","v":76},{"$f":"EngineDef_End","v":120},"Hidden","(null)"]
[null,null,281,null,null,null,null,null,null,null,null,{"$f":"COUNTA(M289:AH289)","v":0}]
[null,null,282,null,null,null,null,null,null,null,null,null,"Direction"]
[null,null,283,null,"Engines","EnginesPrevPageButton","Application Button","EnginePage","(null)",false,"User",{"$f":"COUNTA(M291:AH291)","v":1},"Previous"]
[null,null,284,null,"Engines","EnginesNextPageButton","Application Button","EnginePage","(null)",false,"User",{"$f":"COUNTA(M292:AH292)","v":1},"Next"]
[null,null,285,null,"Engines","EnginesPrevDMDButton","Application Button","EngineDMD","(null)",false,"User",{"$f":"COUNTA(M293:AH293)","v":1},"Previous"]
[null,null,286,null,"Engines","EnginesNextDMDButton","Application Button","EngineDMD","(null)",false,"User",{"$f":"COUNTA(M294:AH294)","v":1},"Next"]
[null,null,287]
[null,null,288,null,null,null,null,null,null,null,null,null,"Group","Item","App Select"]
[null,null,289,null,"Engines","TRRangeButton1",null,"OneOfMany","Hidden",false,"User",{"$f":"COUNTA(M297:AH297)","v":3},10,1,0]
[null,null,290,null,"Engines","TRRangeButton2",null,"OneOfMany","Hidden",false,"User",3,11,1,0]
[null,null,291,null,"Engines","TRRangeButton3",null,"OneOfMany","Hidden",false,"User",3,12,1,0]
[null,null,292,null,"Engines","TRRangeButton4",null,"OneOfMany","Hidden",false,"User",3,13,1,0]
[null,null,293,null,"Engines","TRRangeButton5",null,"OneOfMany","Hidden",false,"User",3,14,1,0]
[null,null,294,null,"Engines","TRRangeButton6",null,"OneOfMany","Hidden",false,"User",3,15,1,0]
[null,null,295,null,null,null,null,null,null,null,null,0]
[null,null,296,null,null,null,null,null,null,null,null,{"$f":"COUNTA(M304:AH304)","v":0}]
[null,null,297,null,null,null,null,null,null,null,null,0]
[null,null,298,null,null,null,null,null,null,null,null,0]
[null,null,299]
[null,null,300]
[null,null,301,"x","Global - Misc  ( excluding Instructions )"]
[null,null,302,"x","Sheet","Shape","Description","Action","State","Internal\nOnly","Called\nBy","Arg\nCount"]
[null,null,303,null,"Style3","Rectangle 35","DLP Logo","Quick_Test","Hidden",false,"User",{"$f":"COUNTA(M311:AH311)","v":0}]
[null,null,304,null,"AnySheet","xDLPLogo","DLP Logo","Toggle_ExcelEnvironment","Hidden",false,"User",0]
[null,null,305,null,"AnySheet","DLPLogo","Instruction Button","Switch_Tabs","(null)",false,"User",2,"Welcome",0]
[null,null,306,null,"xAnySheet","Copyright","Copyright","Toggle_ExcelEnvironment","Hidden",false,"User",0]
[null,null,307,null,"AnySheet","ResetButton","Instruction Button","FunctionCall","(null)",false,"User",1,"ResetDiscreteValues"]
[null,null,308,null,null,null,null,null,null,null,null,0]
[null,null,309,"x","Sheet","Shape","Description","Action","State","Internal\nOnly","Called\nBy","Arg\nCount"]
[null,null,310,null,"AnySheet","SaveButton","Save Button","SaveWorksheet","Hidden",false,"User",{"$f":"COUNTA(M318:AH318)","v":0}]
[null,null,311,null,"AnySheet","SaveAsButton","SaveAs Button","SaveAsWorksheet","Hidden",false,"User",{"$f":"COUNTA(M319:AH319)","v":0}]
[null,null,312,null,"AnySheet","ExitButton","Exit Button","ExitWorksheet","Hidden",false,"User",{"$f":"COUNTA(M320:AH320)","v":0}]
[null,null,313,null,"AnySheet","MinWindowButton","Min/Max Window","MinMaxWindow","Hidden",false,"User",{"$f":"COUNTA(M321:AH321)","v":0}]
[null,null,314,null,null,null,null,null,null,null,null,{"$f":"COUNTA(M322:AH322)","v":0}]
[null,null,315,"x","Sheet","Shape","Description","Action","State","Internal\nOnly","Called\nBy","Arg\nCount","Direction","Step"]
[null,null,316,null,"AnySheet","ZoomPlusButton","Zoom \"+\" Button","ZoomSheet","Hidden",false,"User",{"$f":"COUNTA(M324:AH324)","v":2},"Plus",10]
[null,null,317,null,"AnySheet","ZoomMinusButton","Zoom \"-\" Button","ZoomSheet","Hidden",false,"User",{"$f":"COUNTA(M325:AH325)","v":2},"Minus",10]
[null,null,318,null,null,null,null,null,null,null,null,{"$f":"COUNTA(M326:AH326)","v":0}]
[null,null,319,null,null,null,null,null,null,null,null,{"$f":"COUNTA(M327:AH327)","v":0}]
[null,null,320,null,null,null,null,null,null,null,null,0]
[null,null,321,null,null,null,null,null,null,null,null,0]
[null,null,322,null,null,null,null,null,null,null,null,{"$f":"COUNTA(M330:AH330)","v":0}]
[null,null,323,null,null,null,null,null,null,null,null,{"$f":"COUNTA(M331:AH331)","v":0}]
[null,null,324,"x","Options Sheet"]
[null,null,325,"x","Sheet","Shape","Description","Action","State","Internal\nOnly","Called\nBy","Arg\nCount"]
[null,null,326,null,"Options","SaveParametersButton","Do not show","FunctionCall","(null)",false,"User",{"$f":"COUNTA(M334:AH334)","v":1},"SaveParameters"]
[null,null,327,null,"Options","RestoreParametersButton","Do not show","FunctionCall","(null)",false,"User",{"$f":"COUNTA(M335:AH335)","v":1},"RestoreParameters"]
[null,null,328]
[null,null,329,null,"Target","SaveParametersButton","Do not show","FunctionCall","(null)",false,"User",{"$f":"COUNTA(M337:AH337)","v":1},"SaveParameters"]
[null,null,330,null,"Target","RestoreParametersButton","Do not show","FunctionCall","(null)",false,"User",{"$f":"COUNTA(M338:AH338)","v":1},"RestoreParameters"]
[null,null,331,null,null,null,null,null,null,null,null,{"$f":"COUNTA(M339:AH339)","v":0}]
[null,null,332,"x","Tool Tips"]
[null,null,333,"x","Sheet","Shape","Description","Action","State","Internal\nOnly","Called\nBy","Arg\nCount"]
[null,null,334,null,null,null,null,null,null,null,null,null,"Shown\nShape Color","Hidden\nShape Color","Shown\nBorder Color","Hidden\nBorder Color","Shown\nText Color","Hidden\nText Color","Shown\nText","Hidden\nText","First\nRow","Last\nRow","Last \nState"]
[null,null,335,null,"App","App_TipsExpander","xxx","ShowHide_Rows","Hidden",false,"User",{"$f":"COUNTA(M343:AH343)","v":12},"DarkOrange","Gray178","DarkOrange","Gray178","White","LightGray","-","+",{"$f":"App_ToolTips_Start","v":80},{"$f":"App_ToolTips_End","v":112},"Hidden","(null)"]
[null,null,336,null,"App","App_TipsCorner","xxx","ShowHide_Rows","Hidden",false,"User",12,"DarkOrange","Gray178","DarkOrange","Gray178","DarkOrange","Black","(null)","(null)","(null)","(null)","Hidden","(null)"]
[null,null,337,null,"App","App_TipsBanner","xxx","ShowHide_Rows","Hidden",false,"User",12,"LightOrange","LightGray","DarkOrange","Gray178","DarkOrange","DarkAqua","    Tool Tips - Applications Screen","    Tool Tips - Applications Screen","(null)","(null)","Hidden","(null)"]
[null,null,338,null,null,null,null,null,null,null,null,0]
[null,null,339]
[null,null,340,null,"Target","Target_TipsCorner","xxx","ShowHide_Rows","Hidden",false,"User",12,"DarkOrange","Gray178","DarkOrange","Gray178","DarkOrange","Black","(null)","(null)","(null)","(null)","Hidden","(null)"]
[null,null,341,null,"Target","Target_TipsBanner","xxx","ShowHide_Rows","Hidden",false,"User",12,"LightOrange","LightGray","DarkOrange","Gray178","DarkOrange","DarkAqua","    Tool Tips - Application Parameters Screen","    Tool Tips - Application Parameters Screen","(null)","(null)","Hidden","(null)"]
[null,null,342,null,null,null,null,null,null,null,null,0]
[null,null,343]
[null,null,344,null,"Summary","Summary_TipsCorner","xxx","ShowHide_Rows","Hidden",false,"User",12,"DarkOrange","Gray178","DarkOrange","Gray178","DarkOrange","Black","(null)","(null)","(null)","(null)","Hidden","(null)"]
[null,null,345,null,"Summary","Summary_TipsBanner","xxx","ShowHide_Rows","Hidden",false,"User",12,"LightOrange","LightGray","DarkOrange","Gray178","DarkOrange","DarkAqua","    Tool Tips - Summary Screen","    Tool Tips - Summary Screen","(null)","(null)","Hidden","(null)"]
[null,null,346,null,null,null,null,null,null,null,null,0]
[null,null,347]
[null,null,348,null,"Map","Map_TipsCorner","xxx","ShowHide_Rows","Hidden",false,"User",12,"DarkOrange","Gray178","DarkOrange","Gray178","DarkOrange","Black","(null)","(null)","(null)","(null)","Hidden","(null)"]
[null,null,349,null,"Map","Map_TipsBanner","xxx","ShowHide_Rows","Hidden",false,"User",12,"LightOrange","LightGray","DarkOrange","Gray178","DarkOrange","DarkAqua","    Tool Tips - Chipset Map Screen","    Tool Tips - Chipset Map Screen","(null)","(null)","Hidden","(null)"]
[null,null,350,null,null,null,null,null,null,null,null,0]
[null,null,351]
[null,null,352,null,"Chipsets","Chipsets_TipsCorner","xxx","ShowHide_Rows","Hidden",false,"User",12,"DarkOrange","Gray178","DarkOrange","Gray178","DarkOrange","Black","(null)","(null)","(null)","(null)","Hidden","(null)"]
[null,null,353,null,"Chipsets","Chipsets_TipsBanner","xxx","ShowHide_Rows","Hidden",false,"User",12,"LightOrange","LightGray","DarkOrange","Gray178","DarkOrange","DarkAqua","    Tool Tips","    Tool Tips","(null)","(null)","Hidden","(null)"]
[null,null,354,null,null,null,null,null,null,null,null,0]
[null,null,355]
[null,null,356,null,"Engines","Engines_TipsCorner","xxx","ShowHide_Rows","Hidden",false,"User",12,"DarkOrange","Gray178","DarkOrange","Gray178","DarkOrange","Black","(null)","(null)","(null)","(null)","Hidden","(null)"]
[null,null,357,null,"Engines","Engines_TipsBanner","xxx","ShowHide_Rows","Hidden",false,"User",12,"LightOrange","LightGray","DarkOrange","Gray178","DarkOrange","DarkAqua","    Tool Tips","    Tool Tips","(null)","(null)","Hidden","(null)"]
[null,null,358]
[null,null,359]
[null,null,360]
[null,null,361]
[null,null,362]
[null,null,363]
[null,null,364]
[null,null,365]
[null,null,366]
[null,null,367]
[null,null,368,"x","Added Entry Box Functionality"]
[null,null,369,"x","Sheet","Shape","Description","Action","State","Internal\nOnly","Called\nBy","Arg\nCount","Min","Max","Row Start 1","Row End 1","Row Start 2","Row End 2","BannerEnd1","BannerEnd2"]
[null,null,370,null,null,null,null,null,null,null,null,0]
[null,null,371,null,"Target","TBright_Lumens_Ent",null,"BrightEntryBox","NotFull",false,"User",{"$f":"COUNTA(M379:AH379)","v":8},"TBright_Lumens_Min","TBright_Lumens_Max",{"$f":"TBright_Ambient_BannerStart","v":37},{"$f":"TBright_Ambient_End","v":70},{"$f":"TBright_Nits_BannerStart","v":72},{"$f":"TBright_Nits_End","v":104},{"$f":"TBright_Ambient_BannerEnd","v":39},{"$f":"TBright_Nits_BannerEnd","v":73}]
[null,null,372,null,"Target","TBright_ScreenEff_Ent",null,"BrightEntryBox","NotFull",false,"User",{"$f":"COUNTA(M380:AH380)","v":8},"TBright_ScreenEff_Min","TBright_ScreenEff_Max","(null)","(null)","(null)","(null)","(null)","(null)"]
[null,null,373,null,"Target","TBright_Nits_Ent",null,"BrightEntryBox","NotFull",false,"User",{"$f":"COUNTA(M381:AH381)","v":8},"TBright_Nits_Min","TBright_Nits_Max",{"$f":"TBright_Ambient_BannerStart","v":37},{"$f":"TBright_Ambient_End","v":70},{"$f":"TBright_Lumens_BannerStart","v":106},{"$f":"TBright_Lumens_End","v":133},{"$f":"TBright_Ambient_BannerEnd","v":39},{"$f":"TBright_Lumens_BannerEnd","v":107}]
[null,null,374,"x",null,null,null,null,null,null,null,0,"ColMin","ColMax","RowMin","RowMax","Row Start 1","Row End 1","Row Start 2","Row End 2","Banner End 1","Banner End 2"]
[null,null,375,null,"Target","TRes_ManRes_Ent",null,"ManResEntryBox","NotFull",false,"User",{"$f":"COUNTA(M383:AH383)","v":10},"TRes_ManResCol_Min","TRes_ManResCol_Max","TRes_ManResRow_Min","TRes_ManResRow_Max",{"$f":"TRes_IndustryStd_BannerStart","v":411},{"$f":"TRes_IndustryStd_End","v":467},{"$f":"TRes_Fundamental_BannerStart","v":305},{"$f":"TRes_Fundamental_End","v":409},{"$f":"TRes_IndustryStd_BannerEnd","v":412},{"$f":"TRes_Fundamental_BannerEnd","v":307}]
[null,null,376,"x",null,null,null,null,null,null,null,0,"Height Min","Height Max","Width Min","Width Max","Diag Min","Diag Max","Num Min","Num Max","Denom Min","Denom Max","Width Row","Height Row","Diag Row","AR Row"]
[null,null,377,null,"Target","TSize_Ent",null,"SizeEntryBox","NotFull",false,"User",{"$f":"COUNTA(M385:AH385)","v":14},"TSize_ImageHeight_xMin","TSize_ImageHeight_xMax","TSize_ImageWidth_xMin","TSize_ImageWidth_xMax","TSize_ImageDiag_xMin","TSize_ImageDiag_xMax","TSize_ImageARNum_Min","TSize_ImageARNum_Max","TSize_ImageARDenom_Min","TSize_ImageARDenom_Max",{"$f":"TSize_WidthRow","v":245},{"$f":"TSize_HeightRow","v":248},{"$f":"TSize_DiagRow","v":251},{"$f":"TSize_ARRow","v":254}]
[null,null,378,"x",null,null,null,null,null,null,null,0,"Dist Min","Dist Max","FOV Min","FOV Max","Degree Min","Degree Max","Density Min","Density Max","Conversion Min","Conversion Max","Row Start 1","Row End 1","Row Start 2","Row End 2","Distance Row","FOV Row","Degree Row","Density Row","Conversion Row","BannerEnd1","BannerEnd2"]
[null,null,379,null,"Target","TRes_Fundamental_Ent",null,"FundEntryBox","NotFull",false,"User",{"$f":"COUNTA(M387:AH387)","v":21},"TRes_ViewDist_xMin","TRes_ViewDist_xMax","TRes_FOV_Min","TRes_FOV_Max","TRes_PxPerDeg_xMin","TRes_PxPerDeg_xMax","TRes_PxDens_Min","TRes_PxDens_Max","TRes_PointsToPixelsFactor_Min","TRes_PointsToPixelsFactor_Max",{"$f":"TRes_IndustryStd_BannerStart","v":411},{"$f":"TRes_IndustryStd_End","v":467},{"$f":"TRes_ManualRes_BannerStart","v":469},{"$f":"TRes_ManualRes_End","v":485},{"$f":"TRes_DistRow","v":314},{"$f":"TRes_FOVRow","v":317},{"$f":"TRes_DegRow","v":350},{"$f":"TRes_DensRow","v":369},{"$f":"TRes_ConversionRow","v":386},{"$f":"TRes_IndustryStd_BannerEnd","v":412},{"$f":"TRes_ManualRes_BannerEnd","v":470}]
[null,null,380,"x"]
[null,null,381]
[null,null,382]
[null,null,383]
[null,null,384]
[null,null,385]
[null,null,386]
[null,null,387]
[null,null,388]
[null,null,389]

{"sheet":"Map","index":15,"n_rows":195,"n_cols":88,"rows_kept":195,"cut":false,"hidden":true,"merged":[[21,87,21,102],[21,81,21,86],[82,38,82,49],[55,37,55,40],[55,41,55,45],[55,46,55,49],[57,41,57,45],[58,42,58,44],[59,41,59,45],[51,41,51,45],[53,38,53,40],[53,41,53,45],[53,46,53,48],[54,38,54,40],[54,42,54,44],[54,46,54,48],[50,38,50,40],[50,42,50,44],[9,12,9,15],[9,16,9,19],[9,22,9,33],[9,36,9,39],[9,40,9,43],[13,15,13,20],[13,21,13,36],[47,37,47,49],[49,38,49,40],[49,41,49,45],[9,45,9,49],[7,12,7,19],[7,22,7,33],[7,36,7,43],[7,45,7,49],[8,12,8,15],[8,16,8,19],[8,22,8,33],[8,36,8,39],[8,40,8,43],[8,45,8,49]]}
[]
[]
[]
[]
[]
[]
[]
[null,null,null,null,null,null,null,null,null,null,null,null,"Resolution",null,null,null,null,null,null,null,null,null,"Image Size",null,null,null,null,null,null,null,null,null,null,null,null,null,"Brightness",null,null,null,null,null,null,null,null,"# of Matching"]
[null,null,null,null,null,null,null,null,null,null,null,"Max:",{"$f":"Display_ResolutionSimple_Max","v":"-- x --"},null,null,null,{"$f":"Display_Mpx_Max","v":"-- Mpx"},null,null,null,null,"Max:",{"$f":"CONCATENATE( \"W: \", Display_ImageWidth_Max, \"  x   H: \", Display_ImageHeight_Max, \"   ( D: \", Display_ImageDiag_Max, \" )\"  )","v":"W: -- in  x   H: -- in   ( D: -- in )"},null,null,null,null,null,null,null,null,null,null,null,null,"Max:",{"$f":"Display_Lumens_Max","v":"-- lm"},null,null,null,{"$f":"Display_Nits_Max","v":"-- nits"},null,null,null,null,"Chipsets"]
[null,null,null,null,null,null,null,null,null,null,null,"Min:",{"$f":"Display_ResolutionSimple_Min","v":"-- x --"},null,null,null,{"$f":"Display_Mpx_Min","v":"-- Mpx"},null,null,null,null,"Min:",{"$f":"CONCATENATE( \"W: \", Display_ImageWidth_Min, \"  x   H: \", Display_ImageHeight_Min, \"   ( D: \", Display_ImageDiag_Min, \" )\"  )","v":"W: -- in  x   H: -- in   ( D: -- in )"},null,null,null,null,null,null,null,null,null,null,null,null,"Min:",{"$f":"Display_Lumens_Min","v":"-- lm"},null,null,null,{"$f":"Display_Nits_Min","v":"-- nits"},null,null,null,null,{"$f":"Index_Chipset_Max","v":0}]
[]
[]
[]
[null,null,null,null,null,null,null,null,null,null,null,null,null,null,null,"Target Application",null,null,null,null,null,{"$f":"IF( Display_Application=0, \"( No Application Selected )\", Display_Application )","v":"( No Application Selected )"}]
[]
[]
[]
[]
[]
[]
[]
[null,null,null,null,null,null,null,null,null,null,null,null,null,null,null,null,null,null,null,null,null,null,null,null,null,null,null,null,null,null,null,null,null,null,null,null,null,null,null,null,null,null,null,null,null,null,null,null,null,null,null,null,null,null,null,null,null,null,null,null,null,null,null,null,null,null,null,null,null,null,null,null,null,null,null,null,null,null,null,null,null,"Target Application",null,null,null,null,null,{"$f":"IF( Display_Application=0, \"( No Application Selected )\", Display_Application )","v":"( No Application Selected )"}]
[]
[]
[]
[]
[]
[]
[]
[]
[]
[]
[]
[]
[]
[]
[]
[]
[]
[]
[]
[]
[]
[]
[]
[]
[]
[null,null,null,null,null,null,null,null,null,null,null,null,null,null,null,null,null,null,null,null,null,null,null,null,null,null,null,null,null,null,null,null,null,null,null,null,null,"Matching Zone Size"]
[]
[null,null,null,null,null,null,null,null,null,null,null,null,null,null,null,null,null,null,null,null,null,null,null,null,null,null,null,null,null,null,null,null,null,null,null,null,null,null,"  Apply",null,null,"Top Edge",null,null,null,null,null,null,null,null,null,null,null,{"$f":"ROW(BB50)","v":50},null,null,0]
[null,null,null,null,null,null,null,null,null,null,null,null,null,null,null,null,null,null,null,null,null,null,null,null,null,null,null,null,null,null,null,null,null,null,null,null,null,null,"  Defaults",null,null,null,0]
[null,null,null,null,null,null,null,null,null,null,null,null,null,null,null,null,null,null,null,null,null,null,null,null,null,null,null,null,null,null,null,null,null,null,null,null,null,null,null,null,null,{"$f":"CONCATENATE( \"<<  \", ROUND( AppDef_MatchTol_Top*100,0), \"%  >>\" )","v":"<<  0%  >>"},null,null,null,null,null,null,null,null,null,null,null,null,null,null,null,null,null,null,null,null,null,null,null,null,null,null,null,null,null,"0.45 issue"]
[]
[null,null,null,null,null,null,null,null,null,null,null,null,null,null,null,null,null,null,null,null,null,null,null,null,null,null,null,null,null,null,null,null,null,null,null,null,null,null,"Left Edge",null,null,"Nominal",null,null,null,null,"Right Edge",null,null,null,null,null,null,null,null,null,null,null,null,null,null,null,null,null,null,null,null,null,null,null,null,"Initialize BYPASS button"]
[null,null,null,null,null,null,null,null,null,null,null,null,null,null,null,null,null,null,null,null,null,null,null,null,null,null,null,null,null,null,null,null,null,null,null,null,null,null,0,null,null,null,0.15,null,null,null,0,null,null,null,null,null,null,null,null,null,null,null,null,null,null,null,null,null,null,null,null,null,null,null,null,"fix nominal = 0"]
[null,null,null,null,null,null,null,null,null,null,null,null,null,null,null,null,null,null,null,null,null,null,null,null,null,null,null,null,null,null,null,null,null,null,null,null,null,{"$f":"CONCATENATE( \"<<  \", ROUND( AppDef_MatchTol_Left*100,0), \"%  >>\" )","v":"<<  0%  >>"},null,null,null,{"$f":"CONCATENATE( \"<<  \", ROUND( AppDef_MatchTol_Nom*100,0), \"%  >>\" )","v":"<<  0%  >>"},null,null,null,null,{"$f":"CONCATENATE( \" <<  \", ROUND( AppDef_MatchTol_Right*100,0), \"%  >>\" )","v":" <<  0%  >>"}]
[]
[null,null,null,null,null,null,null,null,null,null,null,null,null,null,null,null,null,null,null,null,null,null,null,null,null,null,null,null,null,null,null,null,null,null,null,null,null,null,null,null,null,"Bottom Edge"]
[null,null,null,null,null,null,null,null,null,null,null,null,null,null,null,null,null,null,null,null,null,null,null,null,null,null,null,null,null,null,null,null,null,null,null,null,null,null,null,null,null,null,0]
[null,null,null,null,null,null,null,null,null,null,null,null,null,null,null,null,null,null,null,null,null,null,null,null,null,null,null,null,null,null,null,null,null,null,null,null,null,null,null,null,null,{"$f":"CONCATENATE( \"<<  \", ROUND( AppDef_MatchTol_Bottom*100,0), \"%  >>\" )","v":"<<  0%  >>"},null,null,null,null,null,null,null,null,null,null,null,null,null,null,null,null,null,null,null,null,null,null,null,null,null,null,null,null,null,"Initialize default button"]
[]
[null,null,null,null,null,null,null,null,null,null,null,null,null,null,null,null,null,null,null,null,null,null,null,null,null,null,null,null,null,null,null,null,null,null,null,null,null,null,null,null,null,null,null,null,null,null,null,null,null,null,null,null,null,null,{"$f":"ROW(BC62)","v":62}]
[null,null,null,null,null,null,null,null,null,null,null,null,null,null,null,null,null,null,null,null,null,null,null,null,null,null,null,null,null,null,null,null,null,null,null,null,null,"•  Entering a percentage value (for a "]
[null,null,null,null,null,null,null,null,null,null,null,null,null,null,null,null,null,null,null,null,null,null,null,null,null,null,null,null,null,null,null,null,null,null,null,null,null,null,"particular edge)  moves the"]
[null,null,null,null,null,null,null,null,null,null,null,null,null,null,null,null,null,null,null,null,null,null,null,null,null,null,null,null,null,null,null,null,null,null,null,null,null,null,"corresponding edge of the Matching Zone "]
[null,null,null,null,null,null,null,null,null,null,null,null,null,null,null,null,null,null,null,null,null,null,null,null,null,null,null,null,null,null,null,null,null,null,null,null,null,null,"box by the prescribed percentage"]
[null,null,null,null,null,null,null,null,null,null,null,null,null,null,null,null,null,null,null,null,null,null,null,null,null,null,null,null,null,null,null,null,null,null,null,null,null,null,"(relative to the Target Zone box)."]
[]
[null,null,null,null,null,null,null,null,null,null,null,null,null,null,null,null,null,null,null,null,null,null,null,null,null,null,null,null,null,null,null,null,null,null,null,null,null,"•  When any of the \"Top\", \"Bottom\","]
[null,null,null,null,null,null,null,null,null,null,null,null,null,null,null,null,null,null,null,null,null,null,null,null,null,null,null,null,null,null,null,null,null,null,null,null,null,null,"\"Left\", and/or \"Right\" Edge percentages"]
[null,null,null,null,null,null,null,null,null,null,null,null,null,null,null,null,null,null,null,null,null,null,null,null,null,null,null,null,null,null,null,null,null,null,null,null,null,null,"are set to 0%, then the \"Nominal\" "]
[null,null,null,null,null,null,null,null,null,null,null,null,null,null,null,null,null,null,null,null,null,null,null,null,null,null,null,null,null,null,null,null,null,null,null,null,null,null,"percentage applies to those Edges."]
[]
[null,null,null,null,null,null,null,null,null,null,null,null,null,null,null,null,null,null,null,null,null,null,null,null,null,null,null,null,null,null,null,null,null,null,null,null,null,"•  Note that the Chipset Map graph"]
[null,null,null,null,null,null,null,null,null,null,null,null,null,null,null,null,null,null,null,null,null,null,null,null,null,null,null,null,null,null,null,null,null,null,null,null,null,null,"is drawn in log-log scale.  "]
[null,null,null,null,null,null,null,null,null,null,null,null,null,null,null,null,null,null,null,null,null,null,null,null,null,null,null,null,null,null,null,null,null,null,null,null,null,null,"Consequently, the size of the"]
[null,null,null,null,null,null,null,null,null,null,null,null,null,null,null,null,null,null,null,null,null,null,null,null,null,null,null,null,null,null,null,null,null,null,null,null,null,null,"Matching Zone box changes in"]
[null,null,null,null,null,null,null,null,null,null,null,null,null,null,null,null,null,null,null,null,null,null,null,null,null,null,null,null,null,null,null,null,null,null,null,null,null,null,"non-linear fashion relative to the"]
[null,null,null,null,null,null,null,null,null,null,null,null,null,null,null,null,null,null,null,null,null,null,null,null,null,null,null,null,null,null,null,null,null,null,null,null,null,null,"entered percentages."]
[]
[null,null,null,null,null,null,null,null,null,null,null,null,null,null,null,null,null,null,null,null,null,null,null,null,null,null,null,null,null,null,null,null,null,null,null,null,null,null,null,null,null,null,null,null,null,null,null,null,null,null,null,null,null,null,{"$f":"ROW(BC81)","v":81}]
[null,null,null,null,null,null,null,null,null,null,null,null,null,null,null,null,null,null,null,null,null,null,null,null,null,null,null,null,null,null,null,null,null,null,null,null,null,null,null,null,null,null,null,null,null,null,null,null,null,null,null,null,null,{"$f":"ROW(BB82)","v":82}]
[null,null,null,null,null,null,null,null,null,null,null,null,null,null,null,null,null,null,null,null,null,null,null,null,null,null,null,null,null,null,null,null,null,null,null,null,null,null,{"$f":"CONCATENATE( \"Ver. \", App_FullVersion )","v":"Ver. [[Prod]] (Smarta2xOPENv3)"}]
[]
[null,null,null,null,null,null,null,null,null,null,null,null,null,null,null,null,null,null,null,null,null,null,null,null,null,null,null,null,null,null,null,null,null,null,null,null,null,null,null,null,null,null,null,null,null,null,null,null,null,null,null,null,null,{"$f":"ROW(BB85)","v":85}]
[]
[]
[null,null,null,null,null,null,null,null,null,null,null,null,null,null,null,null,null,null,null,null,null,null,null,null,null,null,null,null,null,null,null,null,null,null,null,null,null,null,null,null,null,null,null,null,null,null,null,null,null,null,null,null,null,{"$f":"ROW(BB88)","v":88}]
[]
[]
[]
[null,null,null,null,null,null,null,null,null,null,null,null,null,null,null,null,null,null,null,null,null,null,null,null,null,null,null,null,null,null,null,null,null,null,null,null,null,null,null,null,null,null,null,null,null,null,null,null,null,null,null,null,null,{"$f":"ROW(BB92)","v":92}]
[]
[]
[]
[]
[]
[]
[]
[]
[]
[]
[]
[]
[]
[]
[]
[]
[]
[]
[]
[]
[]
[]
[]
[]
[]
[]
[]
[]
[]
[]
[]
[]
[]
[]
[]
[]
[]
[]
[]
[]
[]
[]
[]
[]
[]
[]
[]
[]
[]
[]
[]
[]
[]
[]
[]
[]
[]
[]
[]
[]
[]
[]
[]
[]
[]
[]
[]
[]
[]
[]
[]
[]
[]
[]
[]
[]
[]
[]
[]
[]
[]
[]
[]
[]
[]
[]
[]
[]
[]
[]
[]
[]
[]
[]
[]
[]
[]
[]
[]
[]
[]
[]
[null,null,null,null,null,null,null,null,null,null,null,null,null,null,null,null,null,null,null,null,null,null,null,null,null,null,null,null,null,null,null,null,null,null,null,null,null,null,null,null,null,null,null,null,null,null,null,null,null,null,null,null,null,{"$f":"ROW(BB195)","v":195}]

{"sheet":"xMap","index":16,"n_rows":94,"n_cols":37,"rows_kept":94,"cut":false,"hidden":true,"merged":[[2,13,2,14],[2,16,2,17],[34,1,39,5]]}
[]
[]
[null,null,null,null,null,null,null,null,null,null,null,null,null,"Log",null,null,"Linear"]
[null,null,null,null,null,null,null,"Label","Diag","Standard","Col","Row","Pixels","Mpx","Lumens",null,"Mpx","Lumens"]
[null,null,null,null,null,-1,"XPR"]
[]
[null,null,null,null,null,null,null,"DLP471TP",0.47,"4K",3840,2160,{"$f":"K7*L7","v":8294400},{"$f":"SetPrecision( M7/1000000 )","v":8.2940000000000005},1500,null,{"$f":"F$5 * LOG(N7)","v":-0.91876403102799908},{"$f":"F$5 * LOG(O7)","v":-3.1760912590556813}]
[null,null,null,null,null,null,null,"DLP3310",0.33,"1080p",1920,1080,{"$f":"K8*L8","v":2073600},{"$f":"SetPrecision( M8/1000000 )","v":2.0739999999999998},500,null,-0.31680875205302211,-2.6989700043360187]
[null,null,null,null,null,null,null,"DLP230NP",0.23,"1080p",1920,1080,{"$f":"K9*L9","v":2073600},{"$f":"SetPrecision( M9/1000000 )","v":2.0739999999999998},250,null,-0.31680875205302211,-2.3979400086720375]
[null,null,null,null,null,null,null,"DLP230KP",0.23,"720p",1280,720,{"$f":"K10*L10","v":921600},{"$f":"SetPrecision( M10/1000000 )","v":0.92200000000000004},250,null,3.5269078946370637E-2,-2.3979400086720375]
[null,null,null,null,null,-1,"Keystone"]
[]
[null,null,null,null,null,null,null,"DLP471TP",0.47,"4K",3840,2160,{"$f":"K13*L13","v":8294400},{"$f":"SetPrecision( M13/1000000 )","v":8.2940000000000005},1500,null,{"$f":"F$11 * LOG(N13)","v":-0.91876403102799908},{"$f":"F$11 * LOG(O13)","v":-3.1760912590556813}]
[null,null,null,null,null,null,null,"DLP3310",0.33,"1080p",1920,1080,2073600,2.0739999999999998,500,null,-0.31680875205302211,-2.6989700043360187]
[null,null,null,null,null,null,null,"DLP3010",0.31,"720p",1280,720,921600,0.92200000000000004,300,null,3.5269078946370637E-2,-2.4771212547196626]
[null,null,null,null,null,null,null,"DLP230NP",0.23,"1080p",1920,1080,2073600,2.0739999999999998,250,null,-0.31680875205302211,-2.3979400086720375]
[null,null,null,null,null,null,null,"DLP230KP",0.23,"720p",1280,720,921600,0.92200000000000004,250,null,3.5269078946370637E-2,-2.3979400086720375]
[null,null,null,null,null,null,null,"DLP230GP",0.23,"qHD",960,540,518400,0.51800000000000002,250,null,0.28567024025476695,-2.3979400086720375]
[null,null,null,null,null,null,null,"DLP2010",0.2,"WVGA",854,480,409920,0.41,150,null,0.38721614328026455,-2.1760912590556813]
[null,null,null,null,null,null,null,"DLP160CP",0.16,"nHD",640,360,230400,0.23,100,null,0.63827216398240705,-2]
[null,null,null,null,null,null,null,"DLP160AP",0.16,"QnHD",320,180,57600,5.7599999999999998E-2,100,null,1.2395775165767879,-2]
[null,null,null,null,null,-1,"Frame Rate"]
[]
[null,null,null,null,null,null,null,"60 Hz",0.47,"4K",3840,2160,{"$f":"K24*L24","v":8294400},{"$f":"SetPrecision( M24/1000000 )","v":8.2940000000000005},1500,null,{"$f":"F$22 * LOG(N24)","v":-0.91876403102799908},{"$f":"F$22 * LOG(O24)","v":-3.1760912590556813}]
[null,null,null,null,null,null,null,"60 Hz",0.47,"1080p",1920,1080,2073600,2.0739999999999998,1500,null,-0.31680875205302211,-3.1760912590556813]
[null,null,null,null,null,null,null,"60 Hz",0.33,"1080p",1920,1080,2073600,2.0739999999999998,500,null,-0.31680875205302211,-2.6989700043360187]
[null,null,null,null,null,null,null,"120 Hz",0.31,"720p",1280,720,921600,0.92200000000000004,300,null,3.5269078946370637E-2,-2.4771212547196626]
[null,null,null,null,null,null,null,"60 Hz",0.23,"1080p",1920,1080,2073600,2.0739999999999998,250,null,-0.31680875205302211,-2.3979400086720375]
[null,null,null,null,null,null,null,"60 Hz",0.23,"720p",1280,720,921600,0.92200000000000004,250,null,3.5269078946370637E-2,-2.3979400086720375]
[null,null,null,null,null,null,null,"120 Hz",0.23,"qHD",960,540,518400,0.51800000000000002,250,null,0.28567024025476695,-2.3979400086720375]
[null,null,null,null,null,null,null,"240 Hz",0.2,"WVGA",854,480,409920,0.41,150,null,0.38721614328026455,-2.1760912590556813]
[null,null,null,null,null,null,null,"60 Hz",0.2,"nHD",640,360,230400,0.23,50,null,0.63827216398240705,-1.6989700043360187]
[null,null,null,null,null,null,null,"360 Hz",0.16,"nHD",640,360,230400,0.23,100,null,0.63827216398240705,-2,null,null,null,null,null,null,null,null,null,null,null,null,null,null,null,null,null,null,"The target zone is based solely upon resolution and lumens."]
[null,null,null,null,null,null,null,"60 Hz",0.16,"QnHD",320,180,57600,5.7599999999999998E-2,100,null,1.2395775165767879,-2,null,null,null,null,null,null,null,null,null,null,null,null,null,null,null,null,null,null,"if other chipset characteristics (such as size, power consumption, etc.)"]
[null,"To add Chipsets, add the data to the next available row in this chipsets table and fill out columns H through O. Note this will only add chipsets to the graph on the 'Map' page. To get the chipset to appear on the 'Chipsets' page, refer to the chart on 'xChipsetFilter.'",null,null,null,null,"Chipsets",null,null,null,null,null,null,null,null,null,null,null,null,null,null,null,null,null,null,null,null,null,null,null,null,null,null,null,null,null,"are inportant to your application, refer to the chipset list to "]
[null,null,null,null,null,null,null,"DLP471TP",0.47,"4K",3840,2160,{"$f":"K36*L36","v":8294400},{"$f":"SetPrecision( M36/1000000 )","v":8.2940000000000005},1800,null,{"$f":"LOG(N36)","v":0.91876403102799908},{"$f":"LOG(O36)","v":3.255272505103306}]
[null,null,null,null,null,null,null,"DLP4710",0.47,"1080p",1920,1080,2073600,2.0739999999999998,1800,null,0.31680875205302211,3.255272505103306,null,null,null,null,null,null,null,null,null,null,null,null,null,null,null,null,null,null,"further down-select to the appropriate chipsets."]
[]
[null,null,null,null,null,null,null,"DLP3310",0.33,"1080p",1920,1080,2073600,2.0739999999999998,800,null,0.31680875205302211,2.9030899869919438]
[null,null,null,null,null,null,null,"DLP3010",0.31,"720p",1280,720,921600,0.92200000000000004,300,null,-3.5269078946370637E-2,2.4771212547196626]
[null,null,null,null,null,null,null,"DLP230NP",0.23,"1080p",1920,1080,2073600,2.0739999999999998,450,null,0.31680875205302211,2.6532125137753435]
[null,null,null,null,null,null,null,"DLP230KP",0.23,"720p",1280,720,921600,0.92200000000000004,450,null,-3.5269078946370637E-2,2.6532125137753435]
[null,null,null,null,null,null,null,"DLP230GP",0.23,"qHD",960,540,518400,0.51800000000000002,450,null,-0.28567024025476695,2.6532125137753435]
[null,null,null,null,null,null,null,"DLP2010",0.2,"WVGA",854,480,409920,0.41,200,null,-0.38721614328026455,2.3010299956639813]
[null,null,null,null,null,null,null,"DLP2000",0.2,"nHD",640,360,230400,0.23,50,null,-0.63827216398240705,1.6989700043360187]
[null,null,null,null,null,null,null,"DLP160CP",0.16,"nHD",640,360,230400,0.23,120,null,-0.63827216398240705,2.0791812460476247]
[null,null,null,null,null,null,null,"DLP160AP",0.16,"QnHD",320,180,57600,5.7599999999999998E-2,120,null,-1.2395775165767879,2.0791812460476247]
[]
[]
[]
[]
[]
[]
[null,null,null,null,null,null,"Match Zone (red)"]
[null,null,null,null,null,null,null,null,null,null,null,null,null,{"$f":"Resolved_Mpx_Min","v":0},{"$f":"Resolved_Lumens_Max","v":0},null,{"$f":"LOG(N55)","v":{"$error":"#NUM!"}},{"$error":"#NUM!"}]
[null,null,null,null,null,null,null,null,null,null,null,null,null,{"$f":"Resolved_Mpx_Max","v":0},{"$f":"Resolved_Lumens_Max","v":0},null,{"$error":"#NUM!"},{"$error":"#NUM!"}]
[null,null,null,null,null,null,null,null,null,null,null,null,null,{"$f":"Resolved_Mpx_Max","v":0},{"$f":"Resolved_Lumens_Min","v":0},null,{"$error":"#NUM!"},{"$error":"#NUM!"}]
[null,null,null,null,null,null,null,null,null,null,null,null,null,{"$f":"Resolved_Mpx_Min","v":0},{"$f":"Resolved_Lumens_Min","v":0},null,{"$error":"#NUM!"},{"$error":"#NUM!"}]
[null,null,null,{"$f":"Map_MatchZone_Option1","v":0},null,null,null,null,null,null,null,null,null,{"$f":"N55","v":0},{"$f":"O55","v":0},null,{"$error":"#NUM!"},{"$error":"#NUM!"}]
[null,null,null,"User","AppDef","Applied","Match Tolerance Zone"]
[null,"Default Tolerances",null,{"$f":"Value_MatchZoneTolerance","v":0.15},{"$f":"AppDef_MatchTol_Nom","v":0},{"$f":"IF( (Map_MatchZone_Option1=0), E61, D61 )","v":0},"UL",{"$f":"MIN(Resolved_Mpx_Min, Resolved_Mpx_Max)","v":0},null,null,null,{"$f":"MAX(Resolved_Lumens_Min, Resolved_Lumens_Max)","v":0},null,{"$f":"IF( Value_MinResTol>0, H61 * ( 1-Value_MinResTol ), 1000000 )","v":1000000},{"$f":"L61 * ( 1+Value_MaxLmTol )","v":0},null,{"$f":"LOG(N61)","v":6},{"$error":"#NUM!"}]
[null,"MaxLm Tol",null,{"$f":"IF( Value_MatchZoneTolerance_MaxLm>0, Value_MatchZoneTolerance_MaxLm, Value_MatchZoneTolerance  )","v":0.15},{"$f":"IF( AppDef_MatchTol_Top>0, AppDef_MatchTol_Top, AppDef_MatchTol_Nom )","v":0},{"$f":"IF( (Map_MatchZone_Option1=0), E62, D62 )","v":0},"UR",null,{"$f":"MAX(Resolved_Mpx_Min, Resolved_Mpx_Max)","v":0},null,null,{"$f":"MAX(Resolved_Lumens_Min, Resolved_Lumens_Max)","v":0},null,{"$f":"IF( Value_MaxResTol>0, I62* ( 1+Value_MaxResTol ), 1000000 )","v":1000000},{"$f":"L62 * ( 1+Value_MaxLmTol )","v":0},null,6,{"$error":"#NUM!"}]
[null,"MinLm Tol",{"$f":"IF( Value_MatchZoneTolerance_MinLm<0, 0, IF( Value_MatchZoneTolerance_MinLm>=1, 0.9999, Value_MatchZoneTolerance_MinLm )  )","v":0},{"$f":"IF( AND(C63> 0,C63< 1),C63, Value_MatchZoneTolerance  )","v":0.15},{"$f":"IF( AppDef_MatchTol_Bottom>0, AppDef_MatchTol_Bottom, AppDef_MatchTol_Nom )","v":0},{"$f":"IF( (Map_MatchZone_Option1=0), E63, D63 )","v":0},"LR",null,{"$f":"MAX(Resolved_Mpx_Min, Resolved_Mpx_Max)","v":0},null,{"$f":"MIN(Resolved_Lumens_Min, Resolved_Lumens_Max)","v":0},null,null,{"$f":"IF( Value_MaxResTol>0, I63* ( 1+Value_MaxResTol ), 1000000 )","v":1000000},{"$f":"K63 * ( 1-Value_MinLmTol )","v":0},null,6,{"$error":"#NUM!"}]
[null,"MaxRes Tol",null,{"$f":"IF( Value_MatchZoneTolerance_MaxRes>0, Value_MatchZoneTolerance_MaxRes, Value_MatchZoneTolerance  )","v":0.15},{"$f":"IF( AppDef_MatchTol_Right>0, AppDef_MatchTol_Right, AppDef_MatchTol_Nom )","v":0},{"$f":"IF( (Map_MatchZone_Option1=0), E64, D64 )","v":0},"LL",{"$f":"MIN(Resolved_Mpx_Min, Resolved_Mpx_Max)","v":0},null,null,{"$f":"MIN(Resolved_Lumens_Min, Resolved_Lumens_Max)","v":0},null,null,{"$f":"IF( Value_MinResTol>0, H64 * ( 1-Value_MinResTol ), 1000000 )","v":1000000},{"$f":"K64 * ( 1-Value_MinLmTol )","v":0},null,6,{"$error":"#NUM!"}]
[null,"MinRes Tol",{"$f":"IF( Value_MatchZoneTolerance_MinRes<0, 0, IF( Value_MatchZoneTolerance_MinRes>=1, 0.9999, Value_MatchZoneTolerance_MinRes )  )","v":0},{"$f":"IF( AND(C65> 0,C65< 1),C65, Value_MatchZoneTolerance  )","v":0.15},{"$f":"IF( AppDef_MatchTol_Left>0, AppDef_MatchTol_Left, AppDef_MatchTol_Nom )","v":0},{"$f":"IF( (Map_MatchZone_Option1=0), E65, D65 )","v":0},null,null,null,null,null,null,null,{"$f":"N61","v":1000000},{"$f":"O61","v":0},null,6,{"$error":"#NUM!"}]
[null,null,null,null,null,null,"Resolution Tick-Marks"]
[null,null,null,null,null,null,null,"(8K)",null,"8K",7680,4320,{"$f":"K67*L67","v":33177600},{"$f":"SetPrecision( M67/1000000 )","v":33.18},0.01,null,{"$f":"LOG(N67)","v":1.5208763816883419},-2]
[null,null,null,null,null,null,null,"DLP471TP",0.47,"4K",3840,2160,8294400,8.2940000000000005,{"$f":"O67","v":0.01},null,0.91876403102799908,-2]
[null,null,null,null,null,null,null,"DLP230NP",0.23,"1080p",1920,1080,2073600,2.0739999999999998,0.01,null,0.31680875205302211,-2]
[null,null,null,null,null,null,null,"DLP230KP",0.23,"720p",1280,720,921600,0.92200000000000004,0.01,null,-3.5269078946370637E-2,-2]
[null,null,null,null,null,null,null,"DLP230GP",0.23,"qHD",960,540,518400,0.51800000000000002,0.01,null,-0.28567024025476695,-2]
[null,null,null,null,null,null,null,"DLP2010",0.2,"WVGA",854,480,409920,0.41,0.01,null,-0.38721614328026455,-2]
[null,null,null,null,null,null,null,"DLP160CP",0.16,"nHD",640,360,230400,0.23,0.01,null,-0.63827216398240705,-2]
[null,null,null,null,null,null,null,"DLP160AP",0.16,"QnHD",320,180,57600,5.7599999999999998E-2,0.01,null,-1.2395775165767879,-2]
[null,null,null,null,null,null,"Axis Limits"]
[null,null,null,null,null,null,null,{"$f":"MIN(Resolved_Mpx_Min, Resolved_Mpx_Max)","v":0},null,null,null,{"$f":"MAX(Resolved_Lumens_Min, Resolved_Lumens_Max)","v":0},null,1,10000,null,{"$f":"LOG(N76)","v":0},4]
[null,null,null,null,null,null,null,null,{"$f":"MAX(Resolved_Mpx_Min, Resolved_Mpx_Max)","v":0},null,null,{"$f":"MAX(Resolved_Lumens_Min, Resolved_Lumens_Max)","v":0},null,100,10000,null,2,4]
[null,null,null,null,null,null,null,null,{"$f":"MAX(Resolved_Mpx_Min, Resolved_Mpx_Max)","v":0},null,{"$f":"MIN(Resolved_Lumens_Min, Resolved_Lumens_Max)","v":0},null,null,100,10,null,2,1]
[null,null,null,null,null,null,null,{"$f":"MIN(Resolved_Mpx_Min, Resolved_Mpx_Max)","v":0},null,null,{"$f":"MIN(Resolved_Lumens_Min, Resolved_Lumens_Max)","v":0},null,null,1,10,null,0,1]
[]
[]
[]
[null,null,null,null,null,null,null,{"$f":"MIN(Resolved_Mpx_Min, Resolved_Mpx_Max)","v":0},null,null,null,{"$f":"MAX(Resolved_Lumens_Min, Resolved_Lumens_Max)","v":0},null,{"$f":"IF( $F$61>0, H83 * ( 1-$F$61 ), 1000000 )","v":1000000},{"$f":"L83 * ( 1+$F$61 )","v":0}]
[null,null,null,null,null,null,null,null,{"$f":"MAX(Resolved_Mpx_Min, Resolved_Mpx_Max)","v":0},null,null,{"$f":"MAX(Resolved_Lumens_Min, Resolved_Lumens_Max)","v":0},null,{"$f":"IF( $F$61>0, I84* ( 1+$F$61 ), 1000000 )","v":1000000},{"$f":"L84 * ( 1+$F$61 )","v":0}]
[null,null,null,null,null,null,null,null,{"$f":"MAX(Resolved_Mpx_Min, Resolved_Mpx_Max)","v":0},null,{"$f":"MIN(Resolved_Lumens_Min, Resolved_Lumens_Max)","v":0},null,null,{"$f":"IF( $F$61>0, I85* ( 1+$F$61 ), 1000000 )","v":1000000},{"$f":"K85 * ( 1-$F$61 )","v":0}]
[null,null,null,null,null,null,null,{"$f":"MIN(Resolved_Mpx_Min, Resolved_Mpx_Max)","v":0},null,null,{"$f":"MIN(Resolved_Lumens_Min, Resolved_Lumens_Max)","v":0},null,null,{"$f":"IF( $F$61>0, H86 * ( 1-$F$61 ), 1000000 )","v":1000000},{"$f":"K86 * ( 1-$F$61 )","v":0}]
[null,null,null,null,null,null,null,null,null,null,null,null,null,{"$f":"N83","v":1000000},{"$f":"O83","v":0}]
[]
[]
[null,null,null,null,null,null,null,{"$f":"MIN(Resolved_Mpx_Min, Resolved_Mpx_Max)","v":0},null,null,null,{"$f":"MAX(Resolved_Lumens_Min, Resolved_Lumens_Max)","v":0},null,0.01,10000,null,{"$f":"LOG(N90)","v":-2},4]
[null,null,null,null,null,null,null,null,{"$f":"MAX(Resolved_Mpx_Min, Resolved_Mpx_Max)","v":0},null,null,{"$f":"MAX(Resolved_Lumens_Min, Resolved_Lumens_Max)","v":0},null,100,10000,null,2,4]
[null,null,null,null,null,null,null,null,{"$f":"MAX(Resolved_Mpx_Min, Resolved_Mpx_Max)","v":0},null,{"$f":"MIN(Resolved_Lumens_Min, Resolved_Lumens_Max)","v":0},null,null,100,10,null,2,1]
[null,null,null,null,null,null,null,{"$f":"MIN(Resolved_Mpx_Min, Resolved_Mpx_Max)","v":0},null,null,{"$f":"MIN(Resolved_Lumens_Min, Resolved_Lumens_Max)","v":0},null,null,0.01,10,null,-2,1]
[null,null,null,null,null,null,null,null,null,null,null,null,null,{"$f":"N90","v":0.01},{"$f":"O90","v":10000},null,-2,4]

{"sheet":"Options","index":17,"n_rows":34,"n_cols":58,"rows_kept":34,"cut":false,"hidden":true,"merged":[[7,45,7,49],[8,12,8,15],[8,16,8,19],[8,22,8,33],[8,36,8,39],[8,40,8,43],[8,45,8,49],[7,12,7,19],[7,22,7,33],[7,36,7,43],[33,38,33,49],[9,40,9,43],[9,45,9,49],[12,11,13,49],[26,20,26,46],[17,24,17,27],[17,28,17,33],[9,22,9,33],[29,24,29,27],[29,28,29,33],[24,24,24,27],[9,12,9,15],[9,16,9,19],[9,36,9,39]]}
[]
[]
[]
[]
[]
[]
[]
[null,null,null,null,null,null,null,null,null,null,null,null,"Resolution",null,null,null,null,null,null,null,null,null,"Image Size",null,null,null,null,null,null,null,null,null,null,null,null,null,"Brightness",null,null,null,null,null,null,null,null,"# of Matching"]
[null,null,null,null,null,null,null,null,null,null,null,"Max:",{"$f":"Display_ResolutionSimple_Max","v":"-- x --"},null,null,null,{"$f":"Display_Mpx_Max","v":"-- Mpx"},null,null,null,null,"Max:",{"$f":"CONCATENATE( \"W: \", Display_ImageWidth_Max, \"  x   H: \", Display_ImageHeight_Max, \"   ( D: \", Display_ImageDiag_Max, \" )\"  )","v":"W: -- in  x   H: -- in   ( D: -- in )"},null,null,null,null,null,null,null,null,null,null,null,null,"Max:",{"$f":"Display_Lumens_Max","v":"-- lm"},null,null,null,{"$f":"Display_Nits_Max","v":"-- nits"},null,null,null,null,"Chipsets"]
[null,null,null,null,null,null,null,null,null,null,null,"Min:",{"$f":"Display_ResolutionSimple_Min","v":"-- x --"},null,null,null,{"$f":"Display_Mpx_Min","v":"-- Mpx"},null,null,null,null,"Min:",{"$f":"CONCATENATE( \"W: \", Display_ImageWidth_Min, \"  x   H: \", Display_ImageHeight_Min, \"   ( D: \", Display_ImageDiag_Min, \" )\"  )","v":"W: -- in  x   H: -- in   ( D: -- in )"},null,null,null,null,null,null,null,null,null,null,null,null,"Min:",{"$f":"Display_Lumens_Min","v":"-- lm"},null,null,null,{"$f":"Display_Nits_Min","v":"-- nits"},null,null,null,null,{"$f":"Index_Chipset_Max","v":0}]
[]
[]
[null,null,null,null,null,null,null,null,null,null,null,"Options"]
[]
[]
[]
[]
[null,null,null,null,null,null,null,null,null,null,null,null,null,null,"Default Screen Zoom Level",null,null,null,null,null,null,null,null,null,1,null,null,null,"( 25% to 200% )"]
[]
[null,null,null,null,null,null,null,null,null,null,null,null,null,null,"Default \"System Units\"",null,null,null,null,null,null,null,null,null,null,null,null,null,null,null,null,null,null,null,null,null,null,null,null,null,null,null,null,null,null,null,null,null,null,null,null,null,null,null,null,null,0]
[null,null,null,null,null,null,null,null,null,null,null,null,null,null,null,null,null,null,"inches",null,null,null,null,"• These are the units used for System calculations",null,null,null,null,null,null,null,null,null,null,null,null,null,null,null,null,null,null,null,null,null,null,null,null,null,null,null,null,null,null,null,null,null,1]
[null,null,null,null,null,null,null,null,null,null,null,null,null,null,null,null,null,null,"feet",null,null,null,null,"• All calcuation results are shown in these units",null,null,null,null,null,null,null,null,null,null,null,null,null,null,null,null,null,null,null,null,null,null,null,null,null,null,null,null,null,null,null,null,null,2]
[null,null,null,null,null,null,null,null,null,null,null,null,null,null,null,null,null,null,"meters",null,null,null,null,null,null,null,null,null,null,null,null,null,null,null,null,null,null,null,null,null,null,null,null,null,null,null,null,null,null,null,null,null,null,null,null,null,null,3]
[]
[null,null,null,null,null,null,null,null,null,null,null,null,null,null,"Default Matching Zone Tolerance",null,null,null,null,null,null,null,null,null,0.15]
[]
[null,null,null,null,null,null,null,null,null,null,null,null,null,null,"Default Print Path"]
[null,null,null,null,null,null,null,null,null,null,null,null,null,null,null,null,null,null,null,null,"(if no default path is provided, the path automatically default to directory as the SmartSelect Excel file)"]
[]
[null,null,null,null,null,null,null,null,null,null,null,null,null,null,"Open PDF after printing",null,null,null,null,null,null,null,null,null,"Yes",null,null,null,"( \"Yes\", \"No\" )"]
[]
[]
[]
[null,null,null,null,null,null,null,null,null,null,null,null,null,null,null,null,null,null,null,null,null,null,null,null,null,null,null,null,null,null,null,null,null,null,null,null,null,null,{"$f":"CONCATENATE( \"Ver. \", App_FullVersion )","v":"Ver. [[Prod]] (Smarta2xOPENv3)"}]

{"sheet":"Chipsets","index":18,"n_rows":249,"n_cols":64,"rows_kept":249,"cut":false,"hidden":true,"merged":[[134,12,135,20],[134,21,135,49],[137,12,138,20],[137,21,138,49],[143,13,145,47],[146,13,151,47],[124,12,125,20],[124,21,125,49],[127,12,129,20],[127,21,129,49],[131,12,132,20],[131,21,132,49],[114,12,114,20],[114,21,114,49],[116,12,118,20],[117,21,117,49],[118,21,118,49],[120,12,122,20],[120,21,121,49],[122,21,122,49],[105,12,109,20],[105,21,107,49],[108,21,108,49],[109,21,109,49],[111,12,112,20],[111,21,112,49],[91,12,92,20],[91,21,92,49],[94,12,96,20],[94,21,96,49],[98,12,103,20],[98,21,101,49],[102,21,102,49],[103,21,103,23],[103,24,103,49],[82,12,82,20],[82,21,82,49],[84,12,86,20],[84,21,86,49],[88,12,89,20],[88,21,89,49],[76,12,76,20],[76,21,76,49],[78,12,80,20],[78,21,78,49],[79,21,79,49],[80,21,80,49],[61,33,61,48],[63,40,63,41],[65,38,65,49],[71,12,72,20],[71,21,72,49],[74,12,74,20],[74,21,74,49],[58,11,58,19],[58,20,58,25],[58,26,58,31],[58,32,58,37],[58,38,58,43],[58,44,58,49],[57,11,57,19],[57,20,57,25],[57,26,57,31],[57,32,57,37],[57,38,57,43],[57,44,57,49],[56,11,56,19],[56,20,56,25],[56,26,56,31],[56,32,56,37],[56,38,56,43],[56,44,56,49],[55,11,55,19],[55,20,55,25],[55,26,55,31],[55,32,55,37],[55,38,55,43],[55,44,55,49],[54,11,54,19],[54,20,54,25],[54,26,54,31],[54,32,54,37],[54,38,54,43],[54,44,54,49],[53,11,53,19],[53,20,53,25],[53,26,53,31],[53,32,53,37],[53,38,53,43],[53,44,53,49],[52,11,52,19],[52,20,52,25],[52,26,52,31],[52,32,52,37],[52,38,52,43],[52,44,52,49],[51,11,51,19],[51,20,51,25],[51,26,51,31],[51,32,51,37],[51,38,51,43],[51,44,51,49],[50,11,50,19],[50,20,50,25],[50,26,50,31],[50,32,50,37],[50,38,50,43],[50,44,50,49],[49,11,49,19],[49,20,49,25],[49,26,49,31],[49,32,49,37],[49,38,49,43],[49,44,49,49],[48,11,48,19],[48,20,48,25],[48,26,48,31],[48,32,48,37],[48,38,48,43],[48,44,48,49],[47,11,47,19],[47,20,47,25],[47,26,47,31],[47,32,47,37],[47,38,47,43],[47,44,47,49],[45,11,45,19],[45,20,45,25],[45,26,45,31],[45,32,45,37],[45,38,45,43],[45,44,45,49],[44,11,44,19],[44,20,44,25],[44,26,44,31],[44,32,44,37],[44,38,44,43],[44,44,44,49],[42,11,42,19],[42,20,42,25],[42,26,42,31],[42,32,42,37],[42,38,42,43],[42,44,42,49],[41,11,41,19],[41,20,41,25],[41,26,41,31],[41,32,41,37],[41,38,41,43],[41,44,41,49],[39,63,39,69],[40,11,40,19],[40,20,40,25],[40,26,40,31],[40,32,40,37],[40,38,40,43],[40,44,40,49],[39,11,39,19],[39,20,39,25],[39,26,39,31],[39,32,39,37],[39,38,39,43],[39,44,39,49],[38,11,38,19],[38,20,38,25],[38,26,38,31],[38,32,38,37],[38,38,38,43],[38,44,38,49],[36,11,36,19],[36,20,36,25],[36,26,36,31],[36,32,36,37],[36,38,36,43],[36,44,36,49],[37,11,37,19],[35,11,35,19],[35,20,35,25],[35,26,35,31],[35,32,35,37],[35,38,35,43],[35,44,35,49],[34,11,34,19],[34,20,34,25],[34,26,34,31],[34,32,34,37],[34,38,34,43],[34,44,34,49],[33,11,33,19],[33,20,33,25],[33,26,33,31],[33,32,33,37],[33,38,33,43],[33,44,33,49],[32,11,32,19],[32,20,32,25],[32,26,32,31],[32,32,32,37],[32,38,32,43],[32,44,32,49],[31,11,31,19],[31,20,31,25],[31,26,31,31],[31,32,31,37],[31,38,31,43],[31,44,31,49],[30,11,30,19],[30,20,30,25],[30,26,30,31],[30,32,30,37],[30,38,30,43],[30,44,30,49],[29,11,29,19],[29,20,29,25],[29,26,29,31],[29,32,29,37],[29,38,29,43],[29,44,29,49],[28,11,28,19],[28,20,28,25],[28,26,28,31],[28,32,28,37],[28,38,28,43],[28,44,28,49],[27,11,27,19],[27,20,27,25],[27,26,27,31],[27,32,27,37],[27,38,27,43],[27,44,27,49],[26,11,26,19],[26,20,26,25],[26,26,26,31],[26,32,26,37],[26,38,26,43],[26,44,26,49],[25,11,25,19],[25,20,25,25],[25,26,25,31],[25,32,25,37],[25,38,25,43],[25,44,25,49],[24,11,24,19],[24,20,24,25],[24,26,24,31],[24,32,24,37],[24,38,24,43],[24,44,24,49],[23,11,23,19],[23,20,23,25],[23,26,23,31],[23,32,23,37],[23,38,23,43],[23,44,23,49],[22,11,22,19],[22,20,22,25],[22,26,22,31],[22,32,22,37],[22,38,22,43],[22,44,22,49],[21,11,21,19],[21,20,21,25],[21,26,21,31],[21,32,21,37],[21,38,21,43],[21,44,21,49],[20,11,20,19],[20,20,20,25],[20,26,20,31],[20,32,20,37],[20,38,20,43],[20,44,20,49],[19,11,19,19],[19,20,19,25],[19,26,19,31],[19,32,19,37],[19,38,19,43],[19,44,19,49],[18,11,18,19],[18,20,18,25],[18,26,18,31],[18,32,18,37],[18,38,18,43],[18,44,18,49],[17,11,17,19],[17,20,17,25],[17,26,17,31],[17,32,17,37],[17,38,17,43],[17,44,17,49],[16,11,16,19],[16,20,16,25],[16,26,16,31],[16,32,16,37],[16,38,16,43],[16,44,16,49],[15,11,15,19],[15,20,15,25],[15,26,15,31],[15,32,15,37],[15,38,15,43],[15,44,15,49],[14,11,14,19],[14,20,14,25],[14,26,14,31],[14,32,14,37],[14,38,14,43],[14,44,14,49],[13,11,13,19],[13,20,13,25],[13,26,13,31],[13,32,13,37],[13,38,13,43],[13,44,13,49],[12,11,12,19],[12,20,12,25],[12,26,12,31],[12,32,12,37],[12,38,12,43],[12,44,12,49],[9,12,9,15],[9,16,9,19],[9,22,9,33],[9,36,9,39],[9,40,9,43],[9,45,9,49],[7,12,7,19],[7,22,7,33],[7,36,7,43],[7,45,7,49],[8,12,8,15],[8,16,8,19],[8,22,8,33],[8,36,8,39],[8,40,8,43],[8,45,8,49]]}
[]
[]
[]
[]
[]
[]
[]
[null,null,null,null,null,null,null,null,null,null,null,null,"Resolution",null,null,null,null,null,null,null,null,null,"Image Size",null,null,null,null,null,null,null,null,null,null,null,null,null,"Brightness",null,null,null,null,null,null,null,null,"# of Matching"]
[null,null,null,null,null,null,null,null,null,null,null,"Max:",{"$f":"Display_ResolutionSimple_Max","v":"-- x --"},null,null,null,{"$f":"Display_Mpx_Max","v":"-- Mpx"},null,null,null,null,"Max:",{"$f":"CONCATENATE( \"W: \", Display_ImageWidth_Max, \"  x   H: \", Display_ImageHeight_Max, \"   ( D: \", Display_ImageDiag_Max, \" )\"  )","v":"W: -- in  x   H: -- in   ( D: -- in )"},null,null,null,null,null,null,null,null,null,null,null,null,"Max:",{"$f":"Display_Lumens_Max","v":"-- lm"},null,null,null,{"$f":"Display_Nits_Max","v":"-- nits"},null,null,null,null,"Chipsets"]
[null,null,null,null,null,null,null,null,null,null,null,"Min:",{"$f":"Display_ResolutionSimple_Min","v":"-- x --"},null,null,null,{"$f":"Display_Mpx_Min","v":"-- Mpx"},null,null,null,null,"Min:",{"$f":"CONCATENATE( \"W: \", Display_ImageWidth_Min, \"  x   H: \", Display_ImageHeight_Min, \"   ( D: \", Display_ImageDiag_Min, \" )\"  )","v":"W: -- in  x   H: -- in   ( D: -- in )"},null,null,null,null,null,null,null,null,null,null,null,null,"Min:",{"$f":"Display_Lumens_Min","v":"-- lm"},null,null,null,{"$f":"Display_Nits_Min","v":"-- nits"},null,null,null,null,{"$f":"Index_Chipset_Max","v":0}]
[]
[]
[null,null,null,null,null,null,null,null,null,null,null,"Chipset Number",null,null,null,null,null,null,null,null,{"$f":"( (Value_ChipsetsPage-1)*5 )+1","v":1},null,null,null,null,null,{"$f":"U13+1","v":2},null,null,null,null,null,{"$f":"AA13+1","v":3},null,null,null,null,null,{"$f":"AG13+1","v":4},null,null,null,null,null,{"$f":"AM13+1","v":5}]
[null,null,null,null,null,null,null,null,null,null,null,"Chipset Index",null,null,null,null,null,null,null,null,{"$f":"IFERROR( MATCH( U13, Array_Chipset_Index, 0 ), 0 )","v":0},null,null,null,null,null,{"$f":"IFERROR( MATCH( AA13, Array_Chipset_Index, 0 ), 0 )","v":0},null,null,null,null,null,{"$f":"IFERROR( MATCH( AG13, Array_Chipset_Index, 0 ), 0 )","v":0},null,null,null,null,null,{"$f":"IFERROR( MATCH( AM13, Array_Chipset_Index, 0 ), 0 )","v":0},null,null,null,null,null,{"$f":"IFERROR( MATCH( AS13, Array_Chipset_Index, 0 ), 0 )","v":0}]
[null,null,null,null,null,null,null,null,null,null,null,"Chipset",null,null,null,null,null,null,null,null,{"$f":"IF(U$14>0,INDEX(Table_Chipsets, $BC15,U$14+2),\"--\")","v":"--"},null,null,null,null,null,{"$f":"IF(AA$14>0,INDEX(Table_Chipsets, $BC15,AA$14+2),\"--\")","v":"--"},null,null,null,null,null,{"$f":"IF(AG$14>0,INDEX(Table_Chipsets, $BC15,AG$14+2),\"--\")","v":"--"},null,null,null,null,null,{"$f":"IF(AM$14>0,INDEX(Table_Chipsets, $BC15,AM$14+2),\"--\")","v":"--"},null,null,null,null,null,{"$f":"IF(AS$14>0,INDEX(Table_Chipsets, $BC15,AS$14+2),\"--\")","v":"--"},null,null,null,null,null,{"$f":"IF( Index_Chipset_Max>5, \"…\", \"\" )","v":""},null,null,null,{"$f":"MATCH(L15, Array_ChipsetLables, 0 )","v":2}]
[null,null,null,null,null,null,null,null,null,null,null,"DMD",null,null,null,null,null,null,null,null,{"$f":"IF(U$14>0, IF( $BD16=1, HYPERLINK( INDEX(Table_Chipsets, $BC16+1,U$14+2), INDEX(Table_Chipsets, $BC16,U$14+2)), HYPERLINK(\"\",INDEX(Table_Chipsets, $BC16,U$14+2))), HYPERLINK(\"\", \"--\") )","v":"--"},null,null,null,null,null,{"$f":"IF(AA$14>0, IF( $BE16=1, HYPERLINK( INDEX(Table_Chipsets, $BC16+1,AA$14+2), INDEX(Table_Chipsets, $BC16,AA$14+2)), HYPERLINK(\"\",INDEX(Table_Chipsets, $BC16,AA$14+2))), HYPERLINK(\"\", \"--\") )","v":"--"},null,null,null,null,null,{"$f":"IF(AG$14>0, IF( $BF16=1, HYPERLINK( INDEX(Table_Chipsets, $BC16+1,AG$14+2), INDEX(Table_Chipsets, $BC16,AG$14+2)), HYPERLINK(\"\",INDEX(Table_Chipsets, $BC16,AG$14+2))), HYPERLINK(\"\", \"--\") )","v":"--"},null,null,null,null,null,{"$f":"IF(AM$14>0, IF( $BG16=1, HYPERLINK( INDEX(Table_Chipsets, $BC16+1,AM$14+2), INDEX(Table_Chipsets, $BC16,AM$14+2)), HYPERLINK(\"\",INDEX(Table_Chipsets, $BC16,AM$14+2))), HYPERLINK(\"\", \"--\") )","v":"--"},null,null,null,null,null,{"$f":"IF(AS$14>0, IF( $BH16=1, HYPERLINK( INDEX(Table_Chipsets, $BC16+1,AS$14+2), INDEX(Table_Chipsets, $BC16,AS$14+2)), HYPERLINK(\"\",INDEX(Table_Chipsets, $BC16,AS$14+2))), HYPERLINK(\"\", \"--\") )","v":"--"},null,null,null,null,null,null,null,null,null,3,{"$f":"IF( AND( U$14>0, INDEX(Table_Chipsets, $BC16+1,U$14+2)<>\"--\"), 1, 0 )","v":0},{"$f":"IF( AND( AA$14>0, INDEX(Table_Chipsets, $BC16+1,AA$14+2)<>\"--\"), 1, 0 )","v":0},{"$f":"IF( AND( AG$14>0, INDEX(Table_Chipsets, $BC16+1,AG$14+2)<>\"--\"), 1, 0 )","v":0},{"$f":"IF( AND( AM$14>0, INDEX(Table_Chipsets, $BC16+1,AM$14+2)<>\"--\"), 1, 0 )","v":0},{"$f":"IF( AND( AS$14>0, INDEX(Table_Chipsets, $BC16+1,AS$14+2)<>\"--\"), 1, 0 )","v":0}]
[null,null,null,null,null,null,null,null,null,null,null,"Micromirror Array Diagonal",null,null,null,null,null,null,null,null,{"$f":"IF(U$14>0,INDEX(Table_Chipsets, $BC17,U$14+2),\"--\")","v":"--"},null,null,null,null,null,"--",null,null,null,null,null,"--",null,null,null,null,null,"--",null,null,null,null,null,"--",null,null,null,null,null,null,null,null,null,{"$f":"MATCH(L17, Array_ChipsetLables, 0 )","v":5}]
[null,null,null,null,null,null,null,null,null,null,null,"Display Resolution",null,null,null,null,null,null,null,null,{"$f":"IF(U$14>0,INDEX(Table_Chipsets, $BC18,U$14+2),\"--\")","v":"--"},null,null,null,null,null,"--",null,null,null,null,null,"--",null,null,null,null,null,"--",null,null,null,null,null,"--",null,null,null,null,null,null,null,null,null,{"$f":"MATCH(L18, Array_ChipsetLables, 0 )","v":9}]
[null,null,null,null,null,null,null,null,null,null,null,"Display Standard",null,null,null,null,null,null,null,null,"--",null,null,null,null,null,"--",null,null,null,null,null,"--",null,null,null,null,null,"--",null,null,null,null,null,"--",null,null,null,null,null,null,null,null,null,10]
[null,null,null,null,null,null,null,null,null,null,null,"Micromirror Pitch",null,null,null,null,null,null,null,null,"--",null,null,null,null,null,"--",null,null,null,null,null,"--",null,null,null,null,null,"--",null,null,null,null,null,"--",null,null,null,null,null,null,null,null,null,11]
[null,null,null,null,null,null,null,null,null,null,null,"Micromirror Tilt Angle",null,null,null,null,null,null,null,null,"--",null,null,null,null,null,"--",null,null,null,null,null,"--",null,null,null,null,null,"--",null,null,null,null,null,"--",null,null,null,null,null,null,null,null,null,12]
[null,null,null,null,null,null,null,null,null,null,null,"Micromirror Orientation",null,null,null,null,null,null,null,null,"--",null,null,null,null,null,"--",null,null,null,null,null,"--",null,null,null,null,null,"--",null,null,null,null,null,"--",null,null,null,null,null,null,null,null,null,13]
[null,null,null,null,null,null,null,null,null,null,null,"Illumination Direction",null,null,null,null,null,null,null,null,"--",null,null,null,null,null,"--",null,null,null,null,null,"--",null,null,null,null,null,"--",null,null,null,null,null,"--",null,null,null,null,null,null,null,null,null,14]
[null,null,null,null,null,null,null,null,null,null,null,"DMD Package Size [ mm ]",null,null,null,null,null,null,null,null,"--",null,null,null,null,null,"--",null,null,null,null,null,"--",null,null,null,null,null,"--",null,null,null,null,null,"--",null,null,null,null,null,null,null,null,null,15]
[null,null,null,null,null,null,null,null,null,null,null,"Automotive Qualified",null,null,null,null,null,null,null,null,"--",null,null,null,null,null,"--",null,null,null,null,null,"--",null,null,null,null,null,"--",null,null,null,null,null,"--",null,null,null,null,null,null,null,null,null,15]
[null,null,null,null,null,null,null,null,null,null,null,"DMD Price & Availability",null,null,null,null,null,null,null,null,{"$f":"IF(U$14>0, IF( $BD26=1, HYPERLINK( INDEX(Table_Chipsets, $BC26+1,U$14+2), INDEX(Table_Chipsets, $BC26,U$14+2)), HYPERLINK(\"\",INDEX(Table_Chipsets, $BC26,U$14+2))), HYPERLINK(\"\", \"--\") )","v":"--"},null,null,null,null,null,{"$f":"IF(AA$14>0, IF( $BE26=1, HYPERLINK( INDEX(Table_Chipsets, $BC26+1,AA$14+2), INDEX(Table_Chipsets, $BC26,AA$14+2)), HYPERLINK(\"\",INDEX(Table_Chipsets, $BC26,AA$14+2))), HYPERLINK(\"\", \"--\") )","v":"--"},null,null,null,null,null,{"$f":"IF(AG$14>0, IF( $BF26=1, HYPERLINK( INDEX(Table_Chipsets, $BC26+1,AG$14+2), INDEX(Table_Chipsets, $BC26,AG$14+2)), HYPERLINK(\"\",INDEX(Table_Chipsets, $BC26,AG$14+2))), HYPERLINK(\"\", \"--\") )","v":"--"},null,null,null,null,null,{"$f":"IF(AM$14>0, IF( $BG26=1, HYPERLINK( INDEX(Table_Chipsets, $BC26+1,AM$14+2), INDEX(Table_Chipsets, $BC26,AM$14+2)), HYPERLINK(\"\",INDEX(Table_Chipsets, $BC26,AM$14+2))), HYPERLINK(\"\", \"--\") )","v":"--"},null,null,null,null,null,{"$f":"IF(AS$14>0, IF( $BH26=1, HYPERLINK( INDEX(Table_Chipsets, $BC26+1,AS$14+2), INDEX(Table_Chipsets, $BC26,AS$14+2)), HYPERLINK(\"\",INDEX(Table_Chipsets, $BC26,AS$14+2))), HYPERLINK(\"\", \"--\") )","v":"--"},null,null,null,null,null,null,null,null,null,17,{"$f":"IF( AND( U$14>0, INDEX(Table_Chipsets, $BC26+1,U$14+2)<>\"--\"), 1, 0 )","v":0},{"$f":"IF( AND( AA$14>0, INDEX(Table_Chipsets, $BC26+1,AA$14+2)<>\"--\"), 1, 0 )","v":0},{"$f":"IF( AND( AG$14>0, INDEX(Table_Chipsets, $BC26+1,AG$14+2)<>\"--\"), 1, 0 )","v":0},{"$f":"IF( AND( AM$14>0, INDEX(Table_Chipsets, $BC26+1,AM$14+2)<>\"--\"), 1, 0 )","v":0},{"$f":"IF( AND( AS$14>0, INDEX(Table_Chipsets, $BC26+1,AS$14+2)<>\"--\"), 1, 0 )","v":0}]
[]
[null,null,null,null,null,null,null,null,null,null,null,"Typical Brightness",null,null,null,null,null,null,null,null,{"$f":"IF(U$14>0,INDEX(Table_Chipsets, $BC28,U$14+2),\"--\")","v":"--"},null,null,null,null,null,{"$f":"IF(AA$14>0,INDEX(Table_Chipsets, $BC28,AA$14+2),\"--\")","v":"--"},null,null,null,null,null,{"$f":"IF(AG$14>0,INDEX(Table_Chipsets, $BC28,AG$14+2),\"--\")","v":"--"},null,null,null,null,null,{"$f":"IF(AM$14>0,INDEX(Table_Chipsets, $BC28,AM$14+2),\"--\")","v":"--"},null,null,null,null,null,{"$f":"IF(AS$14>0,INDEX(Table_Chipsets, $BC28,AS$14+2),\"--\")","v":"--"},null,null,null,null,null,null,null,null,null,21]
[null,null,null,null,null,null,null,null,null,null,null,"Typical Illumination Power",null,null,null,null,null,null,null,null,{"$f":"IF(U$14>0,INDEX(Table_Chipsets, $BC29,U$14+2),\"--\")","v":"--"},null,null,null,null,null,{"$f":"IF(AA$14>0,INDEX(Table_Chipsets, $BC29,AA$14+2),\"--\")","v":"--"},null,null,null,null,null,{"$f":"IF(AG$14>0,INDEX(Table_Chipsets, $BC29,AG$14+2),\"--\")","v":"--"},null,null,null,null,null,{"$f":"IF(AM$14>0,INDEX(Table_Chipsets, $BC29,AM$14+2),\"--\")","v":"--"},null,null,null,null,null,{"$f":"IF(AS$14>0,INDEX(Table_Chipsets, $BC29,AS$14+2),\"--\")","v":"--"},null,null,null,null,null,null,null,null,null,22]
[]
[null,null,null,null,null,null,null,null,null,null,null,"Controller",null,null,null,null,null,null,null,null,{"$f":"IF(U$14>0, IF( $BD31=1, HYPERLINK( INDEX(Table_Chipsets, $BC31+1,U$14+2), INDEX(Table_Chipsets, $BC31,U$14+2)), HYPERLINK(\"\",INDEX(Table_Chipsets, $BC31,U$14+2))), HYPERLINK(\"\", \"--\") )","v":"--"},null,null,null,null,null,{"$f":"IF(AA$14>0, IF( $BE31=1, HYPERLINK( INDEX(Table_Chipsets, $BC31+1,AA$14+2), INDEX(Table_Chipsets, $BC31,AA$14+2)), HYPERLINK(\"\",INDEX(Table_Chipsets, $BC31,AA$14+2))), HYPERLINK(\"\", \"--\") )","v":"--"},null,null,null,null,null,{"$f":"IF(AG$14>0, IF( $BF31=1, HYPERLINK( INDEX(Table_Chipsets, $BC31+1,AG$14+2), INDEX(Table_Chipsets, $BC31,AG$14+2)), HYPERLINK(\"\",INDEX(Table_Chipsets, $BC31,AG$14+2))), HYPERLINK(\"\", \"--\") )","v":"--"},null,null,null,null,null,{"$f":"IF(AM$14>0, IF( $BG31=1, HYPERLINK( INDEX(Table_Chipsets, $BC31+1,AM$14+2), INDEX(Table_Chipsets, $BC31,AM$14+2)), HYPERLINK(\"\",INDEX(Table_Chipsets, $BC31,AM$14+2))), HYPERLINK(\"\", \"--\") )","v":"--"},null,null,null,null,null,{"$f":"IF(AS$14>0, IF( $BH31=1, HYPERLINK( INDEX(Table_Chipsets, $BC31+1,AS$14+2), INDEX(Table_Chipsets, $BC31,AS$14+2)), HYPERLINK(\"\",INDEX(Table_Chipsets, $BC31,AS$14+2))), HYPERLINK(\"\", \"--\") )","v":"--"},null,null,null,null,null,null,null,null,null,23,{"$f":"IF( AND( U$14>0, INDEX(Table_Chipsets, $BC31+1,U$14+2)<>\"--\"), 1, 0 )","v":0},{"$f":"IF( AND( AA$14>0, INDEX(Table_Chipsets, $BC31+1,AA$14+2)<>\"--\"), 1, 0 )","v":0},{"$f":"IF( AND( AG$14>0, INDEX(Table_Chipsets, $BC31+1,AG$14+2)<>\"--\"), 1, 0 )","v":0},{"$f":"IF( AND( AM$14>0, INDEX(Table_Chipsets, $BC31+1,AM$14+2)<>\"--\"), 1, 0 )","v":0},{"$f":"IF( AND( AS$14>0, INDEX(Table_Chipsets, $BC31+1,AS$14+2)<>\"--\"), 1, 0 )","v":0}]
[null,null,null,null,null,null,null,null,null,null,null,"Frame Refresh Rate",null,null,null,null,null,null,null,null,{"$f":"IF(U$14>0,INDEX(Table_Chipsets, $BC32,U$14+2),\"--\")","v":"--"},null,null,null,null,null,{"$f":"IF(AA$14>0,INDEX(Table_Chipsets, $BC32,AA$14+2),\"--\")","v":"--"},null,null,null,null,null,{"$f":"IF(AG$14>0,INDEX(Table_Chipsets, $BC32,AG$14+2),\"--\")","v":"--"},null,null,null,null,null,{"$f":"IF(AM$14>0,INDEX(Table_Chipsets, $BC32,AM$14+2),\"--\")","v":"--"},null,null,null,null,null,{"$f":"IF(AS$14>0,INDEX(Table_Chipsets, $BC32,AS$14+2),\"--\")","v":"--"},null,null,null,null,null,null,null,null,null,26]
[null,null,null,null,null,null,null,null,null,null,null,"DLP IntelliBright™ Algorithms",null,null,null,null,null,null,null,null,"--",null,null,null,null,null,"--",null,null,null,null,null,"--",null,null,null,null,null,"--",null,null,null,null,null,"--",null,null,null,null,null,null,null,null,null,27]
[null,null,null,null,null,null,null,null,null,null,null,"Keystone Correction",null,null,null,null,null,null,null,null,"--",null,null,null,null,null,"--",null,null,null,null,null,"--",null,null,null,null,null,"--",null,null,null,null,null,"--",null,null,null,null,null,null,null,null,null,28]
[null,null,null,null,null,null,null,null,null,null,null,"Controller Package Size [ mm ]",null,null,null,null,null,null,null,null,"--",null,null,null,null,null,"--",null,null,null,null,null,"--",null,null,null,null,null,"--",null,null,null,null,null,"--",null,null,null,null,null,null,null,null,null,29]
[null,null,null,null,null,null,null,null,null,null,null,"Controller Price & Availability",null,null,null,null,null,null,null,null,{"$f":"IF(U$14>0, IF( $BD36=1, HYPERLINK( INDEX(Table_Chipsets, $BC36+1,U$14+2), INDEX(Table_Chipsets, $BC36,U$14+2)), HYPERLINK(\"\",INDEX(Table_Chipsets, $BC36,U$14+2))), HYPERLINK(\"\", \"--\") )","v":"--"},null,null,null,null,null,{"$f":"IF(AA$14>0, IF( $BE36=1, HYPERLINK( INDEX(Table_Chipsets, $BC36+1,AA$14+2), INDEX(Table_Chipsets, $BC36,AA$14+2)), HYPERLINK(\"\",INDEX(Table_Chipsets, $BC36,AA$14+2))), HYPERLINK(\"\", \"--\") )","v":"--"},null,null,null,null,null,{"$f":"IF(AG$14>0, IF( $BF36=1, HYPERLINK( INDEX(Table_Chipsets, $BC36+1,AG$14+2), INDEX(Table_Chipsets, $BC36,AG$14+2)), HYPERLINK(\"\",INDEX(Table_Chipsets, $BC36,AG$14+2))), HYPERLINK(\"\", \"--\") )","v":"--"},null,null,null,null,null,{"$f":"IF(AM$14>0, IF( $BG36=1, HYPERLINK( INDEX(Table_Chipsets, $BC36+1,AM$14+2), INDEX(Table_Chipsets, $BC36,AM$14+2)), HYPERLINK(\"\",INDEX(Table_Chipsets, $BC36,AM$14+2))), HYPERLINK(\"\", \"--\") )","v":"--"},null,null,null,null,null,{"$f":"IF(AS$14>0, IF( $BH36=1, HYPERLINK( INDEX(Table_Chipsets, $BC36+1,AS$14+2), INDEX(Table_Chipsets, $BC36,AS$14+2)), HYPERLINK(\"\",INDEX(Table_Chipsets, $BC36,AS$14+2))), HYPERLINK(\"\", \"--\") )","v":"--"},null,null,null,null,null,null,null,null,null,30,{"$f":"IF( AND( U$14>0, INDEX(Table_Chipsets, $BC36+1,U$14+2)<>\"--\"), 1, 0 )","v":0},{"$f":"IF( AND( AA$14>0, INDEX(Table_Chipsets, $BC36+1,AA$14+2)<>\"--\"), 1, 0 )","v":0},{"$f":"IF( AND( AG$14>0, INDEX(Table_Chipsets, $BC36+1,AG$14+2)<>\"--\"), 1, 0 )","v":0},{"$f":"IF( AND( AM$14>0, INDEX(Table_Chipsets, $BC36+1,AM$14+2)<>\"--\"), 1, 0 )","v":0},{"$f":"IF( AND( AS$14>0, INDEX(Table_Chipsets, $BC36+1,AS$14+2)<>\"--\"), 1, 0 )","v":0}]
[]
[null,null,null,null,null,null,null,null,null,null,null,"Power Management IC"]
[null,null,null,null,null,null,null,null,null,null,null,"DLPA1000 ( up to 1A )",null,null,null,null,null,null,null,null,{"$f":"IF(U$14>0, IF( $BD39=1, HYPERLINK( INDEX(Table_Chipsets, $BC39+1,U$14+2), INDEX(Table_Chipsets, $BC39,U$14+2)), HYPERLINK(\"\",INDEX(Table_Chipsets, $BC39,U$14+2))), HYPERLINK(\"\", \"--\") )","v":"--"},null,null,null,null,null,{"$f":"IF(AA$14>0, IF( $BE39=1, HYPERLINK( INDEX(Table_Chipsets, $BC39+1,AA$14+2), INDEX(Table_Chipsets, $BC39,AA$14+2)), HYPERLINK(\"\",INDEX(Table_Chipsets, $BC39,AA$14+2))), HYPERLINK(\"\", \"--\") )","v":"--"},null,null,null,null,null,{"$f":"IF(AG$14>0, IF( $BF39=1, HYPERLINK( INDEX(Table_Chipsets, $BC39+1,AG$14+2), INDEX(Table_Chipsets, $BC39,AG$14+2)), HYPERLINK(\"\",INDEX(Table_Chipsets, $BC39,AG$14+2))), HYPERLINK(\"\", \"--\") )","v":"--"},null,null,null,null,null,{"$f":"IF(AM$14>0, IF( $BG39=1, HYPERLINK( INDEX(Table_Chipsets, $BC39+1,AM$14+2), INDEX(Table_Chipsets, $BC39,AM$14+2)), HYPERLINK(\"\",INDEX(Table_Chipsets, $BC39,AM$14+2))), HYPERLINK(\"\", \"--\") )","v":"--"},null,null,null,null,null,{"$f":"IF(AS$14>0, IF( $BH39=1, HYPERLINK( INDEX(Table_Chipsets, $BC39+1,AS$14+2), INDEX(Table_Chipsets, $BC39,AS$14+2)), HYPERLINK(\"\",INDEX(Table_Chipsets, $BC39,AS$14+2))), HYPERLINK(\"\", \"--\") )","v":"--"},null,null,null,null,null,null,null,null,null,{"$f":"MATCH(L39, Array_ChipsetLables, 0 )","v":36},{"$f":"IF( AND( U$14>0, INDEX(Table_Chipsets, $BC39+1,U$14+2)<>\"--\"), 1, 0 )","v":0},{"$f":"IF( AND( AA$14>0, INDEX(Table_Chipsets, $BC39+1,AA$14+2)<>\"--\"), 1, 0 )","v":0},{"$f":"IF( AND( AG$14>0, INDEX(Table_Chipsets, $BC39+1,AG$14+2)<>\"--\"), 1, 0 )","v":0},{"$f":"IF( AND( AM$14>0, INDEX(Table_Chipsets, $BC39+1,AM$14+2)<>\"--\"), 1, 0 )","v":0},{"$f":"IF( AND( AS$14>0, INDEX(Table_Chipsets, $BC39+1,AS$14+2)<>\"--\"), 1, 0 )","v":0}]
[null,null,null,null,null,null,null,null,null,null,null,"DLPA2000 ( up to 750mA )",null,null,null,null,null,null,null,null,{"$f":"IF(U$14>0, IF( $BD40=1, HYPERLINK( INDEX(Table_Chipsets, $BC40+1,U$14+2), INDEX(Table_Chipsets, $BC40,U$14+2)), HYPERLINK(\"\",INDEX(Table_Chipsets, $BC40,U$14+2))), HYPERLINK(\"\", \"--\") )","v":"--"},null,null,null,null,null,{"$f":"IF(AA$14>0, IF( $BE40=1, HYPERLINK( INDEX(Table_Chipsets, $BC40+1,AA$14+2), INDEX(Table_Chipsets, $BC40,AA$14+2)), HYPERLINK(\"\",INDEX(Table_Chipsets, $BC40,AA$14+2))), HYPERLINK(\"\", \"--\") )","v":"--"},null,null,null,null,null,{"$f":"IF(AG$14>0, IF( $BF40=1, HYPERLINK( INDEX(Table_Chipsets, $BC40+1,AG$14+2), INDEX(Table_Chipsets, $BC40,AG$14+2)), HYPERLINK(\"\",INDEX(Table_Chipsets, $BC40,AG$14+2))), HYPERLINK(\"\", \"--\") )","v":"--"},null,null,null,null,null,{"$f":"IF(AM$14>0, IF( $BG40=1, HYPERLINK( INDEX(Table_Chipsets, $BC40+1,AM$14+2), INDEX(Table_Chipsets, $BC40,AM$14+2)), HYPERLINK(\"\",INDEX(Table_Chipsets, $BC40,AM$14+2))), HYPERLINK(\"\", \"--\") )","v":"--"},null,null,null,null,null,{"$f":"IF(AS$14>0, IF( $BH40=1, HYPERLINK( INDEX(Table_Chipsets, $BC40+1,AS$14+2), INDEX(Table_Chipsets, $BC40,AS$14+2)), HYPERLINK(\"\",INDEX(Table_Chipsets, $BC40,AS$14+2))), HYPERLINK(\"\", \"--\") )","v":"--"},null,null,null,null,null,null,null,null,null,{"$f":"MATCH(L40, Array_ChipsetLables, 0 )","v":38},{"$f":"IF( AND( U$14>0, INDEX(Table_Chipsets, $BC40+1,U$14+2)<>\"--\"), 1, 0 )","v":0},{"$f":"IF( AND( AA$14>0, INDEX(Table_Chipsets, $BC40+1,AA$14+2)<>\"--\"), 1, 0 )","v":0},{"$f":"IF( AND( AG$14>0, INDEX(Table_Chipsets, $BC40+1,AG$14+2)<>\"--\"), 1, 0 )","v":0},{"$f":"IF( AND( AM$14>0, INDEX(Table_Chipsets, $BC40+1,AM$14+2)<>\"--\"), 1, 0 )","v":0},{"$f":"IF( AND( AS$14>0, INDEX(Table_Chipsets, $BC40+1,AS$14+2)<>\"--\"), 1, 0 )","v":0},null,null,null,{"$f":"HYPERLINK(\"\",\"abc\")","v":"abc"}]
[null,null,null,null,null,null,null,null,null,null,null,"DLPA2005 ( up to 2.4A )",null,null,null,null,null,null,null,null,{"$f":"IF(U$14>0, IF( $BD41=1, HYPERLINK( INDEX(Table_Chipsets, $BC41+1,U$14+2), INDEX(Table_Chipsets, $BC41,U$14+2)), HYPERLINK(\"\",INDEX(Table_Chipsets, $BC41,U$14+2))), HYPERLINK(\"\", \"--\") )","v":"--"},null,null,null,null,null,{"$f":"IF(AA$14>0, IF( $BE41=1, HYPERLINK( INDEX(Table_Chipsets, $BC41+1,AA$14+2), INDEX(Table_Chipsets, $BC41,AA$14+2)), HYPERLINK(\"\",INDEX(Table_Chipsets, $BC41,AA$14+2))), HYPERLINK(\"\", \"--\") )","v":"--"},null,null,null,null,null,{"$f":"IF(AG$14>0, IF( $BF41=1, HYPERLINK( INDEX(Table_Chipsets, $BC41+1,AG$14+2), INDEX(Table_Chipsets, $BC41,AG$14+2)), HYPERLINK(\"\",INDEX(Table_Chipsets, $BC41,AG$14+2))), HYPERLINK(\"\", \"--\") )","v":"--"},null,null,null,null,null,{"$f":"IF(AM$14>0, IF( $BG41=1, HYPERLINK( INDEX(Table_Chipsets, $BC41+1,AM$14+2), INDEX(Table_Chipsets, $BC41,AM$14+2)), HYPERLINK(\"\",INDEX(Table_Chipsets, $BC41,AM$14+2))), HYPERLINK(\"\", \"--\") )","v":"--"},null,null,null,null,null,{"$f":"IF(AS$14>0, IF( $BH41=1, HYPERLINK( INDEX(Table_Chipsets, $BC41+1,AS$14+2), INDEX(Table_Chipsets, $BC41,AS$14+2)), HYPERLINK(\"\",INDEX(Table_Chipsets, $BC41,AS$14+2))), HYPERLINK(\"\", \"--\") )","v":"--"},null,null,null,null,null,null,null,null,null,{"$f":"MATCH(L41, Array_ChipsetLables, 0 )","v":40},{"$f":"IF( AND( U$14>0, INDEX(Table_Chipsets, $BC41+1,U$14+2)<>\"--\"), 1, 0 )","v":0},{"$f":"IF( AND( AA$14>0, INDEX(Table_Chipsets, $BC41+1,AA$14+2)<>\"--\"), 1, 0 )","v":0},{"$f":"IF( AND( AG$14>0, INDEX(Table_Chipsets, $BC41+1,AG$14+2)<>\"--\"), 1, 0 )","v":0},{"$f":"IF( AND( AM$14>0, INDEX(Table_Chipsets, $BC41+1,AM$14+2)<>\"--\"), 1, 0 )","v":0},{"$f":"IF( AND( AS$14>0, INDEX(Table_Chipsets, $BC41+1,AS$14+2)<>\"--\"), 1, 0 )","v":0}]
[null,null,null,null,null,null,null,null,null,null,null,"DLPA3000 ( up to 6A )",null,null,null,null,null,null,null,null,{"$f":"IF(U$14>0, IF( $BD42=1, HYPERLINK( INDEX(Table_Chipsets, $BC42+1,U$14+2), INDEX(Table_Chipsets, $BC42,U$14+2)), HYPERLINK(\"\",INDEX(Table_Chipsets, $BC42,U$14+2))), HYPERLINK(\"\", \"--\") )","v":"--"},null,null,null,null,null,{"$f":"IF(AA$14>0, IF( $BE42=1, HYPERLINK( INDEX(Table_Chipsets, $BC42+1,AA$14+2), INDEX(Table_Chipsets, $BC42,AA$14+2)), HYPERLINK(\"\",INDEX(Table_Chipsets, $BC42,AA$14+2))), HYPERLINK(\"\", \"--\") )","v":"--"},null,null,null,null,null,{"$f":"IF(AG$14>0, IF( $BF42=1, HYPERLINK( INDEX(Table_Chipsets, $BC42+1,AG$14+2), INDEX(Table_Chipsets, $BC42,AG$14+2)), HYPERLINK(\"\",INDEX(Table_Chipsets, $BC42,AG$14+2))), HYPERLINK(\"\", \"--\") )","v":"--"},null,null,null,null,null,{"$f":"IF(AM$14>0, IF( $BG42=1, HYPERLINK( INDEX(Table_Chipsets, $BC42+1,AM$14+2), INDEX(Table_Chipsets, $BC42,AM$14+2)), HYPERLINK(\"\",INDEX(Table_Chipsets, $BC42,AM$14+2))), HYPERLINK(\"\", \"--\") )","v":"--"},null,null,null,null,null,{"$f":"IF(AS$14>0, IF( $BH42=1, HYPERLINK( INDEX(Table_Chipsets, $BC42+1,AS$14+2), INDEX(Table_Chipsets, $BC42,AS$14+2)), HYPERLINK(\"\",INDEX(Table_Chipsets, $BC42,AS$14+2))), HYPERLINK(\"\", \"--\") )","v":"--"},null,null,null,null,null,null,null,null,null,{"$f":"MATCH(L42, Array_ChipsetLables, 0 )","v":42},{"$f":"IF( AND( U$14>0, INDEX(Table_Chipsets, $BC42+1,U$14+2)<>\"--\"), 1, 0 )","v":0},{"$f":"IF( AND( AA$14>0, INDEX(Table_Chipsets, $BC42+1,AA$14+2)<>\"--\"), 1, 0 )","v":0},{"$f":"IF( AND( AG$14>0, INDEX(Table_Chipsets, $BC42+1,AG$14+2)<>\"--\"), 1, 0 )","v":0},{"$f":"IF( AND( AM$14>0, INDEX(Table_Chipsets, $BC42+1,AM$14+2)<>\"--\"), 1, 0 )","v":0},{"$f":"IF( AND( AS$14>0, INDEX(Table_Chipsets, $BC42+1,AS$14+2)<>\"--\"), 1, 0 )","v":0}]
[null,null,null,null,null,null,null,null,null,null,null,"DLPA3005 ( up to 16A )",null,null,null,null,null,null,null,null,{"$f":"IF(U$14>0, IF( $BD43=1, HYPERLINK( INDEX(Table_Chipsets, $BC43+1,U$14+2), INDEX(Table_Chipsets, $BC43,U$14+2)), HYPERLINK(\"\",INDEX(Table_Chipsets, $BC43,U$14+2))), HYPERLINK(\"\", \"--\") )","v":"--"},null,null,null,null,null,{"$f":"IF(AA$14>0, IF( $BE43=1, HYPERLINK( INDEX(Table_Chipsets, $BC43+1,AA$14+2), INDEX(Table_Chipsets, $BC43,AA$14+2)), HYPERLINK(\"\",INDEX(Table_Chipsets, $BC43,AA$14+2))), HYPERLINK(\"\", \"--\") )","v":"--"},null,null,null,null,null,{"$f":"IF(AG$14>0, IF( $BF43=1, HYPERLINK( INDEX(Table_Chipsets, $BC43+1,AG$14+2), INDEX(Table_Chipsets, $BC43,AG$14+2)), HYPERLINK(\"\",INDEX(Table_Chipsets, $BC43,AG$14+2))), HYPERLINK(\"\", \"--\") )","v":"--"},null,null,null,null,null,{"$f":"IF(AM$14>0, IF( $BG43=1, HYPERLINK( INDEX(Table_Chipsets, $BC43+1,AM$14+2), INDEX(Table_Chipsets, $BC43,AM$14+2)), HYPERLINK(\"\",INDEX(Table_Chipsets, $BC43,AM$14+2))), HYPERLINK(\"\", \"--\") )","v":"--"},null,null,null,null,null,{"$f":"IF(AS$14>0, IF( $BH43=1, HYPERLINK( INDEX(Table_Chipsets, $BC43+1,AS$14+2), INDEX(Table_Chipsets, $BC43,AS$14+2)), HYPERLINK(\"\",INDEX(Table_Chipsets, $BC43,AS$14+2))), HYPERLINK(\"\", \"--\") )","v":"--"},null,null,null,null,null,null,null,null,null,{"$f":"MATCH(L43, Array_ChipsetLables, 0 )","v":44},{"$f":"IF( AND( U$14>0, INDEX(Table_Chipsets, $BC43+1,U$14+2)<>\"--\"), 1, 0 )","v":0},{"$f":"IF( AND( AA$14>0, INDEX(Table_Chipsets, $BC43+1,AA$14+2)<>\"--\"), 1, 0 )","v":0},{"$f":"IF( AND( AG$14>0, INDEX(Table_Chipsets, $BC43+1,AG$14+2)<>\"--\"), 1, 0 )","v":0},{"$f":"IF( AND( AM$14>0, INDEX(Table_Chipsets, $BC43+1,AM$14+2)<>\"--\"), 1, 0 )","v":0},{"$f":"IF( AND( AS$14>0, INDEX(Table_Chipsets, $BC43+1,AS$14+2)<>\"--\"), 1, 0 )","v":0}]
[]
[null,null,null,null,null,null,null,null,null,null,null,"Evaluation Module ( EVM )",null,null,null,null,null,null,null,null,{"$f":"IF(U$14>0, IF( $BD45=1, HYPERLINK( INDEX(Table_Chipsets, $BC45+1,U$14+2), INDEX(Table_Chipsets, $BC45,U$14+2)), HYPERLINK(\"\",INDEX(Table_Chipsets, $BC45,U$14+2))), HYPERLINK(\"\", \"--\") )","v":"--"},null,null,null,null,null,{"$f":"IF(AA$14>0, IF( $BE45=1, HYPERLINK( INDEX(Table_Chipsets, $BC45+1,AA$14+2), INDEX(Table_Chipsets, $BC45,AA$14+2)), HYPERLINK(\"\",INDEX(Table_Chipsets, $BC45,AA$14+2))), HYPERLINK(\"\", \"--\") )","v":"--"},null,null,null,null,null,{"$f":"IF(AG$14>0, IF( $BF45=1, HYPERLINK( INDEX(Table_Chipsets, $BC45+1,AG$14+2), INDEX(Table_Chipsets, $BC45,AG$14+2)), HYPERLINK(\"\",INDEX(Table_Chipsets, $BC45,AG$14+2))), HYPERLINK(\"\", \"--\") )","v":"--"},null,null,null,null,null,{"$f":"IF(AM$14>0, IF( $BG45=1, HYPERLINK( INDEX(Table_Chipsets, $BC45+1,AM$14+2), INDEX(Table_Chipsets, $BC45,AM$14+2)), HYPERLINK(\"\",INDEX(Table_Chipsets, $BC45,AM$14+2))), HYPERLINK(\"\", \"--\") )","v":"--"},null,null,null,null,null,{"$f":"IF(AS$14>0, IF( $BH45=1, HYPERLINK( INDEX(Table_Chipsets, $BC45+1,AS$14+2), INDEX(Table_Chipsets, $BC45,AS$14+2)), HYPERLINK(\"\",INDEX(Table_Chipsets, $BC45,AS$14+2))), HYPERLINK(\"\", \"--\") )","v":"--"},null,null,null,null,null,null,null,null,null,{"$f":"MATCH(L45, Array_ChipsetLables, 0 )","v":32},{"$f":"IF( AND( U$14>0, INDEX(Table_Chipsets, $BC45+1,U$14+2)<>\"--\"), 1, 0 )","v":0},{"$f":"IF( AND( AA$14>0, INDEX(Table_Chipsets, $BC45+1,AA$14+2)<>\"--\"), 1, 0 )","v":0},{"$f":"IF( AND( AG$14>0, INDEX(Table_Chipsets, $BC45+1,AG$14+2)<>\"--\"), 1, 0 )","v":0},{"$f":"IF( AND( AM$14>0, INDEX(Table_Chipsets, $BC45+1,AM$14+2)<>\"--\"), 1, 0 )","v":0},{"$f":"IF( AND( AS$14>0, INDEX(Table_Chipsets, $BC45+1,AS$14+2)<>\"--\"), INDEX(Table_Chipsets, $BC45+1,AS$14+2), 0 )","v":0}]
[null,null,null,null,null,null,null,null,null,null,null,"TI Reference Design",null,null,null,null,null,null,null,null,{"$f":"IF(U$14>0, IF( $BD46=1, HYPERLINK( INDEX(Table_Chipsets, $BC46+1,U$14+2), INDEX(Table_Chipsets, $BC46,U$14+2)), HYPERLINK(\"\",INDEX(Table_Chipsets, $BC46,U$14+2))), HYPERLINK(\"\", \"--\") )","v":"--"},null,null,null,null,null,{"$f":"IF(AA$14>0, IF( $BE46=1, HYPERLINK( INDEX(Table_Chipsets, $BC46+1,AA$14+2), INDEX(Table_Chipsets, $BC46,AA$14+2)), HYPERLINK(\"\",INDEX(Table_Chipsets, $BC46,AA$14+2))), HYPERLINK(\"\", \"--\") )","v":"--"},null,null,null,null,null,{"$f":"IF(AG$14>0, IF( $BF46=1, HYPERLINK( INDEX(Table_Chipsets, $BC46+1,AG$14+2), INDEX(Table_Chipsets, $BC46,AG$14+2)), HYPERLINK(\"\",INDEX(Table_Chipsets, $BC46,AG$14+2))), HYPERLINK(\"\", \"--\") )","v":"--"},null,null,null,null,null,{"$f":"IF(AM$14>0, IF( $BG46=1, HYPERLINK( INDEX(Table_Chipsets, $BC46+1,AM$14+2), INDEX(Table_Chipsets, $BC46,AM$14+2)), HYPERLINK(\"\",INDEX(Table_Chipsets, $BC46,AM$14+2))), HYPERLINK(\"\", \"--\") )","v":"--"},null,null,null,null,null,{"$f":"IF(AS$14>0, IF( $BH46=1, HYPERLINK( INDEX(Table_Chipsets, $BC46+1,AS$14+2), INDEX(Table_Chipsets, $BC46,AS$14+2)), HYPERLINK(\"\",INDEX(Table_Chipsets, $BC46,AS$14+2))), HYPERLINK(\"\", \"--\") )","v":"--"},null,null,null,null,null,null,null,null,null,{"$f":"MATCH(L46, Array_ChipsetLables, 0 )","v":34},{"$f":"IF( AND( U$14>0, INDEX(Table_Chipsets, $BC46+1,U$14+2)<>\"--\"), 1, 0 )","v":0},{"$f":"IF( AND( AA$14>0, INDEX(Table_Chipsets, $BC46+1,AA$14+2)<>\"--\"), 1, 0 )","v":0},{"$f":"IF( AND( AG$14>0, INDEX(Table_Chipsets, $BC46+1,AG$14+2)<>\"--\"), 1, 0 )","v":0},{"$f":"IF( AND( AM$14>0, INDEX(Table_Chipsets, $BC46+1,AM$14+2)<>\"--\"), 1, 0 )","v":0},{"$f":"IF( AND( AS$14>0, INDEX(Table_Chipsets, $BC46+1,AS$14+2)<>\"--\"), INDEX(Table_Chipsets, $BC46+1,AS$14+2), 0 )","v":0}]
[]
[null,null,null,null,null,null,null,null,null,null,null,null,null,null,null,null,null,null,null,null,{"$f":"IF(U$14>0,INDEX(Table_Chipsets, $BC48,U$14+2),\"--\")","v":"--"},null,null,null,null,null,{"$f":"IF(AA$14>0,INDEX(Table_Chipsets, $BC48,AA$14+2),\"--\")","v":"--"},null,null,null,null,null,{"$f":"IF(AG$14>0,INDEX(Table_Chipsets, $BC48,AG$14+2),\"--\")","v":"--"},null,null,null,null,null,{"$f":"IF(AM$14>0,INDEX(Table_Chipsets, $BC48,AM$14+2),\"--\")","v":"--"},null,null,null,null,null,{"$f":"IF(AS$14>0,INDEX(Table_Chipsets, $BC48,AS$14+2),\"--\")","v":"--"}]
[null,null,null,null,null,null,null,null,null,null,null,null,null,null,null,null,null,null,null,null,"--",null,null,null,null,null,"--",null,null,null,null,null,"--",null,null,null,null,null,"--",null,null,null,null,null,"--"]
[null,null,null,null,null,null,null,null,null,null,null,null,null,null,null,null,null,null,null,null,"--",null,null,null,null,null,"--",null,null,null,null,null,"--",null,null,null,null,null,"--",null,null,null,null,null,"--"]
[null,null,null,null,null,null,null,null,null,null,null,null,null,null,null,null,null,null,null,null,"--",null,null,null,null,null,"--",null,null,null,null,null,"--",null,null,null,null,null,"--",null,null,null,null,null,"--"]
[null,null,null,null,null,null,null,null,null,null,null,null,null,null,null,null,null,null,null,null,"--",null,null,null,null,null,"--",null,null,null,null,null,"--",null,null,null,null,null,"--",null,null,null,null,null,"--"]
[null,null,null,null,null,null,null,null,null,null,null,null,null,null,null,null,null,null,null,null,"--",null,null,null,null,null,"--",null,null,null,null,null,"--",null,null,null,null,null,"--",null,null,null,null,null,"--"]
[null,null,null,null,null,null,null,null,null,null,null,null,null,null,null,null,null,null,null,null,"--",null,null,null,null,null,"--",null,null,null,null,null,"--",null,null,null,null,null,"--",null,null,null,null,null,"--"]
[null,null,null,null,null,null,null,null,null,null,null,null,null,null,null,null,null,null,null,null,"--",null,null,null,null,null,"--",null,null,null,null,null,"--",null,null,null,null,null,"--",null,null,null,null,null,"--"]
[null,null,null,null,null,null,null,null,null,null,null,null,null,null,null,null,null,null,null,null,"--",null,null,null,null,null,"--",null,null,null,null,null,"--",null,null,null,null,null,"--",null,null,null,null,null,"--"]
[null,null,null,null,null,null,null,null,null,null,null,null,null,null,null,null,null,null,null,null,"--",null,null,null,null,null,"--",null,null,null,null,null,"--",null,null,null,null,null,"--",null,null,null,null,null,"--"]
[null,null,null,null,null,null,null,null,null,null,null,null,null,null,null,null,null,null,null,null,"--",null,null,null,null,null,"--",null,null,null,null,null,"--",null,null,null,null,null,"--",null,null,null,null,null,"--"]
[null,null,null,null,null,null,null,null,null,null,null,null,null,null,null,null,null,null,null,null,"--",null,null,null,null,null,"--",null,null,null,null,null,"--",null,null,null,null,null,"--",null,null,null,null,null,"--"]
[]
[]
[null,null,null,null,null,null,null,null,null,null,null,null,null,null,null,null,null,null,null,null,null,null,null,null,null,null,null,null,null,null,null,null,null,"Chipset Page"]
[]
[null,null,null,null,null,null,null,null,null,null,null,null,null,null,null,null,null,null,null,null,null,null,null,null,null,null,null,null,null,null,null,null,null,null,null,null,null,null,null,"Page ",{"$f":"IF(ChipsetsPageMax=0,0,IF(Value_ChipsetsPage>ChipsetsPageMax,ChipsetsPageMax,Value_ChipsetsPage))","v":0},null,{"$f":"CONCATENATE(\" of \", ChipsetsPageMax )","v":" of 0"},null,null,null,null,null,null,null,null,null,null,null,1,null,null,{"$f":"INT((Index_Chipset_Max-1)/5)+1","v":0}]
[]
[null,null,null,null,null,null,null,null,null,null,null,null,null,null,null,null,null,null,null,null,null,null,null,null,null,null,null,null,null,null,null,null,null,null,null,null,null,null,{"$f":"CONCATENATE( \"Ver. \", App_FullVersion )","v":"Ver. [[Prod]] (Smarta2xOPENv3)"}]
[]
[]
[]
[]
[null,null,null,null,null,null,null,null,null,null,null,null,null,null,null,null,null,null,null,null,null,null,null,null,null,null,null,null,null,null,null,null,null,null,null,null,null,null,null,null,null,null,null,null,null,null,null,null,null,null,null,null,null,{"$f":"ROW(BB71)","v":71}]
[null,null,null,null,null,null,null,null,null,null,null,null,"DMD",null,null,null,null,null,null,null,null,"The DMD (Digital Micromirror Device), is a highly efficient and versitile spatial light modulator, suitable for use in a wide varaiety of display and imaging applications."]
[]
[]
[null,null,null,null,null,null,null,null,null,null,null,null,"Micromirror Array Diagonal",null,null,null,null,null,null,null,null,"The size of the DMD array, in inches, measured diagonally."]
[]
[null,null,null,null,null,null,null,null,null,null,null,null,"Display Resolution",null,null,null,null,null,null,null,null,"The resolution of image formed (projected) by the chipset, measured by columns and rows of micromirrors."]
[]
[null,null,null,null,null,null,null,null,null,null,null,null,"Display Standard",null,null,null,null,null,null,null,null,"The industry standard name associated with the display resolution."]
[null,null,null,null,null,null,null,null,null,null,null,null,null,null,null,null,null,null,null,null,null,"For further details, refer to the link below:"]
[null,null,null,null,null,null,null,null,null,null,null,null,null,null,null,null,null,null,null,null,null,{"$f":"HYPERLINK(\"https://en.wikipedia.org/wiki/Display_resolution\",\"https://en.wikipedia.org/wiki/Display_resolution\")","v":"https://en.wikipedia.org/wiki/Display_resolution"}]
[]
[null,null,null,null,null,null,null,null,null,null,null,null,"Micromirror Pitch",null,null,null,null,null,null,null,null,"The size of the individual DMD micromirrors, as measured from center-to-center, in micrometers."]
[]
[null,null,null,null,null,null,null,null,null,null,null,null,"Micromirror Orientation",null,null,null,null,null,null,null,null,"Relative to the X-Y axis of the overall micromirror array, the individual micromirrors can be oriented in either a \"square\" or \"diamond\" orientation.  See the diagrams in the individual DMD data sheets for further clarification."]
[]
[]
[]
[null,null,null,null,null,null,null,null,null,null,null,null,"Illumination Direction",null,null,null,null,null,null,null,null,"The incoming illunination direction for which the DMD was designed.  Will typically be either \"side\", \"bottom\", or \"corner\".  See the individual DMD data sheets for further clarificaiton."]
[]
[]
[null,null,null,null,null,null,null,null,null,null,null,null,"DMD Package Size [ mm ]",null,null,null,null,null,null,null,null,"The X, Y, and Z (respectively) dimensions of the DMD chip.  Full mechanical drawings are provided in the DMD datasheets."]
[]
[]
[null,null,null,null,null,null,null,null,null,null,null,null,"DMD 1ku Price",null,null,null,null,null,null,null,null,"Suggested Resale Price per unit (USD) for BUDGETARY USE ONLY. For higher volume price quotes, prices in local currency or delivery quotes, please contact your local Texas Instruments Sales Office or Authorized Distributor."]
[]
[]
[]
[null,null,null,null,null,null,null,null,null,null,null,null,"Typical Brightness",null,null,null,null,null,null,null,null,"The brightness out of the projection lens (in lumens) which can typically be achieved.  Estimates are based on illumination technology available as of the publication date of this document.  The acutal brightness which is achieved depends upon numerous system factors, including light source selection, optical design, and software configuration.  "]
[]
[]
[]
[null,null,null,null,null,null,null,null,null,null,null,null,null,null,null,null,null,null,null,null,null,"Refer to the TI DLP® System Design: Brightness Requirements and Tradeoffs application note to learn more."]
[null,null,null,null,null,null,null,null,null,null,null,null,null,null,null,null,null,null,null,null,null,"more.",null,null,{"$f":"HYPERLINK(\"https://www.ti.com/lit/pdf/dlpa068\",\"( click here to download )\")","v":"( click here to download )"}]
[]
[null,null,null,null,null,null,null,null,null,null,null,null,"Typical Illumination Power",null,null,null,null,null,null,null,null,"The illumination power consumption which can typically be achieved.  Estimates are based on illumination technology available as of the publication date of this document.  The power consuption depends upon many system design factors, and can be adjusted to meet end-product power consumption constraints. "]
[]
[]
[null,null,null,null,null,null,null,null,null,null,null,null,null,null,null,null,null,null,null,null,null,"Refer to the TI DLP® Pico™ System Design: Optical Module Specifications application note to learn more."]
[null,null,null,null,null,null,null,null,null,null,null,null,null,null,null,null,null,null,null,null,null,{"$f":"HYPERLINK(\"https://www.ti.com/lit/pdf/dlpa078\",\"( click here to download )\")","v":"( click here to download )"}]
[]
[null,null,null,null,null,null,null,null,null,null,null,null,"Controller",null,null,null,null,null,null,null,null,"Every DLP Chipset consists of a specific DMD (DMDxxxx), an Controller (DLPCxxxx), and a Power Management IC (DLPAxxxx).  "]
[]
[]
[null,null,null,null,null,null,null,null,null,null,null,null,"Frame Refresh Rate",null,null,null,null,null,null,null,null,"The maximum frame refresh rate which is supported by the DLP Chipset."]
[]
[null,null,null,null,null,null,null,null,null,null,null,null,"DLP IntelliBright™ Algorithms",null,null,null,null,null,null,null,null,"A suite of image processing algorithms contained within the DLPC34xx family of DLP controllers."]
[null,null,null,null,null,null,null,null,null,null,null,null,null,null,null,null,null,null,null,null,null,"Refer to the TI DLP® Pico™ System Design: Optical Module Specifications application note to learn more."]
[null,null,null,null,null,null,null,null,null,null,null,null,null,null,null,null,null,null,null,null,null,{"$f":"HYPERLINK(\"https://www.ti.com/lit/pdf/dlpa078\",\"( click here to download )\")","v":"( click here to download )"}]
[]
[null,null,null,null,null,null,null,null,null,null,null,null,"Keystone Correction",null,null,null,null,null,null,null,null,"An image processing algorithm which compensates for a \"keystone effect\" which can occur with projected images.  For further details, refer to the link below:"]
[]
[null,null,null,null,null,null,null,null,null,null,null,null,null,null,null,null,null,null,null,null,null,{"$f":"HYPERLINK(\"https://en.wikipedia.org/wiki/Keystone_effect\",\"https://en.wikipedia.org/wiki/Keystone_effect\")","v":"https://en.wikipedia.org/wiki/Keystone_effect"}]
[]
[null,null,null,null,null,null,null,null,null,null,null,null,"Controller Package Size [ mm ]",null,null,null,null,null,null,null,null,"The X, Y, and Z (respectively) dimensions of the controller chip.  Full mechanical drawings are provided at in the controller datasheets."]
[]
[]
[null,null,null,null,null,null,null,null,null,null,null,null,"Controller 1ku Price",null,null,null,null,null,null,null,null,"Suggested Resale Price per unit (USD) for BUDGETARY USE ONLY. For higher volume price quotes, prices in local currency or delivery quotes, please contact your local Texas Instruments Sales Office or Authorized Distributor."]
[]
[]
[]
[null,null,null,null,null,null,null,null,null,null,null,null,"Evaluation Module ( EVM )",null,null,null,null,null,null,null,null,"Evaluation Modules (EVMs) are off-the-shelf hardware/software/opto-mechanical platforms which enable rapid prototyping with the designated DLP chipset."]
[]
[]
[null,null,null,null,null,null,null,null,null,null,null,null,"TI Reference Design",null,null,null,null,null,null,null,null,"TI Reference Designs are provide a starting-point for developing design solutions "]
[]
[]
[null,null,null,null,null,null,null,null,null,null,null,null,"DLPAxxxx Support",null,null,null,null,null,null,null,null,"Every DLP Chipset consists of a specific DMD (DMDxxxx), an Controller (DLPCxxxx), and a Power Management IC (DLPAxxxx).  "]
[]
[]
[null,null,null,null,null,null,null,null,null,null,null,null,null,null,null,null,null,null,null,null,null,null,null,null,null,null,null,null,null,null,null,null,null,null,null,null,null,null,null,null,null,null,null,null,null,null,null,null,null,null,null,null,null,{"$f":"ROW(BB141)","v":141}]
[]
[]
[null,null,null,null,null,null,null,null,null,null,null,null,null,"Important Notice"]
[]
[null,null,null,null,null,null,null,null,null,null,null,null,null,null,null,null,null,null,null,null,null,null,null,null,null,null,null,null,null,null,null,null,null,null,null,null,null,null,null,null,null,null,null,null,null,null,null,null,null,null,null,null,null,{"$f":"ROW(BB146)","v":146}]
[null,null,null,null,null,null,null,null,null,null,null,null,null,"The products and services of Texas Instruments Incorporated and its subsidiaries described herein are sold subject to TI’s standard terms and conditions of sale. Customers are advised to obtain the most current and complete information about TI products and services before placing orders. TI assumes no liability for applications assistance, customer’s applications or product designs, software performance, or infringement of patents. The publication of information regarding any other company’s products or services does not constitute TI’s approval, warranty or endorsement thereof."]
[]
[]
[]
[]
[]
[]
[]
[]
[]
[]
[]
[]
[]
[]
[]
[]
[]
[]
[]
[]
[]
[]
[]
[]
[]
[]
[]
[]
[]
[]
[]
[]
[]
[]
[]
[]
[]
[]
[]
[]
[]
[]
[]
[]
[]
[]
[]
[]
[]
[]
[]
[]
[]
[]
[]
[]
[]
[]
[]
[]
[]
[]
[]
[]
[]
[]
[]
[]
[]
[]
[]
[]
[]
[]
[]
[]
[]
[]
[]
[]
[]
[]
[]
[]
[]
[]
[]
[]
[]
[]
[]
[]
[]
[]
[]
[]
[]
[]
[]
[]
[]
[null,null,null,null,null,null,null,null,null,null,null,null,null,null,null,null,null,null,null,null,null,null,null,null,null,null,null,null,null,null,null,null,null,null,null,null,null,null,null,null,null,null,null,null,null,null,null,null,null,null,null,null,null,{"$f":"ROW(BB249)","v":249}]

{"sheet":"xChipsetFilter","index":19,"n_rows":70,"n_cols":22,"rows_kept":70,"cut":false,"hidden":true,"merged":[[24,20,27,20],[24,21,27,21],[20,0,29,2],[24,19,30,19]]}
[]
[]
[]
[]
[]
[null,null,null,null,{"$f":"Value_MaxResTol","v":0},"Resolved Mpx Max",{"$f":"Resolved_Mpx_Max","v":0},0,0,0,0,0,0,0,0,0,0]
[null,null,null,null,0,"DMD Mpixels",{"$f":"G30*G31/1000000","v":5.7599999999999998E-2},{"$f":"H30*H31/1000000","v":0.23039999999999999},0.23039999999999999,0.40992000000000001,0.51839999999999997,0.92159999999999997,2.0735999999999999,0.92159999999999997,2.0735999999999999,2.0735999999999999,8.2943999999999996]
[null,null,null,null,{"$f":"Value_MinResTol","v":0},"Resolved Mpx Min",{"$f":"Resolved_Mpx_Min","v":0},0,0,0,0,0,0,0,0,0,0]
[null,null,null,null,null,"Mpixels Filter",{"$f":"IF($E7=0, ToleranceRange(G7, G8, G6, Value_MaxResTol, Value_MinResTol ), ToleranceRange(G7, G8, 1000000, 0 ) )","v":false},{"$f":"IF($E7=0, ToleranceRange(H7, H8, H6, Value_MaxResTol, Value_MinResTol ), ToleranceRange(H7, H8, 1000000, 0 ) )","v":false},{"$f":"IF($E7=0, ToleranceRange(I7, I8, I6, Value_MaxResTol, Value_MinResTol ), ToleranceRange(I7, I8, 1000000, 0 ) )","v":false},{"$f":"IF($E7=0, ToleranceRange(J7, J8, J6, Value_MaxResTol, Value_MinResTol ), ToleranceRange(J7, J8, 1000000, 0 ) )","v":false},{"$f":"IF($E7=0, ToleranceRange(K7, K8, K6, Value_MaxResTol, Value_MinResTol ), ToleranceRange(K7, K8, 1000000, 0 ) )","v":false},{"$f":"IF($E7=0, ToleranceRange(L7, L8, L6, Value_MaxResTol, Value_MinResTol ), ToleranceRange(L7, L8, 1000000, 0 ) )","v":false},{"$f":"IF($E7=0, ToleranceRange(M7, M8, M6, Value_MaxResTol, Value_MinResTol ), ToleranceRange(M7, M8, 1000000, 0 ) )","v":false},{"$f":"IF($E7=0, ToleranceRange(N7, N8, N6, Value_MaxResTol, Value_MinResTol ), ToleranceRange(N7, N8, 1000000, 0 ) )","v":false},{"$f":"IF($E7=0, ToleranceRange(O7, O8, O6, Value_MaxResTol, Value_MinResTol ), ToleranceRange(O7, O8, 1000000, 0 ) )","v":false},{"$f":"IF($E7=0, ToleranceRange(P7, P8, P6, Value_MaxResTol, Value_MinResTol ), ToleranceRange(P7, P8, 1000000, 0 ) )","v":false},{"$f":"IF($E7=0, ToleranceRange(Q7, Q8, Q6, Value_MaxResTol, Value_MinResTol ), ToleranceRange(Q7, Q8, 1000000, 0 ) )","v":false}]
[]
[null,null,null,null,{"$f":"Value_MaxLmTol","v":0},"User Max Lumens",{"$f":"Resolved_Lumens_Max","v":0},0,0,0,0,0,0,0,0,0,0]
[null,null,null,null,0,"DMD Max Lumens",{"$f":"G43","v":120},{"$f":"H43","v":120},50,200,450,450,450,300,800,1800,1800]
[null,null,null,null,{"$f":"Value_MinLmTol","v":0},"User Min Lumens",{"$f":"Resolved_Lumens_Min","v":0},{"$f":"Resolved_Lumens_Min","v":0},0,0,0,0,0,0,0,0,0]
[null,null,null,null,null,"Lumens Filter",{"$f":"IF( $E12=0, ToleranceRange(G12, G13, G11, Value_MaxLmTol, Value_MinLmTol ), ToleranceRange(G12, 0, G11, Value_MaxLmTol, Value_MinLmTol ) )","v":false},{"$f":"IF( $E12=0, ToleranceRange(H12, H13, H11, Value_MaxLmTol, Value_MinLmTol ), ToleranceRange(H12, 0, H11, Value_MaxLmTol, Value_MinLmTol ) )","v":false},{"$f":"IF( $E12=0, ToleranceRange(I12, I13, I11, Value_MaxLmTol, Value_MinLmTol ), ToleranceRange(I12, 0, I11, Value_MaxLmTol, Value_MinLmTol ) )","v":false},{"$f":"IF( $E12=0, ToleranceRange(J12, J13, J11, Value_MaxLmTol, Value_MinLmTol ), ToleranceRange(J12, 0, J11, Value_MaxLmTol, Value_MinLmTol ) )","v":false},{"$f":"IF( $E12=0, ToleranceRange(K12, K13, K11, Value_MaxLmTol, Value_MinLmTol ), ToleranceRange(K12, 0, K11, Value_MaxLmTol, Value_MinLmTol ) )","v":false},{"$f":"IF( $E12=0, ToleranceRange(L12, L13, L11, Value_MaxLmTol, Value_MinLmTol ), ToleranceRange(L12, 0, L11, Value_MaxLmTol, Value_MinLmTol ) )","v":false},{"$f":"IF( $E12=0, ToleranceRange(M12, M13, M11, Value_MaxLmTol, Value_MinLmTol ), ToleranceRange(M12, 0, M11, Value_MaxLmTol, Value_MinLmTol ) )","v":false},{"$f":"IF( $E12=0, ToleranceRange(N12, N13, N11, Value_MaxLmTol, Value_MinLmTol ), ToleranceRange(N12, 0, N11, Value_MaxLmTol, Value_MinLmTol ) )","v":false},{"$f":"IF( $E12=0, ToleranceRange(O12, O13, O11, Value_MaxLmTol, Value_MinLmTol ), ToleranceRange(O12, 0, O11, Value_MaxLmTol, Value_MinLmTol ) )","v":false},{"$f":"IF( $E12=0, ToleranceRange(P12, P13, P11, Value_MaxLmTol, Value_MinLmTol ), ToleranceRange(P12, 0, P11, Value_MaxLmTol, Value_MinLmTol ) )","v":false},{"$f":"IF( $E12=0, ToleranceRange(Q12, Q13, Q11, Value_MaxLmTol, Value_MinLmTol ), ToleranceRange(Q12, 0, Q11, Value_MaxLmTol, Value_MinLmTol ) )","v":false}]
[]
[null,null,null,null,null,"OMM Min Lumens","--","--",20,20,20,20,20,20,20,20,20]
[null,null,null,null,null,"OMM Max Lumens","--","--",30,30,30,30,30,30,30,30,30]
[]
[null,null,null,null,{"$f":"Value_MatchZoneTolerance","v":0.15},"Mpixels Filter",{"$f":"G9","v":false},{"$f":"H9","v":false},false,false,false,false,false,false,false,false,false]
[null,null,null,null,null,"Lumens Filter",{"$f":"G14","v":false},{"$f":"H14","v":false},false,false,false,false,false,false,false,false,false]
["If chipsets are added in the future, the range in cell E23 must be increased to include the new columns",null,null,null,null,"Net Filter",{"$f":"IF( AND(G19,G20), 1, 0 )","v":0},{"$f":"IF( AND(H19,H20), 1, 0 )","v":0},0,0,0,0,0,0,{"$f":"IF( AND(O19,O20), 1, 0 )","v":0},{"$f":"IF( AND(P19,P20), 1, 0 )","v":0},0]
[null,null,null,null,null,"Count",{"$f":"IF( ISNUMBER(F22), F22+G21, G21 )","v":0},{"$f":"IF( ISNUMBER(G22), G22+H21, H21 )","v":0},0,0,0,0,0,0,0,{"$f":"IF( ISNUMBER(O22),O22+ P21, P21 )","v":0},{"$f":"IF( ISNUMBER(P22), P22+Q21, Q21 )","v":0}]
[null,null,null,null,{"$f":"MAX(F22:Q23)","v":0},"Index",{"$f":"IF(E22=G22, 0, G22 )","v":0},{"$f":"IF(F22=H22, 0, H22 )","v":0},{"$f":"IF(G22=I22, 0, I22 )","v":0},0,0,0,0,0,{"$f":"IF(M22=O22, 0, O22 )","v":0},{"$f":"IF(N22=P22, 0, P22 )","v":0},{"$f":"IF(O22=Q22, 0, Q22 )","v":0}]
[null,null,null,null,null,null,1,2,3,4,5,6,7,8,9,10,11]
[null,null,null,null,1,null,null,null,null,null,null,null,null,null,null,null,null,null,null,"***To add chipsets in the future, add a column to this chart, fill out the listed information in rows 26-69, and auto fill the formulas in rows 6-23 ","Adding to this chart will include the chipset in the selection algorithm so it will appear on the 'Chipsets' page if it fits the criteria","To include the chipset in the graph on the 'Map' page, see 'xMap'"]
[null,null,null,null,{"$f":"OFFSET(E26,-1,0)+1","v":2},"Chipset","0.16 QnHD","0.16 nHD","0.2 nHD","0.2 WVGA","0.23 qHD","0.23 720p","0.23 1080p","0.3 720p","0.33 1080p","0.47 1080p","0.47 4K"]
[null,null,null,null,{"$f":"OFFSET(E27,-1,0)+1","v":3},"DMD","DLP160AP","DLP160CP","DLP2000","DLP2010","DLP230GP","DLP230KP","DLP230NP","DLP3010","DLP3310","DLP4710","DLP471TP"]
[null,null,null,null,4,"DMD Part Number Hyperlink","https://www.ti.com/product/DLP160AP","https://www.ti.com/product/DLP160CP","https://www.ti.com/product/DLP2000","https://www.ti.com/product/DLP2010","https://www.ti.com/product/DLP230GP","https://www.ti.com/product/DLP230KP","https://www.ti.com/product/DLP230NP","https://www.ti.com/product/DLP3010","https://www.ti.com/product/DLP3310","https://www.ti.com/product/DLP4710","https://www.ti.com/product/DLP471TP"]
[null,null,null,null,5,"Micromirror Array Diagonal","0.16\"","0.16\"","0.20\"","0.20\"","0.23\"","0.23\"","0.23\"","0.31\"","0.33\"","0.47\"","0.47\""]
[null,null,null,null,6,"xColumns",320,640,640,854,960,1280,1920,1280,1920,1920,3840]
[null,null,null,null,7,"xRows",180,360,360,480,540,720,1080,720,1080,1080,2160]
[null,null,null,null,8,"xStandard","QnHD","nHD","nHD","WVGA","qHD","720p","1080p","720p","1080p","1080p","4K"]
[null,null,null,null,9,"Display Resolution","320 x 180","640 x 360","640 x 360","854 x 480","960 x 540","1280 x 720","1920 x 1080","1280 x 720","1920 x 1080","1920 x 1080","3840 x 2160"]
[null,null,null,null,10,"Display Standard","QnHD","nHD","nHD","WVGA","qHD","720p","1080p","720p","1080p","1080p","4K"]
[null,null,null,null,11,"Micromirror Pitch","5.4µm","5.4µm","7.6µm","5.4µm","5.4µm","5.4µm","5.4µm","5.4µm","5.4µm","5.4µm","5.4µm"]
[null,null,null,null,12,"Micromirror Tilt Angle","17°","17°","17°","17°","17°","17°","17°","17°","17°","17°","17°"]
[null,null,null,null,13,"Micromirror Orientation","Square","Square","Square","Square","Square","Square","Square","Square","Square","Square","Square"]
[null,null,null,null,14,"Illumination Direction","Side","Side","Corner","Side","Side","Side","Side","Side","Side","Bottom","Bottom"]
[null,null,null,null,15,"DMD Package Size [ mm ]","13.4 x 4.9 x 3.2","13.4 x 4.9 x 3.2","14.1 x 5.0 x 3.6","15.9 x 5.3 x 3.58","16.8 x 5.9 x 3.6","16.8 x 5.9 x 3.6","16.8 x 5.9 x 3.6","18.2 x 7.0 x 3.8","19.3 x 7.2 x 3.8","24.5 x 11.0 x 3.8","24.7 x 17.0 x 4.1"]
[null,null,null,null,16,"Automotive Qualified","No","No","No","No","No","No","No","No","No","No","No"]
[null,null,null,null,17,"DMD Price & Availability","Order now","Order now","Order now","Order now","Order now","Order now","Order now","Order now","Order now","Order now","Order now"]
[null,null,null,null,18,"TI.com ordering hyperlink","https://www.ti.com/product/DLP160AP#order-quality","https://www.ti.com/product/DLP160CP#order-quality","https://www.ti.com/product/DLP2000#order-quality","https://www.ti.com/product/DLP2010#order-quality","https://www.ti.com/product/DLP230GP#order-quality","https://www.ti.com/product/DLP230KP#order-quality","https://www.ti.com/product/DLP230NP#order-quality","https://www.ti.com/product/DLP3010#order-quality","https://www.ti.com/product/DLP3310#order-quality","https://www.ti.com/product/DLP4710#order-quality","https://www.ti.com/product/DLP471TP#order-quality"]
[null,null,null,null,19,"xLumens",120,120,50,200,450,450,450,300,800,1800,1800]
[null,null,null,null,20,"xWatts",5,5,5,15,25,25,25,25,50,150,150]
[null,null,null,null,21,"Typical Brightness","Up to 75 lm","Up to 75 lm","Up to 50 lm","Up to 150 lm","Up to 250 lm","Up to 250 lm","Up to 250 lm","Up to 300 lm","Up to 500 lm","Up to 1500 lm","Up to 1500 lm"]
[null,null,null,null,22,"Typical Illumination Power","Up to 5W","Up to 5W","Up to 5W","Up to 15W","Up to 25W","Up to 25W","Up to 25W","Up to 25W","Up to 50W","Up to 150W","Up to 150W"]
[null,null,null,null,23,"Controller","DLPC3420","DLPC3421","DLPC2607","DLPC3430/5","DLPC3432","DLPC3434","DLPC3436","DLPC3433/8","2x DLPC3437","2x DLPC3439","DLPC6540"]
[null,null,null,null,24,"Controller Hyperlink","https://www.ti.com/product/DLPC3420","https://www.ti.com/product/DLPC3421","https://www.ti.com/product/DLPC2607","https://www.ti.com/product/DLPC3430","https://www.ti.com/product/DLPC3432","https://www.ti.com/product/DLPC3434","https://www.ti.com/product/DLPC3436","https://www.ti.com/product/DLPC3433","https://www.ti.com/product/DLPC3437","https://www.ti.com/product/DLPC3439","https://www.ti.com/product/DLPC6540"]
[null,null,null,null,25,"xFrame Rate",60,360,60,240,120,60,60,120,60,60,60]
[null,null,null,null,26,"Frame Refresh Rate","Up to 60Hz","Up to 360Hz","Up to 60Hz","Up to 240Hz","Up to 120Hz","Up to 60Hz","Up to 60Hz","Up to 120Hz","Up to 60Hz","Up to 60Hz","Up to 60Hz"]
[null,null,null,null,27,"DLP IntelliBright™ Algorithms","Yes","Yes","--","Yes","Yes","Yes","Yes","Yes","Yes","Yes","--"]
[null,null,null,null,28,"Keystone Correction","1D Vertical","1D Vertical","--","1D Vertical","1D Vertical","1D Vertical","1D Vertical","1D Vertical","1D Vertical","--","1D Vertical"]
[null,null,null,null,29,"Controller Package Size [ mm ]","7 x 7","7 x 7","7 x 7","7x7,  13x13","7 x 7","7 x 7","7 x 7","7 x 7,  13 x 13","13 x 13","13 x 13","31 x 31"]
[null,null,null,null,30,"Controller Price & Availability","Order now","Order now","Order now","Order now","Order now","Order now","Order now","Order now","Order now","Order now","Order now"]
[null,null,null,null,31,"TI.com ordering hyperlink","https://www.ti.com/product/DLPC3420#order-quality","https://www.ti.com/product/DLPC3421#order-quality","https://www.ti.com/product/DLPC2607#order-quality","https://www.ti.com/product/DLPC3430#order-quality","https://www.ti.com/product/DLPC3432#order-quality","https://www.ti.com/product/DLPC3434#order-quality","https://www.ti.com/product/DLPC3436#order-quality","https://www.ti.com/product/DLPC3433#order-quality","https://www.ti.com/product/DLPC3437#order-quality","https://www.ti.com/product/DLPC3439#order-quality","https://www.ti.com/product/DLPC6540#order-quality"]
[null,null,null,null,32,"Evaluation Module ( EVM )","--","--","Order now","--","--","--","Order now","Order now","--","Order now","Order now"]
[null,null,null,null,33,"EVM Hyperlink","--","--","https://www.ti.com/tool/DLPDLCR2000EVM","--","--","--","https://www.ti.com/tool/DLPDLCR230NPEVM","https://www.ti.com/tool/DLPDLCR3010EVM-G2","--","https://www.ti.com/tool/DLPDLCR4710EVM-G2","https://www.ti.com/tool/DLPDLCR4710EVM-G2"]
[null,null,null,null,34,"TI Reference Design","--","--","TIDA-01473","TIDA-00325","TIDA-080002","--","--","TIDA-01571","TIDA-080000","TIDA-01226","--"]
[null,null,null,null,35,"TI Ref Dsgn Hyperlink","--","--","https://www.ti.com/tool/TIDA-01473?keyMatch=TIDA-01473","https://www.ti.com/tool/TIDA-00325?keyMatch=TIDA-00325","https://www.ti.com/tool/TIDA-080002?keyMatch=TIDA-080002","--","--","https://www.ti.com/tool/TIDA-01571?keyMatch=TIDA-01571","https://www.ti.com/tool/TIDA-080000?keyMatch=TIDA-080000","https://www.ti.com/tool/TIDA-01226?keyMatch=TIDA-01226","--"]
[null,null,null,null,36,"DLPA1000 ( up to 1A )","--","--","Supported","--","--","--","--","--","--","--","--"]
[null,null,null,null,37,"Hyperlink","--","--","https://www.ti.com/product/DLPA1000","--","--","--","--","--","--","--","--"]
[null,null,null,null,38,"DLPA2000 ( up to 750mA )","Supported","Supported","--","Supported","Supported","Supported","Supported","Supported","--","--","--"]
[null,null,null,null,39,"Hyperlink","https://www.ti.com/product/DLPA2000","https://www.ti.com/product/DLPA2000","--","https://www.ti.com/product/DLPA2000","https://www.ti.com/product/DLPA2000","https://www.ti.com/product/DLPA2000","https://www.ti.com/product/DLPA2000","https://www.ti.com/product/DLPA2000","--","--","--"]
[null,null,null,null,40,"DLPA2005 ( up to 2.4A )","Supported","Supported","--","Supported","Supported","Supported","Supported","Supported","--","--","--"]
[null,null,null,null,41,"Hyperlink","https://www.ti.com/product/DLPA2005","https://www.ti.com/product/DLPA2005","--","https://www.ti.com/product/DLPA2005","https://www.ti.com/product/DLPA2005","https://www.ti.com/product/DLPA2005","https://www.ti.com/product/DLPA2005","https://www.ti.com/product/DLPA2005","--","--","--"]
[null,null,null,null,42,"DLPA3000 ( up to 6A )","--","--","--","Supported","Supported","Supported","Supported","Supported","Supported","Supported","--"]
[null,null,null,null,43,"Hyperlink","--","--","--","https://www.ti.com/product/DLPA3000","https://www.ti.com/product/DLPA3000","https://www.ti.com/product/DLPA3000","https://www.ti.com/product/DLPA3000","https://www.ti.com/product/DLPA3000","https://www.ti.com/product/DLPA3000","https://www.ti.com/product/DLPA3000","--"]
[null,null,null,null,44,"DLPA3005 ( up to 16A )","--","--","--","--","--","--","--","Supported","Supported","Supported","Supported"]
[null,null,null,null,45,"Hyperlink","--","--","--","--","--","--","--","https://www.ti.com/product/DLPA3000","https://www.ti.com/product/DLPA3005","https://www.ti.com/product/DLPA3005","https://www.ti.com/product/DLPA3005"]
[null,null,null,null,46]

{"sheet":"Engines","index":20,"n_rows":126,"n_cols":65,"rows_kept":126,"cut":false,"hidden":true,"merged":[[48,36,48,49],[70,37,70,50],[122,13,124,47],[125,13,131,47],[52,34,53,36],[52,37,53,49],[59,35,60,49],[56,57,56,61],[113,12,113,19],[113,20,113,49],[115,12,115,19],[115,20,115,49],[117,12,117,19],[117,20,117,49],[98,12,103,19],[98,20,103,49],[105,12,107,19],[105,20,107,49],[109,12,111,19],[109,20,111,49],[90,12,90,19],[90,20,90,49],[92,12,96,19],[83,20,87,49],[88,20,88,49],[92,20,95,49],[96,20,96,49],[79,12,79,19],[79,20,79,49],[81,12,81,19],[81,20,81,49],[7,12,7,19],[7,22,7,33],[7,36,7,43],[7,45,7,49],[8,12,8,15],[8,16,8,19],[8,22,8,33],[8,36,8,39],[8,40,8,43],[8,45,8,49],[9,12,9,15],[9,16,9,19],[9,22,9,33],[9,36,9,39],[9,40,9,43],[22,11,22,18],[24,11,24,18],[62,41,63,42],[9,45,9,49],[32,63,32,69],[29,11,29,18],[30,11,30,18],[29,19,29,26],[30,19,30,26],[28,11,28,18],[28,19,28,26],[26,19,26,26],[19,11,19,18],[20,11,20,18],[21,11,21,18],[25,27,25,34],[26,27,26,34],[28,27,28,34],[29,27,29,34],[30,27,30,34],[20,43,20,50],[20,35,20,42],[21,35,21,42],[22,35,22,42],[13,35,13,42],[19,43,19,50],[13,19,13,26],[83,12,88,19],[35,11,35,19],[35,20,35,25],[35,26,35,31],[35,32,35,37],[35,38,35,43],[34,26,34,31],[34,32,34,37],[34,38,34,43],[38,20,38,25],[38,26,38,31],[38,32,38,37],[38,38,38,43],[36,11,36,19],[36,20,36,25],[36,26,36,31],[36,32,36,37],[36,38,36,43],[41,11,41,19],[41,20,41,25],[41,26,41,31],[52,22,53,30],[76,20,77,49],[76,12,77,19],[52,56,52,57],[13,11,13,18],[14,11,14,18],[15,11,15,18],[16,11,16,18],[17,11,17,18],[18,11,18,18],[15,19,15,26],[16,19,16,26],[17,19,17,26],[18,19,18,26],[14,35,14,42],[15,35,15,42],[16,35,16,42],[17,35,17,42],[18,35,18,42],[33,54,33,58],[30,35,30,42],[19,35,19,42],[24,35,24,42],[14,19,14,26],[25,19,25,26],[34,44,34,49],[32,11,32,18],[22,43,22,50],[25,35,25,42],[26,35,26,42],[28,35,28,42],[29,35,29,42],[29,43,29,50],[33,11,33,18],[30,43,30,50],[32,43,32,50],[33,43,33,50],[25,43,25,50],[26,43,26,50],[32,19,32,26],[33,19,33,26],[33,35,33,42],[25,11,25,18],[26,11,26,18],[28,43,28,50],[41,44,41,49],[42,11,42,19],[38,44,38,49],[37,11,37,19],[37,20,37,25],[37,26,37,31],[37,32,37,37],[37,38,37,43],[37,44,37,49],[40,11,40,19],[40,20,40,25],[40,26,40,31],[40,32,40,37],[40,38,40,43],[40,44,40,49],[39,11,39,19],[39,20,39,25],[13,43,13,50],[14,43,14,50],[15,43,15,50],[16,43,16,50],[17,43,17,50],[18,43,18,50],[43,11,43,19],[44,20,44,25],[44,26,44,31],[44,32,44,37],[44,38,44,43],[44,44,44,49],[34,11,34,19],[34,20,34,25],[33,27,33,34],[32,35,32,42],[43,44,43,49],[39,32,39,37],[41,32,41,37],[41,38,41,43],[39,44,39,49],[39,26,39,31],[42,20,42,25],[42,26,42,31],[13,27,13,34],[14,27,14,34],[15,27,15,34],[16,27,16,34],[17,27,17,34],[18,27,18,34],[19,27,19,34],[20,27,20,34],[21,27,21,34],[55,43,56,44],[55,23,56,23],[55,24,56,26],[55,27,56,29],[63,23,64,23],[62,43,63,44],[52,64,52,65],[19,19,19,26],[20,19,20,26],[21,19,21,26],[22,19,22,26],[24,19,24,26],[22,27,22,34],[24,27,24,34],[42,32,42,37],[42,44,42,49],[39,38,39,43],[35,44,35,49],[38,11,38,19],[36,44,36,49],[42,38,42,43],[21,43,21,50],[24,43,24,50],[32,27,32,34],[46,44,46,49],[45,11,45,19],[45,20,45,25],[45,26,45,31],[45,32,45,37],[45,38,45,43],[45,44,45,49],[54,57,54,67],[66,39,67,50],[63,24,64,26],[63,27,64,29],[65,23,66,23],[65,24,66,26],[65,27,66,29],[57,23,58,23],[57,24,58,26],[57,27,58,29],[59,23,60,23],[59,24,60,26],[59,27,60,29],[61,23,62,23],[61,24,62,26],[61,27,62,29],[55,41,56,42],[44,11,44,19],[43,20,43,25],[43,26,43,31],[43,32,43,37],[43,38,43,43],[46,11,46,19],[46,20,46,25],[46,26,46,31],[46,32,46,37],[46,38,46,43]]}
[]
[]
[]
[]
[]
[]
[]
[null,null,null,null,null,null,null,null,null,null,null,null,"Resolution",null,null,null,null,null,null,null,null,null,"Image Size",null,null,null,null,null,null,null,null,null,null,null,null,null,"Brightness",null,null,null,null,null,null,null,null,"# of Matching"]
[null,null,null,null,null,null,null,null,null,null,null,"Max:",{"$f":"Display_ResolutionSimple_Max","v":"-- x --"},null,null,null,{"$f":"Display_Mpx_Max","v":"-- Mpx"},null,null,null,null,"Max:",{"$f":"CONCATENATE( \"W: \", Display_ImageWidth_Max, \"  x   H: \", Display_ImageHeight_Max, \"   ( D: \", Display_ImageDiag_Max, \" )\"  )","v":"W: -- in  x   H: -- in   ( D: -- in )"},null,null,null,null,null,null,null,null,null,null,null,null,"Max:",{"$f":"Display_Lumens_Max","v":"-- lm"},null,null,null,{"$f":"Display_Nits_Max","v":"-- nits"},null,null,null,null,"Chipsets"]
[null,null,null,null,null,null,null,null,null,null,null,"Min:",{"$f":"Display_ResolutionSimple_Min","v":"-- x --"},null,null,null,{"$f":"Display_Mpx_Min","v":"-- Mpx"},null,null,null,null,"Min:",{"$f":"CONCATENATE( \"W: \", Display_ImageWidth_Min, \"  x   H: \", Display_ImageHeight_Min, \"   ( D: \", Display_ImageDiag_Min, \" )\"  )","v":"W: -- in  x   H: -- in   ( D: -- in )"},null,null,null,null,null,null,null,null,null,null,null,null,"Min:",{"$f":"Display_Lumens_Min","v":"-- lm"},null,null,null,{"$f":"Display_Nits_Min","v":"-- nits"},null,null,null,null,{"$f":"Index_Chipset_Max","v":0}]
[]
[]
[]
[null,null,null,null,null,null,null,null,null,null,null,"Chipset Number",null,null,null,null,null,null,null,{"$f":"( (Value_EnginesPage-1)*4 )+1","v":1},null,null,null,null,null,null,null,{"$f":"T14+1","v":2},null,null,null,null,null,null,null,{"$f":"AB14+1","v":3},null,null,null,null,null,null,null,{"$f":"AJ14+1","v":4}]
[null,null,null,null,null,null,null,null,null,null,null,"Chipset Index",null,null,null,null,null,null,null,{"$f":"IFERROR( MATCH( T14, Array_Engines_Index, 0 ), 0 )","v":0},null,null,null,null,null,null,null,{"$f":"IFERROR( MATCH( AB14, Array_Engines_Index, 0 ), 0 )","v":0},null,null,null,null,null,null,null,{"$f":"IFERROR( MATCH( AJ14, Array_Engines_Index, 0 ), 0 )","v":0},null,null,null,null,null,null,null,{"$f":"IFERROR( MATCH( AR14, Array_Engines_Index, 0 ), 0 )","v":0}]
[null,null,null,null,null,null,null,null,null,null,null,{"$f":"IF(T$15>0,INDEX(#NAME?, $BC16,2),\"--\")","v":"--"},null,null,null,null,null,null,null,{"$f":"IF(T$15>0,INDEX(Table_Engines, $BC16,T$15+3),\"--\")","v":"--"},null,null,null,null,null,null,null,{"$f":"IF(AB$15>0,INDEX(Table_Engines, $BC16,AB$15+3),\"--\")","v":"--"},null,null,null,null,null,null,null,{"$f":"IF(AJ$15>0,INDEX(Table_Engines, $BC16,AJ$15+3),\"--\")","v":"--"},null,null,null,null,null,null,null,{"$f":"IF(AR$15>0,INDEX(Table_Engines, $BC16,AR$15+3),\"--\")","v":"--"},null,null,null,null,null,null,null,null,null,null,2]
[null,null,null,null,null,null,null,null,null,null,null,"Manufacture",null,null,null,null,null,null,null,{"$f":"IF(T$15>0,INDEX(Table_Engines, $BC17,T$15+4),\"--\")","v":"--"},null,null,null,null,null,null,null,{"$f":"IF(AB$15>0,INDEX(Table_Engines, $BC17,AB$15+3),\"--\")","v":"--"},null,null,null,null,null,null,null,{"$f":"IF(AJ$15>0,INDEX(Table_Engines, $BC17,AJ$15+3),\"--\")","v":"--"},null,null,null,null,null,null,null,{"$f":"IF(AR$15>0,INDEX(Table_Engines, $BC17,AR$15+3),\"--\")","v":"--"},null,null,null,null,null,null,null,null,null,null,{"$f":"MATCH(L17, Array_EngineLables, 0 )","v":4}]
[null,null,null,null,null,null,null,null,null,null,null,"Module Model Number",null,null,null,null,null,null,null,{"$f":"IF(T$15>0,INDEX(Table_Engines, $BC18,T$15+3),\"--\")","v":"--"},null,null,null,null,null,null,null,{"$f":"IF(AB$15>0,INDEX(Table_Engines, $BC18,AB$15+3),\"--\")","v":"--"},null,null,null,null,null,null,null,{"$f":"IF(AJ$15>0,INDEX(Table_Engines, $BC18,AJ$15+3),\"--\")","v":"--"},null,null,null,null,null,null,null,{"$f":"IF(AR$15>0,INDEX(Table_Engines, $BC18,AR$15+3),\"--\")","v":"--"},null,null,null,null,null,null,null,null,null,null,3]
[null,null,null,null,null,null,null,null,null,null,null,"Max Lumens",null,null,null,null,null,null,null,{"$f":"IF(T$15>0, CONCATENATE( INDEX(Table_Engines, $BC19,T$15+3), \" lm\"),\"--\")","v":"--"},null,null,null,null,null,null,null,{"$f":"IF(AB$15>0, CONCATENATE( INDEX(Table_Engines, $BC19,AB$15+3), \" lm\"),\"--\")","v":"--"},null,null,null,null,null,null,null,{"$f":"IF(AJ$15>0, CONCATENATE( INDEX(Table_Engines, $BC19,AJ$15+3), \" lm\"),\"--\")","v":"--"},null,null,null,null,null,null,null,{"$f":"IF(AR$15>0, CONCATENATE( INDEX(Table_Engines, $BC19,AR$15+3), \" lm\"),\"--\")","v":"--"},null,null,null,null,null,null,null,null,null,null,5]
[null,null,null,null,null,null,null,null,null,null,null,"Min Lumens",null,null,null,null,null,null,null,{"$f":"IF(T$15>0, CONCATENATE( INDEX(Table_Engines, $BC20,T$15+3), \" lm\"),\"--\")","v":"--"},null,null,null,null,null,null,null,{"$f":"IF(AB$15>0, CONCATENATE( INDEX(Table_Engines, $BC20,AB$15+3), \" lm\"),\"--\")","v":"--"},null,null,null,null,null,null,null,{"$f":"IF(AJ$15>0, CONCATENATE( INDEX(Table_Engines, $BC20,AJ$15+3), \" lm\"),\"--\")","v":"--"},null,null,null,null,null,null,null,{"$f":"IF(AR$15>0, CONCATENATE( INDEX(Table_Engines, $BC20,AR$15+3), \" lm\"),\"--\")","v":"--"},null,null,null,null,null,null,null,null,null,null,6]
[null,null,null,null,null,null,null,null,null,null,null,"Illumination Light Source",null,null,null,null,null,null,null,{"$f":"IF(T$15>0,INDEX(Table_Engines, $BC21,T$15+3),\"--\")","v":"--"},null,null,null,null,null,null,null,{"$f":"IF(AB$15>0,INDEX(Table_Engines, $BC21,AB$15+3),\"--\")","v":"--"},null,null,null,null,null,null,null,{"$f":"IF(AJ$15>0,INDEX(Table_Engines, $BC21,AJ$15+3),\"--\")","v":"--"},null,null,null,null,null,null,null,{"$f":"IF(AR$15>0,INDEX(Table_Engines, $BC21,AR$15+3),\"--\")","v":"--"},null,null,null,null,null,null,null,null,null,null,7]
[null,null,null,null,null,null,null,null,null,null,null,"Optical Offset",null,null,null,null,null,null,null,{"$f":"IF(T$15>0,INDEX(Table_Engines, $BC22,T$15+3),\"--\")","v":"--"},null,null,null,null,null,null,null,{"$f":"IF(AB$15>0,INDEX(Table_Engines, $BC22,AB$15+3),\"--\")","v":"--"},null,null,null,null,null,null,null,{"$f":"IF(AJ$15>0,INDEX(Table_Engines, $BC22,AJ$15+3),\"--\")","v":"--"},null,null,null,null,null,null,null,{"$f":"IF(AR$15>0,INDEX(Table_Engines, $BC22,AR$15+3),\"--\")","v":"--"},null,null,null,null,null,null,null,null,null,null,8]
[null,null,null,null,null,null,null,null,null,null,null,"Throw Ratio",null,null,null,null,null,null,null,{"$f":"IF(T$15>0,INDEX(Table_Engines, $BC23,T$15+3),\"--\")","v":"--"},null,null,null,null,null,null,null,{"$f":"IF(AB$15>0,INDEX(Table_Engines, $BC23,AB$15+3),\"--\")","v":"--"},null,null,null,null,null,null,null,{"$f":"IF(AJ$15>0,INDEX(Table_Engines, $BC23,AJ$15+3),\"--\")","v":"--"},null,null,null,null,null,null,null,{"$f":"IF(AR$15>0,INDEX(Table_Engines, $BC23,AR$15+3),\"--\")","v":"--"},null,null,null,null,null,null,null,null,null,null,9]
[]
[null,null,null,null,null,null,null,null,null,null,null,"Flash Memory Included?",null,null,null,null,null,null,null,{"$f":"IF(T$15>0,INDEX(Table_Engines, $BC25,T$15+3),\"--\")","v":"--"},null,null,null,null,null,null,null,{"$f":"IF(AB$15>0,INDEX(Table_Engines, $BC25,AB$15+3),\"--\")","v":"--"},null,null,null,null,null,null,null,{"$f":"IF(AJ$15>0,INDEX(Table_Engines, $BC25,AJ$15+3),\"--\")","v":"--"},null,null,null,null,null,null,null,{"$f":"IF(AR$15>0,INDEX(Table_Engines, $BC25,AR$15+3),\"--\")","v":"--"},null,null,null,null,null,null,null,null,null,null,{"$f":"MATCH(L25, Array_EngineLables, 0 )","v":10}]
[null,null,null,null,null,null,null,null,null,null,null,"Model # w/ Electronics",null,null,null,null,null,null,null,{"$f":"IF(T$15>0,INDEX(Table_Engines, $BC26,T$15+3),\"--\")","v":"--"},null,null,null,null,null,null,null,{"$f":"IF(AB$15>0,INDEX(Table_Engines, $BC26,AB$15+3),\"--\")","v":"--"},null,null,null,null,null,null,null,{"$f":"IF(AJ$15>0,INDEX(Table_Engines, $BC26,AJ$15+3),\"--\")","v":"--"},null,null,null,null,null,null,null,{"$f":"IF(AR$15>0,INDEX(Table_Engines, $BC26,AR$15+3),\"--\")","v":"--"},null,null,null,null,null,null,null,null,null,null,{"$f":"MATCH(L26, Array_EngineLables, 0 )","v":11}]
[null,null,null,null,null,null,null,null,null,null,null,"Additional Features",null,null,null,null,null,null,null,{"$f":"IF(T$15>0,INDEX(Table_Engines, $BC27,T$15+3),\"--\")","v":"--"},null,null,null,null,null,null,null,{"$f":"IF(AB$15>0,INDEX(Table_Engines, $BC27,AB$15+3),\"--\")","v":"--"},null,null,null,null,null,null,null,{"$f":"IF(AJ$15>0,INDEX(Table_Engines, $BC27,AJ$15+3),\"--\")","v":"--"},null,null,null,null,null,null,null,{"$f":"IF(AR$15>0,INDEX(Table_Engines, $BC27,AR$15+3),\"--\")","v":"--"},null,null,null,null,null,null,null,null,null,null,{"$f":"MATCH(L27, Array_EngineLables, 0 )","v":18}]
[]
[null,null,null,null,null,null,null,null,null,null,null,"High-Vol Orders Only?",null,null,null,null,null,null,null,{"$f":"IF(T$15>0,INDEX(Table_Engines, $BC29,T$15+3),\"--\")","v":"--"},null,null,null,null,null,null,null,{"$f":"IF(AB$15>0,INDEX(Table_Engines, $BC29,AB$15+3),\"--\")","v":"--"},null,null,null,null,null,null,null,{"$f":"IF(AJ$15>0,INDEX(Table_Engines, $BC29,AJ$15+3),\"--\")","v":"--"},null,null,null,null,null,null,null,{"$f":"IF(AR$15>0,INDEX(Table_Engines, $BC29,AR$15+3),\"--\")","v":"--"},null,null,null,null,null,null,null,null,null,null,{"$f":"MATCH(L29, Array_EngineLables, 0 )","v":12}]
[null,null,null,null,null,null,null,null,null,null,null,"Low-Vol Orders Accepted?",null,null,null,null,null,null,null,{"$f":"IF(T$15>0,INDEX(Table_Engines, $BC30,T$15+3),\"--\")","v":"--"},null,null,null,null,null,null,null,{"$f":"IF(AB$15>0,INDEX(Table_Engines, $BC30,AB$15+3),\"--\")","v":"--"},null,null,null,null,null,null,null,{"$f":"IF(AJ$15>0,INDEX(Table_Engines, $BC30,AJ$15+3),\"--\")","v":"--"},null,null,null,null,null,null,null,{"$f":"IF(AR$15>0,INDEX(Table_Engines, $BC30,AR$15+3),\"--\")","v":"--"},null,null,null,null,null,null,null,null,null,null,{"$f":"MATCH(L30, Array_EngineLables, 0 )","v":13}]
[null,null,null,null,null,null,null,null,null,null,null,"Single-Unit Orders Accepted?",null,null,null,null,null,null,null,{"$f":"IF(T$15>0,INDEX(Table_Engines, $BC31,T$15+3),\"--\")","v":"--"},null,null,null,null,null,null,null,{"$f":"IF(AB$15>0,INDEX(Table_Engines, $BC31,AB$15+3),\"--\")","v":"--"},null,null,null,null,null,null,null,{"$f":"IF(AJ$15>0,INDEX(Table_Engines, $BC31,AJ$15+3),\"--\")","v":"--"},null,null,null,null,null,null,null,{"$f":"IF(AR$15>0,INDEX(Table_Engines, $BC31,AR$15+3),\"--\")","v":"--"},null,null,null,null,null,null,null,null,null,null,{"$f":"MATCH(L31, Array_EngineLables, 0 )","v":14}]
[]
[null,null,null,null,null,null,null,null,null,null,null,"Company Website",null,null,null,null,null,null,null,{"$f":"IF(T$15>0, IF( $BD33=1, HYPERLINK( INDEX(Table_Engines, $BC33+1,T$15+3), INDEX(Table_Engines, $BC33,T$15+3)), HYPERLINK(\"\",INDEX(Table_Engines, $BC33,T$15+3))), HYPERLINK(\"\", \"--\") )","v":"--"},null,null,null,null,null,null,null,{"$f":"IF(AB$15>0, IF( $BE33=1, HYPERLINK( INDEX(Table_Engines, $BC33+1,AB$15+3), INDEX(Table_Engines, $BC33,AB$15+3)), HYPERLINK(\"\",INDEX(Table_Engines, $BC33,AB$15+3))), HYPERLINK(\"\", \"--\") )","v":"--"},null,null,null,null,null,null,null,{"$f":"IF(AJ$15>0, IF( $BF33=1, HYPERLINK( INDEX(Table_Engines, $BC33+1,AJ$15+3), INDEX(Table_Engines, $BC33,AJ$15+3)), HYPERLINK(\"\",INDEX(Table_Engines, $BC33,AJ$15+3))), HYPERLINK(\"\", \"--\") )","v":"--"},null,null,null,null,null,null,null,{"$f":"IF(AR$15>0, IF( $BG33=1, HYPERLINK( INDEX(Table_Engines, $BC33+1,AR$15+3), INDEX(Table_Engines, $BC33,AR$15+3)), HYPERLINK(\"\",INDEX(Table_Engines, $BC33,AR$15+3))), HYPERLINK(\"\", \"--\") )","v":"--"},null,null,null,null,null,null,null,null,null,null,{"$f":"MATCH(L33, Array_EngineLables, 0 )","v":15},{"$f":"IF( AND( T$15>0, INDEX(Table_Engines, $BC33+1,T$15+2)<>\"--\"), 1, 0 )","v":0},{"$f":"IF( AND( AB$15>0, INDEX(Table_Engines, $BC33+1,AB$15+2)<>\"--\"), 1, 0 )","v":0},{"$f":"IF( AND( AJ$15>0, INDEX(Table_Engines, $BC33+1,AJ$15+2)<>\"--\"), 1, 0 )","v":0},{"$f":"IF( AND( AR$15>0, INDEX(Table_Engines, $BC33+1,AR$15+2)<>\"--\"), 1, 0 )","v":0},null,null,null,null,{"$f":"HYPERLINK(\"\",\"abc\")","v":"abc"}]
[null,null,null,null,null,null,null,null,null,null,null,"Compay Location",null,null,null,null,null,null,null,{"$f":"IF(T$15>0,INDEX(Table_Engines, $BC34,T$15+3),\"--\")","v":"--"},null,null,null,null,null,null,null,{"$f":"IF(AB$15>0,INDEX(Table_Engines, $BC34,AB$15+3),\"--\")","v":"--"},null,null,null,null,null,null,null,{"$f":"IF(AJ$15>0,INDEX(Table_Engines, $BC34,AJ$15+3),\"--\")","v":"--"},null,null,null,null,null,null,null,{"$f":"IF(AR$15>0,INDEX(Table_Engines, $BC34,AR$15+3),\"--\")","v":"--"},null,null,null,null,null,null,null,null,null,null,17]
[]
[null,null,null,null,null,null,null,null,null,null,null,{"$f":"IF(T$15>0,INDEX(#NAME?, $BC36,2),\"--\")","v":"--"},null,null,null,null,null,null,null,null,{"$f":"IF(T$15>0,INDEX(#NAME?, $BC36,T$15+2),\"--\")","v":"--"},null,null,null,null,null,{"$f":"IF(AB$15>0,INDEX(#NAME?, $BC36,AB$15+2),\"--\")","v":"--"},null,null,null,null,null,{"$f":"IF(AJ$15>0,INDEX(#NAME?, $BC36,AJ$15+2),\"--\")","v":"--"},null,null,null,null,null,{"$f":"IF(AR$15>0,INDEX(#NAME?, $BC36,AR$15+2),\"--\")","v":"--"},null,null,null,null,null,{"$f":"IF(#REF!>0,INDEX(#NAME?, $BC36,#REF!+2),\"--\")","v":{"$error":"#REF!"}},null,null,null,null,null,null,null,null,null,33]
[null,null,null,null,null,null,null,null,null,null,null,"--",null,null,null,null,null,null,null,null,"--",null,null,null,null,null,"--",null,null,null,null,null,"--",null,null,null,null,null,"--",null,null,null,null,null,{"$f":"IF(#REF!>0,INDEX(#NAME?, $BC37,#REF!+2),\"--\")","v":{"$error":"#REF!"}},null,null,null,null,null,null,null,null,null,34]
[null,null,null,null,null,null,null,null,null,null,null,"--",null,null,null,null,null,null,null,null,"--",null,null,null,null,null,"--",null,null,null,null,null,"--",null,null,null,null,null,"--",null,null,null,null,null,{"$f":"IF(#REF!>0,INDEX(#NAME?, $BC38,#REF!+2),\"--\")","v":{"$error":"#REF!"}},null,null,null,null,null,null,null,null,null,35]
[null,null,null,null,null,null,null,null,null,null,null,"--",null,null,null,null,null,null,null,null,"--",null,null,null,null,null,"--",null,null,null,null,null,"--",null,null,null,null,null,"--",null,null,null,null,null,{"$f":"IF(#REF!>0,INDEX(#NAME?, $BC39,#REF!+2),\"--\")","v":{"$error":"#REF!"}},null,null,null,null,null,null,null,null,null,36]
[null,null,null,null,null,null,null,null,null,null,null,"--",null,null,null,null,null,null,null,null,"--",null,null,null,null,null,"--",null,null,null,null,null,"--",null,null,null,null,null,"--",null,null,null,null,null,{"$f":"IF(#REF!>0,INDEX(#NAME?, $BC40,#REF!+2),\"--\")","v":{"$error":"#REF!"}},null,null,null,null,null,null,null,null,null,37]
[null,null,null,null,null,null,null,null,null,null,null,"--",null,null,null,null,null,null,null,null,"--",null,null,null,null,null,"--",null,null,null,null,null,"--",null,null,null,null,null,"--",null,null,null,null,null,{"$f":"IF(#REF!>0,INDEX(#NAME?, $BC41,#REF!+2),\"--\")","v":{"$error":"#REF!"}},null,null,null,null,null,null,null,null,null,38]
[null,null,null,null,null,null,null,null,null,null,null,"--",null,null,null,null,null,null,null,null,"--",null,null,null,null,null,"--",null,null,null,null,null,"--",null,null,null,null,null,"--",null,null,null,null,null,{"$f":"IF(#REF!>0,INDEX(#NAME?, $BC42,#REF!+2),\"--\")","v":{"$error":"#REF!"}},null,null,null,null,null,null,null,null,null,39]
[null,null,null,null,null,null,null,null,null,null,null,"--",null,null,null,null,null,null,null,null,"--",null,null,null,null,null,"--",null,null,null,null,null,"--",null,null,null,null,null,"--",null,null,null,null,null,{"$f":"IF(#REF!>0,INDEX(#NAME?, $BC43,#REF!+2),\"--\")","v":{"$error":"#REF!"}},null,null,null,null,null,null,null,null,null,40]
[null,null,null,null,null,null,null,null,null,null,null,"--",null,null,null,null,null,null,null,null,"--",null,null,null,null,null,"--",null,null,null,null,null,"--",null,null,null,null,null,"--",null,null,null,null,null,{"$f":"IF(#REF!>0,INDEX(#NAME?, $BC44,#REF!+2),\"--\")","v":{"$error":"#REF!"}},null,null,null,null,null,null,null,null,null,41]
[null,null,null,null,null,null,null,null,null,null,null,"--",null,null,null,null,null,null,null,null,"--",null,null,null,null,null,"--",null,null,null,null,null,"--",null,null,null,null,null,"--",null,null,null,null,null,{"$f":"IF(#REF!>0,INDEX(#NAME?, $BC45,#REF!+2),\"--\")","v":{"$error":"#REF!"}},null,null,null,null,null,null,null,null,null,42]
[null,null,null,null,null,null,null,null,null,null,null,"--",null,null,null,null,null,null,null,null,"--",null,null,null,null,null,"--",null,null,null,null,null,"--",null,null,null,null,null,"--",null,null,null,null,null,{"$f":"IF(#REF!>0,INDEX(#NAME?, $BC46,#REF!+2),\"--\")","v":{"$error":"#REF!"}},null,null,null,null,null,null,null,null,null,43]
[null,null,null,null,null,null,null,null,null,null,null,"--",null,null,null,null,null,null,null,null,"--",null,null,null,null,null,"--",null,null,null,null,null,"--",null,null,null,null,null,"--",null,null,null,null,null,{"$f":"IF(#REF!>0,INDEX(#NAME?, $BC47,#REF!+2),\"--\")","v":{"$error":"#REF!"}},null,null,null,null,null,null,null,null,null,44]
[]
[null,null,null,null,null,null,null,null,null,null,null,null,null,null,null,null,null,null,null,"Additional Optical Engine information can be found here  . . . . . . . . . . . . . . . . . . . . . . . . . . . . . .",null,null,null,null,null,null,null,null,null,null,null,null,null,null,null,null,"https://www.ti.com/tool/DLP-OMM-SEARCH"]
[]
[null,null,null,null,null,null,null,null,null,null,null,null,null,null,null,null,null,null,null,null,null,null,null,null,null,null,null,null,null,null,null,null,null,null,null,null,null,null,null,null,null,null,null,null,null,null,null,null,null,null,null,null,null,null,"Reset engines scroller to 1 whenever the chipset changes"]
[]
[null,null,null,null,null,null,null,null,null,null,null,null,null,null,null,null,null,null,null,null,null,null,"Throw Ratio Filter",null,null,null,null,null,null,null,null,null,null,null,"Chipset:",null,null,{"$f":"BF55","v":"--"},null,null,null,null,null,null,null,null,null,null,null,null,null,null,null,null,3,null,{"$f":"IFERROR( MATCH( Value_EnginesDMD, Array_Chipset_Index, 0 ), 0 )","v":0},null,null,null,null,null,null,"ignore lumens",1]
[]
[null,null,null,null,null,null,null,null,null,null,null,null,null,null,null,null,null,null,null,null,null,null,null,null,null,null,null,null,null,null,null,null,null,null,null,null,null,null,null,null,null,null,null,null,null,null,null,null,null,null,null,null,null,null,null,null,null,{"$f":"IF(BE53>0,CONCATENATE( INDEX(Table_Chipsets, $BC53,$BE53+2), \"   ( \", INDEX(Table_Chipsets, $BC53+2,$BE53+2), \" \", INDEX(Table_Chipsets, $BC53+5,$BE53+2), \" - \", INDEX(Table_Chipsets, $BC53+6,$BE53+2), \" )\" ),\"--\")","v":"--"}]
[null,null,null,null,null,null,null,null,null,null,null,null,null,null,null,null,null,null,null,null,null,null,null,null,"≤ 0.4",null,null,{"$f":"IF(xOMM!B14> 0, CONCATENATE( \"( qty \",xOMM!B14, \" )\" ), \"( -- )\" )","v":"( -- )"},null,null,null,null,null,null,null,null,null,null,null,null,null,{"$f":"IF(Index_Chipset_Max=0,0,IF(Value_EnginesDMD>Index_Chipset_Max,Index_Chipset_Max,Value_EnginesDMD))","v":0},null,{"$f":"CONCATENATE( \" of \", Index_Chipset_Max )","v":" of 0"},null,null,null,null,null,null,null,null,null,null,0]
[null,null,null,null,null,null,null,null,null,null,null,null,null,null,null,null,null,null,null,null,null,null,null,null,null,null,null,null,null,null,null,null,null,null,null,null,null,null,null,null,null,null,null,null,null,null,null,null,null,null,null,null,null,null,null,null,null,{"$f":"IF(BC$53>0,INDEX(Table_Chipsets, $BC53,$BE53+2),\"--\")","v":"DMD"}]
[null,null,null,null,null,null,null,null,null,null,null,null,null,null,null,null,null,null,null,null,null,null,null,null,"0.5 - 0.8",null,null,{"$f":"IF(xOMM!B15> 0, CONCATENATE( \"( qty \",xOMM!B15, \" )\" ), \"( -- )\" )","v":"( -- )"},null,null,null,null,null,null,null,null,null,null,null,null,null,null,null,null,null,null,null,null,null,null,null,null,null,null,0]
[]
[null,null,null,null,null,null,null,null,null,null,null,null,null,null,null,null,null,null,null,null,null,null,null,null,"0.9 - 1.2",null,null,{"$f":"IF(xOMM!B16> 0, CONCATENATE( \"( qty \",xOMM!B16, \" )\" ), \"( -- )\" )","v":"( -- )"},null,null,null,null,null,null,null,"Optical Engine Page",null,null,null,null,null,null,null,null,null,null,null,null,null,null,null,null,null,null,0]
[null,null,null,null,null,null,null,null,null,null,null,null,null,null,null,null,null,null,null,null,null,null,null,null,null,null,null,null,null,null,null,null,null,null,null,null,null,null,null,null,null,null,null,null,null,null,null,null,null,null,null,null,null,null,null,null,null,null,null,1]
[null,null,null,null,null,null,null,null,null,null,null,null,null,null,null,null,null,null,null,null,null,null,null,null,"1.3 - 1.6",null,null,{"$f":"IF(xOMM!B17> 0, CONCATENATE( \"( qty \",xOMM!B17, \" )\" ), \"( -- )\" )","v":"( -- )"},null,null,null,null,null,null,null,null,null,null,null,null,null,null,null,null,null,null,null,null,null,null,null,null,null,null,0]
[null,null,null,null,null,null,null,null,null,null,null,null,null,null,null,null,null,null,null,null,null,null,null,null,null,null,null,null,null,null,null,null,null,null,null,null,null,null,null,null,null,{"$f":"IF( INT((Index_Engines_Max-1)/4)+1=0,0,IF(Value_EnginesPage> INT((Index_Engines_Max-1)/4)+1, INT((Index_Engines_Max-1)/4)+1,Value_EnginesPage))","v":0},null,{"$f":"CONCATENATE(\" of \", INT((Index_Engines_Max-1)/4)+1 )","v":" of 0"}]
[null,null,null,null,null,null,null,null,null,null,null,null,null,null,null,null,null,null,null,null,null,null,null,null,"≥ 1.7",null,null,{"$f":"IF(xOMM!B18> 0, CONCATENATE( \"( qty \",xOMM!B18, \" )\" ), \"( -- )\" )","v":"( -- )"},null,null,null,null,null,null,null,null,null,null,null,null,null,null,null,null,null,null,null,null,null,null,null,null,null,null,0,null,null,null,null,1]
[]
[null,null,null,null,null,null,null,null,null,null,null,null,null,null,null,null,null,null,null,null,null,null,null,null,"≥ 3.0",null,null,{"$f":"IF(xOMM!B19> 0, CONCATENATE( \"( qty \",xOMM!B19, \" )\" ), \"( -- )\" )","v":"( -- )"},null,null,null,null,null,null,null,null,null,null,null,null,null,null,null,null,null,null,null,null,null,null,null,null,null,null,0]
[null,null,null,null,null,null,null,null,null,null,null,null,null,null,null,null,null,null,null,null,null,null,null,null,null,null,null,null,null,null,null,null,null,null,null,null,null,null,null,{"$f":"CONCATENATE( \"Ver. \", App_FullVersion )","v":"Ver. [[Prod]] (Smarta2xOPENv3)"}]
[]
[]
[]
[null,null,null,null,null,null,null,null,null,null,null,null,null,null,null,null,null,null,null,null,"Additional Optical Engine information can be found here  . . . . . . . . . . . . . . . . . . . . . . . . . . . . . .",null,null,null,null,null,null,null,null,null,null,null,null,null,null,null,null,"https://www.ti.com/tool/DLP-OMM-SEARCH"]
[]
[]
[]
[]
[null,null,null,null,null,null,null,null,null,null,null,null,null,null,null,null,null,null,null,null,null,null,null,null,null,null,null,null,null,null,null,null,null,null,null,null,null,null,null,null,null,null,null,null,null,null,null,null,null,null,null,null,null,{"$f":"ROW(BB76)","v":76}]
[null,null,null,null,null,null,null,null,null,null,null,null,"Optical Module",null,null,null,null,null,null,null,"An optical module is a compact assembly that includes a digital micromirror device (DMD), an illumination source, optics and associated mechanics.  Some modules also inlcude electronics for driving the DMD."]
[]
[]
[null,null,null,null,null,null,null,null,null,null,null,null,"Manufacture",null,null,null,null,null,null,null,"Manufacture of the optical engine/module"]
[]
[null,null,null,null,null,null,null,null,null,null,null,null,"Module Model Number",null,null,null,null,null,null,null,"The part/model number to use when ordering an optical module from the manufacture."]
[]
[null,null,null,null,null,null,null,null,null,null,null,null,"Min/Max Lumens",null,null,null,null,null,null,null,"Lumens refers to the amount of light, that is emitted from the projection lens when the illumination source is run at peak output and an entirely white image is displayed (i.e. all DLP micromirrors are in the “on” position, and the light source is being driven for maximum output). \nNote that in this table there are pre-set lumens ranges that the modules are categorized into.  Please contact the manufacture for details regarding the specific capability of their modules."]
[]
[]
[]
[]
[null,null,null,null,null,null,null,null,null,null,null,null,null,null,null,null,null,null,null,null,{"$f":"CONCATENATE( \"For further details, refer to \", HYPERLINK(\"https://en.wikipedia.org/wiki/Lumen_(unit)\",\"https://en.wikipedia.org/wiki/Lumen_(unit)\"), \".\" )","v":"For further details, refer to https://en.wikipedia.org/wiki/Lumen_(unit)."}]
[]
[null,null,null,null,null,null,null,null,null,null,null,null,"Illumination Light Source",null,null,null,null,null,null,null,"The type of illumination source used in the module (i.e., LED, laser, etc.)"]
[]
[null,null,null,null,null,null,null,null,null,null,null,null,"Optical Offset",null,null,null,null,null,null,null,"Offset describes the path of the projected light once it exits the projection lens. \n0% offset describes an optical module that sends light equally up and down after it exits the projection lens. 100% offset describes an optical module that sends the top of the image up and keeps the bottom of the image coincident with the projection lens axis."]
[]
[]
[]
[null,null,null,null,null,null,null,null,null,null,null,null,null,null,null,null,null,null,null,null,{"$f":"CONCATENATE( \"For further details, refer to \", HYPERLINK(\"https://www.projectorcentral.com/Understanding-Lens-Offset-and-Lens-Shift.htm\",\"https://www.projectorcentral.com/Understanding-Lens-Offset-and-Lens-Shift.htm\"), \".\" )","v":"For further details, refer to https://www.projectorcentral.com/Understanding-Lens-Offset-and-Lens-Shift.htm."}]
[]
[null,null,null,null,null,null,null,null,null,null,null,null,"Throw Ratio",null,null,null,null,null,null,null,"Throw ratio describes how large of a projected image an optical module creates when the projector is a given distance from the projection surface. I\nt is defined as the ratio of D (the distance from the final optical element to the projection surface) to W (width of projected image). \nNote that in this table there are pre-set throw ratio ranges that the modules are categorized into.  Please contact the manufacture for details regarding the specific capability of their modules."]
[]
[]
[]
[]
[]
[]
[null,null,null,null,null,null,null,null,null,null,null,null,"Flash Memory Included?",null,null,null,null,null,null,null,"The flash memory board is a small board typically attached to either the module itself or the flex cable connecting the DMD and DLP controller. DLP image processing settings specific to the optical module are stored in the flash memory and are used by the DLP controller during configuration of the system."]
[]
[]
[]
[null,null,null,null,null,null,null,null,null,null,null,null,"Model # w/ Electronics",null,null,null,null,null,null,null,"Separate drive electronics (containing the appropriate DLP controller that is required to supply video to the optical module) can also be sourced from independent 3rd party companies or custom built using TI reference designs."]
[]
[]
[]
[null,null,null,null,null,null,null,null,null,null,null,null,"High-Vol Orders Only?",null,null,null,null,null,null,null,"Some optical module manufactures only accept high-volume (i.e., production) order quantities."]
[]
[null,null,null,null,null,null,null,null,null,null,null,null,"Low-Vol Orders Accepted?",null,null,null,null,null,null,null,"Some optical module manufactures will accept low-volume order quantities."]
[]
[null,null,null,null,null,null,null,null,null,null,null,null,"Single-Unit Orders Accepted?",null,null,null,null,null,null,null,"Some optical module manufactures will accept single-unit orders."]
[]
[null,null,null,null,null,null,null,null,null,null,null,null,null,null,null,null,null,null,null,null,null,null,null,null,null,null,null,null,null,null,null,null,null,null,null,null,null,null,null,null,null,null,null,null,null,null,null,null,null,null,null,null,null,{"$f":"ROW(BB120)","v":120}]
[]
[]
[null,null,null,null,null,null,null,null,null,null,null,null,null,"Disclaimer"]
[]
[]
[null,null,null,null,null,null,null,null,null,null,null,null,null,"Certain information and resources (including links to non-TI sites) may be provided by a third-party partner, and is included here merely for your convenience. TI is not the provider of, and is not responsible for, the content of such information and resources, and you should evaluate them carefully for your intended uses and on your own behalf. The inclusion of such information and resources here does not imply endorsement of any third-party company by TI, and shall not be construed as a warranty or representation regarding the suitability of any third-party products or services, either alone or in combination \nwith any TI product or service."]

{"sheet":"xOMM","index":21,"n_rows":43,"n_cols":165,"rows_kept":43,"cut":false,"hidden":true,"merged":[]}
[]
[]
[]
[null,null,{"$f":"Engines!BF57","v":"DMD"},"Selected DMD",null,{"$f":"$C4","v":"DMD"},{"$f":"$C4","v":"DMD"},"DMD","DMD","DMD","DMD","DMD","DMD","DMD","DMD","DMD","DMD","DMD","DMD","DMD","DMD","DMD","DMD","DMD","DMD","DMD","DMD","DMD","DMD","DMD","DMD","DMD","DMD","DMD","DMD","DMD","DMD","DMD","DMD","DMD","DMD","DMD","DMD","DMD","DMD","DMD","DMD","DMD","DMD","DMD","DMD","DMD","DMD","DMD","DMD","DMD","DMD","DMD","DMD","DMD","DMD","DMD","DMD","DMD","DMD","DMD","DMD","DMD","DMD","DMD",{"$f":"$C4","v":"DMD"},"DMD","DMD","DMD","DMD","DMD","DMD","DMD","DMD","DMD","DMD","DMD","DMD","DMD","DMD","DMD","DMD","DMD","DMD","DMD","DMD","DMD","DMD","DMD","DMD","DMD","DMD","DMD","DMD","DMD","DMD","DMD","DMD","DMD","DMD","DMD","DMD","DMD","DMD","DMD","DMD","DMD","DMD","DMD","DMD","DMD","DMD","DMD","DMD","DMD","DMD","DMD","DMD","DMD","DMD","DMD","DMD","DMD","DMD","DMD","DMD","DMD","DMD","DMD",{"$f":"$C4","v":"DMD"},"DMD","DMD","DMD","DMD","DMD","DMD","DMD","DMD","DMD","DMD","DMD","DMD","DMD","DMD","DMD","DMD","DMD","DMD","DMD","DMD","DMD","DMD","DMD","DMD","DMD","DMD","DMD","DMD","DMD","DMD"]
[null,null,null,"Module DMD",null,{"$f":"F26","v":"DLP2000"},{"$f":"G26","v":"DLP2000"},"DLP2000","DLP2000","DLP2000","DLP2000","DLP2010","DLP2010","DLP2010",{"$f":"O26","v":"DLP2010"},{"$f":"P26","v":"DLP2010"},"DLP2010","DLP2010","DLP2010","DLP2010","DLP2010","DLP2010","DLP2010","DLP2010","DLP2010","DLP2010","DLP2010","DLP2010","DLP2010","DLP2010","DLP2010","DLP2010","DLP2010","DLP2010","DLP2010","DLP2010","DLP2010","DLP2010","DLP2010","DLP2010","DLP2010","DLP2010","DLP230GP","DLP230GP","DLP230GP","DLP230GP","DLP230GP","DLP230GP","DLP230GP","DLP230GP","DLP230GP","DLP230GP","DLP230GP","DLP230GP","DLP230GP","DLP230GP","DLP230GP","DLP230KP","DLP230KP","DLP230KP","DLP230KP","DLP230KP","DLP230KP","DLP3010","DLP3010","DLP3010","DLP3010","DLP3010","DLP3010","DLP3010","DLP3010","DLP3010","DLP3010","DLP3010","DLP3010","DLP3010","DLP3010","DLP3010","DLP3010",{"$f":"CB26","v":"DLP3010"},"DLP3010","DLP4500 ","DLP4500 ","DLP4500 ","DLP4501","DLP4501","DLP4501","DLP4501","DLP4501","DLP230NP","DLP230NP","DLP230NP","DLP230NP","DLP230NP","DLP230NP","DLP230NP","DLP230NP","DLP230NP","DLP230NP","DLP230NP","DLP230NP","DLP230NP","DLP230NP","DLP3310","DLP3310","DLP3310","DLP3310","DLP3310","DLP3310","DLP3310","DLP3310","DLP3310","DLP3310","DLP3310","DLP4710","DLP4710","DLP4710","DLP4710","DLP4710","DLP4710","DLP4710","DLP4710","DLP4710","DLP4710","DLP4710","DLP4710","DLP4710","DLP4710","DLP4710","DLP4710","DLP4710","DLP4710","DLP4710","DLP4710","DLP4710","DLP4710","DLP4710","DLP4710","DLP4710","DLP4710","DLP4710","DLP470TE","DLP470TE",{"$f":"EN26","v":"DLP470TP"},"DLP470TP","DLP470TP","DLP470TP","DLP470TP","DLP470TP","DLP470TP","DLP470TP","DLP470TP","DLP470TP","DLP470TP","DLP470TP","DLP470TP","DLP471TP","DLP471TP","DLP471TP","DLP471TP","DLP471TP","DLP471TP","DLP471TP","DLP471TP","DLP471TP"]
[null,null,1,"Match",null,{"$f":"IF(F4=F5, $C6, 0 )","v":0},{"$f":"IF(G4=G5, $C6, 0 )","v":0},0,0,0,0,0,0,0,0,0,0,0,0,0,0,0,0,0,0,0,0,0,0,0,0,0,0,0,0,0,0,0,0,0,0,0,0,0,0,0,0,0,0,0,0,0,0,0,0,0,0,0,0,0,0,0,0,0,0,0,0,0,0,0,{"$f":"IF(BS4=BS5, $C6, 0 )","v":0},0,0,0,0,0,0,0,0,0,0,0,0,0,0,0,0,0,0,0,0,0,0,0,0,0,0,0,0,0,0,0,0,0,0,0,0,0,0,0,0,0,0,0,0,0,0,0,0,0,0,0,0,0,0,0,0,0,0,0,0,0,0,0,{"$f":"IF(EE4=EE5, $C6, 0 )","v":0},0,0,0,0,0,0,0,0,0,0,0,0,0,0,0,0,0,0,0,0,0,0,0,0,0,0,0,0,0,0]
[]
[null,null,null,"Module Max Lumens",null,{"$f":"F29","v":50},150,150,50,50,50,150,150,300,150,150,150,300,300,150,150,150,150,300,150,150,150,150,150,50,50,50,50,300,150,150,150,300,300,50,150,150,300,300,300,300,600,600,300,300,150,150,300,300,600,300,150,300,300,300,600,300,150,300,600,300,150,300,300,{"$f":"BR29","v":600},300,300,300,300,300,150,150,300,300,600,600,300,600,600,600,1500,600,1500,150,300,300,300,300,600,600,300,300,300,600,600,300,300,150,600,1500,600,600,300,600,1500,1500,600,600,600,1500,1500,1500,1500,1500,1500,1500,2000,1500,1500,2000,2000,2000,1500,1500,1500,600,1500,1500,{"$f":"ED29","v":1500},1500,1500,1500,600,600,1500,1500,3000,5000,1500,1500,1500,1500,1500,1500,1500,1500,1500,1500,1500,1500,1500,1500,1500,1500,2000,1500,1500,2000,2000,2000]
[null,null,{"$f":"Resolved_Lumens_Max","v":0},"User Max Lumens",null,{"$f":"Resolved_Lumens_Max","v":0},0,0,0,0,0,0,0,0,0,0,0,0,0,0,0,0,0,0,0,0,0,0,0,0,0,0,0,0,0,0,0,0,0,0,0,0,0,0,0,0,0,0,0,0,0,0,0,0,0,0,0,0,0,0,0,0,0,0,0,0,0,0,0,{"$f":"Resolved_Lumens_Max","v":0},0,0,0,0,0,0,0,0,0,0,0,0,0,0,0,0,0,0,0,0,0,0,0,0,0,0,0,0,0,0,0,0,0,0,0,0,0,0,0,0,0,0,0,0,0,0,0,0,0,0,0,0,0,0,0,0,0,0,0,0,0,0,0,{"$f":"Resolved_Lumens_Max","v":0},0,0,0,0,0,0,0,0,0,0,0,0,0,0,0,0,0,0,0,0,0,0,0,0,0,0,0,0,0,0,0]
[null,null,{"$f":"Resolved_Lumens_Min","v":0},"User Min Lumens",null,{"$f":"Resolved_Lumens_Min","v":0},0,0,0,0,0,0,0,0,0,0,0,0,0,0,0,0,0,0,0,0,0,0,0,0,0,0,0,0,0,0,0,0,0,0,0,0,0,0,0,0,0,0,0,0,0,0,0,0,0,0,0,0,0,0,0,0,0,0,0,0,0,0,0,{"$f":"Resolved_Lumens_Min","v":0},0,0,0,0,0,0,0,0,0,0,0,0,0,0,0,0,0,0,0,0,0,0,0,0,0,0,0,0,0,0,0,0,0,0,0,0,0,0,0,0,0,0,0,0,0,0,0,0,0,0,0,0,0,0,0,0,0,0,0,0,0,0,0,{"$f":"Resolved_Lumens_Min","v":0},0,0,0,0,0,0,0,0,0,0,0,0,0,0,0,0,0,0,0,0,0,0,0,0,0,0,0,0,0,0,0]
[null,null,null,"Module Min Lumens",null,{"$f":"F30","v":0},50,50,0,0,0,50,50,150,50,50,50,150,150,50,50,50,50,150,50,50,50,50,50,0,0,0,0,150,50,50,50,150,150,0,50,50,150,150,150,150,300,300,150,150,50,50,150,150,300,150,50,150,150,150,300,150,50,150,300,150,50,150,150,{"$f":"BR30","v":300},150,150,150,150,150,50,50,150,150,300,300,150,300,300,300,600,300,600,50,150,150,150,150,300,300,150,150,150,300,300,150,150,50,300,600,300,300,150,300,600,600,300,300,300,600,600,600,600,600,600,600,1500,600,600,1500,1500,1500,600,600,600,300,600,600,{"$f":"ED30","v":600},600,600,600,300,300,600,600,1500,3000,600,600,600,600,600,600,600,600,600,600,600,600,600,600,600,600,1500,600,600,1500,1500,1500]
[null,null,{"$f":"Engines!BM53","v":1},"Match",null,{"$f":"IF( AND( F8>=F9, F11<=F10), $C12, 1 )","v":1},{"$f":"IF( AND( G8>=G9, G11<=G10), $C12, 1 )","v":1},1,1,1,1,1,1,1,1,1,1,1,1,1,1,1,1,1,1,1,1,1,1,1,1,1,1,1,1,1,1,1,1,1,1,1,1,1,1,1,1,1,1,1,1,1,1,1,1,1,1,1,1,1,1,1,1,1,1,1,1,1,1,1,{"$f":"IF( AND( BS8>=BS9, BS11<=BS10), $C12, 1 )","v":1},1,1,1,1,1,1,1,1,1,1,1,1,1,1,1,1,1,1,1,1,1,1,1,1,1,1,1,1,1,1,1,1,1,1,1,1,1,1,1,1,1,1,1,1,1,1,1,1,1,1,1,1,1,1,1,1,1,1,1,1,1,1,1,{"$f":"IF( AND( EE8>=EE9, EE11<=EE10), $C12, 1 )","v":1},1,1,1,1,1,1,1,1,1,1,1,1,1,1,1,1,1,1,1,1,1,1,1,1,1,1,1,1,1,1]
[]
[null,{"$f":"SUMPRODUCT(E$6:FJ$6,E14:FJ14)","v":0},{"$f":"IF( TRRange_Option1=0, 1, 0 )","v":1},"0 - 0.4",null,{"$f":"IF( F$33=$D14, 1, 0 )","v":0},{"$f":"IF( G$33=$D14, 1, 0 )","v":0},0,0,0,0,0,0,0,0,0,0,0,0,0,0,0,0,0,0,0,0,0,0,0,0,0,0,0,1,1,0,0,0,0,0,0,0,0,1,0,0,0,0,0,0,0,1,0,0,0,0,0,0,0,0,0,0,0,0,0,0,0,0,0,{"$f":"IF( BS$33=$D14, 1, 0 )","v":0},0,0,0,1,0,0,0,0,0,0,0,0,0,0,0,0,0,0,0,0,1,1,0,0,0,0,0,1,0,0,0,0,0,0,0,0,0,0,1,0,0,0,0,0,0,0,0,1,0,0,0,0,1,0,0,0,0,0,0,0,0,1,1,{"$f":"IF( EE$33=$D14, 1, 0 )","v":0},1,0,0,1,0,0,0,0,0,0,0,1,1,0,1,1,0,0,1,0,0,0,1,0,0,0,1,0,0,0]
[null,0,{"$f":"IF( TRRange_Option2=0, 1, 0 )","v":1},"0.5 - 0.8",null,{"$f":"IF( F$33=$D15, 1, 0 )","v":0},0,0,0,0,0,0,0,0,0,0,0,0,0,0,0,0,0,0,0,0,0,0,0,0,0,0,0,0,0,0,0,0,0,0,0,0,0,0,0,0,0,0,0,0,0,0,0,0,0,0,0,0,0,0,0,0,0,0,0,0,0,0,0,0,0,0,0,0,0,0,0,0,0,0,0,0,0,1,0,0,0,0,0,0,0,0,0,0,0,0,0,0,0,0,0,0,0,0,0,0,0,0,0,0,0,0,0,0,0,0,1,1,0,1,0,0,1,0,0,1,0,0,0,0,0,0,0,0,0,0,0,0,0,0,0,0,0,0,0,0,0,0,0,0,0,0,0,0,0,0,0,0,1,0,1,0,0,1,0]
[null,0,{"$f":"IF( TRRange_Option3=0, 1, 0 )","v":1},"0.9 - 1.2",null,0,0,0,0,0,0,1,1,0,1,1,0,0,0,1,1,1,1,1,1,0,0,0,0,0,1,0,1,1,0,0,0,1,1,0,0,0,1,1,0,0,1,0,1,1,1,1,0,1,1,1,1,0,1,1,1,1,1,0,1,0,0,0,0,1,0,1,1,1,0,0,1,0,0,1,1,1,1,0,1,1,1,1,0,1,1,0,0,1,1,1,1,1,0,1,1,1,1,1,1,1,1,1,1,0,1,1,1,1,1,1,0,0,0,0,1,1,0,0,0,0,1,1,1,1,1,1,0,0,1,0,1,0,0,1,1,1,1,1,1,1,0,0,1,0,0,1,1,0,0,1,1,0,0,1,0,0,0,0,1]
[null,0,{"$f":"IF( TRRange_Option4=0, 1, 0 )","v":1},"1.3 - 1.6",null,1,0,1,0,1,0,0,0,0,0,0,1,1,1,0,0,0,0,0,0,1,1,1,1,1,0,1,0,0,0,0,1,0,0,1,1,1,0,0,0,0,0,0,0,0,0,0,0,0,0,0,0,1,0,0,0,0,0,1,0,1,1,1,1,0,1,0,0,0,0,0,0,1,1,0,0,0,0,0,0,0,0,0,1,0,0,0,0,0,0,0,0,0,0,0,0,0,0,0,0,0,0,0,0,0,0,0,0,0,0,0,0,0,0,0,0,0,0,0,0,0,0,0,0,0,0,0,0,{"$f":"IF( ED$33=$D17, 1, 0 )","v":0},0,0,0,1,0,0,0,0,0,0,0,0,0,0,0,0,0,0,0,0,1,0,0,0,0,0,0,0,0,0,0]
[null,0,{"$f":"IF( TRRange_Option5=0, 1, 0 )","v":1},"≥ 1.7",null,0,0,0,1,0,1,0,0,0,0,0,0,0,0,0,0,0,0,0,0,0,0,0,0,0,0,0,0,0,0,{"$f":"IF( AJ$33=$D18, 1, 0 )","v":0},0,0,0,0,0,0,0,0,0,0,0,0,0,0,0,0,0,0,0,0,0,0,0,0,0,0,0,0,0,0,0,0,0,0,0,0,0,0,0,1,0,0,0,0,0,0,0,0,0,0,0,0,0,0,0,0,0,0,0,0,0,0,0,{"$f":"IF( CV$33=$D18, 1, 0 )","v":0},0,0,0,0,0,0,0,0,0,0,0,0,0,0,0,0,0,0,0,0,0,0,0,0,0,0,0,0,0,0,0,0,0,0,0,0,0,0,0,0,0,0,0,0,0,0,0,0,0,0,0,0,0,0,0,0,0,0,0,0,0,0,0,0,0]
[null,0,{"$f":"IF( TRRange_Option6=0, 1, 0 )","v":1},"≥3.0",null,0,1,0,0,0,0,0,0,1,0,0,0,0,0,0,0,{"$f":"IF( V$33=$D19, 1, 0 )","v":0},0,0,0,0,0,0,0,0,0,0,0,0,0,0,0,0,0,0,0,0,0,0,0,1,0,1,0,0,0,0,0,0,0,0,0,0,0,0,0,0,0,0,0,0,0,0,0,0,0,0,0,0,0,0,0,0,0,0,0,0,0,0,0,0,0,0,0,0,0,0,0,0,0,0,0,0,0,0,0,0,0,0,0,0,0,0,0,0,0,0,0,0,0,0,0,0,0,0,0,0,0,0,0,0,0,0,0,0,0,0,0,0,0,0,0,0,0,0,0,0,0,0,0,0,0,0,0,0,0,0,0,0,0,0,0,0,0,0,0,0,0,0,0]
[]
[null,null,null,"Net Filter",null,{"$f":"IF( (PRODUCT($C6,F$6)+PRODUCT($C12,F$12)+SUMPRODUCT($C14:$C19,F$14:F$19))=3, 1, 0 )","v":0},{"$f":"IF( (PRODUCT($C6,G$6)+PRODUCT($C12,G$12)+SUMPRODUCT($C14:$C19,G$14:G$19))=3, 1, 0 )","v":0},0,0,0,0,0,0,0,0,0,0,0,0,0,0,0,0,0,0,0,0,0,0,0,0,0,0,0,0,0,0,0,0,0,0,0,0,0,0,0,0,0,0,0,0,0,0,0,0,0,0,0,0,0,0,0,0,0,0,0,0,0,0,0,{"$f":"IF( (PRODUCT($C6,BS$6)+PRODUCT($C12,BS$12)+SUMPRODUCT($C14:$C19,BS$14:BS$19))=3, 1, 0 )","v":0},0,0,0,0,0,0,0,0,0,0,0,0,0,0,0,0,0,0,0,0,0,0,0,0,0,0,0,0,0,0,0,0,0,0,0,0,0,0,0,0,0,0,0,0,0,0,0,0,0,0,0,0,0,0,0,0,0,0,0,0,0,0,0,{"$f":"IF( (PRODUCT($C6,EE$6)+PRODUCT($C12,EE$12)+SUMPRODUCT($C14:$C19,EE$14:EE$19))=3, 1, 0 )","v":0},0,0,0,0,0,0,0,0,0,0,0,0,0,0,0,0,0,0,0,0,0,0,0,0,0,0,0,0,0,0]
[null,null,null,"Count",null,{"$f":"IF( ISNUMBER(D22), D22+F21, F21 )","v":0},{"$f":"IF( ISNUMBER(F22), F22+G21, G21 )","v":0},0,0,0,0,0,0,0,{"$f":"IF( ISNUMBER(N22), N22+O21, O21 )","v":0},{"$f":"IF( ISNUMBER(O22), O22+P21, P21 )","v":0},0,0,0,0,0,0,0,0,0,0,0,0,0,0,0,0,0,0,0,0,0,0,0,0,0,0,0,0,0,0,0,0,0,0,0,0,0,0,0,0,0,0,0,0,0,0,0,0,0,0,0,0,0,0,0,0,0,0,0,0,0,0,0,{"$f":"IF( ISNUMBER(CA22), CA22+CB21, CB21 )","v":0},0,0,0,0,0,0,0,0,0,0,0,0,0,0,0,0,0,0,0,0,0,0,0,0,0,0,0,0,0,0,0,0,0,0,0,0,0,0,0,0,0,0,0,0,0,0,0,0,0,0,0,0,0,0,0,0,0,0,0,0,0,0,0,{"$f":"IF( ISNUMBER(EM22), EM22+EN21, EN21 )","v":0},0,0,0,0,0,0,0,0,0,0,0,0,0,0,0,0,0,0,0,0,{"$f":"IF( ISNUMBER(FC22), FC22+FI21, FI21 )","v":0}]
[null,{"$f":"MAX(D23:FI23)","v":0},null,"Index",null,{"$f":"IF(C22=F22, 0, F22 )","v":0},{"$f":"IF(D22=G22, 0, G22 )","v":0},{"$f":"IF(F22=H22, 0, H22 )","v":0},0,0,0,0,0,0,{"$f":"IF(M22=O22, 0, O22 )","v":0},{"$f":"IF(N22=P22, 0, P22 )","v":0},0,0,0,0,0,0,0,0,0,0,0,0,0,0,0,0,0,0,0,0,0,0,0,0,0,0,0,0,0,0,0,0,0,0,0,0,0,0,0,0,0,0,0,0,0,0,0,0,0,0,0,0,0,0,0,0,0,0,0,0,0,0,0,{"$f":"IF(BZ22=CB22, 0, CB22 )","v":0},0,0,0,0,0,0,0,0,0,0,0,0,0,0,0,0,0,0,0,0,0,0,0,0,0,0,0,0,0,0,0,0,0,0,0,0,0,0,0,0,0,0,0,0,0,0,0,0,0,0,0,0,0,0,0,0,0,0,0,0,0,0,0,{"$f":"IF(EL22=EN22, 0, EN22 )","v":0},0,0,0,0,0,0,0,0,0,0,0,0,0,0,0,0,0,0,0,0,{"$f":"IF(FB22=FI22, 0, FI22 )","v":0}]
[null,null,null,null,null,1,2,3,4,5,6,7,8,9,10,11,12,13,14,15,16,17,18,19,20,21,22,23,24,25,26,27,28,29,30,31,32,33,34,35,36,37,38,39,40,41,42,43,44,45,46,47,48,49,50,51,52,53,54,55,56,57,58,59,60,61,62,63,64,65,66,67,68,69,70,71,72,73,74,75,76,77,78,79,80,81,82,83,84,85,86,87,88,89,90,91,92,93,94,95,96,97,98,99,100,101,102,103,104,105,106,107,108,109,110,111,112,113,114,115,116,117,118,119,120,121,122,123,124,125,126,127,128,129,130,131,132,133,134,135,136,137,138,139,140,141,142,143,144,145,146,147,148,149,150,151,152,153,154,155,156,157,158,159,160]
[null,null,1]
[null,null,2,"DMD",null,"DLP2000","DLP2000","DLP2000","DLP2000","DLP2000","DLP2000","DLP2010","DLP2010","DLP2010","DLP2010","DLP2010","DLP2010","DLP2010","DLP2010","DLP2010","DLP2010","DLP2010","DLP2010","DLP2010","DLP2010","DLP2010","DLP2010","DLP2010","DLP2010","DLP2010","DLP2010","DLP2010","DLP2010","DLP2010","DLP2010","DLP2010","DLP2010","DLP2010","DLP2010","DLP2010","DLP2010","DLP2010","DLP230GP","DLP230GP","DLP230GP","DLP230GP","DLP230GP","DLP230GP","DLP230GP","DLP230GP","DLP230GP","DLP230GP","DLP230GP","DLP230GP","DLP230GP","DLP230GP","DLP230GP","DLP230KP","DLP230KP","DLP230KP","DLP230KP","DLP230KP","DLP230KP","DLP3010","DLP3010","DLP3010","DLP3010","DLP3010","DLP3010","DLP3010","DLP3010","DLP3010","DLP3010","DLP3010","DLP3010","DLP3010","DLP3010","DLP3010","DLP3010","DLP3010","DLP3010","DLP4500 ","DLP4500 ","DLP4500 ","DLP4501","DLP4501","DLP4501","DLP4501","DLP4501","DLP230NP","DLP230NP","DLP230NP","DLP230NP","DLP230NP","DLP230NP","DLP230NP","DLP230NP","DLP230NP","DLP230NP","DLP230NP","DLP230NP","DLP230NP","DLP230NP","DLP3310","DLP3310","DLP3310","DLP3310","DLP3310","DLP3310","DLP3310","DLP3310","DLP3310","DLP3310","DLP3310","DLP4710","DLP4710","DLP4710","DLP4710","DLP4710","DLP4710","DLP4710","DLP4710","DLP4710","DLP4710","DLP4710","DLP4710","DLP4710","DLP4710","DLP4710","DLP4710","DLP4710","DLP4710","DLP4710","DLP4710","DLP4710","DLP4710","DLP4710","DLP4710","DLP4710","DLP4710","DLP4710","DLP470TE","DLP470TE","DLP470TP","DLP470TP","DLP470TP","DLP470TP","DLP470TP","DLP470TP","DLP470TP","DLP470TP","DLP470TP","DLP470TP","DLP470TP","DLP470TP","DLP470TP","DLP471TP","DLP471TP","DLP471TP","DLP471TP","DLP471TP","DLP471TP","DLP471TP","DLP471TP","DLP471TP"]
[null,null,3,"Module Model Number",null,"U205","H210","H212","SP1000","FLA2","FLE2-T","H15L","HV75","Z213","U206","U209","S215","S216","F220","E4P","E4","E4SP","E4S","E6","E5","H6R","H6T","IPD832G","IPD832GH","IPD833G","IPD833L","IPD833YL","IPD831GS","IPD881GS","IPD832MR","IPD881MR","OPD60L","OPD07","OPD07S","OPD08","MW700","FLA8+","H21","H21E","HQ33HB_MFC","F241","F240","F250C","IPD981GS","OPD61L","OPD60","OPD60H","USD65","OPD66S","OPD63L","FLA12-T","FLA12X-T","APOXXX003A","IPD1281GS","OPD61","OPD63N","FLA12-H","FLA12","APOXXX002A","H6E","H9H","COP30D","DODP30E1","P2","P8","IPD1238GN","IPD1238GL","IPD1238MX","IPD1238GX-E","IPD1238GR","IPD1239GH","OPD27","OPD20","OPD22","OPD51P","FLA6H","P1ATA","P1ATGA","F4TF","IPD1261HL","IPD1261HS","OPD35","OPD38","SCOTCH","H23","H23E","HY37HB_MFC","HY33HC_MFC","F230","F250","E10","E10FUR","OPD62","USD63","OPD68","FLA12-FH","FLA12-FH+","FLA12-F","P13EGA","P13HG","P6","P6A","OPD50","OPD51","USD53","OPD53","R0618","FLA9","FLA9-H","F10G","F10HG","F11GS","F11HG","F27F_MF","F56","F57","FY80HA","FY81HA","FY82HA_MF","FY85HA_MFB","FY86HA","FY87HA","F18H","S3","IPD1961G","IPD1963G","IPD1981GP","IPD1981MU","IPD1982GR","IPD1986MS","USD85L","OPD85L","FLA7","FUL","FLA7-S","FLA7S+","U30UE-X2","U30UE-X1","U16U pro","U18U+","S5","LM5","LM9","IPD3891SL","IPD3891GR","USD85","OPD80","OPD85","FUV","FLA11X","FLA11H","F16D","F17D_MF","F25D_MF","FF80HA","FF81HA","FF82HA_MF","FF85HA_MFB","FF86HA","FF87HA"]
[null,null,4,"Manufacture",null,"ELEPN","ELEPN","ELEPN","Sekonix","Young Optics","Young Optics","AnHua","AnHua","ELEPN","ELEPN","ELEPN","ELEPN","ELEPN","ELEPN","eViewTek","eViewTek","eViewTek","eViewTek","eViewTek","eViewTek","eViewTek","eViewTek","iView","iView","iView","iView","iView","iView","iView","iView","iView","Ongine","Ongine","Ongine","Ongine","Sekonix","Young Optics","AnHua","AnHua","AnHua","ELEPN","ELEPN","ELEPN","iView","Ongine","Ongine","Ongine","Ongine","Ongine","Ongine","Young Optics","Young Optics","ACTS","iView","Ongine","Ongine","Young Optics","Young Optics","ACTS","AnHua","AnHua","CLAROPTIC","Digital Optics","eViewTek","eViewTek","iView","iView","iView","iView","iView","iView","Ongine","Ongine","Ongine","Ongine","Young Optics","AnHua","AnHua","AnHua","iView","iView","Ongine","Ongine","UNEED","AnHua","AnHua","AnHua","AnHua","ELEPN","ELEPN","eViewTek","eViewTek","Ongine","Ongine","Ongine","Young Optics","Young Optics","Young Optics","AnHua","AnHua","eViewTek","eViewTek","Ongine","Ongine","Ongine","Ongine","Techno Horizon","Young Optics","Young Optics","AnHua","AnHua","AnHua","AnHua","AnHua","AnHua","AnHua","AnHua","AnHua","AnHua","AnHua","AnHua","AnHua","Appotronics","eViewTek","iView","iView","iView","iView","iView","iView","Ongine","Ongine","Young Optics","Young Optics","Young Optics","Young Optics","Appotronics","Appotronics","Appotronics","Appotronics","eViewTek","Hisense","Hisense","iView","iView","Ongine","Ongine","Ongine","Young Optics","Young Optics","Young Optics","AnHua","AnHua","AnHua","AnHua","AnHua","AnHua","AnHua","AnHua","AnHua"]
[null,null,5,"Max Lumens",null,50,150,150,50,50,50,150,150,300,150,150,150,300,300,150,150,150,150,300,150,150,150,150,150,50,50,50,50,300,150,150,150,300,300,50,150,150,300,300,300,300,600,600,300,300,150,150,300,300,600,300,150,300,300,300,600,300,150,300,600,300,150,300,300,600,300,300,300,300,300,150,150,300,300,600,600,300,600,600,600,1500,600,1500,150,300,300,300,300,600,600,300,300,300,600,600,300,300,150,600,1500,600,600,300,600,1500,1500,600,600,600,1500,1500,1500,1500,1500,1500,1500,2000,1500,1500,2000,2000,2000,1500,1500,1500,600,1500,1500,1500,1500,1500,1500,600,600,1500,1500,3000,5000,1500,1500,1500,1500,1500,1500,1500,1500,1500,1500,1500,1500,1500,1500,1500,1500,2000,1500,1500,2000,2000,2000]
[null,null,6,"Min Lumens",null,0,50,50,0,0,0,50,50,150,50,50,50,150,150,50,50,50,50,150,50,50,50,50,50,0,0,0,0,150,50,50,50,150,150,0,50,50,150,150,150,150,300,300,150,150,50,50,150,150,300,150,50,150,150,150,300,150,50,150,300,150,50,150,150,300,150,150,150,150,150,50,50,150,150,300,300,150,300,300,300,600,300,600,50,150,150,150,150,300,300,150,150,150,300,300,150,150,50,300,600,300,300,150,300,600,600,300,300,300,600,600,600,600,600,600,600,1500,600,600,1500,1500,1500,600,600,600,300,600,600,600,600,600,600,300,300,600,600,1500,3000,600,600,600,600,600,600,600,600,600,600,600,600,600,600,600,600,1500,600,600,1500,1500,1500]
[null,null,7,"Illumination Light Source",null,"LED","LED","LED","LED","LED","LED","LED","LED","LED","LED","LED","LED","LED","LED","LED","LED","LED","LED","LED","LED","LED","LED","LED","LED","LED","LED","LED","LED","LED","LED","LED","LED","LED","LED","LED","LED","LED","LED","LED","LED","LED","LED","LED","LED","LED","LED","LED","LED","LED","LED","LED","LED","LED","LED","LED","LED","LED","LED","LED","LED","LED","LED","LED","LED","LED","LED","LED","LED","LED","LED","LED","LED","LED","LED","LED","LED","LED","LED","LED","LED","LED","LED","LED","LED","LED","LED","LED","LED","LED","LED","LED","LED","LED","LED","LED","LED","LED","LED","LED","LED","LED","LED","LED","LED","LED","LED","LED","LED","LED","LED","LED","LED","LED","LED","LED","LED","LED","LED","LED","LED","LED","LED","Laser","LED","LED","LED","LED","LED","LED","LED","LED","LED","LED","LED","LED","LED","Laser","Laser","Laser","Laser","LED","Laser","Laser","LED","LED","LED","LED","LED","Laser","LED","LED","LED","LED","LED","LED","LED","LED","LED","LED","LED"]
[null,null,8,"Optical Offset",null,1,0,1,1,1,1,1,1,0,0,0,1,1,1,0,0,1,1,1,1,1,1,1,1,0,0,0,0,1,"≥120%","≥120%",0,1,1,1,1,1,1,1,1,0,1,0,1,1,0,1,1.2,1,1,1,1,1,1,1,1,1,1,1,1,1,"100% or 0%","100% or 0%",1,1,1,1,1,1,"≥120%",1,0.5,1,1,1,1,1,1,1.32,1,1,1,1,1,1,1,1,1,1,1,1,1.4,1,1.2,1,1,1,1,1,1,1,1,1,1,1.2,1,1,1,1,1,1,1,1,1.2,1,1.4,1,1,1.2,1,1,1.4,"≥100%",1,1,1,1,"≥120%",null,null,1,1,1,"≥120%",1,1,"≥140%","≥140%","≥140%","≥140%",1,"≥120%","≥120%",1,null,1.5,1,1,"≥120%",1,1,1,1.2,1,1,1,1.2,1,1,1.4]
[null,null,9,"Throw Ratio",null,"1.3 - 1.6","≥3.0","1.3 - 1.6","≥ 1.7","1.3 - 1.6","≥ 1.7","0.9 - 1.2","0.9 - 1.2","≥3.0","0.9 - 1.2","0.9 - 1.2","1.3 - 1.6","1.3 - 1.6","1.3 - 1.6","0.9 - 1.2","0.9 - 1.2","0.9 - 1.2","0.9 - 1.2","0.9 - 1.2","0.9 - 1.2","1.3 - 1.6","1.3 - 1.6","1.3 - 1.6","1.3 - 1.6","1.3 - 1.6","0.9 - 1.2","1.3 - 1.6","0.9 - 1.2","0.9 - 1.2","0 - 0.4","0 - 0.4","1.3 - 1.6","0.9 - 1.2","0.9 - 1.2","1.3 - 1.6","1.3 - 1.6","1.3 - 1.6","0.9 - 1.2","0.9 - 1.2","0 - 0.4","≥3.0","0.9 - 1.2","≥3.0","0.9 - 1.2","0.9 - 1.2","0.9 - 1.2","0.9 - 1.2","0 - 0.4","0.9 - 1.2","0.9 - 1.2","0.9 - 1.2","0.9 - 1.2","1.3 - 1.6","0.9 - 1.2","0.9 - 1.2","0.9 - 1.2","0.9 - 1.2","0.9 - 1.2","1.3 - 1.6","0.9 - 1.2","1.3 - 1.6","1.3 - 1.6","1.3 - 1.6","1.3 - 1.6","0.9 - 1.2","1.3 - 1.6","0.9 - 1.2","0.9 - 1.2","0.9 - 1.2","0 - 0.4","≥ 1.7","0.9 - 1.2","1.3 - 1.6","1.3 - 1.6","0.9 - 1.2","0.9 - 1.2","0.9 - 1.2","0.9 - 1.2","0.5 - 0.8","0.9 - 1.2","0.9 - 1.2","0.9 - 1.2","0.9 - 1.2","1.3 - 1.6","0.9 - 1.2","0.9 - 1.2","0 - 0.4","0 - 0.4","0.9 - 1.2","0.9 - 1.2","0.9 - 1.2","0.9 - 1.2","0.9 - 1.2","0 - 0.4","0.9 - 1.2","0.9 - 1.2","0.9 - 1.2","0.9 - 1.2","0.9 - 1.2","0.9 - 1.2","0.9 - 1.2","0.9 - 1.2","0.9 - 1.2","0.9 - 1.2","0 - 0.4","0.9 - 1.2","0.9 - 1.2","0.9 - 1.2","0.9 - 1.2","0.9 - 1.2","0.9 - 1.2","0.5 - 0.8","0.5 - 0.8","0 - 0.4","0.5 - 0.8","0.9 - 1.2","0.9 - 1.2","0.5 - 0.8","0 - 0.4",">1.2","0.5 - 0.8","0.9 - 1.2","0.9 - 1.2","0.9 - 1.2","0.9 - 1.2","0.9 - 1.2","0.9 - 1.2","0 - 0.4","0 - 0.4","0.9 - 1.2","0 - 0.4","0.9 - 1.2","1.3 - 1.6","0 - 0.4","0.9 - 1.2","0.9 - 1.2","0.9 - 1.2","0.9 - 1.2","0.9 - 1.2","0.9 - 1.2","0.9 - 1.2","0 - 0.4","0 - 0.4","0.9 - 1.2","0 - 0.4","0 - 0.4","0.9 - 1.2","0.9 - 1.2","0 - 0.4","1.3 - 1.6","0.9 - 1.2","0.9 - 1.2","0 - 0.4","0.5 - 0.8","0.9 - 1.2","0.5 - 0.8","0 - 0.4",">1.2","0.5 - 0.8","0.9 - 1.2"]
[null,null,10,"Flash Memory Included?",null,"Yes","Yes","Yes","Yes","Yes","Yes","No","No","Yes","Yes","Yes","Yes","Yes","Yes","No","No","No","No","No","No","No","No","Yes","Yes","Yes","Yes","Yes","Yes","Yes","Yes","Yes","Yes","Yes","Yes","Yes","Yes","Yes","No","No","No","Yes","Yes","Yes","Yes","Yes","Yes","Yes","Yes","Yes","Yes","Yes","Yes","No","Yes","Yes","Yes","Yes","Yes","No","No","No","Yes","No","No","No","Yes","Yes","Yes","Yes","Yes","Yes","Yes","Yes","Yes","Yes","Yes","No","No","No","No","No","No","No","Yes","Yes","Yes","Yes","Yes","Yes","Yes","No","Yes","Yes","Yes","Yes","Yes","Yes","Yes","No","No","No","No","Yes","Yes","Yes","Yes","No","Yes","Yes","No","No","No","No","No","No","No","No","No","No","No","No","No","Yes","No","Yes","Yes","No","No","Yes","No","Yes","Yes","Yes","Yes","Yes","Yes","Yes","Yes","Yes","Yes","No","Yes","Yes","No","No","Yes","Yes","Yes","Yes","Yes","Yes","No","No","No","No","No","No","No","No","No"]
[null,null,11,"Model # w/ Electronics",null,"U205A","H210A","H212A",null,null,null,"H15L EVM","HV75 EVM","Z213A","U206A","U209A","S215A","S216A","F220A",null,"DB086",null,"DB086","DB056P",null,"DB086","DB086","IPD833 demo board v1.2","IPD833 demo board v1.2","IPD833 demo board v1.2","IPD833 demo board v1.2","IPD833 demo board v1.2","IPD833 demo board v1.2","IPD833 demo board v1.2","IPD833 demo board v1.2","IPD833 demo board v1.2","OPD60LM","OPD07M","OPD07SM","OPD08M",null,"FLA8+_EVM","H21 EVM","H21E EVM","HQ33HB_MFC EVM","F241A","F240A","F250CA","IPD981 demo board v1.0","OPD61LM","OPD60M","OPD60HM","USD65M","OPD66SM","OPD63LM",null,null,null,"IPD1281 demo board v1.0","OPD61M","OPD63NM",null,null,null,"H6E EVM","H9H EVM","DODP30D EVM","DODP30E1 EVM","DB162","DB168","IPD1238 demo board v1.3","IPD1238 demo board v1.3","IPD1238 demo board v1.3","IPD1238 demo board v1.3","IPD1238 demo board v1.3","IPD1238 demo board v1.3","OPD27M","OPD20M","OPD22M","OPD51PM",null,"P1ATA EVM","P1ATGA EVM","F4TF EVM","IPD1261 demo board v1.2","IPD1261 demo board v1.2","NO","NO","SCOTCH-E","H23 EVM","H23E EVM","HY37HB_MFC EVM","HY33HC_MFC EVM","F230A","F250A",null,null,"OPD62M","USD63M","OPD68M",null,null,"FLA12-F_EVM","P13EGA EVM","P13HG EVM",null,null,"OPD50M","OPD51M","USD53M","OPD53M",null,null,null,"F10G EVM","F10HG EVM","F11GS EVM","F11HG EVM","F27 EVM","F56 EVM","F57 EVM","FY80HA EVM","FY81HA EVM","FY82HA_MF EVM","FY85HA_MFB EVM","FY86HA EVM","FY87HA EVM",null,null,"IPD1961 demo board v1.0","IPD1961 demo board v1.0","IPD1961 demo board v1.0","IPD1961 demo board v1.0","IPD1961 demo board v1.0","IPD1961 demo board v1.0","USD85LM","OPD85LM","FLA7_EVM",null,"FLA7-S EVM",null,null,null,null,null,null,null,null,"IPD1961 demo board v1.0","IPD1961 demo board v1.0","USD85M","OPD80M","OPD85M",null,null,null,"F16D EVM","F17D_MF EVM","F25D_MF EVM","FF80HA EVM","FF81HA EVM","FF82HA_MF EVM","FF85HA_MFB EVM","FF86HA EVM","FF87HA EVM"]
[null,null,12,"High-Vol Orders Only?",null,"Yes","--","Yes","Yes","--","--","--","--","Yes","Yes","Yes","Yes","Yes","Yes","--","--","--","--","--","--","--","--","???","???","???","???","???","???","???","???","???","--","--","--","--","--","--","--","--","--","Yes","Yes","--","???","--","--","--","--","--","--","--","--","--","???","--","--","--","--","--","--","--","--","--","--","--","???","???","???","???","???","???","--","--","--","--","--","--","--","--","???","???","--","--","--","--","--","--","--","Yes","Yes","--","--","--","--","--","--","--","--","--","--","--","--","--","--","--","--","???","--","--","--","--","--","--","--","--","--","--","--","--","--","--","--","--","--","???","???","???","???","???","???","--","--","--","--","--","--","--","--","--","--","--","--","--","???","???","--","--","--","--","--","--","--","--","--","--","--","--","--","--","--"]
[null,null,13,"Low-Vol Orders Accepted?",null,"--","Yes","--","--","Yes","Yes","--","--","--","--","--","--","--","--","--","--","--","--","--","--","--","--","???","???","???","???","???","???","???","???","???","Yes","Yes","Yes","Yes","Yes","Yes","--","--","--","--","--","Yes","???","Yes","Yes","Yes","Yes","Yes","Yes","Yes","Yes","Yes","???","Yes","Yes","Yes","Yes","Yes","--","--","--","--","--","--","???","???","???","???","???","???","Yes","Yes","Yes","Yes","Yes","--","--","--","???","???","Yes","Yes","--","--","--","--","--","--","--","--","--","Yes","Yes","Yes","Yes","Yes","Yes","--","--","--","--","Yes","Yes","Yes","Yes","???","Yes","Yes","--","--","--","--","--","--","--","--","--","--","--","--","--","Yes","--","???","???","???","???","???","???","Yes","Yes","Yes","Yes","Yes","Yes","Yes","Yes","Yes","Yes","--","Yes","Yes","???","???","Yes","Yes","Yes","Yes","Yes","Yes","--","--","--","--","--","--","--","--","--"]
[null,null,14,"Single-Unit Orders Accepted?",null,"--","--","--","--","--","--","Yes","Yes","--","--","--","--","--","--","Yes","Yes","Yes","Yes","Yes","Yes","Yes","Yes","???","???","???","???","???","???","???","???","???","--","--","--","--","--","--","Yes","Yes","Yes","--","--","--","???","--","--","--","--","--","--","--","--","--","???","--","--","--","--","--","Yes","Yes","Yes","Yes","Yes","Yes","???","???","???","???","???","???","--","--","--","--","--","Yes","Yes","Yes","???","???","--","--","Yes","Yes","Yes","Yes","Yes","--","--","Yes","Yes","--","--","--","--","--","--","Yes","Yes","Yes","Yes","--","--","--","--","???","--","--","Yes","Yes","Yes","Yes","Yes","Yes","Yes","Yes","Yes","Yes","Yes","Yes","Yes","--","Yes","???","???","???","???","???","???","--","--","--","--","--","--","--","--","--","--","Yes","--","--","???","???","--","--","--","--","--","--","Yes","Yes","Yes","Yes","Yes","Yes","Yes","Yes","Yes"]
[null,null,15,"Company Website",null,"ELEPN","ELEPN","ELEPN","Sekonix","YOUNGOptics","YOUNGOptics","AnHua","AnHua","ELEPN","ELEPN","ELEPN","ELEPN","ELEPN","ELEPN","eViewTek","eViewTek","eViewTek","eViewTek","eViewTek","eViewTek","eViewTek","eViewTek","iView","iView","iView","iView","iView","iView","iView","iView","iView","Ongine","Ongine","Ongine","Ongine","Sekonix","YOUNGOptics","AnHua","AnHua","AnHua","ELEPN","ELEPN","ELEPN","iView","Ongine","Ongine","Ongine","Ongine","Ongine","Ongine","YOUNGOptics","YOUNGOptics","ACTS","iView","Ongine","Ongine","YOUNGOptics","YOUNGOptics","ACTS","AnHua","AnHua","CLAROPTIC","Digital Optics","eViewTek","eViewTek","iView","iView","iView","iView","iView","iView","Ongine","Ongine","Ongine","Ongine","YOUNGOptics","AnHua","AnHua","AnHua","iView","iView","Ongine","Ongine","UNEED","AnHua","AnHua","AnHua","AnHua","ELEPN","ELEPN","eViewTek","eViewTek","Ongine","Ongine","Ongine","YOUNGOptics","YOUNGOptics","YOUNGOptics","AnHua","AnHua","eViewTek","eViewTek","Ongine","Ongine","Ongine","Ongine","Techno Horizon","YOUNGOptics","YOUNGOptics","AnHua","AnHua","AnHua","AnHua","AnHua","AnHua","AnHua","AnHua","AnHua","AnHua","AnHua","AnHua","AnHua","Appotronics","eViewTek","iView","iView","iView","iView","iView","iView","Ongine","Ongine","YOUNGOptics","YOUNGOptics","YOUNGOptics","YOUNGOptics","Appotronics","Appotronics","Appotronics","Appotronics","eViewTek","Hisense","Hisense","iView","iView","Ongine","Ongine","Ongine","YOUNGOptics","YOUNGOptics","YOUNGOptics","AnHua","AnHua","AnHua","AnHua","AnHua","AnHua","AnHua","AnHua","AnHua"]
[null,null,16,"Company Website",null,"http://www.elepn.com/","http://www.elepn.com/","http://www.elepn.com/","http://www.sekonix.com/","http://www.youngoptics.com/","http://www.youngoptics.com/","http://www.anhuaoe.com/","http://www.anhuaoe.com/","http://www.elepn.com/","http://www.elepn.com/","http://www.elepn.com/","http://www.elepn.com/","http://www.elepn.com/","http://www.elepn.com/","http://www.eviewtek.com/","http://www.eviewtek.com/","http://www.eviewtek.com/","http://www.eviewtek.com/","http://www.eviewtek.com/","http://www.eviewtek.com/","http://www.eviewtek.com/","http://www.eviewtek.com/","http://www.iviewdisplays.com/","http://www.iviewdisplays.com/","http://www.iviewdisplays.com/","http://www.iviewdisplays.com/","http://www.iviewdisplays.com/","http://www.iviewdisplays.com/","http://www.iviewdisplays.com/","http://www.iviewdisplays.com/","http://www.iviewdisplays.com/","http://www.ongine.com.cn/","http://www.ongine.com.cn/","http://www.ongine.com.cn/","http://www.ongine.com.cn/","http://www.sekonix.com/","http://www.youngoptics.com/","http://www.anhuaoe.com/","http://www.anhuaoe.com/","http://www.anhuaoe.com/","http://www.elepn.com/","http://www.elepn.com/","http://www.elepn.com/","http://www.iviewdisplays.com/","http://www.ongine.com.cn/","http://www.ongine.com.cn/","http://www.ongine.com.cn/","http://www.ongine.com.cn/","http://www.ongine.com.cn/","http://www.ongine.com.cn/","http://www.youngoptics.com/","http://www.youngoptics.com/","http://www.acts.co.kr/","http://www.iviewdisplays.com/","http://www.ongine.com.cn/","http://www.ongine.com.cn/","http://www.youngoptics.com/","http://www.youngoptics.com/","http://www.acts.co.kr/","http://www.anhuaoe.com/","http://www.anhuaoe.com/","http://www.claroptic.co.kr/","http://www.digitaloptics.co.kr/","http://www.eviewtek.com/","http://www.eviewtek.com/","http://www.iviewdisplays.com/","http://www.iviewdisplays.com/","http://www.iviewdisplays.com/","http://www.iviewdisplays.com/","http://www.iviewdisplays.com/","http://www.iviewdisplays.com/","http://www.ongine.com.cn/","http://www.ongine.com.cn/","http://www.ongine.com.cn/","http://www.ongine.com.cn/","http://www.youngoptics.com/","http://www.anhuaoe.com/","http://www.anhuaoe.com/","http://www.anhuaoe.com/","http://www.iviewdisplays.com/","http://www.iviewdisplays.com/","http://www.ongine.com.cn/","http://www.ongine.com.cn/","https://uneedsys.com/","http://www.anhuaoe.com/","http://www.anhuaoe.com/","http://www.anhuaoe.com/","http://www.anhuaoe.com/","http://www.elepn.com/","http://www.elepn.com/","http://www.eviewtek.com/","http://www.eviewtek.com/","http://www.ongine.com.cn/","http://www.ongine.com.cn/","http://www.ongine.com.cn/","http://www.youngoptics.com/","http://www.youngoptics.com/","http://www.youngoptics.com/","http://www.anhuaoe.com/","http://www.anhuaoe.com/","http://www.eviewtek.com/","http://www.eviewtek.com/","http://www.ongine.com.cn/","http://www.ongine.com.cn/","http://www.ongine.com.cn/","http://www.ongine.com.cn/","https://www.technohorizon.co.jp/","http://www.youngoptics.com/","http://www.youngoptics.com/","http://www.anhuaoe.com/","http://www.anhuaoe.com/","http://www.anhuaoe.com/","http://www.anhuaoe.com/","http://www.anhuaoe.com/","http://www.anhuaoe.com/","http://www.anhuaoe.com/","http://www.anhuaoe.com/","http://www.anhuaoe.com/","http://www.anhuaoe.com/","http://www.anhuaoe.com/","http://www.anhuaoe.com/","http://www.anhuaoe.com/","http://www.appotronics.com/","http://www.eviewtek.com/","http://www.iviewdisplays.com/","http://www.iviewdisplays.com/","http://www.iviewdisplays.com/","http://www.iviewdisplays.com/","http://www.iviewdisplays.com/","http://www.iviewdisplays.com/","http://www.ongine.com.cn/","http://www.ongine.com.cn/","http://www.youngoptics.com/","http://www.youngoptics.com/","http://www.youngoptics.com/","http://www.youngoptics.com/","http://www.appotronics.com/","http://www.appotronics.com/","http://www.appotronics.com/","http://www.appotronics.com/","http://www.eviewtek.com/","http://www.hisense.cn/","http://www.hisense.cn/","http://www.iviewdisplays.com/","http://www.iviewdisplays.com/","http://www.ongine.com.cn/","http://www.ongine.com.cn/","http://www.ongine.com.cn/","http://www.youngoptics.com/","http://www.youngoptics.com/","http://www.youngoptics.com/","http://www.anhuaoe.com/","http://www.anhuaoe.com/","http://www.anhuaoe.com/","http://www.anhuaoe.com/","http://www.anhuaoe.com/","http://www.anhuaoe.com/","http://www.anhuaoe.com/","http://www.anhuaoe.com/","http://www.anhuaoe.com/"]
[null,null,17,"Company Location",null,"China","China","China","Republic of Korea","Taiwan","Taiwan","China","China","China","China","China","China","China","China","China","China","China","China","China","China","China","China","China","China","China","China","China","China","China","China","China","China","China","China","China","Republic of Korea","Taiwan","China","China","China","China","China","China","China","China","China","China","China","China","China","Taiwan","Taiwan","Republic of Korea","China","China","China","Taiwan","Taiwan","Republic of Korea","China","China","Republic of Korea","Republic of Korea","China","China","China","China","China","China","China","China","China","China","China","China","Taiwan","China","China","China","China","China","China","China","Republic of Korea","China","China","China","China","China","China","China","China","China","China","China","Taiwan","Taiwan","Taiwan","China","China","China","China","China","China","China","China","Japan","Taiwan","Taiwan","China","China","China","China","China","China","China","China","China","China","China","China","China","China","China","China","China","China","China","China","China","China","China","Taiwan","Taiwan","Taiwan","Taiwan","China","China","China","China","China","China","China","China","China","China","China","China","Taiwan","Taiwan","Taiwan","China","China","China","China","China","China","China","China","China"]
[null,null,18,"Additional Features",null,"Works w/ TI EVM","Works w/ TI EVM","Works w/ TI EVM","--","--","AR waveguide sub","--","--","Works w/ TI EVM","Works w/ TI EVM","Works w/ TI EVM","Works w/ TI EVM","Works w/ TI EVM","Works w/ TI EVM","--","--","--","--","--","--","--","--","--","--","--","--","--","--","--","--","--","Works w/ TI EVM","Works w/ TI EVM","Works w/ TI EVM","Works w/ TI EVM","--","--","--","--","--","--","Works w/ TI EVM","Works w/ TI EVM","--","Works w/ TI EVM","Works w/ TI EVM","Works w/ TI EVM","Works w/ TI EVM","Works w/ TI EVM","Works w/ TI EVM","--","--","--","--","Works w/ TI EVM","Works w/ TI EVM","--","--","--","--","--","--","--","--","--","--","--","--","--","--","--","Works w/ TI EVM","Works w/ TI EVM","Works w/ TI EVM","Works w/ TI EVM","--","--","--","--","--","--","Works w/ TI EVM","Works w/ TI EVM","--","--","--","--","--","Works w/ TI EVM","Works w/ TI EVM","--","--","Works w/ TI EVM","Works w/ TI EVM","Works w/ TI EVM","--","--","--","--","--","--","--","Works w/ TI EVM","Works w/ TI EVM","Works w/ TI EVM","Works w/ TI EVM","--","--","--","--","--","--","--","--","--","--","--","--","--","--","--","--","--","--","--","--","--","--","--","--","Works w/ TI EVM","Works w/ TI EVM","--","--","--","--","--","--","--","--","--","Works w/ TI EVM","Works w/ TI EVM","--","--","Works w/ TI EVM","Works w/ TI EVM","Works w/ TI EVM","--","--","--","--","--","--","--","--","--","--","--","--"]
[null,null,19]

{"sheet":"Support","index":22,"n_rows":83,"n_cols":46,"rows_kept":83,"cut":false,"hidden":true,"merged":[[12,11,13,49],[9,12,9,15],[9,16,9,19],[9,22,9,33],[9,36,9,39],[9,40,9,43],[9,45,9,49],[7,12,7,19],[7,22,7,33],[7,36,7,43],[7,45,7,49],[8,12,8,15],[8,16,8,19],[8,22,8,33],[8,36,8,39],[8,40,8,43],[8,45,8,49],[71,11,76,49],[44,13,45,27],[22,13,23,18],[29,13,30,27],[36,13,37,27],[55,38,55,49],[41,15,41,19],[15,13,16,18],[57,11,59,49],[60,11,65,49],[68,11,70,49],[48,15,48,27]]}
[]
[]
[]
[]
[]
[]
[]
[null,null,null,null,null,null,null,null,null,null,null,null,"Resolution",null,null,null,null,null,null,null,null,null,"Image Size",null,null,null,null,null,null,null,null,null,null,null,null,null,"Brightness",null,null,null,null,null,null,null,null,"# of Matching"]
[null,null,null,null,null,null,null,null,null,null,null,"Max:",{"$f":"Display_ResolutionSimple_Max","v":"-- x --"},null,null,null,{"$f":"Display_Mpx_Max","v":"-- Mpx"},null,null,null,null,"Max:",{"$f":"CONCATENATE( \"W: \", Display_ImageWidth_Max, \"  x   H: \", Display_ImageHeight_Max, \"   ( D: \", Display_ImageDiag_Max, \" )\"  )","v":"W: -- in  x   H: -- in   ( D: -- in )"},null,null,null,null,null,null,null,null,null,null,null,null,"Max:",{"$f":"Display_Lumens_Max","v":"-- lm"},null,null,null,{"$f":"Display_Nits_Max","v":"-- nits"},null,null,null,null,"Chipsets"]
[null,null,null,null,null,null,null,null,null,null,null,"Min:",{"$f":"Display_ResolutionSimple_Min","v":"-- x --"},null,null,null,{"$f":"Display_Mpx_Min","v":"-- Mpx"},null,null,null,null,"Min:",{"$f":"CONCATENATE( \"W: \", Display_ImageWidth_Min, \"  x   H: \", Display_ImageHeight_Min, \"   ( D: \", Display_ImageDiag_Min, \" )\"  )","v":"W: -- in  x   H: -- in   ( D: -- in )"},null,null,null,null,null,null,null,null,null,null,null,null,"Min:",{"$f":"Display_Lumens_Min","v":"-- lm"},null,null,null,{"$f":"Display_Nits_Min","v":"-- nits"},null,null,null,null,{"$f":"Index_Chipset_Max","v":0}]
[]
[]
[null,null,null,null,null,null,null,null,null,null,null,"TI Worldwide Technical Support"]
[]
[]
[null,null,null,null,null,null,null,null,null,null,null,null,null,"DLP Products"]
[]
[null,null,null,null,null,null,null,null,null,null,null,null,null,null,"Thank you for your business.  Find more information about the wide range of solutions offered by DLP Products at:"]
[]
[null,null,null,null,null,null,null,null,null,null,null,null,null,null,null,{"$f":"HYPERLINK(\"www.ti.com/dlp\", \"DLP® Website\")","v":"DLP® Website"}]
[]
[]
[null,null,null,null,null,null,null,null,null,null,null,null,null,"TI Support"]
[]
[null,null,null,null,null,null,null,null,null,null,null,null,null,null,"Find the answers to your support needs, or get in touch with our support center at:"]
[]
[null,null,null,null,null,null,null,null,null,null,null,null,null,null,null,{"$f":"HYPERLINK(\"www.ti.com/support\", \"TI Support\")","v":"TI Support"}]
[]
[]
[null,null,null,null,null,null,null,null,null,null,null,null,null,"Technical support forums"]
[]
[null,null,null,null,null,null,null,null,null,null,null,null,null,null,"Search through millions of technical quesitons and answers at TI's E2E™ support forum (engineer-to-engineer) at:"]
[]
[null,null,null,null,null,null,null,null,null,null,null,null,null,null,null,"TI E2E™ design support forums"]
[]
[]
[null,null,null,null,null,null,null,null,null,null,null,null,null,"TI Training"]
[]
[null,null,null,null,null,null,null,null,null,null,null,null,null,null,"From technical fundamentals to advanced implementation, we offer on-demand and live training to help bring your"]
[null,null,null,null,null,null,null,null,null,null,null,null,null,null,"next-generation designs to life.  Get started now at:"]
[]
[null,null,null,null,null,null,null,null,null,null,null,null,null,null,null,{"$f":"HYPERLINK(\"https://www.ti.com/video/library.html\", \"TI Video Library\")","v":"TI Video Library"}]
[]
[]
[null,null,null,null,null,null,null,null,null,null,null,null,null,"Feedback on this tool"]
[]
[null,null,null,null,null,null,null,null,null,null,null,null,null,null,"To provide feedback or ask questions about this tool:"]
[]
[null,null,null,null,null,null,null,null,null,null,null,null,null,null,null,"dlpdisplay_smartselect@list.ti.com"]
[]
[]
[null,null,null,null,null,null,null,null,null,null,null,null,null,null,"The platform bar, E2E and Pico are trademarks and DLP is a registred trademark of Texas Instruments."]
[null,null,null,null,null,null,null,null,null,null,null,null,null,null,"All other trademarks are the property of their respective owners."]
[]
[]
[null,null,null,null,null,null,null,null,null,null,null,null,null,null,null,null,null,null,null,null,null,null,null,null,null,null,null,null,null,null,null,null,null,null,null,null,null,null,{"$f":"CONCATENATE( \"Ver. \", App_FullVersion )","v":"Ver. [[Prod]] (Smarta2xOPENv3)"}]
[]
[null,null,null,null,null,null,null,null,null,null,null,"Important Notice"]
[]
[]
[null,null,null,null,null,null,null,null,null,null,null,"The products and services of Texas Instruments Incorporated and its subsidiaries described herein are sold subject to TI’s standard terms and conditions of sale. Customers are advised to obtain the most current and complete information about TI products and services before placing orders. TI assumes no liability for applications assistance, customer’s applications or product designs, software performance, or infringement of patents. The publication of information regarding any other company’s products or services does not constitute TI’s approval, warranty or endorsement thereof."]
[]
[]
[]
[]
[]
[]
[]
[null,null,null,null,null,null,null,null,null,null,null,"Disclaimer"]
[]
[]
[null,null,null,null,null,null,null,null,null,null,null,"Certain information and resources (including links to non-TI sites) may be provided by a third-party partner, and is included here merely for your convenience. TI is not the provider of, and is not responsible for, the content of such information and resources, and you should evaluate them carefully for your intended uses and on your own behalf. The inclusion of such information and resources here does not imply endorsement of any third-party company by TI, and shall not be construed as a warranty or representation regarding the suitability of any third-party products or services, either alone or in combination with any TI product or service."]
[]
[]
[]
[]
[]
[]
[]
[]
[]
[]
[null,null,null,null,null,null,null,null,null,null,null,null,null,null,null,null,null,null,null,null,null,null,null,null,"Show"]

{"sheet":"xAppParmSummary","index":23,"n_rows":26,"n_cols":16,"rows_kept":26,"cut":false,"hidden":true,"merged":[]}
[]
[]
[null,"Image Brightness"]
[null,"Ambient Light Level",{"$f":"DisplayApp_Ambient_Min","v":"--"},"- to -",{"$f":"DisplayApp_Ambient_Max","v":"--"},null,{"$f":"IF( AND(C4<>\"--\", E4<>\"--\"), 1, 0 )","v":0},{"$f":"IF( G4=1, H3+G4, H3 )","v":0},{"$f":"G4*H4","v":0},null,1,{"$f":"MATCH(K4, I$4:I$26, 0 )","v":{"$error":"#N/A"}},{"$f":"IF( ISERROR($L4), \"  \", INDEX(B$4:B$26, $L4, 0 ) )","v":"  "},"  ",{"$f":"IF( ISERROR($L4), \"  \", \"- to -\" )","v":"  "},{"$f":"IF( ISERROR($L4), \" \", INDEX(E$4:E$26, $L4, 0 ) )","v":" "}]
[null,"Image Nits",{"$f":"DisplayApp_Nits_Min","v":"--"},"- to -",{"$f":"DisplayApp_Nits_Max","v":"--"},null,0,{"$f":"IF( G5=1, H4+G5, H4 )","v":0},{"$f":"G5*H5","v":0},null,2,{"$error":"#N/A"},{"$f":"IF( ISERROR($L5), \"  \", INDEX(B$4:B$26, $L5, 0 ) )","v":"  "},"  ",{"$f":"IF( ISERROR($L5), \"  \", \"- to -\" )","v":"  "}," "]
[null,"Projected Lumens",{"$f":"DisplayApp_Lumens_Min","v":"--"},"- to -",{"$f":"DisplayApp_Lumens_Max","v":"--"},null,0,0,0,null,3,{"$error":"#N/A"},{"$f":"IF( ISERROR($L6), \"   \", INDEX(B$4:B$26, $L6, 0 ) )","v":"   "},"  ","  "," "]
[null,"Screen Efficiency",{"$f":"DisplayApp_ScreenEff_Min","v":"--"},"- to -",{"$f":"DisplayApp_ScreenEff_Max","v":"--"},null,0,0,0,null,4,{"$error":"#N/A"},"  ","  ","  "," "]
[null,null,null,null,null,null,null,null,null,null,5,{"$error":"#N/A"},"  ","  ","  "," "]
[null,"Image Size",null,null,null,null,null,null,null,null,6,{"$f":"MATCH(K9, I$4:I$26, 0 )","v":{"$error":"#N/A"}},"  ","  ","  "," "]
[null,"Projected Image Width",{"$f":"DisplayApp_Width_Min","v":"--"},"- to -",{"$f":"DisplayApp_Width_Max","v":"--"},null,{"$f":"IF( AND(C10<>\"--\", E10<>\"--\"), 1, 0 )","v":0},{"$f":"IF( G10=1, H7+G10, H7 )","v":0},{"$f":"G10*H10","v":0},null,7,{"$error":"#N/A"},"  ","  ","  "," "]
[null,"Projected Image Height",{"$f":"DisplayApp_Height_Min","v":"--"},"- to -",{"$f":"DisplayApp_Height_Max","v":"--"},null,0,{"$f":"IF( G11=1, H10+G11, H10 )","v":0},0,null,8,{"$error":"#N/A"},"  ","  ","  "," "]
[null,"Projected Image Diagonal",{"$f":"DisplayApp_Diag_Min","v":"--"},"- to -",{"$f":"DisplayApp_Diag_Max","v":"--"},null,0,0,0]
[null,"Image Aspect Ratio",{"$f":"DisplayApp_AR_Min","v":"--"},"- to -",{"$f":"DisplayApp_AR_Max","v":"--"},null,0,0,0]
[]
[null,"Image Resolution"]
[null,"Viewing Distance",{"$f":"DisplayApp_ViewDist_Min","v":"--"},"- to -",{"$f":"DisplayApp_ViewDist_Max","v":"--"},null,{"$f":"IF( AND(C16<>\"--\", E16<>\"--\"), 1, 0 )","v":0},{"$f":"IF( G16=1, H13+G16, H13 )","v":0},{"$f":"G16*H16","v":0}]
[null,"Horizontal Image FOV",{"$f":"DisplayApp_FOV_Min","v":"--"},"- to -",{"$f":"DisplayApp_FOV_Max","v":"--"},null,0,{"$f":"IF( G17=1, H16+G17, H16 )","v":0},0]
[null,"Pixels Per Degree",{"$f":"DisplayApp_PxPerDeg_Min","v":"--"},"- to -",{"$f":"DisplayApp_PxPerDeg_Max","v":"--"},null,0,0,0]
[null,"Pixels per inch",{"$f":"DisplayApp_PxPerIn_Min","v":"--"},"- to -",{"$f":"DisplayApp_PxPerIn_Max","v":"--"},null,0,0,0]
[null,"Pixels per mm",{"$f":"DisplayApp_PxPerMM_Min","v":"--"},"- to -",{"$f":"DisplayApp_PxPerMM_Max","v":"--"},null,0,0,0]
[null,null,{"$f":"DisplayApp_TextRows_Min","v":"1 in"},"- to -",{"$f":"DisplayApp_TextRows_Max","v":"1 in"}]
[null,null,{"$f":"DisplayApp_TextSize_Min","v":"--"},"- to -",{"$f":"DisplayApp_TextSize_Max","v":"--"},null,{"$f":"IF( AND(C22<>\"--\", E22<>\"--\"), 1, 0 )","v":0},{"$f":"IF( G22=1, H20+G22, H20 )","v":0},{"$f":"G22*H22","v":0}]
[null,"Pixels per Point",{"$f":"DisplayApp_TextFactor_Min","v":"--"},"- to -",{"$f":"DisplayApp_TextFactor_Max","v":"--"},null,0,0,0]
[null,"Standard Resolution ",{"$f":"DisplayApp_IndStdName_Min","v":"--"},"- to -",{"$f":"DisplayApp_IndStdName_Max","v":"--"},null,0,0,0]
[null,"Standard Resolution ",{"$f":"DisplayApp_IndStdRes_Min","v":"--"},null,{"$f":"DisplayApp_IndStdRes_Max","v":"--"},null,0,0,0]
[null,"Manual Resolution",{"$f":"DisplayApp_ManualRes_Min","v":"--"},"- to -",{"$f":"DisplayApp_ManualRes_Max","v":"--"},null,0,0,0]

{"sheet":"xOMMCount","index":24,"n_rows":20,"n_cols":3,"rows_kept":20,"cut":false,"hidden":true,"merged":[]}
[]
[]
[]
[]
[null,"DLP160AP",0]
[null,"DLP160CP",0]
[null,"DLP2000",6]
[null,"DLP2010",31]
[null,"DLP230GP",15]
[null,"DLP230KP",6]
[null,"DLP230NP",14]
[null,"DLP3010",18]
[null,"DLP3310",11]
[null,"DLP4500 ",3]
[null,"DLP4501",5]
[null,"DLP470TE",2]
[null,"DLP470TP",13]
[null,"DLP4710",27]
[null,"DLP471TP",9]
[null,"(8K)",0]

{"sheet":"xLists","index":25,"n_rows":35,"n_cols":41,"rows_kept":35,"cut":false,"hidden":true,"merged":[[2,1,2,3],[2,6,2,9],[2,12,2,15],[2,20,2,28],[3,7,3,8],[3,13,3,14]]}
[]
[]
[null,"App List",null,null,null,null,"Ambient Light Level",null,null,null,null,null,"Units of Measure",null,null,null,null,null,null,null,"Industry Standard Resolutions"]
[null,"Index",null,null,null,null,"Index","Label",null,"Nits Value",null,null,"Index","Label",null,null,null,null,null,null,"Index","Std","Label",null,null,"Columns","Rows",null,"Mpx"]
[null,0,null,null,null,null,0,"Very Dark",null,0,null,null,0,null,null,"--",null,"--",null,null,0]
[null,1,"Laser TV",null,null,null,1,"Dark",null,50,null,null,1,"inches",null,"in",null,1,null,null,1,"8K UHD",{"$f":"CONCATENATE(REPT(\" \", X6), \"  ( \", Z6, \" x \", AA6, \",\", REPT(\" \", Y6),  AC6, \"Mpx )\" )","v":"    ( 7680 x 4320,  33.2Mpx )"},2,2,7680,4320,{"$f":"CONCATENATE(\"_\", Z6, \"_\", AA6, \"_\" )","v":"_7680_4320_"},{"$f":"TEXT( ROUND( (Z6*AA6/1000000), 1 ), \"0.0\")","v":"33.2"},null,null,null,null,null,null,null,null,null,null,null,{"$f":"V6","v":"8K UHD"}]
[null,2,"Mobile Smart TV (Smart Projector)",null,null,null,2,"Dim",null,100,null,null,2,"feet",null,"ft",null,{"$f":"1/12","v":8.3333333333333329E-2},null,null,2,"5K","    ( 5120 x 2880,  14.7Mpx )",2,2,5120,2880,{"$f":"CONCATENATE(\"_\", Z7, \"_\", AA7, \"_\" )","v":"_5120_2880_"},"14.7",null,null,null,null,null,null,null,null,null,null,null,"5K"]
[null,3,"Mobile Projector",null,null,null,3,"Moderate",null,200,null,null,3,"meters",null,"m",null,{"$f":"1/39.37008","v":2.5399999187200026E-2},null,null,3,"4K","    ( 4096 x 2160,    8.8Mpx )",2,4,4096,2160,"_4096_2160_","8.8",null,null,null,null,null,null,null,null,null,null,null,"4K"]
[null,4,"Enterprise Data Projector",null,null,null,4,"Bright",null,300,null,null,4,"[4]",null,null,null,null,null,null,4,"4K / UHD","    ( 3840 x 2160,    8.3Mpx )",2,4,3840,2160,"_3840_2160_","8.3",null,null,null,null,null,null,null,null,null,null,null,"4K / UHD"]
[null,5,"Education Projector",null,null,null,5,"Outside",null,600,null,null,5,"[5]",null,null,null,null,null,null,5,"QHD","    ( 2560 x 1440,    3.7Mpx )",2,4,2560,1440,"_2560_1440_","3.7",null,null,null,null,null,null,null,null,null,null,null,"QHD"]
[null,6,"Smart Display",null,null,null,6,"[6]",null,null,null,null,6,"[6]",null,null,null,null,null,null,6,"QWXGA","    ( 2048 x 1152,    2.4Mpx )",2,4,2048,1152,"_2048_1152_","2.4",null,null,null,null,null,null,null,null,null,null,null,"QWXGA"]
[null,7,"Tablet (embedded)",null,null,null,7,"[7]",null,null,null,null,7,"[7]",null,null,null,null,null,null,7,"WUXGA","    ( 1920 x 1200,    2.3Mpx )",2,4,1920,1200,"_1920_1200_","2.3",null,null,null,null,null,null,null,null,null,null,null,"WUXGA"]
[null,8,"Smartphone (embedded)",null,null,null,8,"[8]",null,null,null,null,8,"[8]",null,null,null,null,null,null,8,"2K","    ( 2048 x 1080,    2.2Mpx )",2,4,2048,1080,"_2048_1080_","2.2",null,null,null,null,null,null,null,null,null,null,null,"2K"]
[null,9,"Smartphone Companion",null,null,null,9,"[9]",null,null,null,null,9,"[9]",null,null,null,null,null,null,9,"1080p","    ( 1920 x 1080,    2.1Mpx )",2,4,1920,1080,"_1920_1080_","2.1",null,null,null,null,null,null,null,null,null,null,null,"1080p"]
[null,10,"Augmented Reality Headset",null,null,null,10,"[10]",null,null,null,null,10,"[10]",null,null,null,null,null,null,10,"WQXGA","    ( 1260 x 1600,    2.0Mpx )",2,4,1260,1600,"_1260_1600_","2.0",null,null,null,null,null,null,null,null,null,null,null,"WQXGA"]
[null,11,"High-Performance Augmented Reality  ",null,null,null,11,"[11]",null,null,null,null,11,"[11]",null,null,null,null,null,null,11,"WSXGA+","    ( 1680 x 1050,    1.8Mpx )",2,4,1680,1050,"_1680_1050_","1.8",null,null,null,null,null,null,null,null,null,null,null,"WSXGA+"]
[null,12,"Digital Signage",null,null,null,12,"[12]",null,null,null,null,12,"[12]",null,null,null,null,null,null,12,"HD+","    ( 1600 x 900,    1.4Mpx )",2,4,1600,900,"_1600_900_","1.4",null,null,null,null,null,null,null,null,null,null,null,"HD+"]
[null,13,"Interactive Kiosk",null,null,null,13,"[13]",null,null,null,null,13,"[13]",null,null,null,null,null,null,13,"SXGA","    ( 1280 x 1024,    1.3Mpx )",2,4,1280,1024,"_1280_1024_","1.3",null,null,null,null,null,null,null,null,null,null,null,"SXGA"]
[null,14,"Electronic Gaming Machines",null,null,null,14,"[14]",null,null,null,null,14,"[14]",null,null,null,null,null,null,14,"WXGA+","    ( 1440 x 900,    1.3Mpx )",2,4,1440,900,"_1440_900_","1.3",null,null,null,null,null,null,null,null,null,null,null,"WXGA+"]
[null,15,"Collaborative Robots",null,null,null,15,"[15]",null,null,null,null,15,"[15]",null,null,null,null,null,null,15,"HD","    ( 1360 x 768,    1.0Mpx )",2,4,1360,768,"_1360_768_","1.0",null,null,null,null,null,null,null,null,null,null,null,"HD"]
[null,16,"Appliances",null,null,null,16,"[16]",null,null,null,null,16,"[16]",null,null,null,null,null,null,16,"WXGA","    ( 1280 x 800,    1.0Mpx )",2,4,1280,800,"_1280_800_","1.0",null,null,null,null,null,null,null,null,null,null,null,"WXGA"]
[null,17,"Toy",null,null,null,17,"[17]",null,null,null,null,17,"[17]",null,null,null,null,null,null,17,"720p","    ( 1280 x 720,    0.9Mpx )",2,4,1280,720,"_1280_720_","0.9",null,null,null,null,null,null,null,null,null,null,null,"720p"]
[null,18,"Other",null,null,null,18,"[18]",null,null,null,null,18,"[18]",null,null,null,null,null,null,18,"XGA","    ( 1024 x 768,    0.8Mpx )",2,4,1024,768,"_1024_768_","0.8",null,null,null,null,null,null,null,null,null,null,null,"XGA"]
[null,19,"[19]",null,null,null,19,"[19]",null,null,null,null,19,"[19]",null,null,null,null,null,null,19,"WSVGA","    ( 1024 x 600,    0.6Mpx )",2,4,1024,600,"_1024_600_","0.6",null,null,null,null,null,null,null,null,null,null,null,"WSVGA"]
[null,20,"[20]",null,null,null,20,"[20]",null,null,null,null,20,"[20]",null,null,null,null,null,null,20,"qHD","    ( 960 x 540,    0.5Mpx )",2,4,960,540,"_960_540_","0.5",null,null,null,null,null,null,null,null,null,null,null,"qHD"]
[null,21,"[21]",null,null,null,21,"[21]",null,null,null,null,21,"[21]",null,null,null,null,null,null,21,"SVGA","    ( 800 x 600,    0.5Mpx )",2,4,800,600,"_800_600_","0.5",null,null,null,null,null,null,null,null,null,null,null,"SVGA"]
[null,22,"[22]",null,null,null,22,"[22]",null,null,null,null,22,"[22]",null,null,null,null,null,null,22,"WVGA","    ( 854 x 480,    0.4Mpx )",2,4,854,480,"_854_480_","0.4",null,null,null,null,null,null,null,null,null,null,null,"WVGA"]
[null,23,"[23]",null,null,null,23,"[23]",null,null,null,null,23,"[23]",null,null,null,null,null,null,23,"VGA","    ( 684 x 456,    0.3Mpx )",2,4,684,456,"_684_456_","0.3",null,null,null,null,null,null,null,null,null,null,null,"VGA"]
[null,24,"[24]",null,null,null,24,"[24]",null,null,null,null,24,"[24]",null,null,null,null,null,null,24,"nHD","    ( 640 x 360,    0.2Mpx )",2,4,640,360,"_640_360_","0.2",null,null,null,null,null,null,null,null,null,null,null,"nHD"]
[null,25,"[25]",null,null,null,25,"[25]",null,null,null,null,25,"[25]",null,null,null,null,null,null,25,"QnHD","    ( 320 x 180,    0.1Mpx )",2,4,320,180,"_320_180_","0.1"]
[null,26,null,null,null,null,26,null,null,null,null,null,26,null,null,null,null,null,null,null,26]
[null,{"$f":"App_Select","v":0},{"$f":"IF( ISERROR( INDEX(List_Apps, B32+1 ) ), \"(null)\", INDEX(List_Apps, B32+1 ) )","v":0},null,null,"Max",{"$f":"TBright_Ambient_MaxSelect","v":0},{"$f":"IF( ISERROR( INDEX(List_AmbientLightLevel, G32+1 ) ), \"(null)\", INDEX(List_AmbientLightLevel, G32+1 ) )","v":"Very Dark"},null,{"$f":"IF( ISERROR( INDEX(List_AmbientLightNitValue, G32+1 ) ), \"(null)\", INDEX(List_AmbientLightNitValue, G32+1 ) )","v":0},null,null,{"$f":"IF(TUnits <> 0, TUnits, 1)","v":1},{"$f":"IF( ISERROR( INDEX(List_UnitsOfMeasure, M32+1 ) ), \"(null)\", INDEX(List_UnitsOfMeasure, M32+1 ) )","v":"inches"},null,{"$f":"IF( ISERROR( INDEX(List_UnitsOfMeasure_Short, $M32+1 ) ), \"(null)\", CONCATENATE( \" \", INDEX(List_UnitsOfMeasure_Short, $M32+1 ) ) )","v":" in"},{"$f":"IF( ISERROR( INDEX(List_UnitsOfMeasure_Short, M32+1 ) ), \"(null)\", CONCATENATE( \" sqr \", INDEX(List_UnitsOfMeasure_Short, M32+1 ) ) )","v":" sqr in"},{"$f":"IF( ISERROR( INDEX(List_UnitsOfMeasure_Convert, $M32+1 ) ), \"(null)\", CONCATENATE( \" \", INDEX(List_UnitsOfMeasure_Convert, $M32+1 ) ) )","v":" 1"},null,"Max",{"$f":"StdRes_Select_Max","v":0},{"$f":"IF( ISERROR( INDEX(List_StdRes, U32+1 ) ), \"(null)\", INDEX(List_StdRes, U32+1 ) )","v":0},null,null,null,{"$f":"IF( ISERROR( INDEX(List_StdRes, U32+1 ) ), \"(null)\", INDEX(List_StdRes_Col, U32+1 ) )","v":0},{"$f":"IF( ISERROR( INDEX(List_StdRes, U32+1 ) ), \"(null)\", INDEX(List_StdRes_Row, U32+1 ) )","v":0}]
[null,null,null,null,null,"Min",{"$f":"TBright_Ambient_MinSelect","v":0},{"$f":"IF( ISERROR( INDEX(List_AmbientLightLevel, G33+1 ) ), \"(null)\", INDEX(List_AmbientLightLevel, G33+1 ) )","v":"Very Dark"},null,{"$f":"IF( ISERROR( INDEX(List_AmbientLightNitValue, G33+1 ) ), \"(null)\", INDEX(List_AmbientLightNitValue, G33+1 ) )","v":0},null,null,null,null,null,{"$f":"CONCATENATE( \"--\", Value_UnitsOfMeasure_Short )","v":"-- in"},{"$f":"CONCATENATE( \"--\", Value_UnitsOfMeasure_AreaShort )","v":"-- sqr in"},null,null,"Min",{"$f":"StdRes_Select_Min","v":0},{"$f":"IF( ISERROR( INDEX(List_StdRes, U33+1 ) ), \"(null)\", INDEX(List_StdRes, U33+1 ) )","v":0},null,null,null,{"$f":"IF( ISERROR( INDEX(List_StdRes, U33+1 ) ), \"(null)\", INDEX(List_StdRes_Col, U33+1 ) )","v":0},{"$f":"IF( ISERROR( INDEX(List_StdRes, U33+1 ) ), \"(null)\", INDEX(List_StdRes_Row, U33+1 ) )","v":0}]
[null,null,null,null,null,"Max",{"$f":"IF( ISNUMBER( AppDef_AmbientIndex_Max ), AppDef_AmbientIndex_Max, 0 )","v":0},{"$f":"IF( ISERROR( INDEX(List_AmbientLightLevel, G34+1 ) ), \"(null)\", INDEX(List_AmbientLightLevel, G34+1 ) )","v":"Very Dark"},null,{"$f":"IF( ISERROR( INDEX(List_AmbientLightNitValue, G34+1 ) ), \"(null)\", INDEX(List_AmbientLightNitValue, G34+1 ) )","v":0},null,null,null,null,null,null,null,null,null,"Max",{"$f":"IF( ISNUMBER( AppDef_StdRes_Max ), AppDef_StdRes_Max, 0 )","v":0},{"$f":"IF( ISERROR( INDEX(List_StdRes, U34+1 ) ), \"(null)\", INDEX(List_StdRes, U34+1 ) )","v":0},null,null,null,{"$f":"IF( ISERROR( INDEX(List_StdRes, U34+1 ) ), \"(null)\", INDEX(List_StdRes_Col, U34+1 ) )","v":0},{"$f":"IF( ISERROR( INDEX(List_StdRes, U34+1 ) ), \"(null)\", INDEX(List_StdRes_Row, U34+1 ) )","v":0}]
[null,null,null,null,null,"Min",{"$f":"IF( ISNUMBER( AppDef_AmbientIndex_Min ), AppDef_AmbientIndex_Min, 0 )","v":0},{"$f":"IF( ISERROR( INDEX(List_AmbientLightLevel, G35+1 ) ), \"(null)\", INDEX(List_AmbientLightLevel, G35+1 ) )","v":"Very Dark"},null,{"$f":"IF( ISERROR( INDEX(List_AmbientLightNitValue, G35+1 ) ), \"(null)\", INDEX(List_AmbientLightNitValue, G35+1 ) )","v":0},null,null,null,null,null,null,null,null,null,"Min",{"$f":"IF( ISNUMBER( AppDef_StdRes_Min ), AppDef_StdRes_Min, 0 )","v":0},{"$f":"IF( ISERROR( INDEX(List_StdRes, U35+1 ) ), \"(null)\", INDEX(List_StdRes, U35+1 ) )","v":0},null,null,null,{"$f":"IF( ISERROR( INDEX(List_StdRes, U35+1 ) ), \"(null)\", INDEX(List_StdRes_Col, U35+1 ) )","v":0},{"$f":"IF( ISERROR( INDEX(List_StdRes, U35+1 ) ), \"(null)\", INDEX(List_StdRes_Row, U35+1 ) )","v":0}]

{"sheet":"xLinks","index":26,"n_rows":389,"n_cols":11,"rows_kept":389,"cut":false,"hidden":true,"merged":[[1,2,1,10]]}
[]
[null,null,"Object Link Table"]
[]
[null,null,1,2,3,4,5,6,7,8,9]
[null,null,null,null,null,null,"When","On","Switch"]
[null,null,"Index","Sheet","Shape","Description","Switching To …","Sheet …","Object ..","To …"]
[null,null,{"$f":"COUNTA(C8:C390)","v":382}]
[null,null,1]
[null,null,2]
[null,null,3,"Target","TUnits_Expander","Target Brightness","Shown","Target","TBright_Banner","Hidden"]
[null,null,4,"Target","TUnits_Expander","Target Brightness","Shown","Target","TBright_Expander","Hidden"]
[null,null,5,"Target","TUnits_Expander","Target Brightness","Shown","Target","TSize_Banner","Hidden"]
[null,null,6,"Target","TUnits_Expander","Target Brightness","Shown","Target","TSize_Expander","Hidden"]
[null,null,7,"Target","TUnits_Expander","Target Brightness","Shown","Target","TRes_Banner","Hidden"]
[null,null,8,"Target","TUnits_Expander","Target Brightness","Shown","Target","TRes_Expander","Hidden"]
[null,null,9]
[null,null,10,"Summary","TUnits_Expander","Target Brightness","Hidden","Summary","TUnits_Banner","Hidden"]
[null,null,11,"Summary","TUnits_Expander","Target Brightness","Shown","Summary","TUnits_Banner","Shown"]
[null,null,12,"Summary","TUnits_Expander","Target Brightness","Shown","Summary","TUnits_Banner","xScroll"]
[null,null,13]
[null,null,14]
[null,null,15]
[null,null,16]
[null,null,17,"Target","TBright_Expander","Target Brightness","Shown","Target","TSize_Banner","Hidden"]
[null,null,18,"Target","TBright_Expander","Target Brightness","Shown","Target","TSize_Expander","Hidden"]
[null,null,19,"Target","TBright_Expander","Target Brightness","Shown","Target","TRes_Banner","Hidden"]
[null,null,20,"Target","TBright_Expander","Target Brightness","Shown","Target","TRes_Expander","Hidden"]
[null,null,21,"Target","TBright_Expander","Target Brightness","Shown","Target","TBright_ScreenEff_InfoButton1","Hidden"]
[null,null,22]
[null,null,23,"Target","TBright_Expander","Target Brightness","Hidden","Target","TBright_Banner","Hidden"]
[null,null,24,"Target","TBright_Expander","Target Brightness","Shown","Target","TBright_Banner","Shown"]
[null,null,25,"Target","TBright_Expander","Target Brightness","Shown","Target","TBright_Banner","xScroll"]
[null,null,26]
[null,null,27,"Target","TBright_Expander","Target Brightness","Shown","Target","TBright_Ambient_Expander","Last"]
[null,null,28,"Target","TBright_Expander","Target Brightness","Shown","Target","TBright_Ambient_Banner","Last"]
[null,null,29,"Target","TBright_Expander","Ambient","Shown","Target","TBright_Ambient_InfoButton1","Last"]
[null,null,30,"Target","TBright_Expander","Ambient","Shown","Target","xTBright_Ambient_InfoButton3","Last"]
[null,null,31,"Target","TBright_Expander","Ambient","Shown","Target","TBright_Nits_Expander","Last"]
[null,null,32,"Target","TBright_Expander","Ambient","Shown","Target","TBright_Nits_Banner","Last"]
[null,null,33,"Target","TBright_Expander","Ambient","Shown","Target","TBright_Nits_InfoButton1","Last"]
[null,null,34,"Target","TBright_Expander","Ambient","Shown","Target","xTBright_Nits_InfoButton3","Last"]
[null,null,35,"Target","TBright_Expander","Ambient","Shown","Target","TBright_Lumens_Expander","Last"]
[null,null,36,"Target","TBright_Expander","Ambient","Shown","Target","TBright_Lumens_Banner","Last"]
[null,null,37,"Target","TBright_Expander","Ambient","Shown","Target","TBright_Lumens_InfoButton1","Last"]
[null,null,38,"Target","TBright_Expander","Ambient","Shown","Target","xTBright_Lumens_InfoButton3","Last"]
[null,null,39]
[null,null,40]
[null,null,41,"Target","TBright_Ambient_Expander","Ambient","Shown","Target","TBright_Lumens_Expander","Hidden"]
[null,null,42,"Target","TBright_Ambient_Expander","Ambient","Shown","Target","TBright_Lumens_Banner","Hidden"]
[null,null,43,"Target","TBright_Ambient_Expander","Ambient","Shown","Target","TBright_Nits_Expander","Hidden"]
[null,null,44,"Target","TBright_Ambient_Expander","Ambient","Shown","Target","TBright_Nits_Banner","Hidden"]
[null,null,45]
[null,null,46,"Target","TBright_Ambient_Expander","Ambient","Hidden","Target","TBright_Ambient_Banner","Hidden"]
[null,null,47,"Target","TBright_Ambient_Expander","Ambient","Shown","Target","TBright_Ambient_Banner","Shown"]
[null,null,48,"Target","TBright_Ambient_Expander","Ambient","Shown","Target","TBright_Ambient_InfoButton1","Last"]
[null,null,49,"Target","TBright_Ambient_Expander","Ambient","Shown","Target","xTBright_Ambient_InfoButton3","Last"]
[null,null,50,"Target","TBright_Ambient_Expander","Ambient","Shown","Target","TBright_Ambient_Banner","xScroll"]
[null,null,51]
[null,null,52]
[null,null,53,"Target","TBright_Nits_Expander","Ambient","Shown","Target","TBright_Ambient_Expander","Hidden"]
[null,null,54,"Target","TBright_Nits_Expander","Ambient","Shown","Target","TBright_Ambient_Banner","Hidden"]
[null,null,55,"Target","TBright_Nits_Expander","Ambient","Shown","Target","xTBright_Ambient_InfoButton1","Hidden"]
[null,null,56,"Target","TBright_Nits_Expander","Ambient","Shown","Target","xTBright_Ambient_InfoButton1","Hidden"]
[null,null,57,"Target","TBright_Nits_Expander","Ambient","Shown","Target","TBright_Lumens_Expander","Hidden"]
[null,null,58,"Target","TBright_Nits_Expander","Ambient","Shown","Target","TBright_Lumens_Banner","Hidden"]
[null,null,59]
[null,null,60,"Target","TBright_Nits_Expander","Ambient","Hidden","Target","TBright_Nits_Banner","Hidden"]
[null,null,61,"Target","TBright_Nits_Expander","Ambient","Shown","Target","TBright_Nits_Banner","Shown"]
[null,null,62,"Target","TBright_Nits_Expander","Ambient","Shown","Target","TBright_Nits_InfoButton1","Last"]
[null,null,63,"Target","TBright_Nits_Expander","Ambient","Shown","Target","xTBright_Nits_InfoButton3","Last"]
[null,null,64,"Target","TBright_Nits_Expander","Ambient","Shown","Target","TBright_Nits_Banner","xScroll"]
[null,null,65]
[null,null,66]
[null,null,67,"Target","TBright_Lumens_Expander","Ambient","Shown","Target","TBright_Ambient_Expander","Hidden"]
[null,null,68,"Target","TBright_Lumens_Expander","Ambient","Shown","Target","TBright_Ambient_Banner","Hidden"]
[null,null,69,"Target","TBright_Lumens_Expander","Ambient","Shown","Target","TBright_Nits_Expander","Hidden"]
[null,null,70,"Target","TBright_Lumens_Expander","Ambient","Shown","Target","TBright_Nits_Banner","Hidden"]
[null,null,71]
[null,null,72,"Target","TBright_Lumens_Expander","Ambient","Hidden","Target","TBright_Lumens_Banner","Hidden"]
[null,null,73,"Target","TBright_Lumens_Expander","Ambient","Shown","Target","TBright_Lumens_Banner","Shown"]
[null,null,74,"Target","TBright_Lumens_Expander","Ambient","Shown","Target","TBright_Lumens_InfoButton1","Last"]
[null,null,75,"Target","TBright_Lumens_Expander","Ambient","Shown","Target","xTBright_Lumens_InfoButton3","Last"]
[null,null,76,"Target","TBright_Lumens_Expander","Ambient","Shown","Target","TBright_Lumens_Banner","xScroll"]
[null,null,77]
[null,null,78]
[null,null,79,"Target","TSize_Expander","Target Brightness","Shown","Target","TUnits_Banner","Hidden"]
[null,null,80,"Target","TSize_Expander","Target Brightness","Shown","Target","TUnits_Expander","Hidden"]
[null,null,81,"Target","TSize_Expander","Target Brightness","Shown","Target","TBright_Banner","Hidden"]
[null,null,82,"Target","TSize_Expander","Target Brightness","Shown","Target","TBright_Expander","Hidden"]
[null,null,83,"Target","TSize_Expander","Target Brightness","Shown","Target","TRes_Banner","Hidden"]
[null,null,84,"Target","TSize_Expander","Target Brightness","Shown","Target","TRes_Expander","Hidden"]
[null,null,85]
[null,null,86,"Target","TSize_Expander","xxx","Hidden","Target","TSize_Banner","Hidden"]
[null,null,87,"Target","TSize_Expander","xxx","Shown","Target","TSize_Banner","Shown"]
[null,null,88,"Target","TSize_Expander","xxx","Shown","Target","TSize_ImageHeight_InfoButton1","Last"]
[null,null,89,"Target","TSize_Expander","xxx","Shown","Target","TSize_ImageWidth_InfoButton1","Last"]
[null,null,90,"Target","TSize_Expander","xxx","Shown","Target","TSize_ImageDiag_InfoButton1","Last"]
[null,null,91,"Target","TSize_Expander","xxx","Shown","Target","TSize_ImageAR_InfoButton1","Last"]
[null,null,92,"Target","TSize_Expander","Target Brightness","Shown","Target","TSize_Banner","xScroll"]
[null,null,93]
[null,null,94,"Target","TSize_ImageHeight_InfoButton1","Ambient","Shown","Target","TSize_ImageWidth_InfoButton1","Shown"]
[null,null,95,"Target","TSize_ImageHeight_InfoButton1","Ambient","Shown","Target","TSize_ImageDiag_InfoButton1","Shown"]
[null,null,96]
[null,null,97,"Target","TSize_ImageHeight_InfoButton1","Ambient","Hidden","Target","TSize_ImageWidth_InfoButton1","Hidden"]
[null,null,98,"Target","TSize_ImageHeight_InfoButton1","Ambient","Hidden","Target","TSize_ImageDiag_InfoButton1","Hidden"]
[null,null,99]
[null,null,100,"Target","TSize_ImageWidth_InfoButton1","Ambient","Shown","Target","TSize_ImageHeight_InfoButton1","Shown"]
[null,null,101,"Target","TSize_ImageWidth_InfoButton1","Ambient","Shown","Target","TSize_ImageDiag_InfoButton1","Shown"]
[null,null,102]
[null,null,103,"Target","TSize_ImageWidth_InfoButton1","Ambient","Hidden","Target","TSize_ImageHeight_InfoButton1","Hidden"]
[null,null,104,"Target","TSize_ImageWidth_InfoButton1","Ambient","Hidden","Target","TSize_ImageDiag_InfoButton1","Hidden"]
[null,null,105]
[null,null,106,"Target","TSize_ImageDiag_InfoButton1","Ambient","Shown","Target","TSize_ImageHeight_InfoButton1","Shown"]
[null,null,107,"Target","TSize_ImageDiag_InfoButton1","Ambient","Shown","Target","TSize_ImageWidth_InfoButton1","Shown"]
[null,null,108]
[null,null,109,"Target","TSize_ImageDiag_InfoButton1","Ambient","Hidden","Target","TSize_ImageHeight_InfoButton1","Hidden"]
[null,null,110,"Target","TSize_ImageDiag_InfoButton1","Ambient","Hidden","Target","TSize_ImageWidth_InfoButton1","Hidden"]
[null,null,111]
[null,null,112]
[null,null,113]
[null,null,114]
[null,null,115]
[null,null,116,"Target","TRes_Expander",null,"Shown","Target","TSize_Banner","Hidden"]
[null,null,117,"Target","TRes_Expander",null,"Shown","Target","TSize_Expander","Hidden"]
[null,null,118,"Target","TRes_Expander","Target Brightness","Shown","Target","TBright_Banner","Hidden"]
[null,null,119,"Target","TRes_Expander","Target Brightness","Shown","Target","TBright_Expander","Hidden"]
[null,null,120]
[null,null,121,"Target","TRes_Expander","Target Brightness","Hidden","Target","TRes_Banner","Hidden"]
[null,null,122,"Target","TRes_Expander","Target Brightness","Shown","Target","TRes_Banner","Shown"]
[null,null,123,"Target","TRes_Expander",null,"Shown","Target","TRes_Fundamental_Expander","Last"]
[null,null,124,"Target","TRes_Expander",null,"Shown","Target","TRes_Fundamental_Banner","Last"]
[null,null,125,"Target","TRes_Expander",null,"Shown","Target","TRes_ViewDist_InfoButton1","Last"]
[null,null,126,"Target","TRes_Expander",null,"Shown","Target","TSize_FOV_InfoButton1","Last"]
[null,null,127,"Target","TRes_Expander",null,"Shown","Target","TRes_PxPerDeg_InfoButton1","Last"]
[null,null,128,"Target","TRes_Expander",null,"Shown","Target","TRes_PxPerInch_InfoButton1","Last"]
[null,null,129,"Target","TRes_Expander",null,"Shown","Target","TRes_PxPerMM_InfoButton1","Last"]
[null,null,130,"Target","TRes_Expander","Target Brightness","Shown","Target","TRes_TextDashboardButton","Last"]
[null,null,131,"Target","TRes_Expander",null,"Shown","Target","TRes_TextSize_InfoButton1","Last"]
[null,null,132,"Target","TRes_Expander",null,"Shown","Target","TRes_TextSize_InfoButton2","Last"]
[null,null,133,"Target","TRes_Expander",null,"Shown","Target","TRes_TextSize_InfoButton3","Last"]
[null,null,134,"Target","TRes_Expander","Ambient","Shown","Target","TRes_IndustryStd_Expander","Last"]
[null,null,135,"Target","TRes_Expander","Ambient","Shown","Target","TRes_IndustryStd_Banner","Last"]
[null,null,136,"Target","TRes_Expander","Ambient","Shown","Target","TRes_ManualRes_Expander","Last"]
[null,null,137,"Target","TRes_Expander","Ambient","Shown","Target","TRes_ManualRes_Banner","Last"]
[null,null,138,"Target","TRes_Expander",null,"Shown","Target","TRes_ManualRes_InfoButton1","Last"]
[null,null,139,"Target","TRes_Expander","Target Brightness","Shown","Target","TRes_Banner","xScroll"]
[null,null,140]
[null,null,141]
[null,null,142,"Target","TRes_Fundamental_Expander",null,"Shown","Target","TRes_IndustryStd_Expander","Hidden"]
[null,null,143,"Target","TRes_Fundamental_Expander",null,"Shown","Target","TRes_IndustryStd_Banner","Hidden"]
[null,null,144,"Target","TRes_Fundamental_Expander",null,"Shown","Target","TRes_ManualRes_Expander","Hidden"]
[null,null,145,"Target","TRes_Fundamental_Expander",null,"Shown","Target","TRes_ManualRes_Banner","Hidden"]
[null,null,146]
[null,null,147,"Target","TRes_Fundamental_Expander","Target Brightness","Hidden","Target","TRes_Fundamental_Banner","Hidden"]
[null,null,148,"Target","TRes_Fundamental_Expander","Target Brightness","Shown","Target","TRes_Fundamental_Banner","Shown"]
[null,null,149,"Target","TRes_Fundamental_Expander","Target Brightness","Shown","Target","TRes_TextDashboardButton","Last"]
[null,null,150]
[null,null,151,"Target","TRes_Fundamental_Expander","Target Brightness","Shown","Target","TRes_ViewDist_InfoButton1","Last"]
[null,null,152,"Target","TRes_Fundamental_Expander","Target Brightness","Shown","Target","TRes_FOV_InfoButton1","Last"]
[null,null,153,"Target","TRes_Fundamental_Expander","Target Brightness","Shown","Target","TRes_PxPerDeg_InfoButton1","Last"]
[null,null,154,"Target","TRes_Fundamental_Expander","Target Brightness","Shown","Target","TRes_PxPerInch_InfoButton1","Last"]
[null,null,155,"Target","TRes_Fundamental_Expander","Target Brightness","Shown","Target","TRes_PxPerMM_InfoButton1","Last"]
[null,null,156,"Target","TRes_Fundamental_Expander","Target Brightness","Shown","Target","TRes_TextSize_InfoButton1","Last"]
[null,null,157,"Target","TRes_Fundamental_Expander","Target Brightness","Shown","Target","TRes_TextSize_InfoButton2","Last"]
[null,null,158,"Target","TRes_Fundamental_Expander","Target Brightness","Shown","Target","TRes_TextSize_InfoButton3","Last"]
[null,null,159,"Target","TRes_Fundamental_Expander",null,"Shown","Target","TRes_Banner","xScroll"]
[null,null,160]
[null,null,161,"Target","TRes_ViewDist_InfoButton1","Target Brightness","Shown","Target","TRes_FOV_InfoButton1","Shown"]
[null,null,162,"Target","TRes_ViewDist_InfoButton1","Target Brightness","Hidden","Target","TRes_FOV_InfoButton1","Hidden"]
[null,null,163,"Target","TRes_FOV_InfoButton1","Target Brightness","Shown","Target","TRes_ViewDist_InfoButton1","Shown"]
[null,null,164,"Target","TRes_FOV_InfoButton1","Target Brightness","Hidden","Target","TRes_ViewDist_InfoButton1","Hidden"]
[null,null,165]
[null,null,166,"xTarget","TRes_TextSize_InfoButton1","Target Brightness","Shown","Target","TRes_TextSize_InfoButton2","Shown"]
[null,null,167,"xTarget","TRes_TextSize_InfoButton1","Target Brightness","Shown","Target","TRes_TextSize_InfoButton3","Shown"]
[null,null,168,"xTarget","TRes_TextSize_InfoButton1","Target Brightness","Hidden","Target","TRes_TextSize_InfoButton2","Hidden"]
[null,null,169,"xTarget","TRes_TextSize_InfoButton1","Target Brightness","Hidden","Target","TRes_TextSize_InfoButton3","Hidden"]
[null,null,170]
[null,null,171,"xTarget","TRes_TextSize_InfoButton2","Target Brightness","Shown","Target","TRes_TextSize_InfoButton1","Shown"]
[null,null,172,"xTarget","TRes_TextSize_InfoButton2","Target Brightness","Shown","Target","TRes_TextSize_InfoButton3","Shown"]
[null,null,173,"xTarget","TRes_TextSize_InfoButton2","Target Brightness","Hidden","Target","TRes_TextSize_InfoButton1","Hidden"]
[null,null,174,"xTarget","TRes_TextSize_InfoButton2","Target Brightness","Hidden","Target","TRes_TextSize_InfoButton3","Hidden"]
[null,null,175]
[null,null,176,"xTarget","TRes_TextSize_InfoButton3","Target Brightness","Shown","Target","TRes_TextSize_InfoButton1","Shown"]
[null,null,177,"xTarget","TRes_TextSize_InfoButton3","Target Brightness","Shown","Target","TRes_TextSize_InfoButton2","Shown"]
[null,null,178,"xTarget","TRes_TextSize_InfoButton3","Target Brightness","Hidden","Target","TRes_TextSize_InfoButton1","Hidden"]
[null,null,179,"xTarget","TRes_TextSize_InfoButton3","Target Brightness","Hidden","Target","TRes_TextSize_InfoButton2","Hidden"]
[null,null,180]
[null,null,181,"Target","TRes_TextDashboardButton",null,"Shown","Target","TRes_TextSize_InfoButton1","Last"]
[null,null,182,"Target","TRes_TextDashboardButton",null,"Shown","Target","TRes_TextSize_InfoButton2","Last"]
[null,null,183]
[null,null,184]
[null,null,185,"Target","TRes_IndustryStd_Expander",null,"Shown","Target","TRes_Fundamental_Expander","Hidden"]
[null,null,186,"Target","TRes_IndustryStd_Expander",null,"Shown","Target","TRes_Fundamental_Banner","Hidden"]
[null,null,187,"Target","TRes_IndustryStd_Expander",null,"Shown","Target","TRes_ManualRes_Expander","Hidden"]
[null,null,188,"Target","TRes_IndustryStd_Expander",null,"Shown","Target","TRes_ManualRes_Banner","Hidden"]
[null,null,189]
[null,null,190,"Target","TRes_IndustryStd_Expander","Target Brightness","Hidden","Target","TRes_IndustryStd_Banner","Hidden"]
[null,null,191,"Target","TRes_IndustryStd_Expander","Target Brightness","Shown","Target","TRes_IndustryStd_Banner","Shown"]
[null,null,192,"Target","TRes_IndustryStd_Expander",null,"Shown","Target","TRes_IndustryStd_Banner","xScroll"]
[null,null,193]
[null,null,194]
[null,null,195]
[null,null,196,"Target","TRes_ManualRes_Expander",null,"Shown","Target","TRes_Fundamental_Expander","Hidden"]
[null,null,197,"Target","TRes_ManualRes_Expander",null,"Shown","Target","TRes_Fundamental_Banner","Hidden"]
[null,null,198,"Target","TRes_ManualRes_Expander",null,"Shown","Target","TRes_IndustryStd_Expander","Hidden"]
[null,null,199,"Target","TRes_ManualRes_Expander",null,"Shown","Target","TRes_IndustryStd_Banner","Hidden"]
[null,null,200]
[null,null,201,"Target","TRes_ManualRes_Expander","Target Brightness","Hidden","Target","TRes_ManualRes_Banner","Hidden"]
[null,null,202,"Target","TRes_ManualRes_Expander","Target Brightness","Shown","Target","TRes_ManualRes_Banner","Shown"]
[null,null,203,"Target","TRes_ManualRes_Expander","Target Brightness","Shown","Target","TRes_ManualRes_InfoButton1","Last"]
[null,null,204,"Target","TRes_ManualRes_Expander",null,"Shown","Target","TRes_ManualRes_Banner","xScroll"]
[null,null,205]
[null,null,206]
[null,null,207]
[null,null,208,"Target","TUnits_Expander","Target Brightness","Shown","Target","TBright_Ambient_InfoButton1","Hidden"]
[null,null,209,"Target","TUnits_Expander","Target Brightness","Shown","Target","TBright_Ambient_InfoButton3","Hidden"]
[null,null,210,"Target","TUnits_Expander","Target Brightness","Shown","Target","TBright_Nits_InfoButton1","Hidden"]
[null,null,211,"Target","TUnits_Expander","Target Brightness","Shown","Target","TBright_Nits_InfoButton3","Hidden"]
[null,null,212,"Target","TUnits_Expander","Target Brightness","Shown","Target","TBright_Lumens_InfoButton1","Hidden"]
[null,null,213,"Target","TUnits_Expander","Target Brightness","Shown","Target","TBright_Lumens_InfoButton3","Hidden"]
[null,null,214,"Target","TUnits_Expander","Target Brightness","Shown","Target","TSize_ImageHeight_InfoButton1","Hidden"]
[null,null,215,"Target","TUnits_Expander","Target Brightness","Shown","Target","TSize_ImageWidth_InfoButton1","Hidden"]
[null,null,216,"Target","TUnits_Expander","Target Brightness","Shown","Target","TSize_ImageDiag_InfoButton1","Hidden"]
[null,null,217,"Target","TUnits_Expander","Target Brightness","Shown","Target","TSize_ImageAR_InfoButton1","Hidden"]
[null,null,218,"Target","TUnits_Expander","Target Brightness","Shown","Target","TRes_ViewDist_InfoButton1","Hidden"]
[null,null,219,"Target","TUnits_Expander","Target Brightness","Shown","Target","TRes_FOV_InfoButton1","Hidden"]
[null,null,220,"Target","TUnits_Expander","Target Brightness","Shown","Target","TRes_PxPerDeg_InfoButton1","Hidden"]
[null,null,221,"Target","TUnits_Expander","Target Brightness","Shown","Target","TRes_PxPerInch_InfoButton1","Hidden"]
[null,null,222,"Target","TUnits_Expander","Target Brightness","Shown","Target","TRes_PxPerMM_InfoButton1","Hidden"]
[null,null,223,"Target","TUnits_Expander","Target Brightness","Shown","Target","TRes_TextSize_InfoButton1","Hidden"]
[null,null,224,"Target","TUnits_Expander","Target Brightness","Shown","Target","TRes_TextSize_InfoButton2","Hidden"]
[null,null,225,"Target","TUnits_Expander","Target Brightness","Shown","Target","TRes_TextSize_InfoButton3","Hidden"]
[null,null,226,"Target","TUnits_Expander","Target Brightness","Shown","Target","TRes_ManualRes_InfoButton1","Hidden"]
[null,null,227]
[null,null,228,"Target","TBright_Expander","Target Brightness","Shown","Target","TSize_ImageHeight_InfoButton1","Hidden"]
[null,null,229,"Target","TBright_Expander","Target Brightness","Shown","Target","TSize_ImageWidth_InfoButton1","Hidden"]
[null,null,230,"Target","TBright_Expander","Target Brightness","Shown","Target","TSize_ImageDiag_InfoButton1","Hidden"]
[null,null,231,"Target","TBright_Expander","Target Brightness","Shown","Target","TSize_ImageAR_InfoButton1","Hidden"]
[null,null,232,"Target","TBright_Expander","Target Brightness","Shown","Target","TRes_ViewDist_InfoButton1","Hidden"]
[null,null,233,"Target","TBright_Expander","Target Brightness","Shown","Target","TRes_FOV_InfoButton1","Hidden"]
[null,null,234,"Target","TBright_Expander","Target Brightness","Shown","Target","TRes_PxPerDeg_InfoButton1","Hidden"]
[null,null,235,"Target","TBright_Expander","Target Brightness","Shown","Target","TRes_PxPerInch_InfoButton1","Hidden"]
[null,null,236,"Target","TBright_Expander","Target Brightness","Shown","Target","TRes_PxPerMM_InfoButton1","Hidden"]
[null,null,237,"Target","TBright_Expander","Target Brightness","Shown","Target","TRes_TextSize_InfoButton1","Hidden"]
[null,null,238,"Target","TBright_Expander","Target Brightness","Shown","Target","TRes_TextSize_InfoButton2","Hidden"]
[null,null,239,"Target","TBright_Expander","Target Brightness","Shown","Target","TRes_TextSize_InfoButton3","Hidden"]
[null,null,240,"Target","TBright_Expander","Target Brightness","Shown","Target","TRes_ManualRes_InfoButton1","Hidden"]
[null,null,241]
[null,null,242,"Target","TSize_Expander","Target Brightness","Shown","Target","TBright_Ambient_InfoButton1","Hidden"]
[null,null,243,"Target","TSize_Expander","Target Brightness","Shown","Target","TBright_Ambient_InfoButton3","Hidden"]
[null,null,244,"Target","TSize_Expander","Target Brightness","Shown","Target","TBright_Nits_InfoButton1","Hidden"]
[null,null,245,"Target","TSize_Expander","Target Brightness","Shown","Target","TBright_Nits_InfoButton3","Hidden"]
[null,null,246,"Target","TSize_Expander","Target Brightness","Shown","Target","TBright_Lumens_InfoButton1","Hidden"]
[null,null,247,"Target","TSize_Expander","Target Brightness","Shown","Target","TBright_Lumens_InfoButton3","Hidden"]
[null,null,248,"Target","TSize_Expander","Target Brightness","Shown","Target","TRes_ViewDist_InfoButton1","Hidden"]
[null,null,249,"Target","TSize_Expander","Target Brightness","Shown","Target","TRes_FOV_InfoButton1","Hidden"]
[null,null,250,"Target","TSize_Expander","Target Brightness","Shown","Target","TRes_PxPerDeg_InfoButton1","Hidden"]
[null,null,251,"Target","TSize_Expander","Target Brightness","Shown","Target","TRes_PxPerInch_InfoButton1","Hidden"]
[null,null,252,"Target","TSize_Expander","Target Brightness","Shown","Target","TRes_PxPerMM_InfoButton1","Hidden"]
[null,null,253,"Target","TSize_Expander","Target Brightness","Shown","Target","TRes_TextSize_InfoButton1","Hidden"]
[null,null,254,"Target","TSize_Expander","Target Brightness","Shown","Target","TRes_TextSize_InfoButton2","Hidden"]
[null,null,255,"Target","TSize_Expander","Target Brightness","Shown","Target","TRes_TextSize_InfoButton3","Hidden"]
[null,null,256,"Target","TSize_Expander","Target Brightness","Shown","Target","TRes_ManualRes_InfoButton1","Hidden"]
[null,null,257]
[null,null,258,"Target","TRes_Expander","Target Brightness","Shown","Target","TBright_Ambient_InfoButton1","Hidden"]
[null,null,259,"Target","TRes_Expander","Target Brightness","Shown","Target","TBright_Ambient_InfoButton3","Hidden"]
[null,null,260,"Target","TRes_Expander","Target Brightness","Shown","Target","TBright_Nits_InfoButton1","Hidden"]
[null,null,261,"Target","TRes_Expander","Target Brightness","Shown","Target","TBright_Nits_InfoButton3","Hidden"]
[null,null,262,"Target","TRes_Expander","Target Brightness","Shown","Target","TBright_Lumens_InfoButton1","Hidden"]
[null,null,263,"Target","TRes_Expander","Target Brightness","Shown","Target","TBright_Lumens_InfoButton3","Hidden"]
[null,null,264,"Target","TRes_Expander","Target Brightness","Shown","Target","TSize_ImageHeight_InfoButton1","Hidden"]
[null,null,265,"Target","TRes_Expander","Target Brightness","Shown","Target","TSize_ImageWidth_InfoButton1","Hidden"]
[null,null,266,"Target","TRes_Expander","Target Brightness","Shown","Target","TSize_ImageDiag_InfoButton1","Hidden"]
[null,null,267,"Target","TRes_Expander","Target Brightness","Shown","Target","TSize_ImageAR_InfoButton1","Hidden"]
[null,null,268,"Target","TRes_Expander","Target Brightness","Shown","Target","TRes_ViewDist_InfoButton1","Hidden"]
[null,null,269]
[null,null,270]
[null,null,271,"Chipsets","ChipsetDef_Expander","Target Brightness","Shown","Chipsets","ChipsetDef_Banner","Shown"]
[null,null,272,"Chipsets","ChipsetDef_Expander","Target Brightness","Hidden","Chipsets","ChipsetDef_Banner","Hidden"]
[null,null,273]
[null,null,274,"Chipsets","ChipsetDef_Banner","Target Brightness","Shown","Chipsets","ChipsetDef_Expander","Shown"]
[null,null,275,"Chipsets","ChipsetDef_Banner","Target Brightness","Hidden","Chipsets","ChipsetDef_Expander","Hidden"]
[null,null,276]
[null,null,277]
[null,null,278,"Engines","EngineDef_Expander","Target Brightness","Shown","Engines","EngineDef_Banner","Shown"]
[null,null,279,"Engines","EngineDef_Expander","Target Brightness","Hidden","Engines","EngineDef_Banner","Hidden"]
[null,null,280]
[null,null,281,"Engines","EngineDef_Banner","Target Brightness","Shown","Engines","EngineDef_Expander","Shown"]
[null,null,282,"Engines","EngineDef_Banner","Target Brightness","Hidden","Engines","EngineDef_Expander","Hidden"]
[null,null,283]
[null,null,284]
[null,null,285,"Target","DashboardButton","Dashboard","Shown","Target","DashboardBanner","Shown"]
[null,null,286,"Target","DashboardButton","Dashboard","Hidden","Target","DashboardBanner","Hidden"]
[null,null,287]
[null,null,288]
[null,null,289]
[null,null,290]
[null,null,291]
[null,null,292]
[null,null,293]
[null,null,294]
[null,null,295]
[null,null,296]
[null,null,297]
[null,null,298]
[null,null,299]
[null,null,300]
[null,null,301,"Summary","Summary_CalcResult_Expander",null,"Shown","Summary","Summary_CalcResult_Banner","Shown"]
[null,null,302,"Summary","Summary_CalcResult_Expander",null,"Hidden","Summary","Summary_CalcResult_Banner","Hidden"]
[null,null,303]
[null,null,304,"Summary","Summary_Inputs_Expander",null,"Shown","Summary","Summary_Inputs_Banner","Shown"]
[null,null,305,"Summary","Summary_Inputs_Expander",null,"Hidden","Summary","Summary_Inputs_Banner","Hidden"]
[null,null,306]
[null,null,307]
[null,null,308]
[null,null,309]
[null,null,310]
[null,null,311]
[null,null,312]
[null,null,313]
[null,null,314,"Map","Map_MatchZone_Expander",null,"Shown","Map","Map_MatchingZone_InfoButton1","Hidden"]
[null,null,315]
[null,null,316,"Target","TBright_Expander",null,"Shown","Target","TBright_Ambient_Expander","Hidden"]
[null,null,317,"Target","TBright_Expander",null,"Shown","Target","TBright_Ambient_Banner","Hidden"]
[null,null,318,"Target","TBright_Expander",null,"Shown","Target","TBright_Lumens_Expander","Hidden"]
[null,null,319,"Target","TBright_Expander",null,"Shown","Target","TBright_Lumens_Banner","Hidden"]
[null,null,320,"Target","TBright_Expander",null,"Shown","Target","TBright_Nits_Expander","Hidden"]
[null,null,321,"Target","TBright_Expander",null,"Shown","Target","TBright_Nits_Banner","Hidden"]
[null,null,322]
[null,null,323,"Target","TRes_Expander",null,"Shown","Target","TRes_Fundamental_Expander","Hidden"]
[null,null,324,"Target","TRes_Expander",null,"Shown","Target","TRes_Fundamental_Banner","Hidden"]
[null,null,325,"Target","TRes_Expander",null,"Shown","Target","TRes_IndustryStd_Expander","Hidden"]
[null,null,326,"Target","TRes_Expander",null,"Shown","Target","TRes_IndustryStd_Banner","Hidden"]
[null,null,327,"Target","TRes_Expander",null,"Shown","Target","TRes_ManualRes_Expander","Hidden"]
[null,null,328,"Target","TRes_Expander",null,"Shown","Target","TRes_ManualRes_Banner","Hidden"]
[null,null,329]
[null,null,330]
[null,null,331]
[null,null,332]
[null,null,333]
[null,null,334]
[null,null,335]
[null,null,336]
[null,null,337]
[null,null,338]
[null,null,339]
[null,null,340]
[null,null,341]
[null,null,342]
[null,null,343]
[null,null,344]
[null,null,345,"Target","TRes_Expander",null,"Shown","Target","TRes_Main_InfoButton3","Hidden"]
[null,null,346,"Target","TBright_Expander",null,"Shown","Target","TBright_Main_InfoButton1","Hidden"]
[null,null,347,"Target","TRes_IndustryStd_Expander",null,"Shown","Target","TRes_IndStan_InfoButton","Hidden"]
[null,null,348]
[null,null,349,"Target","TBright_Lumens_Ent",null,"NotFull","Target","TBright_Ambient_Expander","Hidden"]
[null,null,350,"Target","TBright_Lumens_Ent",null,"NotFull","Target","TBright_Nits_Expander","Hidden"]
[null,null,351,"Target","TBright_Nits_Ent",null,"NotFull","Target","TBright_Ambient_Expander","Hidden"]
[null,null,352,"Target","TBright_Nits_Ent",null,"NotFull","Target","TBright_Lumens_Expander","Hidden"]
[null,null,353,"Target","TRes_ManRes_Ent",null,"NotFull","Target","TBright_IndustryStd_Expander","Hidden"]
[null,null,354,"Target","TRes_ManRes_Ent",null,"NotFull","Target","TBright_Fundamental_Expander","Hidden"]
[null,null,355,"Target","TRes_Fundamental_Expander",null,"NotFull","Target","TBright_IndustryStd_Expander","Hidden"]
[null,null,356,"Target","TRes_Fundamental_Expander",null,"NotFull","Target","TBright_ManualRes_Expander","Hidden"]
[null,null,357]
[null,null,358]
[null,null,359]
[null,null,360]
[null,null,361]
[null,null,362]
[null,null,363]
[null,null,364]
[null,null,365]
[null,null,366]
[null,null,367]
[null,null,368]
[null,null,369]
[null,null,370]
[null,null,371]
[null,null,372]
[null,null,373]
[null,null,374]
[null,null,375]
[null,null,376]
[null,null,377]
[null,null,378]
[null,null,379]
[null,null,380]
[null,null,381]
[null,null,382]

{"sheet":"xMimic","index":27,"n_rows":98,"n_cols":8,"rows_kept":98,"cut":false,"hidden":true,"merged":[[1,2,1,7]]}
[]
[null,null,"Object Mimic Table"]
[]
[null,null,1,2,3,4,5,6]
[null,null,null,null,null,"On","Switch"]
[null,null,"Index","Sheet","Shape","Sheet …","Object .."]
[null,null,{"$f":"MAX(C33:C99)","v":91}]
[null,null,1]
[null,null,2]
[null,null,3,"App","DashboardBanner","App","DashboardButton"]
[null,null,4,"Target","DashboardBanner","Target","DashboardButton"]
[null,null,5,"Summary","DashboardBanner","Summary","DashboardButton"]
[null,null,6,"Map","DashboardBanner","Map","DashboardButton"]
[null,null,7,"Chipsets","DashboardBanner","Chipsets","DashboardButton"]
[null,null,8,"Engines","DashboardBanner","Engines","DashboardButton"]
[null,null,9,"Support","DashboardBanner","Support","DashboardButton"]
[null,null,10,"Options","DashboardBanner","Options","DashboardButton"]
[null,null,11]
[null,null,12,"App","DashboardBox","App","DashboardButton"]
[null,null,13,"Target","DashboardBox","Target","DashboardButton"]
[null,null,14,"Summary","DashboardBox","Summary","DashboardButton"]
[null,null,15,"Map","DashboardBox","Map","DashboardButton"]
[null,null,16,"Chipsets","DashboardBox","Chipsets","DashboardButton"]
[null,null,17,"Engines","DashboardBox","Engines","DashboardButton"]
[null,null,18,"Support","DashboardBox","Support","DashboardButton"]
[null,null,19,"Options","DashboardBox","Options","DashboardButton"]
[null,null,20]
[null,null,21]
[null,null,22,"Summary","TUnits_Banner","Target","TUnits_Expander"]
[null,null,23,"Summary","TUnits_BannerLine","Target","TUnits_Expander"]
[null,null,24]
[null,null,25]
[null,null,26,"Target","TBright_Banner","Target","TBright_Expander"]
[null,null,27,"Target","TBright_BannerLine","Target","TBright_Expander"]
[null,null,28]
[null,null,29,"Target","TBright_Ambient_Banner","Target","TBright_Ambient_Expander"]
[null,null,30,"Target","TBright_Nits_Banner","Target","TBright_Nits_Expander"]
[null,null,31,"Target","TBright_Lumens_Banner","Target","TBright_Lumens_Expander"]
[null,null,32]
[null,null,33]
[null,null,34]
[null,null,35,"Target","TSize_Banner","Target","TSize_Expander"]
[null,null,36,"Target","TSize_BannerLine","Target","TSize_Expander"]
[null,null,37]
[null,null,38]
[null,null,39]
[null,null,40,"Target","TRes_Banner","Target","TRes_Expander"]
[null,null,41,"Target","TRes_BannerLine","Target","TRes_Expander"]
[null,null,42]
[null,null,43,"Target","TRes_Fundamental_Banner","Target","TRes_Fundamental_Expander"]
[null,null,44,"Target","TRes_IndustryStd_Banner","Target","TRes_IndustryStd_Expander"]
[null,null,45,"Target","TRes_ManualRes_Banner","Target","TRes_ManualRes_Expander"]
[null,null,46]
[null,null,47]
[null,null,48,"Map","Map_MatchZone_Banner","Map","Map_MatchZone_Expander"]
[null,null,49]
[null,null,50]
[null,null,51]
[null,null,52,"Engines","EngineDef_Banner","Engines","EngineDef_Expander"]
[null,null,53,"Engines","EngineDef_BannerLine","Engines","EngineDef_Expander"]
[null,null,54]
[null,null,55]
[null,null,56,"Chipsets","ChipsetDef_Banner","Chipsets","ChipsetDef_Expander"]
[null,null,57,"Chipsets","ChipsetDef_BannerLine","Chipsets","ChipsetDef_Expander"]
[null,null,58]
[null,null,59]
[null,null,60,"Map","BypassUserInputsButton","Summary","BypassUserInputsButton"]
[null,null,61,"Summary","BypassUserInputsButton","Map","BypassUserInputsButton"]
[null,null,62]
[null,null,63]
[null,null,64]
[null,null,65]
[null,null,66]
[null,null,67]
[null,null,68]
[null,null,69]
[null,null,70]
[null,null,71]
[null,null,72]
[null,null,73,"Summary","Summary_CalcResult_Banner","App","Summary_CalcResult_Expander"]
[null,null,74,"Summary","Summary_Inputs_Banner","App","Summary_Inputs_Expander"]
[null,null,75]
[null,null,76]
[null,null,77]
[null,null,78]
[null,null,79]
[null,null,80]
[null,null,81]
[null,null,82]
[null,null,83]
[null,null,84]
[null,null,85]
[null,null,86]
[null,null,87]
[null,null,88]
[null,null,89]
[null,null,90]
[null,null,91]

{"sheet":"xUnitsConvert","index":28,"n_rows":10,"n_cols":12,"rows_kept":10,"cut":false,"hidden":true,"merged":[[2,4,2,6],[5,1,9,1]]}
[]
[]
[null,null,null,null,"To … System Units"]
[null,null,null,null,"in","ft","m",null,{"$f":"IF(TUnits <> 0, TUnits+1, 2)","v":2}]
[]
[null,"From ...\nLocal Units","in",null,1,{"$f":"1/12","v":8.3333333333333329E-2},2.5399999999999999E-2,null,null,null,2,{"$f":"INDEX( Table_UnitConvert, K6, 2 )","v":1}]
[null,null,"ft",null,12,1,0.30480000000000002,null,null,null,3,{"$f":"INDEX( Table_UnitConvert, K7, 2 )","v":12}]
[null,null,"mm",null,3.9370080000000002E-2,{"$f":"E8/12","v":3.2808400000000001E-3},1E-3,null,null,null,4,{"$f":"INDEX( Table_UnitConvert, K8, 2 )","v":3.9370080000000002E-2}]
[null,null,"cm",null,0.39370080000000002,3.2808399930000003E-2,0.01,null,null,null,5,{"$f":"INDEX( Table_UnitConvert, K9, 2 )","v":0.39370080000000002}]
[null,null,"m",null,39.370080000000002,0.32808399929999998,1,null,null,null,6,{"$f":"INDEX( Table_UnitConvert, K10, 2 )","v":39.370080000000002}]

{"sheet":"xOneofManyGroups","index":29,"n_rows":120,"n_cols":61,"rows_kept":120,"cut":false,"hidden":true,"merged":[[1,3,1,12]]}
[]
[null,null,null,"One-of-Many Groups"]
[]
[null,null,null,1,null,4,5,6,7,9,null,10,11]
[]
[null,null,null,"Group","Item","Shown\nShape Color","Hidden\nShape Color","Shown\nOutline Color","Hidden\nOutline Color","On Value","Linked cells (sheet, shape, cell)"]
[null,null,null,{"$f":"MAX(B8:B120)","v":109}]
[null,1,null,1,1,"DarkAqua","LightYellow","Gray191","LightYellow",1,"Target,MinAmbientOption1,TBright_Ambient_MinSelect"]
[null,2,null,1,2,"DarkAqua","LightYellow","Gray191","LightYellow",2,"Target,MinAmbientOption2,TBright_Ambient_MinSelect"]
[null,3,null,1,3,"DarkAqua","LightYellow","Gray191","LightYellow",3,"Target,MinAmbientOption3,TBright_Ambient_MinSelect"]
[null,4,null,1,4,"DarkAqua","LightYellow","Gray191","LightYellow",4,"Target,MinAmbientOption4,TBright_Ambient_MinSelect"]
[null,5,null,1,5,"DarkAqua","LightYellow","Gray191","LightYellow",5,"Target,MinAmbientOption5,TBright_Ambient_MinSelect"]
[null,6]
[null,7,null,2,1,"DarkAqua","LightYellow","Gray191","LightYellow",1,"Target,MaxAmbientOption1,TBright_Ambient_MaxSelect"]
[null,8,null,2,2,"DarkAqua","LightYellow","Gray191","LightYellow",2,"Target,MaxAmbientOption2,TBright_Ambient_MaxSelect"]
[null,9,null,2,3,"DarkAqua","LightYellow","Gray191","LightYellow",3,"Target,MaxAmbientOption3,TBright_Ambient_MaxSelect"]
[null,10,null,2,4,"DarkAqua","LightYellow","Gray191","LightYellow",4,"Target,MaxAmbientOption4,TBright_Ambient_MaxSelect",null,null,null,null,null,null,null,null,null,null,null,null,null,null,null,null,null,null,null,null,null,null,null,null,null,null,null,null,null,null,null,null,null,null,null,null,null,null,null,null,null,null,null,null,null,null,null,null,0]
[null,11,null,2,5,"DarkAqua","LightYellow","Gray191","LightYellow",5,"Target,MaxAmbientOption5,TBright_Ambient_MaxSelect"]
[null,12]
[null,13,null,8,1,"DarkAqua","LightYellow","Gray191","LightYellow",1,"Summary,TUnit1,Tunits"]
[null,14,null,8,2,"DarkAqua","LightYellow","Gray191","LightYellow",2,"Summary,TUnit2,Tunits"]
[null,15,null,8,3,"DarkAqua","LightYellow","Gray191","LightYellow",3,"Summary,TUnit3,Tunits"]
[null,16]
[null,17,null,9,1,"DarkAqua","LightYellow","Gray191","LightYellow",1,"Options,Default_TUnit1,Default_Tunits,Summary,TUnit1,Tunits"]
[null,18,null,9,2,"DarkAqua","LightYellow","Gray191","LightYellow",2,"Options,Default_TUnit2,Default_Tunits,Summary,TUnit2,Tunits"]
[null,19,null,9,3,"DarkAqua","LightYellow","Gray191","LightYellow",3,"Options,Default_TUnit3,Default_Tunits,Summary,TUnit3,Tunits"]
[null,20]
[null,21,null,5,1,"DarkAqua","LightYellow","Gray191","LightYellow",1,"App,AppOption1,App_Select"]
[null,22,null,5,2,"DarkAqua","LightYellow","Gray191","LightYellow",2,"App,AppOption2,App_Select"]
[null,23,null,5,3,"DarkAqua","LightYellow","Gray191","LightYellow",3,"App,AppOption3,App_Select"]
[null,24,null,5,4,"DarkAqua","LightYellow","Gray191","LightYellow",4,"App,AppOption4,App_Select",null,null,null,null,null,null,null,null,null,null,null,null,null,null,null,null,null,null,null,null,null,null,null,null,null,null,null,null,null,null,null,null,null,null,null,null,null,null,null,null,null,null,null,null,null,null,0,null,null,0]
[null,25,null,5,5,"DarkAqua","LightYellow","Gray191","LightYellow",5,"App,AppOption5,App_Select"]
[null,26,null,5,6,"DarkAqua","LightYellow","Gray191","LightYellow",6,"App,AppOption6,App_Select"]
[null,27,null,5,7,"DarkAqua","LightYellow","Gray191","LightYellow",7,"App,AppOption7,App_Select"]
[null,28,null,5,8,"DarkAqua","LightYellow","Gray191","LightYellow",8,"App,AppOption8,App_Select"]
[null,29,null,5,9,"DarkAqua","LightYellow","Gray191","LightYellow",9,"App,AppOption9,App_Select"]
[null,30,null,5,10,"DarkAqua","LightYellow","Gray191","LightYellow",10,"App,AppOption10,App_Select"]
[null,31,null,5,11,"DarkAqua","LightYellow","Gray191","LightYellow",11,"App,AppOption11,App_Select"]
[null,32,null,5,12,"DarkAqua","LightYellow","Gray191","LightYellow",12,"App,AppOption12,App_Select"]
[null,33,null,5,13,"DarkAqua","LightYellow","Gray191","LightYellow",13,"App,AppOption13,App_Select"]
[null,34,null,5,14,"DarkAqua","LightYellow","Gray191","LightYellow",14,"App,AppOption14,App_Select"]
[null,35,null,5,15,"DarkAqua","LightYellow","Gray191","LightYellow",15,"App,AppOption15,App_Select"]
[null,36,null,5,16,"DarkAqua","LightYellow","Gray191","LightYellow",16,"App,AppOption16,App_Select"]
[null,37,null,5,17,"DarkAqua","LightYellow","Gray191","LightYellow",17,"App,AppOption17,App_Select"]
[null,38,null,5,18,"DarkAqua","LightYellow","Gray191","LightYellow",18,"App,AppOption18,App_Select"]
[null,39,null,5,19,"DarkAqua","LightYellow","Gray191","LightYellow",19,"App,AppOption19,App_Select"]
[null,40,null,5,20,"DarkAqua","LightYellow","Gray191","LightYellow",20,"App,AppOption20,App_Select"]
[null,41,null,5,21,"DarkAqua","LightYellow","Gray191","LightYellow",21,"App,AppOption21,App_Select"]
[null,41,null,5,22,"DarkAqua","LightYellow","Gray191","LightYellow",22,"App,AppOption22,App_Select"]
[null,41,null,5,23,"DarkAqua","LightYellow","Gray191","LightYellow",23,"App,AppOption23,App_Select"]
[null,41,null,5,24,"DarkAqua","LightYellow","Gray191","LightYellow",24,"App,AppOption24,App_Select"]
[null,41,null,5,25,"DarkAqua","LightYellow","Gray191","LightYellow",25,"App,AppOption25,App_Select"]
[null,42]
[null,43,null,6,1,"DarkAqua","LightYellow","Gray191","LightYellow",1,"Target,StdResMin_Option1,StdRes_Select_Min"]
[null,44,null,6,2,"DarkAqua","LightYellow","Gray191","LightYellow",2,"Target,StdResMin_Option2,StdRes_Select_Min"]
[null,45,null,6,3,"DarkAqua","LightYellow","Gray191","LightYellow",3,"Target,StdResMin_Option3,StdRes_Select_Min"]
[null,46,null,6,4,"DarkAqua","LightYellow","Gray191","LightYellow",4,"Target,StdResMin_Option4,StdRes_Select_Min",null,null,null,null,null,null,null,null,null,null,null,null,null,null,null,null,null,null,null,null,null,null,null,null,null,null,null,null,null,null,null,null,null,null,null,null,null,null,null,null,null,null,null,null,null,null,0,null,null,0]
[null,47,null,6,5,"DarkAqua","LightYellow","Gray191","LightYellow",5,"Target,StdResMin_Option5,StdRes_Select_Min"]
[null,48,null,6,6,"DarkAqua","LightYellow","Gray191","LightYellow",6,"Target,StdResMin_Option6,StdRes_Select_Min"]
[null,49,null,6,7,"DarkAqua","LightYellow","Gray191","LightYellow",7,"Target,StdResMin_Option7,StdRes_Select_Min"]
[null,50,null,6,8,"DarkAqua","LightYellow","Gray191","LightYellow",8,"Target,StdResMin_Option8,StdRes_Select_Min"]
[null,51,null,6,9,"DarkAqua","LightYellow","Gray191","LightYellow",9,"Target,StdResMin_Option9,StdRes_Select_Min"]
[null,52,null,6,10,"DarkAqua","LightYellow","Gray191","LightYellow",10,"Target,StdResMin_Option10,StdRes_Select_Min"]
[null,53,null,6,11,"DarkAqua","LightYellow","Gray191","LightYellow",11,"Target,StdResMin_Option11,StdRes_Select_Min"]
[null,54,null,6,12,"DarkAqua","LightYellow","Gray191","LightYellow",12,"Target,StdResMin_Option12,StdRes_Select_Min"]
[null,55,null,6,13,"DarkAqua","LightYellow","Gray191","LightYellow",13,"Target,StdResMin_Option13,StdRes_Select_Min"]
[null,56,null,6,14,"DarkAqua","LightYellow","Gray191","LightYellow",14,"Target,StdResMin_Option14,StdRes_Select_Min"]
[null,57,null,6,15,"DarkAqua","LightYellow","Gray191","LightYellow",15,"Target,StdResMin_Option15,StdRes_Select_Min"]
[null,58,null,6,16,"DarkAqua","LightYellow","Gray191","LightYellow",16,"Target,StdResMin_Option16,StdRes_Select_Min"]
[null,59,null,6,17,"DarkAqua","LightYellow","Gray191","LightYellow",17,"Target,StdResMin_Option17,StdRes_Select_Min"]
[null,60,null,6,18,"DarkAqua","LightYellow","Gray191","LightYellow",18,"Target,StdResMin_Option18,StdRes_Select_Min"]
[null,61,null,6,19,"DarkAqua","LightYellow","Gray191","LightYellow",19,"Target,StdResMin_Option19,StdRes_Select_Min"]
[null,62,null,6,20,"DarkAqua","LightYellow","Gray191","LightYellow",20,"Target,StdResMin_Option20,StdRes_Select_Min"]
[null,63,null,6,21,"DarkAqua","LightYellow","Gray191","LightYellow",21,"Target,StdResMin_Option21,StdRes_Select_Min"]
[null,64,null,6,22,"DarkAqua","LightYellow","Gray191","LightYellow",22,"Target,StdResMin_Option22,StdRes_Select_Min"]
[null,65,null,6,23,"DarkAqua","LightYellow","Gray191","LightYellow",23,"Target,StdResMin_Option23,StdRes_Select_Min"]
[null,66,null,6,24,"DarkAqua","LightYellow","Gray191","LightYellow",24,"Target,StdResMin_Option24,StdRes_Select_Min"]
[null,67,null,6,25,"DarkAqua","LightYellow","Gray191","LightYellow",25,"Target,StdResMin_Option25,StdRes_Select_Min"]
[null,68]
[null,69]
[null,70,null,7,1,"DarkAqua","LightYellow","Gray191","Gray191",1,"Target,StdResMax_Option1,StdRes_Select_Max"]
[null,71,null,7,2,"DarkAqua","LightYellow","Gray191","Gray191",2,"Target,StdResMax_Option2,StdRes_Select_Max"]
[null,72,null,7,3,"DarkAqua","LightYellow","Gray191","Gray191",3,"Target,StdResMax_Option3,StdRes_Select_Max"]
[null,73,null,7,4,"DarkAqua","LightYellow","Gray191","Gray191",4,"Target,StdResMax_Option4,StdRes_Select_Max",null,null,null,null,null,null,null,null,null,null,null,null,null,null,null,null,null,null,null,null,null,null,null,null,null,null,null,null,null,null,null,null,null,null,null,null,null,null,null,null,null,null,null,null,null,null,0,null,null,0]
[null,74,null,7,5,"DarkAqua","LightYellow","Gray191","Gray191",5,"Target,StdResMax_Option5,StdRes_Select_Max"]
[null,75,null,7,6,"DarkAqua","LightYellow","Gray191","Gray191",6,"Target,StdResMax_Option6,StdRes_Select_Max"]
[null,76,null,7,7,"DarkAqua","LightYellow","Gray191","Gray191",7,"Target,StdResMax_Option7,StdRes_Select_Max"]
[null,77,null,7,8,"DarkAqua","LightYellow","Gray191","Gray191",8,"Target,StdResMax_Option8,StdRes_Select_Max"]
[null,78,null,7,9,"DarkAqua","LightYellow","Gray191","Gray191",9,"Target,StdResMax_Option9,StdRes_Select_Max"]
[null,79,null,7,10,"DarkAqua","LightYellow","Gray191","Gray191",10,"Target,StdResMax_Option10,StdRes_Select_Max"]
[null,80,null,7,11,"DarkAqua","LightYellow","Gray191","Gray191",11,"Target,StdResMax_Option11,StdRes_Select_Max"]
[null,81,null,7,12,"DarkAqua","LightYellow","Gray191","Gray191",12,"Target,StdResMax_Option12,StdRes_Select_Max"]
[null,82,null,7,13,"DarkAqua","LightYellow","Gray191","Gray191",13,"Target,StdResMax_Option13,StdRes_Select_Max"]
[null,83,null,7,14,"DarkAqua","LightYellow","Gray191","Gray191",14,"Target,StdResMax_Option14,StdRes_Select_Max"]
[null,84,null,7,15,"DarkAqua","LightYellow","Gray191","Gray191",15,"Target,StdResMax_Option15,StdRes_Select_Max"]
[null,85,null,7,16,"DarkAqua","LightYellow","Gray191","Gray191",16,"Target,StdResMax_Option16,StdRes_Select_Max"]
[null,86,null,7,17,"DarkAqua","LightYellow","Gray191","Gray191",17,"Target,StdResMax_Option17,StdRes_Select_Max"]
[null,87,null,7,18,"DarkAqua","LightYellow","Gray191","Gray191",18,"Target,StdResMax_Option18,StdRes_Select_Max"]
[null,88,null,7,19,"DarkAqua","LightYellow","Gray191","Gray191",19,"Target,StdResMax_Option19,StdRes_Select_Max"]
[null,89,null,7,20,"DarkAqua","LightYellow","Gray191","Gray191",20,"Target,StdResMax_Option20,StdRes_Select_Max"]
[null,90,null,7,21,"DarkAqua","LightYellow","Gray191","Gray191",21,"Target,StdResMax_Option21,StdRes_Select_Max"]
[null,91,null,7,22,"DarkAqua","LightYellow","Gray191","Gray191",22,"Target,StdResMax_Option22,StdRes_Select_Max"]
[null,92,null,7,23,"DarkAqua","LightYellow","Gray191","Gray191",23,"Target,StdResMax_Option23,StdRes_Select_Max"]
[null,93,null,7,24,"DarkAqua","LightYellow","Gray191","Gray191",24,"Target,StdResMax_Option24,StdRes_Select_Max"]
[null,94,null,7,25,"DarkAqua","LightYellow","Gray191","Gray191",25,"Target,StdResMax_Option25,StdRes_Select_Max"]
[null,95]
[null,96,null,10,1,"LightYellow","DarkAqua","LightYellow","Gray191",1,"Engines,TRRangeButton1,TRRange_Option1"]
[null,97,null,11,1,"LightYellow","DarkAqua","LightYellow","Gray191",1,"Engines,TRRangeButton2,TRRange_Option2"]
[null,98,null,12,1,"LightYellow","DarkAqua","LightYellow","Gray191",1,"Engines,TRRangeButton3,TRRange_Option3"]
[null,99,null,13,1,"LightYellow","DarkAqua","LightYellow","Gray191",1,"Engines,TRRangeButton4,TRRange_Option4"]
[null,100,null,14,1,"LightYellow","DarkAqua","LightYellow","Gray191",1,"Engines,TRRangeButton5,TRRange_Option5"]
[null,101,null,15,1,"LightYellow","DarkAqua","LightYellow","Gray191",1,"Engines,TRRangeButton6,TRRange_Option6"]
[null,102]
[null,103,null,16,1,"LightYellow","DarkAqua","LightYellow","Gray191",1,"Map,Map_MatchingZone_OptionButton1,Map_MatchZone_Option1"]
[null,104]
[null,105]
[null,106]
[null,107]
[null,108]
[null,109]

{"sheet":"xSmartSelect","index":30,"n_rows":4,"n_cols":2,"rows_kept":4,"cut":false,"hidden":true,"merged":[]}
["This sheet is intentionally blank"]
[]
[null,"This sheet is used by the macros to determine if SmartSelect is the active workbook."]
[null,"(in case customers have multiple workbooks open)"]

{"sheet":"xActSheets","index":31,"n_rows":18,"n_cols":11,"rows_kept":18,"cut":false,"hidden":true,"merged":[[1,2,1,10]]}
[]
[null,null,"Active Sheets Table"]
[]
[null,null,1,2,3,4,5,6,7,8,9]
[]
[null,null,"Index","Sheet"]
[null,null,{"$f":"MAX(C8:C22)","v":11}]
[null,null,1,"NoMacros"]
[null,null,2,"Placard"]
[null,null,3,"Welcome"]
[null,null,4,"App"]
[null,null,5,"Target"]
[null,null,6,"Summary"]
[null,null,7,"Map"]
[null,null,8,"Chipsets"]
[null,null,9,"Engines"]
[null,null,10,"Support"]
[null,null,11,"Options"]

{"sheet":"xColors","index":32,"n_rows":38,"n_cols":9,"rows_kept":38,"cut":false,"hidden":true,"merged":[[3,2,3,8]]}
[]
[]
[]
[null,null,"Colors"]
[]
[null,null,1,null,null,3,4,5,6]
[]
[null,null,"Index","Name","R","G","B"]
[null,null,{"$f":"MAX(C10:C39)","v":29}]
[null,null,1,"Red",255,0,0]
[null,null,2,"Green",0,255,0]
[null,null,3,"Blue",0,0,255]
[null,null,4,"White",255,255,255]
[null,null,5,"Black",0,0,0]
[null,null,6]
[null,null,7,"LightAqua",214,242,241]
[null,null,8,"DarkAqua",0,124,140]
[null,null,9]
[null,null,10,"LightYellow",255,255,204]
[null,null,11,"MediumYellow"]
[null,null,12,"BrightYellow",255,255,0]
[null,null,13]
[null,null,14,"PaleOrange",255,192,0]
[null,null,15,"LightOrange",252,213,181]
[null,null,16,"FadedOrange",246,142,56]
[null,null,17,"DarkOrange",228,108,10]
[null,null,18]
[null,null,19,"Gray191",191,191,191]
[null,null,20,"Gray178",178,178,178]
[null,null,21,"Gray242",242,242,242]
[null,null,22,"Gray217",217,217,217]
[null,null,23,"Gray64",64,64,64]
[null,null,24]
[null,null,25]
[null,null,26,"LightGray",242,242,242]
[null,null,27,"MediumGray",217,217,217]
[null,null,28,"DarkGray",64,64,64]
[null,null,29]