{"text_format":"1","workbook":"xlsx","n_sheets":9,"sheets":["InputSheet","DeviceCalculator","revisionNotes","Disclaimer","partData","Std. R and C Values","Schematic Checklist","Layout Checklist","Extra"],"not_rendered":{"charts":0,"images":2,"macros":1,"external_links":4,"defined_names":376,"comments":1,"pivot_tables":0},"unopened":[],"bounds":{"document_bytes":16777216,"sheet_cells":100000,"rows_first":2000,"rows_last":500,"rows_between":2000,"halvings":0,"cell_chars":16384,"cell_head_chars":4096},"cells_cut":0,"cells_raw":0,"read":"whole","date_system":"1900"}

{"sheet":"InputSheet","index":0,"n_rows":51,"n_cols":7,"rows_kept":51,"cut":false,"hidden":false,"merged":[]}
["Parameter","Units","Type","Default","*selected*","end"]
["Rail Name",null,"Req",null,"Example"]
["Part Number",null,"Req",null,"TPSM843620"]
["Vin_min","V","Opt","Vin_nom*0.8",11]
["Vin_nom","V","Req",null,12,null,"Sheet Descriptions:"]
["Vin_max","V","Opt","Vin_nom*1.1",13,null,"InputSheet = sheet with simplified input for checking component values with the macros described below"]
["Vout","V","Req",null,1,null,"DeviceCalculator = sheet where all calculations are done. This sheet can be used by itself to select or check component values."]
["Iout","A","Opt","Io_max_IC",6]
["dVo_trans",null,"Opt","Vout*0.03",0.03,null,"Macro Directions:"]
["dVo_dc",null,"Opt","Vout*0.01",0.01,null,"Check/Calculate Selected Column"]
["Io_step","A","Opt","Iout*0.5",3,null,"Select any cell in the column of the design you would like to check."]
["R_fsel",null,"Opt","R_fsel_rec",11.8,null,"Click on the Check/Calculate to send the input values to the DeviceCalculator worksheet."]
["fsw_select",null,"Calc",null,1000,null,"The calculated results on the DeviceCalculator worksheet are then pulled back to this sheet to check the component values used."]
["N_Cout_cer",null,"Opt",1,2]
["Cout_single_cer","mΩ","Opt","Cout_min",100,null,"Pull Values from DeviceCalculator Sheet"]
["Cer_derating",null,"Opt",0.8,0.8,null,"The DeviceCalculator worksheet has more details to aid in the design."]
["ESR_single_cer","µF","Opt",1,1,null,"Updates to the design can be mode in the DeviceCalculator sheet."]
["N_Cout_bulk",null,"Opt",0,0,null,"After making updates, click on Pull Values to use the values on the DeviceCalculator sheet and check them."]
["Cout_single_bulk","µF","Opt",0.1,0]
["ESR_single_bulk","mΩ","Opt",1,0,null,"Check/Calculate All Columns"]
{"$rows_left_out":32}
{"sheet":"DeviceCalculator","index":1,"n_rows":154,"n_cols":10,"rows_kept":154,"cut":false,"hidden":false,"merged":[[41,1,41,7],[42,1,42,7],[56,1,56,7],[57,1,57,7],[100,1,100,7],[88,1,88,7],[95,1,95,7],[123,1,123,7],[101,1,101,7],[109,1,109,7],[135,1,135,7],[149,1,149,7],[33,1,33,7],[0,1,0,7],[7,1,7,7],[25,1,25,7],[1,1,6,1],[1,2,6,2],[1,3,6,3],[1,4,6,4],[1,5,6,5],[1,6,6,6],[1,7,6,7]]}
[null,"Design Calculations",null,null,null,null,null,null,null,"Key"]
[null,"Parameter","Input","Recommended","Selected Value","Calculated with Selected Value","Units","Description",null,"User Entered Value"]
[null,null,null,null,null,null,null,null,null,"Fixed IC Parameter"]
[null,null,null,null,null,null,null,null,null,"Calculated Parameter"]
[null,null,null,null,null,null,null,null,null,"Recommended Component Value"]
[null,null,null,null,null,null,null,null,null,"Design Caution"]
[null,null,null,null,null,null,null,null,null,"Design Warning"]
[null,"Choose Device"]
[null,"Part number","TPSM843620",null,null,null,null,"Select IC part number"]
[null,"Vin_min_IC",{"$f":"VLOOKUP($C$9,partData!$A$3:$N$12,2,FALSE)","v":4},null,null,null,"V","IC rated minimum input voltage"]
[null,"Vin_max_IC",{"$f":"VLOOKUP($C$9,partData!$A$3:$AAA$13,3,FALSE)","v":18},null,null,null,"V","IC rated maximum input voltage"]
[null,"Vref",{"$f":"VLOOKUP($C$9,partData!$A$3:$AAA$13,9,FALSE)","v":0.5},null,null,null,"V","Internal voltage reference"]
[null,"Io_max_IC",{"$f":"VLOOKUP($C$9,partData!$A$3:$AAA$13,4,FALSE)","v":6},null,null,null,"A","IC rated maximum output current"]
[null,"EN_rise",{"$f":"VLOOKUP($C$9,partData!$A$3:$AAA$13,12,FALSE)","v":1.2},null,null,null,"V","EN rising voltage threshold"]
[null,"EN_rise_max",{"$f":"VLOOKUP($C$9,partData!$A$3:$AAA$13,17,FALSE)","v":1.25},null,null,null,"V","EN rising voltage threshold (maximum spec)"]
[null,"EN_fall",{"$f":"VLOOKUP($C$9,partData!$A$3:$AAA$13,13,FALSE)","v":1.1000000000000001},null,null,null,"V","EN falling voltage threshold"]
[null,"OC_high_min",{"$f":"VLOOKUP($C$9,partData!$A$3:$AAA$13,5,FALSE)","v":8.3699999999999992},null,null,null,"A","Minimum peak current limit for High current limits"]
[null,"OC_low_min",{"$f":"VLOOKUP($C$9,partData!$A$3:$AAA$13,6,FALSE)","v":4},null,null,null,"A","Minimum peak current limit for Low current limits"]
[null,"ton_min_max",{"$f":"VLOOKUP($C$9,partData!$A$3:$AAA$13,7,FALSE)","v":40},null,null,null,"ns","Worst case minimum on-time"]
[null,"toff_min_max",{"$f":"VLOOKUP($C$9,partData!$A$3:$AAA$13,8,FALSE)","v":140},null,null,null,"ns","Worst case minimum off-time"]
{"$rows_left_out":135}
{"sheet":"revisionNotes","index":2,"n_rows":2,"n_cols":2,"rows_kept":2,"cut":false,"hidden":false,"merged":[]}
["Date","Change"]
["2023-11-09","Initial Rev A release"]

{"sheet":"Disclaimer","index":3,"n_rows":8,"n_cols":1,"rows_kept":8,"cut":false,"hidden":false,"merged":[]}
["Important notice and disclaimer"]
["TI PROVIDES TECHNICAL AND RELIABILITY DATA (INCLUDING DATASHEETS), DESIGN RESOURCES (INCLUDING REFERENCE DESIGNS), APPLICATION OR OTHER DESIGN ADVICE, WEB TOOLS, SAFETY INFORMATION, AND OTHER RESOURCES “AS IS” AND WITH ALL FAULTS, AND DISCLAIMS ALL WARRANTIES, EXPRESS AND IMPLIED, INCLUDING WITHOUT LIMITATION ANY IMPLIED WARRANTIES OF MERCHANTABILITY, FITNESS FOR A PARTICULAR PURPOSE OR NON-INFRINGEMENT OF THIRD PARTY INTELLECTUAL PROPERTY RIGHTS."]
["These resources are intended for skilled developers designing with TI products. You are solely responsible for (1) selecting the appropriate TI products for your application, (2) designing, validating and testing your application, and (3) ensuring your application meets applicable standards, and any other safety, security, or other requirements."]
["These resources are subject to change without notice. TI grants you permission to use these resources only for development of an application that uses the TI products described in the resource. Other reproduction and display of these resources is prohibited. No license is granted to any other TI intellectual property right or to any third party intellectual property right. TI disclaims responsibility for, and you will fully indemnify TI and its representatives against, any claims, damages, costs, losses, and liabilities arising out of your use of these resources."]
["TI’s products are provided subject to TI’s Terms of Sale or other applicable terms available either on ti.com or provided in conjunction with such TI products. TI’s provision of these resources does not expand or otherwise alter TI’s applicable warranties or warranty disclaimers for TI products."]
["TI objects to and rejects any additional or different terms you may have proposed.  "]
[]
["All information in this document is provided “AS IS” and “with all faults”, and is subject to TI’s Important Notice \n(http://www.ti.com/corp/docs/legal/important-notice.shtml)"]

{"sheet":"partData","index":4,"n_rows":40,"n_cols":33,"rows_kept":40,"cut":false,"hidden":true,"merged":[]}
[1,2,3,4,5,6,7,8,9,10,11,12,13,14,15,16,17,18,19,20,21,22,23,24,25]
["Part #","VIN_min","VIN_max","Io,rated","OC high min","OC low min","tonmin max","toffmin max","Vref","R_HS","R_LS","EN_rise","EN_fall","I_p1","I_p2","I_h","EN_rise_max",null,"Lout","DCR","Tolerance"]
["TPSM843320",4,18,3,4,2.6,40,140,0.5,25,13.9,1.2,1.1000000000000001,1.5E-6,{"$f":"0.0000116","v":1.1600000000000001E-5},{"$f":"I_p2-I_p1","v":1.0100000000000002E-5},1.25,null,1,25,0.2]
["TPSM843620",4,18,6,8.3699999999999992,4,40,140,0.5,25,6.5,1.2,1.1000000000000001,1.5E-6,{"$f":"0.0000116","v":1.1600000000000001E-5},{"$f":"I_p2-I_p1","v":1.0100000000000002E-5},1.25,null,0.47,18,0.2]
["TPSM843820",4,18,8,11.25,8.3699999999999992,40,140,0.5,25,6.5,1.2,1.1000000000000001,1.5E-6,{"$f":"0.0000116","v":1.1600000000000001E-5},{"$f":"I_p2-I_p1","v":1.0100000000000002E-5},1.25,null,0.22,7,0.2]
[]
[]
[]
[null,null,null,null,null,null,null,null,null,null,null,null,null,null,null,null,null,null,1.01E-5,null,null,null,null,null,null,"No"]
[null,null,null,null,null,null,null,null,null,null,null,null,null,null,null,null,null,null,null,null,null,null,null,null,null,"Yes"]
[]
[null,null,null,null,null,null,null,null,null,null,null,null,null,null,null,null,null,null,null,null,{"$f":"R_mode","v":2.21}]
[]
[null,null,null,null,null,null,null,null,null,null,null,null,null,null,"Cur.lim","Cramp","SS time","#","Res to GND","E12 Series","Error","In range?","E12 Par","Error","In range?"]
[null,null,null,null,null,null,null,null,null,null,null,null,null,{"$f":"CONCATENATE(O15, P15, Q15)","v":"High10.5"},{"$f":"AD$16","v":"High"},{"$f":"AE$16","v":1},{"$f":"AF$16","v":0.5},1,1.78,1.8,{"$f":"(T15-S15)/S15","v":1.1235955056179785E-2},{"$f":"IF(U15>0,AND(R_mode>=S15,R_mode<=S15*(1+U15)),AND(R_mode<=S15,R_mode>=S15*(1+U15)))","v":false},1.8,{"$f":"(W15-S15)/S15","v":1.1235955056179785E-2},{"$f":"IF(X15>0,AND(R_mode>=S15,R_mode<=S15*(1+X15)),AND(R_mode<=S15,R_mode>=S15*(1+X15)))","v":false},{"$f":"OR(V15,Y15)","v":false},{"$f":"O15","v":"High"},{"$f":"P15","v":1},{"$f":"Q15","v":0.5},null,null,null,{"$f":"S15*(100+U15)","v":178.02}]
[null,null,null,null,"Frequency selection table",null,null,{"$f":"R_fsel","v":11.8},null,null,null,null,null,"High11",{"$f":"AD$16","v":"High"},1,{"$f":"AF$17","v":1},2,2.21,2.2000000000000002,{"$f":"(T16-S16)/S16","v":-4.5248868778279576E-3},true,2.2000000000000002,-4.5248868778279576E-3,true,{"$f":"OR(V16,Y16)","v":true},"High",1,1,"High",1,0.5]
[null,null,null,null,"Freq(kHz)","Res to GND","E12 Res to GND","Rfsel_min","Rfsel_max",null,{"$f":"MIN(fsw_max_ton,fsw_max_toff)","v":1748.251748251748},null,null,"High12","High",1,{"$f":"AF$18","v":2},3,2.74,2.7,-1.4598540145985413E-2,false,2.7,-1.4598540145985413E-2,false,false,"High",1,2,"Low",2,1]
["Top Resistor: ","GND","\nConnect to GND",null,500,24.3,27,24,1000000,{"$f":"AND(R_fsel>=H18,R_fsel<=I18)","v":false},{"$f":"K$17<L19","v":false},{"$f":"E18","v":500},null,"High14","High",1,{"$f":"AF$19","v":4},4,3.32,3.3,-6.0240963855421742E-3,false,3.3,-6.0240963855421742E-3,false,false,"High",1,4,null,4,2]
["\nBottom Resistor: ","PGOOD","\nConnect to PGOOD",null,750,17.399999999999999,18,17.399999999999999,18,{"$f":"AND(R_fsel>=H19,R_fsel<=I19)","v":false},{"$f":"K$17<L20","v":false},{"$f":"E19","v":750},null,"High20.5",{"$f":"AD$16","v":"High"},{"$f":"AE$17","v":2},{"$f":"AF$16","v":0.5},5,4.0199999999999996,4,-4.9751243781093468E-3,false,4,-4.9751243781093468E-3,false,false,"High",2,0.5,null,null,4]
[{"$f":"CONCATENATE(A18, DeviceCalculator!D113)","v":"Top Resistor: 4.99"},"VREG","\nConnect to VREG",null,1000,11.8,12,11.8,12.1,{"$f":"AND(R_fsel>=H20,R_fsel<=I20)","v":true},{"$f":"K$17<L21","v":false},1000,null,"High21","High",{"$f":"AE$17","v":2},{"$f":"AF$17","v":1},6,4.87,4.9000000000000004,6.1601642710472785E-3,false,{"$f":"8.2*12/(8.2+12)","v":4.8712871287128712},2.6429747697557826E-4,false,false,"High",2,1]
{"$rows_left_out":21}
{"sheet":"Std. R and C Values","index":5,"n_rows":99,"n_cols":17,"rows_kept":99,"cut":false,"hidden":true,"merged":[[2,4,2,5],[2,6,2,7],[9,4,9,5],[22,4,22,5],[47,4,47,5]]}
["Hide Sheet"]
[null,null,null,null,"Std. Resistors",null,null,null,null,"Capacitors"]
[null,"Enter resistor value",25,null,"E6",null,"E96",null,null,"Cap value",1500,"pF"]
[null,null,null,null,100,150,100,102,null,null,{"$f":"IF(K3*10^12<10000,IF((10^(LOG(K3*10^12)-INT(LOG(K3*10^12))))-VLOOKUP((10^(LOG(K3*10^12)-INT(LOG(K3*10^12)))),c_s1:C_f1,1)<VLOOKUP((10^(LOG(K3*10^12)-INT(LOG(K3*10^12)))),c_s1:C_f1,2)-(10^(LOG(K3*10^12)-INT(LOG(K3*10^12)))),VLOOKUP((10^(LOG(K3*10^12)-INT(LOG(K3*10^12)))),c_s1:C_f1,1),VLOOKUP((10^(LOG(K3*10^12)-INT(LOG(K3*10^12)))),c_s1:C_f1,2))*10^INT(LOG(K3*10^12)),IF((10^(LOG(K3*10^12)-INT(LOG(K3*10^12))))-VLOOKUP((10^(LOG(K3*10^12)-INT(LOG(K3*10^12)))),C_s2:C_f2,1)<VLOOKUP((10^(LOG(K3*10^12)-INT(LOG(K3*10^12)))),C_s2:C_f2,2)-(10^(LOG(K3*10^12)-INT(LOG(K3*10^12)))),VLOOKUP((10^(LOG(K3*10^12)-INT(LOG(K3*10^12)))),C_s2:C_f2,1),VLOOKUP((10^(LOG(K3*10^12)-INT(LOG(K3*10^12)))),C_s2:C_f2,2))*10^INT(LOG(K3*10^12)))*10^-12","v":1500},"pF"]
[null,"Closest E6 Value",{"$f":"(IF((10^(LOG(C3)-INT(LOG(C3)))*100)-VLOOKUP((10^(LOG(C3)-INT(LOG(C3)))*100),E6_s:E6_f,1)<VLOOKUP((10^(LOG(C3)-INT(LOG(C3)))*100),E6_s:E6_f,2)-(10^(LOG(C3)-INT(LOG(C3)))*100),VLOOKUP((10^(LOG(C3)-INT(LOG(C3)))*100),E6_s:E6_f,1),VLOOKUP((10^(LOG(C3)-INT(LOG(C3)))*100),E6_s:E6_f,2)))*10^INT(LOG(C3))/100","v":22},null,150,220,102,105]
[null,"Closest E12 Value",{"$f":"(IF((10^(LOG(C3)-INT(LOG(C3)))*100)-VLOOKUP((10^(LOG(C3)-INT(LOG(C3)))*100),E12_s:E12_f,1)<VLOOKUP((10^(LOG(C3)-INT(LOG(C3)))*100),E12_s:E12_f,2)-(10^(LOG(C3)-INT(LOG(C3)))*100),VLOOKUP((10^(LOG(C3)-INT(LOG(C3)))*100),E12_s:E12_f,1),VLOOKUP((10^(LOG(C3)-INT(LOG(C3)))*100),E12_s:E12_f,2)))*10^INT(LOG(C3))/100","v":27},null,220,330,105,107,null,"C values up to 10nF"]
[null,"Closest E24 Value",{"$f":"(IF((10^(LOG(C3)-INT(LOG(C3)))*100)-VLOOKUP((10^(LOG(C3)-INT(LOG(C3)))*100),E24_s:E24_f,1)<VLOOKUP((10^(LOG(C3)-INT(LOG(C3)))*100),E24_s:E24_f,2)-(10^(LOG(C3)-INT(LOG(C3)))*100),VLOOKUP((10^(LOG(C3)-INT(LOG(C3)))*100),E24_s:E24_f,1),VLOOKUP((10^(LOG(C3)-INT(LOG(C3)))*100),E24_s:E24_f,2)))*10^INT(LOG(C3))/100","v":24},null,330,470,107,110,null,1,1.2,{"$f":"IF((10^(LOG(K3)-INT(LOG(K3))))-VLOOKUP((10^(LOG(K3)-INT(LOG(K3)))),c_s1:C_f1,1)<VLOOKUP((10^(LOG(K3)-INT(LOG(K3)))),c_s1:C_f1,2)-(10^(LOG(K3)-INT(LOG(K3)))),VLOOKUP((10^(LOG(K3)-INT(LOG(K3)))),c_s1:C_f1,1),VLOOKUP((10^(LOG(K3)-INT(LOG(K3)))),c_s1:C_f1,2))","v":1.5}]
[null,"Closest E48 Value",{"$f":"(IF((10^(LOG(C3)-INT(LOG(C3)))*100)-VLOOKUP((10^(LOG(C3)-INT(LOG(C3)))*100),E48_s:E48_f,1)<VLOOKUP((10^(LOG(C3)-INT(LOG(C3)))*100),E48_s:E48_f,2)-(10^(LOG(C3)-INT(LOG(C3)))*100),VLOOKUP((10^(LOG(C3)-INT(LOG(C3)))*100),E48_s:E48_f,1),VLOOKUP((10^(LOG(C3)-INT(LOG(C3)))*100),E48_s:E48_f,2)))*10^INT(LOG(C3))/100","v":24.9},null,470,680,110,113,null,1.2,1.5]
[null,"Closest E96 Value",{"$f":"(IF((10^(LOG(C3)-INT(LOG(C3)))*100)-VLOOKUP((10^(LOG(C3)-INT(LOG(C3)))*100),E96_s:E96_f,1)<VLOOKUP((10^(LOG(C3)-INT(LOG(C3)))*100),E96_s:E96_f,2)-(10^(LOG(C3)-INT(LOG(C3)))*100),VLOOKUP((10^(LOG(C3)-INT(LOG(C3)))*100),E96_s:E96_f,1),VLOOKUP((10^(LOG(C3)-INT(LOG(C3)))*100),E96_s:E96_f,2)))*10^INT(LOG(C3))/100","v":24.9},null,680,1000,113,115,null,1.5,1.8,null,null,null,null,"Notes:","If I use the value in column K it rounds up"]
[null,null,null,null,"E12",null,115,118,null,1.8,2.2000000000000002,null,null,null,null,null,"If I use the value in column J it rounds down"]
[null,null,null,null,100,120,118,121,null,2.2000000000000002,2.7]
[null,null,null,null,120,150,121,124,null,2.7,3.3]
[null,null,null,null,150,180,124,127,null,3.3,3.9]
[null,null,null,null,180,220,127,130,null,3.9,4.7]
[null,null,null,null,220,270,130,133,null,4.7,5.6]
[null,null,null,null,270,330,133,137,null,5.6,6.8]
[null,null,null,null,330,390,137,140,null,6.8,8.1999999999999993]
[null,null,null,null,390,470,140,143,null,8.1999999999999993,10]
[null,null,null,null,470,560,143,147,null,"C values greater than 10nF"]
[null,null,null,null,560,680,147,150,null,1,1.5,{"$f":"IF((10^(LOG(K3)-INT(LOG(K3))))-VLOOKUP((10^(LOG(K3)-INT(LOG(K3)))),C_s2:C_f2,1)<VLOOKUP((10^(LOG(K3)-INT(LOG(K3)))),C_s2:C_f2,2)-(10^(LOG(K3)-INT(LOG(K3)))),VLOOKUP((10^(LOG(K3)-INT(LOG(K3)))),C_s2:C_f2,1),VLOOKUP((10^(LOG(K3)-INT(LOG(K3)))),C_s2:C_f2,2))","v":1.5}]
{"$rows_left_out":80}
{"sheet":"Schematic Checklist","index":6,"n_rows":39,"n_cols":9,"rows_kept":39,"cut":false,"hidden":true,"merged":[[37,0,37,7],[16,0,16,7],[31,0,31,7],[1,0,1,7],[7,0,7,7]]}
["Pin","Name","Purpose","Connection For Functional Use","Reasoning","Recommended Component Values from Calculator","Component units","Status","Comments"]
["Control"]
[1,"VFB","Output feedback input","Ensure that the feedback divider network gives the appropriate Vout based on the Vref chosen",null,{"$f":"CONCATENATE(partData!A20, partData!A21)","v":"Top Resistor: 4.99\nBottom Resistor: 4.99"},{"$f":"DeviceCalculator!G112","v":"kΩ"},"Open"]
[1,"VFB","Output feedback input","Use 1% or better resistors for VFB",null,null,null,"Open"]
[1,"VFB","Output feedback input","If the application has ferrite beads, ensure that the output is take after the ferrite bead. This will adjust the converter for the DC drop across the ferrite bead.","It is necessary that the LC resonance of ferrite bead-cap is away from the LC resonance of inductor-Cout. If they resonate at the same frequency then a huge amount of noise can be passed through to the output.",null,null,"Open"]
[]
[]
["Configuration"]
[2,"EN","Enable pin","The recommended max voltage rating on the EN pin is 6.5V. Do not connect EN pin directly to VIN or VDD (unless the max Vin & VDD for your application is below 6.5V). When using VIN or VDD to drive the EN pin, use a resistor divider and ensure that the voltage stays below 6.5V.","Typical turnon threshold voltage is 1.2 V. Typical turnoff threshold voltage is 0.95 V.",null,null,"Open"]
[20,"MODE","Soft-start and Skip/CCM selection","Connect a resistor to select soft-start time using Table 3. The soft-start time is detected and stored into internal register during start-up.",null,{"$f":"CONCATENATE(DeviceCalculator!#REF!,VLOOKUP(DeviceCalculator!#REF!,partData!B18:C21,2,0))","v":{"$error":"#REF!"}},{"$f":"DeviceCalculator!G131","v":"kΩ"},"Open"]
[20,"MODE","Soft-start and Skip/CCM selection","You must connect the MODE pin to PGOOD pin of the IC if you wanted FCCM operation.  Note that it is connected to PGOOD pin and not after the pull up resistor etc.","You cannot connect the MODE pin resistor to VREG etc. This is because the IC senses the resistance on the MODE pin when it is low (before PGOOD becomes active). ",null,null,"Open"]
[22,"RF","Switching frequency selection","Follow the recommendations in table 1 to select the switching frequency. Use 1% or better resistors for the RF selection resistor",null,{"$f":"CONCATENATE(DeviceCalculator!D39,VLOOKUP(DeviceCalculator!#REF!,partData!B20:C23,2,0))","v":{"$error":"#REF!"}},{"$f":"DeviceCalculator!G39","v":"kΩ"},"Open"]
[3,"PGOOD","Open drain power good flag","Have a 100k resistor connected between the pin to VREG",null,100,"kΩ","Open"]
[21,"TRIP","OCL detection threshold setting pin","Use WEBENCH to calculate the RTRIP resistor value. Use 1% or better resistors for RTRIP",null,{"$f":"DeviceCalculator!#REF!","v":{"$error":"#REF!"}},{"$f":"DeviceCalculator!#REF!","v":{"$error":"#REF!"}},"Open"]
[]
[]
["Power Stage"]
[4,"VBST","Supply input for high-side FET gate driver (boost terminal)","Connect capacitor from this pin to LL node. Internally connected to VREG via bootstrap MOSFET switch. The boot capacitor should be >25V rated, X5R. Preferable to use a 0603.",null,null,null,"Open"]
[4,"VBST","Supply input for high-side FET gate driver (boost terminal)","An 0402 size, 0 to 2 Ohm resistor in can be placed in series with Boot Capacitor to decrease noise from aggressive switching.",null,null,null,"Open"]
["6, 7, 8, 9, 10, 11","LL","Output of converted power.","Connect this pin to the output Inductor.",null,null,null,"Open"]
{"$rows_left_out":20}
{"sheet":"Layout Checklist","index":7,"n_rows":28,"n_cols":8,"rows_kept":28,"cut":false,"hidden":true,"merged":[[25,0,25,6],[1,0,1,6],[5,0,5,6],[11,0,11,6],[19,0,19,6]]}
["Pin","Name","Purpose","Placement or Routing?","Remarks","Reasoning","Status","Comments"]
["Control"]
[1,"VFB","Output feedback input","Routing"," The trace from the resistor divider to the VFB pin should be short and thin. Avoid routing near noisy signals or power planes.",null,"Open"]
[]
[]
["Configuration"]
[2,"EN","Enable pin","Routing","All routing for the EN pin should be placed away from any high voltage switch node (itself and others), such as LL and VBST to avoid noise coupling. ",null,"Open"]
["20, 21, 22","RF, TRIP, MODE",null,"Placement","Place the frequency setting resistor (RF), OCP setting resistor (RTRIP) and mode setting resistor (RMODE) as close to the device as possible. Use the common GND via to connect them to the GND plane. Route all of these traces away from the switch node and other noisy signals",null,"Open"]
[3,"PGOOD","Open drain power good flag","Placement","Keep the PGOOD resistor local to the device and place it as close as possible to the PGOOD pin. The resistor should be kept away from fast switching voltage and current paths.",null,"Open"]
[]
[]
["Power Stage"]
[4,"VBST","Supply input for high-side FET gate driver (boost terminal)","Placement","Place the boot resistor (if used) as close as possible to the pin, followed by the boot capacitor. Route these separate from the SW copper plane.",null,"Open"]
["6, 7, 8, 9, 10, 11","LL","Output of converted power.","Routing","The PCB trace defined as switch node, which connects the LL pins and high-voltage side of the inductor, should be as short and wide as possible.",null,"Open"]
["6, 7, 8, 9, 10, 11","LL","Output of converted power.","Routing","Use separated vias or trace to connect LL node to snubber, boot strap capacitor and ripple injection resistor. Do not combine these connections.",null,"Open"]
["12, 13, 14, 15, 16, 17","VIN","Conversion power input","Placement","Place the VIN decoupling capacitors as close to the VIN and PGND pins as possible to minimize the input AC current loop.",null,"Open"]
["12, 13, 14, 15, 16, 17","VIN","Conversion power input","Placement","Additionally, a high-frequency bypass capacitor in 0402 package on the VIN pins can be placed right underneath the IC on the other side of the PCB to reduce switching spikes and associated noise.",null,"Open"]
[]
[]
["On Chip Regulator"]
{"$rows_left_out":9}
{"sheet":"Extra","index":8,"n_rows":5,"n_cols":2,"rows_kept":5,"cut":false,"hidden":true,"merged":[]}
[]
[null,"Validation Options"]
[null,"Open"]
[null,"Complete"]
[null,"Not Applicable"]