{"text_format":"1","workbook":"xlsx","n_sheets":13,"sheets":["Design the Converter","Variable Management","Schematic Management","Schematic & BOM","EVMs","MOSFET Parameters","Stability Calculations","Bode Plot Management","Efficiency Calculations","Efficiency Plot Management","Standard Value Calculator","Snubber","Parallel Output Caps"],"not_rendered":{"charts":9,"images":21,"macros":1,"external_links":0,"defined_names":266,"comments":2,"pivot_tables":0},"unopened":[],"bounds":{"document_bytes":16777216,"sheet_cells":100000,"rows_first":2000,"rows_last":500,"rows_between":2000,"halvings":0,"cell_chars":16384,"cell_head_chars":4096},"cells_cut":0,"cells_raw":0,"read":"whole","date_system":"1900"}

{"sheet":"Design the Converter","index":0,"n_rows":73,"n_cols":17,"rows_kept":73,"cut":false,"hidden":false,"merged":[[2,14,2,15],[0,0,0,16],[43,11,44,16],[45,11,46,16]]}
["                    LMR604x0 36VIN, 3AOUT, 4AOUT Converter Design Tool"]
[null,null,null,null,null,null,null,null,null,null,null,null,null,null,"http://www.ti.com/product/lm5175"]
["About",null,"xx",null,null,"= Input Box",null,null,null,null,null,null,null,null,"TERMS OF USE",null,"                "]
[]
["Step 1: Operating Specifications"]
[null,null,null,"Device","LMR60440"]
[null,null,null,"Input Voltage – Min, VIN(min) ",9,"V"]
[null,null,null,"Input Voltage – Nom, VIN(nom)",12,"V"]
[null,null,null,"Input Voltage – Max, VIN(max)",18,"V"]
[null,null,null,"Output Voltage, VOUT ",6,"V"]
[null,null,null,"Full Load Output Current, IOUT ",3,"A"]
[null,null,null,"Switching Frequency, FSW",400,"kHz"]
[null,null,null,"Frequency Set Resistor, RT ",{"$f":"'Variable Management'!C352","v":86.6},{"$f":"'Variable Management'!E352","v":"kΩ"}]
[null,null,null,"Ambient Temperature, TA",25,"°C"]
[null,null,null,"Light-Load Operating Mode"]
[]
[]
["Step 2: Buck Inductor"]
[null,null,null,"Inductance for 35% Ripple Current at VIN(nom)",{"$f":"Lopt*1000000","v":7.1428571428571423},"µH"]
[null,null,null,"Buck Inductance, LO ",5.6,"µH"]
[null,null,null,"Inductor DCR at 25°C",200,"mΩ"]
[null,null,null,"Inductor Pk-Pk Ripple Current at VIN(nom)",{"$f":"'Variable Management'!B73","v":1.3094339622641511},"Apk-pk"]
[null,null,null,"DIL as a % of Full Load at VIN(nom)",{"$f":"'Variable Management'!D73*100","v":43.64779874213837},"%"]
[null,null,null,"Peak Inductor Current at VIN(max) and Full Load",{"$f":"'Variable Management'!B110","v":3.9376569037656903},"Apk"]
[null,null,null,"Peak Inductor Current Limit at VIN(nom)",{"$f":"Ipk_OCP_Vinnom","v":5.7921157232704408},"Apk"]
[null,null,null,"Estimate Inductor Core Loss at VIN(nom)",0.1,"W"]
[]
["Step 3: Output Capacitors"]
[null,null,null,"Desired Output Voltage Ripple",100,"mVpk-pk"]
[null,null,null,"Effective COUT Value to Meet Ripple Spec",{"$f":"'Variable Management'!B124","v":10},"µF"]
[null,null,null,"Desired Crossover Frequency",62,{"$f":"\"     kHz \"","v":"     kHz "}]
[null,null,null,"Effective COUT Value to Meet Crossover Spec",{"$f":"'Variable Management'!B220","v":35.786166711542023},"µF"]
[null,null,null,"Output Capacitance (derated), COUT ",35.200000000000003,"µF"]
[null,null,null,"Output Cap ESR (Max) to Meet Ripple Spec",1,"mΩ"]
[null,null,null,"Output Capacitor ESR",1,"mΩ"]
[null,null,null,"Resulting Output Voltage Ripple (max) ",{"$f":"'Variable Management'!B130*1000","v":11.698461268754455},"mVpk-pk"]
[null,null,null,"Output Capacitor RMS Current (max) ",{"$f":"'Variable Management'!B117","v":0.54135646579663232},"A (rms)"]
[null,null,null,"Effective Crossover Frequency",{"$f":"'Stability Calculations'!AK7","v":45.188499999999998},"kHz"]
[]
["Step 4: Input Capacitors"]
[null,null,null,"Input Voltage Ripple Spec",120,"mVpk-pk"]
[null,null,null,"Minimum Input Capacitance",{"$f":"'Variable Management'!B147","v":15.625},"µF"]
[null,null,null,"Input Capacitance (derated), CIN ",20,"µF"]
[null,null,null,"Maximum Permitted ESR",{"$f":"'Variable Management'!B152","v":6.6664010200828807},"mΩ",null,null,null,null,null,{"$f":"CHOOSE(SCH_MODE, \"\", \"** For Single-Output Operation in 2-Phase Mode, tie MODE to VDDA and use FB1 to set VOUT **\", \"** For Single-Output Operation in 3-Phase Mode, tie both MODE pins to VDDA. Use FB1 of master IC to set VOUT. Connect FB2 of master IC to AGND. Connect FB2 of slave IC to VDDA to configure it as a slave **\", \"** For Single-Output Operation in 4-Phase Mode, tie both MODE pins to VDDA. Use FB1 of master IC to set VOUT. Connect FB2 of master IC to AGND. Connect FB2 of slave IC to VDDA to configure it as a slave **\")","v":""}]
[null,null,null,"Input Capacitor ESR",2,"mΩ"]
[null,null,null,"Resulting Input Voltage Ripple (max)",{"$f":"'Variable Management'!B157*1000","v":101.62531380753138},"mVpk-pk",null,null,null,null,null,{"$f":"CHOOSE(SCH_MODE, \"\", \"** For Single-Output Operation in 2-Phase Mode, tie MODE to VDDA and use FB1 to set VOUT **\", \"** For Single-Output Operation in 3-Phase Mode, tie both MODE pins to VDDA. Use FB1 of master IC to set VOUT. Connect FB2 of master IC to AGND. Connect FB2 of slave IC to VDDA to configure it as a slave **\", \"** For Single-Output Operation in 4-Phase Mode, tie both MODE pins to VDDA. Use FB1 of master IC to set VOUT. Connect FB2 of master IC to AGND. Connect FB2 of slave IC to VDDA to configure it as a slave **\")","v":""}]
[null,null,null,"Input Capacitor RMS Current (max)",{"$f":"'Variable Management'!B140","v":1.5},"A (rms)"]
[]
["Step 5: Feedback Network"]
[null,null,null,{"$f":"CHOOSE(LMR604x0_FB_sel, \"Upper Feedback Resistance (E96), RFBT\", \"* Tie FB to VOUT for a Fixed 5V Output*\", \"*Tie FB to VOUT for a Fixed 3.3V Output*\")","v":"Upper Feedback Resistance (E96), RFBT"},100,"kΩ"]
[null,null,null,{"$f":" CHOOSE(LMR604x0_FB_sel, \"Lower Feedback Resistance (E96), RFBB\", \"\",\"\")","v":"Lower Feedback Resistance (E96), RFBB"},{"$f":"IF(Vout=Vref,\"OPEN\",Rfb2_u/1000)","v":20},{"$f":"IF(Vout=Vref,\"\",\"kΩ\")","v":"kΩ"}]
[null,null,null,{"$f":"CHOOSE(LMR604x0_FB_sel, \"Feedforward Capacitance, CFF\", \"*Select drop table as No CFF*\", \"*Select drop table as No CFF*\")","v":"Feedforward Capacitance, CFF"},100,"pF"]
[]
["Step 6: VIN UVLO",null,null,null,null,null,null,null,null,null,null,null,null,null,null,null," "]
[null,null,null,"Desired VIN UVLO Turn-On Threshold",3.5,"V"]
[null,null,null,"UVLO Divider Upper Resistance, RENT",175,"kΩ"]
[null,null,null,"UVLO Divider Lower Resistance (E96), RENB",{"$f":"Renb_u/1000","v":100},{"$f":"IF(Vout=Vref,\"\",\"kΩ\")","v":"kΩ"}]
[null,null,null,"Actual VIN UVLO Turn-On Threshold",{"$f":"1.263/E57*(E56+E57)","v":3.4732499999999997},"V"]
[null,null,null,"Actual VIN UVLO Turn-Off Threshold",{"$f":"E58*0.72","v":2.5007399999999995},"V"]
[]
[]
["Step 7: Power Loss & Thermals"]
[null,null,null,"IC Power Dissipation",{"$f":"'Efficiency Calculations'!BE109","v":0.63687927180033554},"W"]
[null,null,null,"Junction Temperature (estimate)",{"$f":"'Variable Management'!B296","v":78.752610539948321},"°C"]
[null,null,null,null,{"$f":"CHOOSE(Ext_VCC, \"* Tie FB pin to VOUT\", \"* Tie FB pin to VOUT Resistor Divider\")","v":"* Tie FB pin to VOUT Resistor Divider"}]
[]
[]
["Pole/Zero Frequencies"]
[null,null,null,"Load Pole Frequency, FP-LOAD",{"$f":"Fp_dominant/1000","v":4.835091601313505},"kHz"]
[null,null,null,"Output Cap ESR Zero Frequency, FZ-ESR",{"$f":"Fesr/1000000","v":4.521447252095351},"MHz"]
[null,null,null,"Error Amp Dominant Pole Frequency, FP-EA",{"$f":"Fp1_u","v":11.789255057315287},"Hz"]
[null,null,null,"Compensator Zero Frequency, FZ-COMP",{"$f":"Fz1_u/1000","v":10.105075763413103},"kHz"]
[null,null,null,"Compensator Pole Frequency, FP-COMP",{"$f":"Fp2_u_simplified/1000","v":2115.3291931411427},"kHz"]

{"sheet":"Variable Management","index":1,"n_rows":357,"n_cols":26,"rows_kept":357,"cut":false,"hidden":true,"merged":[[32,17,32,19],[4,4,4,7],[0,0,0,8],[28,17,28,19],[29,17,29,19],[30,17,30,19],[31,17,31,19],[27,17,27,19]]}
["EXCEL Variables Names/Calculations"]
[null,"Input from user =",null,null,"Good"]
[null,"Output ="]
[null,"Constant"]
["Variable Name","Value","STD Units",null,"Notes",null,null,null,"Iteration"]
[]
[null,null,null,null,null,null,null,null,null,null,"Device GPN",null,null,null,"Use feedforward cap","Use CFF",1,null,"BOM Variant","LMR60440 5V",1,null,null,null,"selector used in power loss and thermal calculations"]
[null,null,null,null,null,null,null,null,null,null,null,"LMR60440",null,null,null,"No CFF",2,null,null,"LMR60440 3.3V",2,null,null,null,"Fixed Output",1]
[null,null,null,null,null,null,null,null,null,null,null,"LMR60430",null,null,null,"Result",2,null,null,"LMR60440 ADJ",3,null,null,null,"Adjustable Output",2]
[null,null,null,null,null,null,null,null,null,null,null,null,null,null,null,"No FF ",{"$f":"IF(Q9=2, TRUE, FALSE)","v":true},null,null,"LMR60430 5V",4,null,null,null,"Ext_VCC",{"$f":"IF(VOUT_FIXED = TRUE, 1, 2)","v":2}]
[null,null,null,null,null,null,null,null,null,null,"Device Selected",{"$f":"Device","v":"LMR60440"},null,null,null,null,null,null,null,"LMR60430 3.3V",5]
[null,null,null,null,null,null,null,null,null,null,null,null,null,null,null,null,null,null,null,"LMR60430 ADJ",6]
[]
[null,null,null,null,null,null,null,null,null,null,null,null,null,null,null,null,null,null,"4A fixed BOM Variant Selected",null,{"$f":"IF(AND(Device=\"LMR60440\",Vout=5),1,IF(AND(Device=\"LMR60440\",Vout=3.3),2,0))","v":0},"1 =5V, 4A; 2 = 3.3V, 4A"]
[null,null,null,null,null,null,null,null,null,null,null,null,null,null,null,null,null,null,"3A fixed BOM Variant Selected",null,{"$f":"IF(AND(Device=\"LMR60430\",Vout=5),4,IF(AND(Device=\"LMR60430\",Vout=3.3),5,0))","v":0},"4 = 5V, 3A; 5 = 3.3V, 3A"]
[null,null,null,null,null,null,null,null,null,null,null,null,null,null,null,null,null,null,"4A BOM Variant Adj",null,{"$f":"IF(AND(AND(SelectFixed4A = 0, SelectFixed3A = 0), Device = \"LMR60440\"),3,)","v":3},"Shows 3 if adj 4A"]
[null,null,null,null,null,null,null,null,null,null,null,null,null,null,null,null,null,null,"3A adj BOM Variant Selected",null,{"$f":"IF(AND(AND(SelectFixed4A = 0, SelectFixed3A = 0), Device = \"LMR60430\"),6,)","v":0},"Shows 6 if adj 3A"]
[null,null,null,null,null,null,null,null,null,null,null,null,null,null,null,null,null,null,"BOM Selector ",null,{"$f":"SUM(U14:U17)","v":3}]
["Step 1: Operational Specs"]
["VIN_min",{"$f":"'Design the Converter'!E7","v":9},"V","Minimum input voltage",null,null,null,null,1,null,"Used in Step 5: Feedback Network",null,null,null,"Used in efficiency calculations for single/dual phase",null,null,"Single/Dual Yes/No",1,null,"Selector used in schematic design. Mode = RT for FPWM, Mode = GND for DEM",null,null,"Selector used in Bode plot manager Set to single channel. "]
["VIN_nom",{"$f":"'Design the Converter'!E8","v":12},"V","Nominal input voltage",null,null,null,null,null,null,"LMR604x0 3.3Vout",{"$f":"IF(Vout = 3.3, 1, 0)","v":0},null,null,null,null,null,"MODE (Single/Dual), DUAL = 1, SINGLE = 2",{"$f":"IF(S20=1, 1, 2)","v":1},null,"FPWM",1,null,null,{"$f":"CHOOSE(SCH_MODE, \"Bode Plot (Ch1)\", \"Bode Plot - 2 Ph\", \"Bode Plot - 3 Ph\", \"Bode Plot - 4 Ph\")","v":"Bode Plot (Ch1)"},1]
["VIN_max",{"$f":"'Design the Converter'!E9","v":18},"V","Maximum input voltage",null,null,null,null,null,null,"LMR604x0 5Vout",{"$f":"IF(Vout = 5, 1, 0)","v":0},null,null,null,null,null,"SINGLE OUTPUT (1 = YES)",{"$f":"IF(S20=1, 2, 1)","v":2},null,"DEM",2,null,null,{"$f":"IF(MODE=1, \"Bode Plot (Ch2)\", \"N/A - Do Not Use\")","v":"Bode Plot (Ch2)"},2]
[null,null,null,null,null,null,null,null,null,null,"Connection Point",{"$f":"IF(Vout=3.3,3,IF(Vout=5,2,1))","v":1},"1 = No, 2 = 5V, 3 = 3.3V",null,null,null,null,"Number of Phases",{"$f":"SCH_MODE","v":1},null,"FPWM/DEM",2,null,null,"BODE_PLOT_TYPE",1]
["Vout",{"$f":"'Design the Converter'!E10","v":6},"V","Output voltage",null,null,null,null,null,null,"Fixed VOUT",{"$f":"OR(L21,L22)","v":false},"If VOUT = 5 or 3.3"]
["Iout",{"$f":"'Design the Converter'!E11","v":3},"A","Output current",null,"Iout-max",{"$f":"CHOOSE(GPN, 6, 6)","v":{"$error":"#VALUE!"}},"A",1]
[null,null,null,null,null,null,null,null,1]
["Rout",{"$f":"Vout/Iout","v":2},"W","Load resistance",null,null,null,null,null,null,null,null,null,"This defines the schematic variant"]
["Pout",{"$f":"Vout*Iout","v":18},"W","Output power",null,null,null,null,null,null,null,null,null,null,null,null,null,"Schematic Look-up Table",null,null,"Value"]
[null,null,null,null,null,null,null,null,null,null,null,null,null,"Schematic variant definition","LMR60440_Fix_FPWM",1,null,"If (Bom selector = 1 or 2 or 4 or 5) & DEMB = 1, do variant 1",null,null,{"$f":"IF(AND(OR(BOM_sel = 1, BOM_sel = 2, BOM_sel = 4, BOM_sel =5), DEMB = 1),1,)","v":0}]
["Efficiency",0.9,null,"Estimate of efficiency",null,null,null,null,null,null,null,null,null,null,"LMR60440_Adj_FPWM",2,null,"if (BOM selector = 3 or 6) & DEMB = 1, do variant 2",null,null,{"$f":"IF(AND(OR(BOM_sel = 3, BOM_sel = 6), DEMB = 1),2,)","v":0}]
["Pin",{"$f":"Pout/Efficiency","v":20},"W","Calculate input power assuming finite efficiency",null,null,null,null,null,null,null,null,null,null,"LMR60440_Fix_DEM",3,null,"If (Bom selector = 1 or 2 or 4 or 5) & DEMB = 2, do variant 3",null,null,{"$f":"IF(AND(OR(BOM_sel = 1, BOM_sel = 2, BOM_sel = 4, BOM_sel =5), DEMB = 2),3,)","v":0}]
[null,null,null,null,null,null,null,null,null,null,null,null,null,null,"LMR60440_Adj_DEM",4,null,"If (Bom selector = 3 or 6) & DEMB = 2, do variant 4",null,null,{"$f":"IF(AND(OR(BOM_sel = 3, BOM_sel = 6), DEMB = 2),4,)","v":4}]
["Iin_Vinmin",{"$f":"Pin/VIN_min","v":2.2222222222222223},"A",null,null,null,null,null,null,null,null,null,null,null,null,null,null,"Result",null,null,{"$f":"SUM(U29:U32)","v":4}]
["Iin_Vinnom",{"$f":"Pin/VIN_nom","v":1.6666666666666667},"A","Input currents at min, nom, max Vin",null,null,null,{"$f":"AND(OSC=1, OR(Fsw/1000>2530, Fsw/1000<1800))","v":false},null,null,null,null,null,null,null,null,null,null,null,"VARIANT",{"$f":"U33","v":4}]
["Iin_Vinmax",{"$f":"Pin/VIN_max","v":1.1111111111111112},"A",null,null,null,null,{"$f":"AND(OSC=2, OR(Fsw/1000>500, Fsw/1000<300))","v":false}]
[null,null,null,null,null,null,null,{"$f":"OR(H34,H35)","v":false}]
["Fsw",{"$f":"'Design the Converter'!E12*1000","v":400000},"Hz","Nominal switching frequency - determines RT resistor"]
["RT resistor to AGND",{"$f":"((1/Fsw-(30*10^-9))/(2.825*10^-11))/1000","v":87.43362831858407},"kΩ",null,null,null,null,null,1,null,"basically if has fixed RT option"]
["Tsw",{"$f":"1/Fsw","v":2.5000000000000002E-6},"sec","Switching period"]
["Max crossover frequency = 20% Fsw",{"$f":"Fsw*0.2/1000","v":80},"kHz",null,null,"Min Crossover",10,null,null,null,"Adjustable"]
["Vref",1,"V","Reference voltage",null,null,null,null,null,null,"5V"]
["Rt",{"$f":"'Standard Value Calculator'!O12/1000","v":86.6},"kΩ","Frequency set resistor",null,{"$f":"IF(OR((Fsw=440000),(Fsw=2200000)),\"N/A\",Rfadj/1000)","v":8.6599999999999996E-2},null,null,null,null,"3.3V",1]
[null,null,null,null,null,null,null,null,null,null,"Adjustable_NoRT",2]
[null,null,null,null,null,null,null,null,null,null,"5V_NoRT",3]
[null,null,null,null,null,null,null,null,null,null,"3.3V_NoRT",4]
["Step 2: Buck Inductor","Channel 1",null,null,null,null,null,null,null,null,"Schematic setting",5]
["Don1",{"$f":"Vout/VIN_nom","v":0.5},null,null,null,"Ideal Duty Cycle at VIN(nom)",null,null,null,null,null,6]
["Doff1",{"$f":"1-B47","v":0.5},null,null,null,"Ideal 1- Duty Cycle at VIN(nom)",null,null,null,null,null,{"$f":"IF(No_RT, IF(Vout=3.3, 6, IF(Vout=5, 5, 4)),IF(Vout=3.3, 3, IF(Vout=5, 2, 1)))","v":1}]
[]
["D_Vinmin",{"$f":"Vout/VIN_min","v":0.66666666666666663}]
["D_Vinnom",{"$f":"Vout/VIN_nom","v":0.5}]
["D_Vinmax",{"$f":"Vout/VIN_max","v":0.33333333333333331}]
[]
["L_Vinnom",{"$f":"(VIN_nom-Vout)*D1_Vinnom/(Fsw*Iout*0.35)","v":7.1428571428571427E-6},"H",null,null,"Calculated inductance for 35% ripple at VIN(nom)"]
["L_slopecomp",{"$f":"0.27*Vout/Fsw","v":4.0500000000000002E-6},"H","Matches DS",null,"Calculated inductance based on one times inductor downslope"]
[]
["Lopt",{"$f":"B54","v":7.1428571428571427E-6},"H",null,null,"min of calculated inductances at VIN(min) and VIN(nom)"]
["L_actual_TPSM63602-03",{"$f":"-0.0238*Iout^2-0.0868*Iout+2.0073","v":1.5326999999999997},"uH",null,null,"Calculate TOKO chip inductance based on entered load current value"]
["L_actual_TPSM63604-06",{"$f":"-0.1304*Iout+2.32","v":1.9287999999999998},"uH",null,null,"Calculate MagLayers inductance based on entered load current value"]
[]
["Lo",{"$f":"'Design the Converter'!E20*0.000001","v":5.5999999999999997E-6},"H",null,null,"Chosen inductance"]
["Rdcr",{"$f":"'Design the Converter'!E21/1000","v":0.2},"W",null,null,"Chosen inductor DCR"]
[]
["Don2",{"$f":"(Vout+Iout*(Rdcr+Rdson2))/(Vin+Iout*(Rdson2-Rdson1))","v":0.56352201257861634}]
["Doff2",{"$f":"1-_Don2","v":0.43647798742138366}]
[]
["D_Vinmin_2",{"$f":"(Vout+Iout*(Rdcr+Rdson2))/(VIN_min+Iout*(Rdson2-Rdson1))","v":0.75294117647058811},null,{"$f":"Vout/VIN_min","v":0.66666666666666663},null,"Duty cycles adjusted for DCR/Rdson voltage drops"]
["D_Vinnom_2",{"$f":"(Vout+Iout*(Rdcr+Rdson2))/(VIN_nom+Iout*(Rdson2-Rdson1))","v":0.56352201257861634},null,{"$f":"Vout/VIN_nom","v":0.5}]
["D_Vinmax_2",{"$f":"(Vout+Iout*(Rdcr+Rdson2))/(VIN_max+Iout*(Rdson2-Rdson1))","v":0.37489539748953971},null,{"$f":"Vout/VIN_max","v":0.33333333333333331},null,{"$f":"(Ts-0.000000085)/Ts","v":0.96599999999999997},"Dmax = [Ts-toff(min)]/Ts"]
[]
[]
["Iripple_Vinmin",{"$f":"(VIN_min-Vout-Iout*(Rdcr+Rdson1))*D1_Vinmin_2/(Fsw*Lf)","v":0.74117647058823521},"A",{"$f":"B72/Iout","v":0.24705882352941175},null,"Ripple calculations include DCR and Rdson"]
["Iripple_Vinnom",{"$f":"(VIN_nom-Vout-Iout*(Rdcr+Rdson1))*D1_Vinnom_2/(Fsw*Lf)","v":1.3094339622641511},"A",{"$f":"B73/Iout","v":0.43647798742138372},null,"% ripple current at Vin-nom"]
["Iripple_Vinmax",{"$f":"(VIN_max-Vout-Iout*(Rdcr+Rdson1))*D1_Vinmax_2/(Fsw*Lf)","v":1.8753138075313807},"A",{"$f":"B74/Iout","v":0.62510460251046018},null,"Max inductor ripple current - it's at Vin-max"]
[]
["Iinductor_rms_Vinmin",{"$f":"SQRT(Iout^2+(Iripple_Vinmin^2)/12)","v":3.0076200801818045},"A"]
["Iinductor_rms_Vinnom",{"$f":"SQRT(Iout^2+(Iripple_Vinnom^2)/12)","v":3.0237203533275965},"A"]
["Iinudctor_rms_Vinmax",{"$f":"SQRT(Iout^2+(Iripple_Vinmax^2)/12)","v":3.0484531853154349},"A"]
[]
[]
["Core loss estimate - Vin(nom)",{"$f":"'Design the Converter'!E26","v":0.1},"W"]
[]
[]
["Inductor copper temperature",125,"°C"]
["Inductor DCR at hot",{"$f":"Rdcr*(1+Ltc*(B84-25))*1000","v":278.60000000000002},"mW"]
[]
[]
["Step 2b: Sense Resistors, Slope Comp, Current Limit"]
[]
["Ilimit_inductor_Vinmin",{"$f":"Ipk_OCP_Vinmin","v":5.4197176470588246},"A","refers to B87",null,"Peak inductor current at current limit inception"]
["Ilimit_inductor_Vinnom",{"$f":"Ipk_OCP_Vinnom","v":5.7921157232704408},"A","refers to B88"]
["Ilimit_inductor_Vinmax",{"$f":"Ipk_OCP_Vinmax","v":6.162955648535565},"A","refers to B89"]
[]
["CS threshold_min",6.8000000000000005E-2,"V","not applicable here"]
["CS threshold",7.4999999999999997E-2,"V","not applicable here"]
["CS threshold_max",8.2000000000000003E-2,"V","not applicable here"]
[]
["Rs",6.5000000000000002E-2,"W",null,null,"Current sense resistance Rs = 0.12Ohm: high-side MOSFET Rdson"]
[]
["Current limit setpoint - peak - Vin(min)",{"$f":"6.9-(1.966)*MAX(0, (D1_Vinmin_2))","v":5.4197176470588246},"A",null,"6.9-1.966*MAX(0, (D1_Vinmin_2)) (original)","Golf Peak Current limit can be defined that at 100% duty cycle, the current limit will drop by 28.5% from the 0% duty cycle current limit (6.9A nominal)"]
["Current limit setpoint - peak - Vin(nom)",{"$f":"6.9-(1.966)*MAX(0, (D1_Vinnom_2))","v":5.7921157232704408},"A",null,null,"Peak current limit (6.9A trimmed at ATE minus slope comp contribution) = min inductor sat current at hot"]
["Current limit setpoint - peak - Vin(max)",{"$f":"6.9-(1.966)*MAX(0, (D1_Vinmax_2))","v":6.162955648535565},"A"]
[]
["Iout_OCP_Vinmin",{"$f":"Ipk_OCP_Vinmin-Iripple_Vinmin/2","v":5.0491294117647074},"A",null,null,"Current limit setpoints (i.e. IOUT) assuming no CS delay"]
["Iout_OCP_Vinnom",{"$f":"Ipk_OCP_Vinnom-Iripple_Vinnom/2","v":5.1373987421383651},"A"]
["Iout_OCP_Vinmax",{"$f":"Ipk_OCP_Vinmax-Iripple_Vinmax/2","v":5.2252987447698747},"A"]
[]
["Ipk_full-load_Vinmin",{"$f":"Iout+Iripple_Vinmin/2","v":3.3705882352941177},"A"]
["Ipk_full-load_Vinnom",{"$f":"Iout+Iripple_Vinnom/2","v":3.6547169811320757},"A"]
["Ipk_full-load_Vinmax",{"$f":"Iout+Iripple_Vinmax/2","v":3.9376569037656903},"A"]
[]
[]
["Step 3: Output Capacitor"]
["Icoutrms_VINmin",{"$f":"Iripple_Vinmin/SQRT(12)","v":0.2139592174055672},"A",null,null,"Output cap RMS current"]
["Icoutrms_VINnom",{"$f":"Iripple_Vinnom/SQRT(12)","v":0.37800102529962298},"A"]
["Icoutrms_VINmax",{"$f":"Iripple_Vinmax/SQRT(12)","v":0.54135646579663232},"A"]
["Max Cout rms current",{"$f":"MAX(B114:B116)","v":0.54135646579663232},"A"]
[]
["Vripple1",{"$f":"'Design the Converter'!E29/1000","v":0.1},"V",null,null,"Output voltage ripple spec(pk-pk)"]
[]
["Output Ripple Spec (pk-pk)",{"$f":"Vo1_ripple*1000","v":100},"mV",null,null,"Vout ripple spec at Vin(nom)"]
[]
["Coutmin",{"$f":"Iripple_Vinnom/(Fsw*8*Vo1_ripple)","v":4.091981132075472E-6},"F",null,null,"Minimum output capacitnace",null,{"$f":"Vo2_ripple","v":0},1]
["Reported Coutmin",{"$f":"IF(Cout_min*1000000<10, 10,Cout_min*1000000)","v":10},"uF"]
["Cout",{"$f":"'Design the Converter'!E33/1000000","v":3.5200000000000002E-5},"F",null,null,"Chosen output capacitance",null,null,1]
["Resrmax",{"$f":"SQRT((Vo1_ripple/Iripple_Vinnom)^2-(1/(Fsw*Cout*8))^2)","v":7.5851098704111775E-2},"W",null,null,"Max ESR before ripple exceeds Vripple1. Terms are squared because the voltage ripple from ESR and output capacitor are out of phase, so you need to treat the ripples like you're summing two orthogonal vectors.",null,null,1]
[]
["Reported Cout ESR max",{"$f":"IF(OR(CoutEsrMax>0.3, CoutEsrMax<0, (ISERROR(CoutEsrMax))), \"N/A\", CoutEsrMax*1000)","v":75.851098704111777},"mΩ"]
["CoutEsr",{"$f":"'Design the Converter'!E35/1000","v":1E-3},"W",null,null,"Chosen ESR",null,null,1,null,{"$f":"ISERROR(CoutEsrMax)","v":false}]
["Vripple",{"$f":"Iripple_Vinnom*SQRT(Cout_ESR^2+(1/(8*Fsw*Cout))^2)","v":1.1698461268754455E-2},"Vp-p"]
[null,null,null,null,null,null,null,null,null,null,{"$f":"OR(TRUE, FALSE, TRUE)","v":true},{"$f":"ISERROR(B128)","v":false}]
["Step 4: Input Capacitor",null,null,null,null,null,null,null,null,null,null,{"$f":"OR(CoutEsrMax>0.3,CoutEsrMax<0)","v":false}]
[]
["Icinrms_VINmin",{"$f":"SQRT(D1_Vinmin_2*(Iout^2*(1-D1_Vinmin_2)+Iripple_Vinmin^2/12))","v":1.3071554628391089},"A",null,null,"Calculate input cap rms current"]
["Icinrms_VINnom",{"$f":"SQRT(D1_Vinnom_2*(Iout^2*(1-D1_Vinnom_2)+Iripple_Vinnom^2/12))","v":1.5146627681792366},"A"]
["Icinrms_VINmax",{"$f":"SQRT(D1_Vinmax_2*(Iout^2*(1-D1_Vinmax_2)+Iripple_Vinmax^2/12))","v":1.4896338305094663},"A",null,null,null,null,null,null,null,null,null,null,null,"A"]
["Max Cin rms current",{"$f":"MAX(B134:B136)","v":1.5146627681792366},"A"]
[]
["Icinrms - max at D = 0.5",{"$f":"Iout/2","v":1.5},"A"]
["Final result",{"$f":"IF(VIN_min<2*Vout, Iout/2, B134)","v":1.5},"A","…report this"]
[]
["Vinripple1",{"$f":"'Design the Converter'!E41/1000","v":0.12},"Vp-p",null,null,"Input voltage ripple spec (pk-pk)"]
[null,null,null,null,null,{"$f":"Number_of_Phases","v":1}]
["Cinmin_Vinmax",{"$f":"Iout*D1_Vinmax*(1-D1_Vinmax)/(Vinripple1*Fsw)","v":1.3888888888888891E-5},"F",null,null,"Calculate cap at Vinmax and 50% duty cycle (Vin = 2*Vout)"]
["Cinmin_50%D",{"$f":"Iout*0.5*(1-0.5)/(Vinripple1*Fsw)","v":1.5625E-5},"F",null,null,"Buck 50% typically worst case"]
["Cinmin",{"$f":"IF(VIN_max<2*Vout, B144,B145)","v":1.5625E-5},"F"]
["Reported Cinmin",{"$f":"IF(Cinmin*1000000<4.7, 4.7,Cinmin*1000000)","v":15.625},"uF",null,null,"…report this"]
["Cin",{"$f":"'Design the Converter'!E43/1000000","v":2.0000000000000002E-5},"F",null,null,"Input capacitance"]
["CinEsrMax_Vinmax",{"$f":"-(Iout*D1_Vinmax*(1-D1_Vinmax)/(Cin*Fsw)-Vinripple1)/(Iout+Iripple_Vinmax/2)","v":9.3117982502744986E-3},"W"]
["CinEsrMax_50%D",{"$f":"-(Iout*0.5*(1-0.5)/(Cin*Fsw)-Vinripple1)/(Iout+Iripple_Vinmax/2)","v":6.6664010200828804E-3},"W",null,null,"Calculate ESR at Vinmax and 50% duty cycle (Vin = 2*Vout)"]
["CinEsrMax",{"$f":"IF(VIN_max<2*Vout, B149,B150)","v":6.6664010200828804E-3},"W"]
["Reported Cin ESR max",{"$f":"IF(OR(CinEsrMax>0.3, CinEsrMax<0), \"N/A\",CinEsrMax*1000)","v":6.6664010200828807},"mΩ",null,null,"…report this"]
["RCinEsr",{"$f":"'Design the Converter'!E45/1000","v":2E-3},"W",null,null,"Input capacitance series resistance (ESR)"]
[]
["Vinripple2_Vinmax",{"$f":"Iout*D1_Vinmax_2*(1-D1_Vinmax_2)/(Cin*Fsw)+(Iout +Iripple_Vinmax/2)*RCinEsr","v":9.5756128219043779E-2},"Vp-p"]
["Vinripple2_50%D",{"$f":"Iout*0.5*(1-0.5)/(Cin*Fsw)+(Iout +Iripple_Vinmax/2)*RCinEsr","v":0.10162531380753138},"Vp-p",null,null,"Calculate ripple at Vinmax and 50% duty cycle (Vin = 2*Vout)"]
["Vinripple2",{"$f":"IF(VIN_max<2*Vout, B155,B156)","v":0.10162531380753138},"Vp-p",null,null,"…report highest of these"]
[]
[null,{"$f":"Iout*D1_Vinmax_2*(1-D1_Vinmax_2)/(Cin*Fsw)","v":8.7880814411512395E-2},"Vp-p"]
[]
["Step ?: Other Components - MODE"]
[]
["RPG1/2",100,"kΩ"]
["RFB1/2",null,"W",null,"Tie to VDDA 3.3V/5V output, respectively. "]
["R_MODE",null,"W",null,"Tie to VDDA or AGND for Single/Dual operation, respectively. "]
[null,null,"W"]
[]
[]
["Step 5: Feedback Network and Internal Compensation"]
["Pi",3.1415926500000002,null,"p"]
["CS Amp Gain (effective value)",{"$f":"IF(Device = \"LMR60440\",1, IF(Device = \"LMR60430\",1.3))","v":1},1.3,"*per Simplis, CS Amp = 1.3 for 3A device, 1 for 4A device",null,"Effective CS gain - depending on control architecture"]
["Ri",{"$f":"Rdson1*CSAmp_gain","v":6.5000000000000002E-2},"W","Grabbed value from SIMPLIS model.Use slightly higher value to match bench",null,"Current Sense effective resistance = shunt resistor Rs * CS amp gain"]
[]
["Se_ext",{"$f":"(B178/Ri)*1000000","v":1661538461.5384614},"A/s",null,null,"Slope Comp Slope - referred to inductor current"]
["Sn",{"$f":"(Vin-Vout)/Lf","v":1071428.5714285714},"A/s","(VIN-VOUT)/L",null,"On-time Slope"]
["Sf",{"$f":"Vout/Lf","v":1071428.5714285714},"A/s","VOUT/L",null,"Off-time Slope"]
[]
["Se_int",{"$f":"0.27*Fsw/1000","v":108},"mV/μs","From SIMPLIS (1V amplitude, period of 1/fsw, multiply by gain of 0.27)",null,"Slope Comp Slope - referred to IC",null,"Slope = 0.27"]
["Sn_int",{"$f":"Sn*Ri/1000","v":69.642857142857139},"mV/μs",null,null,"Upslope"]
["Sf_int",{"$f":"Sf*Ri/1000","v":69.642857142857139},"mV/μs",null,null,"Downslope"]
[]
["Gain Terms Control-to-Output"]
["Km",{"$f":"VIN_nom/0.27","v":44.444444444444443},{"$f":"1/((0.5-D1_Vinnom)*Ri*(1/(Fsw*Lf))+(Vout*Ri*(1/(Lf*Fsw))/VIN_nom))","v":68.923076923076906},"From Sheehan's paper",null,{"$f":"1/((0.5-D1_Vinnom)*Ri*(1/(Fsw*Lf))+(Vout*Ri*(1/(Lf*Fsw))/VIN_nom))","v":68.923076923076906},{"$f":"1/((0.5-D1_Vinnom)*Ri*(1/(Fsw*Lf))+(Vout*Ri*(1/(Lf*Fsw))/VIN_nom))","v":68.923076923076906},{"$f":"1/((0.5-D1_Vinnom)*Ri*(1/(Fsw*Lf))+((Se_int*1000/Fsw)*CSAmp_gain)/VIN_nom)","v":44.444444444444436}]
["Kd",{"$f":"1+(Ro/(Km*Ri))","v":1.4464285714285716},null,"From Sheehan's paper"]
["mc",{"$f":"1+Se_int/Sn_int","v":2.5507692307692311},null,"Mc is ratio of 1+ (Se_int/Sn_int)"]
["Q",{"$f":"1/(Pi*((1-(Vout/Vin))*(1+mc)-0.5))","v":0.24957952503725364},null,"Q equation in PCM2 Bob Sheehan",null,"1/(Pi*(k-0.5))",null,"Q = 2/Pi = 0.636 gives ideal one-cycle damping"]
[]
["Error Amp (EA)"]
["gm",{"$f":"8.63/1000000","v":8.6300000000000004E-6},"S",null,null,"Error Amp Transconductance"]
["Imod",3.7530000000000002E-4]
["GBW",1.44,"MHz","Check Simplis (plotting TF across error amp_",null,"EA gain-bandwidth product"]
["Cbw",{"$f":"gm/(2*Pi*GBW*1000000)","v":9.5382441698091492E-13},"F","Need to check",null,"EA effective bandwidth limiting capacitance = gm/(2*Pi*GBW)"]
[]
["RoEA",540000000,"W","Simplis model (DCGain/GM)",null,"EA output resistance"]
[]
["AEA",{"$f":"gm*RoEA","v":4660.2},"V/V",null,null,"EA DC gain = gm*RoEA"]
["Afb",{"$f":"Vref/Vout","v":0.16666666666666666},"V/V",null,null,"Feedback gain from Vout to FB"]
["Acs",{"$f":"1/Ri","v":15.384615384615383},{"$f":"1/Ri","v":15.384615384615383},null,null,"Acs = 1/Ri"]
["Am",{"$f":"Rout/Ri","v":30.769230769230766},null,"Buck modulator gain"]
[null,null,{"$f":"Acs*Ro/Kd","v":21.272554605887933}]
["DC Gain is Adc = AEA*Afb*Am"]
["Power-Stage"]
["Rout",{"$f":"Rout","v":2},"W",null,null,"Output Resistance (Load)"]
["Fp_load_buck_simplified",{"$f":"Kd/(2*Pi*Ro*Cout)","v":3269.9752448189597},null,null,null,"Buck dominant pole frequency - without slope comp influence"]
["Fp_load_buck",{"$f":"Kd/(2*Pi*Ro*Cout)+((mc*(1-D1_Vinnom)-0.5)/(2*Pi*Fsw*Lf*Cout))","v":4835.0916013135047},"Hz",null,null,"Buck dominant pole frequency -- note slope comp influence"]
["Fp_dominant",{"$f":"Fload_u","v":4835.0916013135047},"Hz"]
["Inductor pole",{"$f":"(B183*Ri)/(2*Pi*Lf)","v":82103.740577731471},"Hz","inductor pole"]
["Fesr",{"$f":"1/(2*Pi*Cout*Cout_ESR)","v":4521447.252095351},"Hz",null,null,"Cout ESR zero frequency"]
["Cbw",{"$f":"Cbw","v":9.5382441698091492E-13},"F",null,null,"Cbw"]
[]
["Error Amplifier"]
["Fp_EA",{"$f":"1/(2*Pi*(RoEA)*Cc1ea_u)","v":11.789255057315287},"Hz",null,null,"Error Amp LF pole -- related to amplifier ouptut resistance and comp cap"]
["Fp_HF_simplified",{"$f":"1*(Cc1ea_u+Cc2ea_u)/(2*Pi*Rcea1_u*Cc2ea_u*Cc1ea_u)","v":2115329.1931411428},"Hz",null,null,"Error Amp HF pole without Cbw effect (like the SIMPLIS model)"]
["Fp_HF",{"$f":"1/(2*Pi*Rcea1_u*(Cc2ea_u+Cbw))","v":235259.03312535453},"Hz",null,null,"Error Amp HF pole cancels zero related to Output Cap ESR"]
["F_mod",{"$f":"Fsw/2","v":200000},"Hz",null,null,"Zero-order sample-and-hold effects of current-mode control modeled as pole at Fsw/2"]
["Fz_ff",{"$f":"IF(NO_FF_CAP=TRUE, 1000000000, 1/(2*Pi*Rfb1_*Cff_u*0.000000000001))","v":1000000000},"Hz",{"$f":"Fz_ff/1000","v":1000000},"kHz"]
["Fp_ff",{"$f":"IF(NO_FF_CAP=TRUE, 1000000000, 1/(2*Pi*Rfb4_u*Cff_u*0.000000000001))","v":1000000000},"Hz",{"$f":"Fp_ff/1000","v":1000000},"kHz"]
[]
["Desired Crossover Frequency",{"$f":"'Design the Converter'!E31*1000","v":62000},"Hz"]
["Cout - for the Fc spec",{"$f":"(Rcea1_u*gm*Vref)/(Fcross*2*Pi*Vout*Ri)*1000000","v":35.786166711542023},"uF",null,null,"Output cap to meet the crossover frequeny spec"]
[]
["Chosen Compensation Components from the standard value sheet"]
["Rcea1_u",630000,"W","Rcomp",null,{"$f":"1/(Rcea1*2*Pi*(Fsw/2))-Cbw","v":{"$error":"#REF!"}}]
["Cc1ea_u",2.5000000000000001E-11,"F","Ccomp"]
["Cc2ea_u",1.1999999999999999E-13,"F","Chf"]
[]
["Resulting Pole/Zero Locations",null,null,null,null,{"$f":"Cout","v":3.5200000000000002E-5},{"$f":"Cout_ESR","v":1E-3}]
["Fz1",{"$f":"1/(2*Pi*Rcea1_u*Cc1ea_u)","v":10105.075763413102},"Hz","Zero from Rcomp, Ccomp",null,"This zero is set at or close to the dominant load pole"]
["Fp2",{"$f":"1/(2*Pi*Rcea1_u*(Cc2ea_u+Cbw))","v":235259.03312535453},"Hz","high frequency pole Rcomp, Chf",null,"This pole cancels the zero from the Output Cap ESR"]
[]
["Rfb1",{"$f":"'Design the Converter'!E50*1000","v":100000},"W",null,null,"Upper Feedback Resistance - chosen by user"]
["Rfb2",{"$f":"IF(Vout=Vref, \"N/A\", Vref*B231/(Vout-Vref))","v":20000},"W",{"$f":"Rfb2_u","v":20000},null,"Upper Feedback Resistance"]
["Rfb2_u",{"$f":"IF(Vout=Vref,\"N/A\",'Standard Value Calculator'!O11)","v":20000},"W",null,null,"Std Value Upper Feedback Resistance"]
["Cff",{"$f":"1/(2*Pi*200000)/Rfb1_","v":7.9577471636878189E-12},"F",{"$f":"1/(1/Rfb1_+1/Rfb2_u)","v":16666.666666666668},"W","Based on a 200kHz zero frequency"]
["Cff_u",{"$f":"IF('Design the Converter'!E52<0.1, 0.1, 'Design the Converter'!E52)","v":100},"pF"]
[]
[]
["Step 6: UVLO Divider"]
["VIN UVLO turn-on voltage",{"$f":"'Design the Converter'!E55","v":3.5},"V"]
["VIN UVLO turn-off voltage",{"$f":"'Design the Converter'!E59","v":2.5007399999999995},"V"]
["Rent",{"$f":"'Design the Converter'!E56*1000","v":175000},"W"]
["Renb",{"$f":"B241*(1.263/(B239-1.263))","v":98804.202056325434},"W"]
["Renb_u",{"$f":"'Standard Value Calculator'!O7","v":100000},"W"]
[]
["Step 7: Efficiency"]
["VAR",0]
["Design"]
["Ta",{"$f":"'Design the Converter'!E14","v":25},"°C","Ambient Temperature"]
["Components"]
["LTc",{"$f":"3930/1000000","v":3.9300000000000003E-3},"%/°C","Inductor DCR Temp Co"]
["θCA",22,"°C/W","Inductor Core-to-Ambient Thermal Resistance"]
["RCinEsr",{"$f":"RCinEsr","v":2E-3},"W","Input Capacitor ESR"]
[]
["Controller Characteristics"]
["VCC",3.15,"V"]
["Top Driver"]
["RdsonDRT",0.5,"W","Drain-Source Resistance of Pullup High-side FET Driver"]
["RdsonDRT2",0.5,"W","Drain-Source Resistance of Pulldown High-side FET Driver"]
["Bottom Driver"]
["RdsonDRB",0.5,"W","Drain-Source Resistance of Pullup Low-side FET Driver"]
["RdsonDRB2",0.5,"W","Drain-Source Resistance of Pulldown Low-side FET Driver"]
["Deadtime"]
["Deadtime",5.5500000000000001E-9,"s","Total Deadtime",null,null,"5.55ns"]
["IQ"]
["IQ ",3.4999999999999997E-5,"A","Quiescent Current of MC-Q0 converter (current into VOUT/BIAS pin + VIN pin, non switching)"]
[]
["High- & low-side MOSFETs - Ch1","Q1: high-side",null,"Q2: low-side"]
["Rdson",6.5000000000000002E-2,"W",0.04,"W","Drain-Source Resistances of internal FETs"]
["RdsonTopTc",{"$f":"4000/1000000","v":4.0000000000000001E-3},"%/°C",4.0000000000000001E-3,"%/°C","Drain-Source Resistance Temp Co"]
["Qg",{"$f":"'MOSFET Parameters'!E7/1000000000","v":3.182E-9},"C",{"$f":"'MOSFET Parameters'!F7/1000000000","v":5.0469999999999996E-9},"C","Gate Charge at VCC = 3.15V"]
["Qgd",{"$f":"'MOSFET Parameters'!E8/1000000000","v":2.0080000000000001E-9},"C",{"$f":"'MOSFET Parameters'!F8/1000000000","v":2.7489999999999999E-9},"C","Gate to Drain Charge"]
["Qgs",{"$f":"'MOSFET Parameters'!E9/1000000000","v":1.175E-9},"C",{"$f":"'MOSFET Parameters'!F9/1000000000","v":2.2980000000000001E-9},"C","Gate to Source Charge"]
["Qoss",{"$f":"'MOSFET Parameters'!E10/1000000000","v":5.0469999999999996E-9},"C",{"$f":"'MOSFET Parameters'!F10/1000000000","v":3.182E-9},"C","Output Charge"]
["Coss",{"$f":"'MOSFET Parameters'!E11/1000000000000","v":1.4000000000000001E-10},"F",{"$f":"'MOSFET Parameters'!F11/1000000000000","v":8.8390000000000004E-11},"F","Output Capacitance"]
["Rgate",{"$f":"'MOSFET Parameters'!E12","v":0},"W",{"$f":"'MOSFET Parameters'!F12","v":0},"W","Gate Resistance"]
["Gfs",{"$f":"'MOSFET Parameters'!E13","v":100},"S",{"$f":"'MOSFET Parameters'!F13","v":100},"S","Transconductance"]
["Vth",{"$f":"'MOSFET Parameters'!E14","v":1.5},"V",{"$f":"'MOSFET Parameters'!F14","v":1.5},"V","Threshold Voltage"]
["Vsp",{"$f":"Vth_Q1+Iout/Gfs_Q1","v":1.53},"V",{"$f":"Vth_Q2+Iout/Gfs_Q2","v":1.53},"V","Switch Point Voltage of FETs"]
[]
["Vsd - Buck",{"$f":"'MOSFET Parameters'!E15","v":0.7},"V",{"$f":"'MOSFET Parameters'!F15","v":0.7},"V","Diode Forward Voltage of MOSFET Body diode"]
["QrrTop",null,"C",{"$f":"'MOSFET Parameters'!F16/1000000000","v":6.9999999999999998E-9},"C","Reverse Recovery Charge of Body Diode"]
["TrrTop",4.0000000000000001E-8,"s",4.0000000000000001E-8,"s","Reverse Recovery Time of Body Diode"]
["θJA-MOSFET",23,"°C/W",23,"°C/W","Junction-to-Ambient Resistance"]
[]
[]
["Controller"]
["θJACtrl",84.4,"°C/W",null,null,"Junction-to-ambient thermal resistance of converter"]
["Outputs"]
["Top FET"]
["Tr",{"$f":"(Qgd_Q1+Qgs_Q1/2)*(RdsonDRT+Rgate1)/(VCC-Vsp_Q1)","v":8.0108024691358034E-10},"s"]
["Tf",{"$f":"(Qgd_Q1+Qgs_Q1/2)*(RdsonDRT2+Rgate1)/(Vsp_Q1)","v":8.4820261437908493E-10},"s"]
[]
["IC Power Disipation","Value","Units"]
["Power Dis",{"$f":"'Efficiency Calculations'!BE109","v":0.63687927180033554},"W"]
["Temp rise",{"$f":"B294*ThetaJaCtrl","v":53.752610539948321},"°C"]
["Junction temperature",{"$f":"B295 + Ta","v":78.752610539948321},"°C"]
[]
["Current (switching)",{"$f":"(Qg_Q1+Qg_Q2)*Fsw+Iq","v":3.3265999999999999E-3},"A"]
["Qrr Current",{"$f":"Qrr_Q2*Fsw","v":2.8E-3},"A"]
["Diode Current",{"$f":"C300/Vin","v":{"$error":"#NAME?"}},{"$f":"Deadtime*Fsw*(Ipp/2)*(Vsd_Q1+Vsd_Q2)","v":{"$error":"#NAME?"}}]
["Total Application Switching IQ",{"$f":"SUM(B298:B300)","v":{"$error":"#NAME?"}},"A"]
[]
["Low-side MOSFET/Diode"]
["Part Power"]
["Power Dis"]
[]
["SCHEMATIC LABELS"]
[{"$f":"\"RFBT = \"&'Design the Converter'!E50&\"kΩ\"","v":"RFBT = 100kΩ"},{"$f":"IF(VARIANT<5, 'Design the Converter'!E50&\" kΩ\", \"\")","v":"100 kΩ"},null,{"$f":"'Design the Converter'!E50&\"kΩ\"","v":"100kΩ"}]
[{"$f":"\"RFBB = \"&'Design the Converter'!E51&\"kΩ\"","v":"RFBB = 20kΩ"},{"$f":"IF(VARIANT<5, 'Design the Converter'!E51&\" kΩ\", \"\")","v":"20 kΩ"},null,{"$f":"'Design the Converter'!E51&\"kΩ\"","v":"20kΩ"}]
[{"$f":"\"CFF = \"&'Design the Converter'!E52&\"pF\"","v":"CFF = 100pF"},{"$f":"IF(VARIANT< 5, IF(NO_FF_CAP=TRUE,\"N/A\",IF(Cff_u>0.1,ROUND(Cff_u,1)&\" pF\",\"N/A\")), \"\")","v":"N/A"},null,{"$f":"IF(Cff_u>0, ROUND(Cff_u,1), \"N/A\")","v":100}]
[]
[{"$f":"\"RRT = \"&'Design the Converter'!E13&\"kΩ\"","v":"RRT = 86.6kΩ"},{"$f":"'Design the Converter'!E13&\" kΩ\"","v":"86.6 kΩ"},null,{"$f":"'Design the Converter'!E13&\"kΩ\"","v":"86.6kΩ"},{"$f":"GPN","v":0}]
[{"$f":"\"RENT = \"&'Design the Converter'!E56&\"kΩ\"","v":"RENT = 175kΩ"},{"$f":"'Design the Converter'!E56&\" kΩ\"","v":"175 kΩ"},null,{"$f":"'Design the Converter'!E56","v":175}]
[{"$f":"\"RENB = \"&Renb_u/1000&\"kΩ\"","v":"RENB = 100kΩ"},{"$f":"Renb_u/1000&\" kΩ\"","v":"100 kΩ"},null,{"$f":"Renb_u/1000","v":100}]
["RPG",{"$f":"100&\" kΩ\"","v":"100 kΩ"}]
[{"$f":"\"Lo = \"&'Design the Converter'!E20&\"µH\"","v":"Lo = 5.6µH"},{"$f":"'Design the Converter'!E20&\" µH\"","v":"5.6 µH"},null,{"$f":"IF(MODE = 1, 'Design the Converter'!J34&\"µH\", 'Design the Converter'!E20&\"µH\")","v":"µH"}]
[{"$f":"\"Rdcr = \"&Rdcr*1000&\"mΩ\"","v":"Rdcr = 200mΩ"},{"$f":"Rdcr*1000&\"mΩ\"","v":"200mΩ"},null,{"$f":"Rdcr*1000&\"mΩ\"","v":"200mΩ"}]
[]
[{"$f":"\"VOUT = \"&'Design the Converter'!E10&\" V\"","v":"VOUT = 6 V"},{"$f":"'Design the Converter'!E10&\" V\"","v":"6 V"},null,{"$f":"IF(MODE=1, 'Design the Converter'!J11&\"V\", \"\")","v":"V"}]
[]
[{"$f":"\"COUT = \"&'Design the Converter'!$E$33&\" µF\"","v":"COUT = 35.2 µF"},{"$f":"ROUND('Design the Converter'!$E$33, 0)&\" µF\"","v":"35 µF"},null,{"$f":"IF(MODE=1, 'Design the Converter'!$J$44&\"µF\", ROUND('Design the Converter'!$E$33/Number_of_Phases, 0)&\"µF\")","v":"µF"}]
["Capacitance per component (Cout)",{"$f":"\"22µF\"","v":"22µF"}]
["# of output caps",{"$f":"ROUNDUP(Cout*1000000/22,0)&\" x\"","v":"2 x"}]
[]
["CIN",{"$f":"Cin/2*1000000&\" µF\"","v":"10 µF"},{"$f":"Cin*1000000&\" µF\"","v":"20 µF"}]
["Capacitance per component (Cin)",{"$f":"\"10 µF\"","v":"10 µF"}]
["# of input caps",{"$f":"ROUNDUP(Cin*1000000/10,0)&\" x\"","v":"2 x"}]
[]
[{"$f":"\"CVCC = 1µF\"","v":"CVCC = 1µF"},{"$f":"CHOOSE(GPN, \"\", \"\", \"1 µF\", \"1 µF\")","v":{"$error":"#VALUE!"}},null,{"$f":"IF(MODE=1, 'Design the Converter'!$J$44&\"µF\", ROUND('Design the Converter'!$E$33/Number_of_Phases, 0)&\"µF\")","v":"µF"}]
[]
[{"$f":"\"RC1 = \"&Rcea1_u/1000&\"kΩ\"","v":"RC1 = 630kΩ"},{"$f":"ROUND(Rcea1_u/1000,2)&\" kΩ\"","v":"630 kΩ"}]
[{"$f":"\"CC1 = \"&Cc1ea_u*10^9&\"nF\"","v":"CC1 = 0.025nF"},{"$f":"Cc1ea_u*10^9&\" nF\"","v":"0.025 nF"}]
[{"$f":"\"CC2 = \"&IF(Cc2ea_u>0, Cc2ea_u*10^12&\"pF\", \"OPEN\")","v":"CC2 = 0.12pF"},{"$f":"IF(Cc2ea_u>0, ROUND(Cc2ea_u*10^12,1)&\" pF\", \"N/A\")","v":"0.1 pF"}]
[]
[{"$f":"\"gm = \"&$B$189*1000&\"mS\"","v":"gm = 0.00863mS"},{"$f":"$B$189*1000&\"mS\"","v":"0.00863mS"}]
[{"$f":"\"RoEA = \"&RoEA/1000000&\"MΩ\"","v":"RoEA = 540MΩ"},{"$f":"RoEA/1000000&\"MΩ\"","v":"540MΩ"}]
[{"$f":"\"GBW = \"&GBW&\"MHz\"","v":"GBW = 1.44MHz"},{"$f":"GBW&\"MHz\"","v":"1.44MHz"}]
[]
[{"$f":"\"RPGOOD = 100 kΩ\"","v":"RPGOOD = 100 kΩ"},{"$f":"CHOOSE(GPN, \"100 kΩ\", \"100 kΩ\", \"\", \"\")","v":{"$error":"#VALUE!"}}]
[{"$f":"\"RFB1 = \"&'Design the Converter'!E50&\"kΩ\"","v":"RFB1 = 100kΩ"},{"$f":"IF(VOUT_setting=1, 'Design the Converter'!E50&\"kΩ\", \"\")","v":{"$error":"#NAME?"}},null,{"$f":"'Design the Converter'!#REF!&\"kΩ\"","v":{"$error":"#REF!"}}]
[{"$f":"\"RFB2 = \"&IF(Vout=Vref,\"OPEN\",'Design the Converter'!E51&\"kΩ\")","v":"RFB2 = 20kΩ"},{"$f":"IF(VOUT_setting=1, IF(Vout=Vref,\"OPEN\",Rfb2_u/1000&\"kΩ\"), \"\")","v":{"$error":"#NAME?"}},null,{"$f":"IF(Vout2=Vref,\"OPEN\",Rfb4_u/1000&\"kΩ\")","v":"16.6666666666667kΩ"}]
[{"$f":"\"Crossover Frequency = \"&ROUND('Stability Calculations'!Q4,1)&\" kHz\"","v":"Crossover Frequency = 45.2 kHz"},{"$f":"ROUND('Stability Calculations'!Q4,1)&\" kHz\"","v":"45.2 kHz"},null,{"$f":"'Stability Calculations'!Q4","v":45.188499999999998}]
[{"$f":"\"Phase Margin = \"&ROUND('Stability Calculations'!Q5,0)&\"°\"","v":"Phase Margin = 37°"},{"$f":"ROUND('Stability Calculations'!Q5,0)&\"°\"","v":"37°"}]
[]
["Full-load/high line efficiency",{"$f":"ROUND('Efficiency Calculations'!AZ109,1)&\"%\"","v":"86%"}]
["Half-load/mid-line efficiency",{"$f":"ROUND('Efficiency Calculations'!AZ59,1)&\"%\"","v":"91.7%"}]
[]
[]
["Rpgood","100 kΩ"]
[]
[]
["Rt",{"$f":"IF(No_RT,\"\", Rfadj&\"kΩ\")","v":"86.6kΩ"},{"$f":"Rfadj","v":86.6},{"$f":"Fsw","v":400000},{"$f":"\"kΩ\"","v":"kΩ"},{"$f":"OR((Fsw=440000),(Fsw=2200000))","v":false},null,{"$f":"OR(OR(AND(OSC=1, OR(Fsw/1000>2530, Fsw/1000<1800)), AND(OSC=2, OR(Fsw/1000>500, Fsw/1000<300))), OR((Fsw=440000),(Fsw=2200000)))","v":false}]
[]
["Blank out",{"$f":"IF(B89=\"y\",\"\",\"|\")","v":"|"}]
["OUTPUT CURRENT",{"$f":"'Design the Converter'!$E$11&\" A\"","v":"3 A"},null,{"$f":"IF(MODE=1,'Design the Converter'!$J$12&\"A\",\"\")","v":"A"}]
["VIN",{"$f":"VIN_nom&\" V\"","v":"12 V"}]
["VIN range",{"$f":"VIN_min&\" V\"&\"...\"&VIN_max&\" V\"","v":"9 V...18 V"}]

{"sheet":"Schematic Management","index":2,"n_rows":15,"n_cols":14,"rows_kept":15,"cut":false,"hidden":true,"merged":[]}
[{"$f":"VARIANT","v":4},null,null,null,null,null,null,null,null,null,null,null,null,"3.3V or 5V fixed (FB1/2)"]
[{"$f":"CHOOSE(VARIANT, \"LMR60440_fix_FPWM\", \"LMR60440_adj_FPWM\", \"LMR60440_fix_DEM\", \"LMR60440_adj_DEM\")","v":"LMR60440_adj_DEM"},null,null,null,null,null,null,null,null,"With/without dither (DITH)",null,null,null,"With/without VOUT connected to VCCX"]
[null,null,null,null,null,null,null,null,null,"FPWM or DEM (DEMB)"]
[null,null,null,null,null,null,null,null,null,"Shunt or inductor DCR current sensing"]
[]
[]
[]
[]
[]
[]
[]
[]
[]
[]
[null," "]

{"sheet":"Schematic & BOM","index":3,"n_rows":51,"n_cols":10,"rows_kept":51,"cut":false,"hidden":true,"merged":[[46,0,47,0],[46,9,47,9],[46,3,47,6],[46,2,47,2],[46,1,47,1],[46,7,47,7],[46,8,47,8],[45,3,45,6],[41,3,41,6],[42,3,42,6],[40,3,40,6],[39,3,39,6],[36,3,36,5],[34,3,34,5],[43,3,43,6],[44,3,44,6],[33,3,33,6],[35,3,35,5],[38,3,38,5],[37,3,37,5]]}
[]
[]
[]
[]
[]
[]
[]
[]
[]
[]
[]
[]
[]
[]
[]
[]
[]
[]
[]
[]
[]
[]
[]
[]
[]
[]
[]
[]
[]
[]
[]
[{"$f":"\"VIN = \"&VIN_min&\" V to \"&VIN_max&\" V, VOUT = \"&Vout&\" V, IOUT = \"&Iout&\" A,  Fsw = \"&Fsw/1000&\" kHz\"","v":"VIN = 9 V to 18 V, VOUT = 6 V, IOUT = 3 A,  Fsw = 400 kHz"}]
["High-Efficiency Synchronous Buck DC/DC Converter BOM"]
["Count","Ref Des","Value","Description",null,null,null,"Size","Part Number","MFR"]
[{"$f":"ROUNDUP('Design the Converter'!E43/10,0)","v":2},"CIN1, CIN2",10,{"$f":"C35","v":10},null,null,null,1210,"Std","Std"]
[2,"COUT",47,{"$f":"C36","v":47},null,null,null,1210,"Std","Std"]
[1,"CVCC",1,{"$f":"C37","v":1},null,null,null,"0402","Std","Std"]
[1,"CSYNC",1,{"$f":"C38","v":1},null,null,null,"0402","Std","Std"]
[1,"CFF",{"$f":"'Variable Management'!D310","v":100},100,null,null,null,"0402","Std","Std"]
[1,"LO",{"$f":"'Design the Converter'!E20","v":5.6},{"$f":"\"Buck Inductor, \"&Lf*1000000&\" µH, \"&Rdcr*1000&\" mΩ, >\"&ROUNDUP(Ipk_OCP_Vinmin*1.05,0)&\" A\"","v":"Buck Inductor, 5.6 µH, 200 mΩ, >6 A"},null,null,null,"--","--","Various"]
[1,"RRT",{"$f":"'Design the Converter'!E13","v":86.6},{"$f":"C41","v":86.6},null,null,null,"0402","Std","Std"]
[1,"RFBT",{"$f":"'Design the Converter'!E50","v":100},{"$f":"C42","v":100},null,null,null,"0402","Std","Std"]
[1,"RFBB",{"$f":"'Design the Converter'!E51","v":20},20,null,null,null,"0402","Std","Std"]
[1,"RENT",{"$f":"'Variable Management'!D313","v":175},{"$f":"C44","v":175},null,null,null,"0402","Std","Std"]
[1,"RENB",{"$f":"'Variable Management'!D314","v":100},100,null,null,null,"0402","Std","Std"]
[1,"RPGOOD",100,100,null,null,null,"0402","Std","Std"]
[1,"U1",{"$f":"'Variable Management'!O34","v":0},{"$f":"CHOOSE(GPN, \"IC, LMR36503E-Q1 Synchronous Buck DC/DC Converter, 3V–65V Input, 0.3A Output\", \"IC, LMR36503E-Q1 Synchronous Buck DC/DC Converter, 3V–65V Input, 0.3A Output\", \"IC, LMR36503E-Q1 Synchronous Buck DC/DC Converter, 3V–65V Input, 0.3A Output\")","v":{"$error":"#VALUE!"}},null,null,null,"VQFN-22",{"$f":"CHOOSE(VARIANT, \"LM63460AASQRYFTQ1\", \"LM63460AFSQRYFTQ1\", \"LM64460APPQRYFRQ1\", \"LM64460BPPQRYFRQ1\", \"LM64460CPPQRYFRQ1\")","v":"LM64460BPPQRYFRQ1"},"TI"]
[]
[]
["NOTES:"]
["** Effective input and output capacitances should be appropriately derated for applied voltage and temperature, particularly with ceramics **"]

{"sheet":"EVMs","index":4,"n_rows":6,"n_cols":2,"rows_kept":6,"cut":false,"hidden":true,"merged":[[0,0,0,16]]}
["LM63460-Q1 & LM64460-Q1 Converter Design Tool"]
[]
[]
[]
[]
[null,"LM64460EVM-2MHZ (BSR173) PCB Layout"]

{"sheet":"MOSFET Parameters","index":5,"n_rows":22,"n_cols":8,"rows_kept":22,"cut":false,"hidden":true,"merged":[]}
[]
[]
["MOSFET Parameters"]
[null,null,null,null,"Internal Power MOSFETs"]
[null,null,null,null,"High-side","  Low-side"]
[null,null,null,"On-State Resistance, RDS(on) ",42,60,"mΩ","LMR60440 Switcher Template "]
[null,null,null,"Total Gate Charge, QG ",3.1819999999999999,5.0469999999999997,"nC","LMR60440 FET parameter table @36V"]
[null,null,null,"Gate-Drain Charge, QGD ",2.008,2.7490000000000001,"nC","LMR60440 FET parameter table @36V"]
[null,null,null,"Gate-Source Charge, QGS ",1.175,2.298,"nC","LMR60440 FET parameter table @36V"]
[null,null,null,"Output Charge, QOSS ",5.0469999999999997,3.1819999999999999,"nC","LMR60440 FET parameter table @36V"]
[null,null,null,"Output Capacitance, COSS ",140,88.39,"pF","Qoss/36V"]
[null,null,null,"Gate Resistance, RGATE ",0,0,"Ω"]
[null,null,null,"Transconductance, gFS ",100,100,"S"]
[null,null,null,"Gate-Source Miller Plateau Voltage, VTH ",1.5,1.5,"V"]
[null,null,null,"Body Diode Forward Voltage, VBD ",0.7,0.7,"V","LMR60440 Switcher Template"]
[null,null,null,"Body Diode Rev Recovery Charge, QRR ",4.5,7,"nC","N/A"]
[null,null,null,"Thermal Resistance, θJA ",23,23,"°C/W"]
[]
[]
["Note: "]
["2025-03-21","values from Golf Parameter FET table (worst case)"]
["2025-03-26"]

{"sheet":"Stability Calculations","index":6,"n_rows":687,"n_cols":37,"rows_kept":687,"cut":false,"hidden":true,"merged":[[9,20,9,22],[10,14,10,15],[10,16,10,17],[9,27,9,28],[9,32,9,33],[10,18,10,19],[9,18,9,19],[9,1,10,1],[1,0,1,3],[1,9,1,11],[1,12,1,14],[9,0,11,0],[10,6,10,7],[1,4,1,6],[9,2,9,7],[9,8,9,13],[10,2,10,3],[10,4,10,5],[10,8,10,9],[10,10,10,11],[10,12,10,13]]}
[null,null,null,null,null,null,null,null,null,null,null,null,null,null,null,null,null,null,null,"2025-03-21","AM matches"]
["Divider Network & EA Poles/Zeros",null,null,null,"Modulator",null,null,null,null,"Power Stage Poles/Zeros",null,null,"Complex Pole Pair",null,null,"Total System",null,null,null,null,"Afb matches"]
[null,"Afb1",{"$f":"Afb*0.8","v":0.13333333333333333},"V/V","Acs",{"$f":"Acs","v":15.384615384615383},"A/V","gm",{"$f":"gm","v":8.6300000000000004E-6},"z_ESR",{"$f":"Fesr","v":4521447.252095351},"Hz","p3",{"$f":"Fsw/2","v":200000},"Hz","Adc",{"$f":"Am_stability*C3*0.8*Aea_stability","v":15295.015384615384},"V/V",null,null,"p_dom matches SIMPLIS model if neglecting slope comp influence. Need to change back"]
[null,"EA zero, z1",{"$f":"Fz1_u","v":10105.075763413102},"Hz","Am",{"$f":"Am_new","v":30.769230769230766},"V/V",null,null,"p_dom",{"$f":"Fp_load_buck_simplified","v":3269.9752448189597},"Hz","pterm1",{"$f":"Q*pole3","v":49915.905007450725},null,"Crossover",{"$f":"AK7","v":45.188499999999998},"kHz",null,null,"z_ESR doesn't really matter (beyond half the switching frequency)"]
[null,"EA pole, p1",{"$f":"Fp1_u","v":11.789255057315287},"Hz","Q",{"$f":"Q","v":0.24957952503725364},null,null,null,"p_L",{"$f":"FL","v":82103.740577731471},"Hz","pterm2",{"$f":"pole3^2","v":40000000000},null,"Phase Margin",{"$f":"AK9","v":37.246273356971244},"°",null,null,"FF zero, FF pole don't matter (beyond)"]
[null,"Aea",{"$f":"AEA","v":4660.2},"V/V","mc",{"$f":"mc","v":2.5507692307692311},null,"FF zero, z5",{"$f":"1*Fz_ff","v":1000000000},null,null,null,null,null,null,"radconv",{"$f":"180/Pi","v":57.295779578552292},null,null,null,"EA zero, z1 looks correct",null,null,null,null,null,null,null,null,null,null,null,null,null,null,"XOVER SEARCH"]
[null,"EA pole, p2",{"$f":"1*Fp2_u_simplified","v":2115329.1931411428},"Hz",null,null,null,"FF pole, p5",{"$f":"Fp_ff","v":1000000000},null,null,null,null,null,null,null,null,null,null,null,"EA HF pole seems off by 2x from SIMPLIS)",null,null,null,null,null,null,null,null,null,null,null,null,null,null,"xover",{"$f":"SUM(AJ12:AJ613)/1000","v":45.188499999999998}]
[]
[null,null,null,null,null,null,null,null,null,null,null,null,null,null,null,null,null,null,null,null,null,null,null,null,null,null,null,null,null,null,null,null,null,null,null,"phase margin",{"$f":"SUM(AK13:AK613)","v":37.246273356971244}]
["Freq (Hz)",null,"Power Stage",null,null,null,null,null,"Error Amplifier",null,null,null,null,null,null,"FF Network",null,null,"Sampling Double Pole",null,"System Response",null,null,null,null,null,null,"ERROR AMP Response",null,null,null,null,"PLANT Response"]
[null,null,"p_dom",null,"z_ESR",null,"z_RHP",null,"p1",null,"z1",null,"p2",null,"z3",null,"p3",null,"p3"]
[null,null,"Gain(V/V)","Phase(rad)","Gain(V/V)","Phase(rad)","Gain(V/V)","Phase(rad)","Gain(V/V)","Phase(rad)","Gain(V/V)","Phase(rad)","Gain(V/V)","Phase(rad)","Gain(V/V)","Phase(rad)","Gain(V/V)","Phase(rad)","Gain(V/V)","Phase(rad)","Gain (dB)","Phase (°)","Phase Margin (°)",null,null,"Fsquare",null,"Gain(dB)","Phase(Deg)",null,null,null,"Gain(dB)","Phase(Deg)"]
[1,{"$f":"A13/1000","v":1E-3},{"$f":"SQRT(1+(A13/p_dom)^2)","v":1.0000000467607066},{"$f":"ATAN(A13/p_dom)","v":3.0581270314221023E-4},{"$f":"SQRT(1+(A13/z_ESR)^2)","v":1.0000000000000244},{"$f":"ATAN(A13/z_ESR)","v":2.2116812255999644E-7},{"$f":"IF(VIN_nom>Vout, 1, SQRT(1+(A13/z_RHP)^2))","v":1},{"$f":"IF(VIN_nom>Vout, 0, -ATAN(A13/z_RHP))","v":0},{"$f":"SQRT(1+(A13/EA_p1)^2)","v":1.0035910230726215},{"$f":"ATAN(A13/EA_p1)","v":8.4620443090768077E-2},{"$f":"SQRT(1+(A13/EA_z1)^2)","v":1.0000000048965574},{"$f":"ATAN(A13/EA_z1)","v":9.8960168151957244E-5},{"$f":"SQRT(1+(A13/EA_hf_p)^2)","v":1.0000000000001117},{"$f":"ATAN(A13/EA_hf_p)","v":4.7273965832002854E-7},{"$f":"SQRT(1+(A13/Zero3)^2)","v":1},{"$f":"ATAN(A13/Zero3)","v":1.0000000000000001E-9},{"$f":"SQRT(1+(A13/pole5)^2)","v":1},{"$f":"ATAN(A13/pole5)","v":1.0000000000000001E-9},{"$f":"SQRT((1-(Z13/pterm2))^2+(A13/pterm1)^2)","v":1.0000000001756746},{"$f":"IF((ATAN((A13/pterm1)/(1-A13^2/pterm2))>0),ATAN((A13/pterm1)/(1-A13^2/pterm2)),PI()+ATAN((A13/pterm1)/(1-A13^2/pterm2)))","v":2.0033694665897602E-5},{"$f":"20*LOG10(((E13*K13*G13*O13)/(C13*I13*S13*M13*Q13))*Adc)","v":83.659862638438966},{"$f":"((F13+L13+H13+P13)-(D13+J13+T13+N13+R13))*radconv","v":-4.8614082925591253},{"$f":"IF(V13>0,V13,V13+180)","v":175.13859170744087},null,{"$f":"IF(U13<0,A13,1000000000)","v":1000000000},{"$f":"A13^2","v":1},null,{"$f":"20*LOG10((K13/(I13*M13))*Aea_stability*Afb*0.8)","v":55.835730525861599},{"$f":"(L13-(J13+N13))*radconv","v":-4.8427513411738463},"57dB",null,"33dB ",{"$f":"20*LOG10((E13*G13/(C13*S13))*Am_stability)","v":29.762332372738506},{"$f":"(F13+H13-(D13+T13))*radconv","v":-1.8656951385278613E-2},null,{"$f":"SUM((U14<0)*(U13>0))*A13","v":0},{"$f":"IF(AJ13>0,W11,0)","v":0}]
[1.0965,{"$f":"A14/1000","v":1.0965E-3},1.0000000562209699,3.3532362688060033E-4,1.0000000000000293,2.4251084638703531E-7,1,0,{"$f":"SQRT(1+(A14/EA_p1)^2)","v":1.0043159694110402},9.2741612821113997E-2,1.000000005887191,1.0850982430695882E-4,{"$f":"SQRT(1+(A14/EA_hf_p)^2)","v":1.0000000000001343},5.1835903534790357E-7,1,1.0965000000000001E-9,1,1.0965000000000001E-9,1.0000000002112155,2.196694620067327E-5,83.653590556760506,-5.327972897840179,174.67202710215983,null,1000000000,1.2023122500000001,null,55.829458526662592,-5.3075155507674197,null,null,null,29.762332290259046,-2.0457347072759282E-2,null,0,0]
[1.2022999999999999,1.2022999999999999E-3,1.0000000675937832,3.6767860788129508E-4,1.0000000000000353,2.6591043375388178E-7,1,0,1.0051867836532862,0.10163132880691837,1.0000000070780977,1.189798099960587E-4,1.0000000000001616,5.683748911981514E-7,1,1.2022999999999999E-9,1,1.2022999999999999E-9,1.0000000002539418,2.408651109564132E-5,83.646062439570784,-5.8386929904690863,174.1613070095309,null,1000000000,1.4455252899999997,null,55.821930508626934,-5.8162617381112183,null,null,null,29.762332191104989,-2.2431252357867863E-2,null,0,0]
[1.3183,1.3183000000000001E-3,1.0000000812661267,4.0315287727840313E-4,1.0000000000000426,2.9156593597083982E-7,1,0,1.0062326749441863,0.11135954671577332,1.0000000085098,1.3045918936047145E-4,1.0000000000001941,6.2321269156325933E-7,1,1.3183000000000001E-9,1,1.3183000000000001E-9,1.0000000003053073,2.6410419675932779E-5,83.637029411195826,-6.3975884475735887,173.60241155242642,null,1000000000,1.7379148900000001,null,55.812897599454502,-6.3729929890938575,null,null,null,29.762332071902438,-2.4595458479731831E-2,null,0,0]
[1.4454,1.4454000000000001E-3,1.0000000976915846,4.4202166611338343E-4,1.0000000000000511,3.1967640434821317E-7,1,0,1.007487735121974,0.12199434335328813,1.0000000102297955,1.4303702653827201E-4,1.0000000000002336,6.8329790213571384E-7,1,1.4454E-9,1,1.4454E-9,1.0000000003670158,2.8956702266657477E-5,83.626202243038179,-7.0085714954142695,172.99142850458574,null,1000000000,2.0891811599999999,null,55.802070574502487,-6.9816047387421012,null,null,null,29.762331928696817,-2.6966756672169027E-2,null,0,0]
[1.5849,1.5849E-3,1.0000001174585891,4.8468253036607067E-4,1.0000000000000613,3.5052935744532974E-7,1,0,1.0089960512392031,0.13363475710422229,1.0000000122997019,1.5684196972995455E-4,1.0000000000002807,7.4924508447132886E-7,1,1.5849E-9,1,1.5849E-9,1.0000000004412781,3.1751402670758961E-5,83.613208113853403,-7.6773335336731545,172.32266646632684,null,1000000000,2.51190801,null,55.789076617656661,-7.6477641327317922,null,null,null,29.76233175635787,-2.9569400941363025E-2,null,0,0]
[1.7378,1.7378000000000001E-3,1.0000001412149349,5.3144128205595E-4,1.0000000000000737,3.843459633847492E-7,1,0,1.0108057951527984,0.14635149257756122,1.0000000147873529,1.7197297908050493E-4,1.0000000000003375,8.2152697822842194E-7,1,1.7377999999999999E-9,1,1.7377999999999999E-9,1.0000000005305278,3.4814554582746834E-5,83.597642797393121,-8.4079386520413966,171.59206134795861,null,1000000000,3.0199488400000001,null,55.773511508316467,-8.3755166038418789,null,null,null,29.762331549237793,-3.2422048199519486E-2,null,0,0]
[1.9055,1.9055000000000001E-3,1.0000001697848535,5.8272605804456589E-4,1.0000000000000888,4.2143585753805513E-7,1,0,1.0129779519185989,0.16024439398955559,1.0000000177790584,1.8856859879406445E-4,1.0000000000004057,9.0080541892863788E-7,1,1.9055000000000001E-9,1,1.9055000000000001E-9,1.0000000006378615,3.8174205174942409E-5,83.578997181751646,-9.2061257223267425,170.79387427767327,null,1000000000,3.63093025,null,55.754866141762278,-9.1705749042010503,null,null,null,29.762331300150517,-3.5550818125690054E-2,null,0,0]
[2.0893000000000002,2.0893000000000001E-3,1.0000002041186271,6.3893441364742867E-4,1.0000000000001068,4.6208655846457527E-7,1,0,1.0155821854947169,0.17539956011283755,1.0000000213743274,2.067574770486162E-4,1.0000000000004876,9.876949681277881E-7,1,2.0893000000000002E-9,1,2.0893000000000002E-9,1.0000000007668497,4.1856398250137336E-5,83.556695284574189,-10.07684475901015,169.92315524098984,null,1000000000,4.3651744900000002,null,55.732564543924347,-10.037864794322161,null,null,null,29.762331000810978,-3.8979964687986597E-2,null,0,0]
[2.2909000000000002,2.2909000000000002E-3,1.0000002454105821,7.0058622884758173E-4,1.0000000000001283,5.0667405197266069E-7,1,0,1.018705382620263,0.19192908101059855,1.0000000256982244,2.2670784607538484E-4,1.0000000000005864,1.0829992832450105E-6,1,2.2909E-9,1,2.2909E-9,1.0000000009219787,4.5895191088895081E-5,83.53002442911972,-11.026540173419479,168.97345982658052,null,1000000000,5.2482228100000006,null,55.705894048474399,-10.983798968808113,null,null,null,29.76233064080645,-4.2741204611365102E-2,null,0,0]
[2.5118999999999998,2.5118999999999996E-3,1.0000002950432629,7.6817080187398289E-4,1.0000000000001543,5.5555220705840693E-7,1,0,1.0224468215267215,0.20992773502361706,1.0000000308955224,2.4857804207238692E-4,1.0000000000007052,1.1874747477336098E-6,1,2.5119E-9,1,2.5119E-9,1.0000000011084429,5.0322637602201895E-5,83.49818147560012,-12.060663186820568,167.93933681317944,null,1000000000,6.309641609999999,null,55.674051527678039,-12.013798797922647,null,null,null,29.762330208083196,-4.6864388897918621E-2,null,0,0]
[2.7542,2.7542000000000001E-3,1.0000003547087857,8.4226917407750023E-4,1.0000000000001856,6.0914124315467671E-7,1,0,1.0269265192109296,0.22950331733004262,1.0000000371434121,2.7255608926473631E-4,1.0000000000008478,1.3020195669443839E-6,1,2.7541999999999999E-9,1,2.7541999999999999E-9,1.0000000013325994,5.517680180928634E-5,83.460208209992018,-13.18541473449714,166.81458526550287,null,1000000000,7.5856176399999997,null,55.636078782264661,-13.134029768901472,null,null,null,29.762329687888496,-5.1384965595668082E-2,null,0,0]
[3.02,3.0200000000000001E-3,1.0000004264762667,9.2355412969756989E-4,1.0000000000002229,6.6792773013110079E-7,1,0,1.0322890802944844,0.25077298266819964,1.0000000446585617,2.9885969989673714E-4,1.0000000000010192,1.4276737681256224E-6,1,3.0199999999999999E-9,1,3.0199999999999999E-9,1.0000000016022212,6.0501757837565856E-5,83.414968366160224,-14.407535919189803,165.5924640808102,null,1000000000,9.1204000000000001,null,55.590839564138612,-14.351191939404615,null,null,null,29.762329062182737,-5.6343979785189784E-2,null,0,0]
[3.3113000000000001,3.3113000000000001E-3,1.000000512717359,1.0126372893514287E-3,1.0000000000002682,7.3235400423279725E-7,1,0,1.0386965059161262,0.27381935439091365,1.0000000536893199,3.276867941424135E-4,1.0000000000012252,1.5653828305939485E-6,1,3.3112999999999999E-9,1,3.3112999999999999E-9,1.000000001926219,6.633757307527743E-5,83.361220945490572,-15.731786738119714,164.26821326188028,null,1000000000,10.964707690000001,null,55.537092895363038,-15.670007993024914,null,null,null,29.762328310288662,-6.1778745094799338E-2,null,0,0]
[3.6307999999999998,3.6308E-3,1.0000006164325943,1.1103443408807881E-3,1.0000000000003224,8.0301721939067549E-7,1,0,1.0463502371044371,0.29875747766312621,1.0000000645498885,3.5930456423698376E-4,1.000000000001473,1.7164231514268017E-6,1,3.6307999999999999E-9,1,3.6307999999999999E-9,1.0000000023158653,7.2738338496542977E-5,83.297452008327738,-17.164793931242404,162.8352060687576,null,1000000000,13.182708639999998,null,55.47332486244273,-17.097054296319197,null,null,null,29.762327406046126,-6.7739634923206629E-2,null,0,0]
[3.9811000000000001,3.9811000000000004E-3,1.0000007411175316,1.2174703889069028E-3,1.0000000000003877,8.8049241272338867E-7,1,0,1.0554779772252967,0.32566538535940481,1.000000077606306,3.9397030633276915E-4,1.000000000001771,1.8820238537357838E-6,1,3.9810999999999998E-9,1,3.9810999999999998E-9,1.0000000027842921,7.9756141705572027E-5,83.222009054000694,-18.711062288970723,161.28893771102929,null,1000000000,15.849157210000001,null,55.397882995182712,-18.636787132108498,null,null,null,29.76232631897912,-7.4275156862222483E-2,null,0,0]
[4.3651999999999997,4.3651999999999996E-3,1.0000008910235325,1.3349328604002966E-3,1.0000000000004661,9.6544308859861208E-7,1,0,1.0663486313908428,0.35461682892137419,1.0000000933037565,4.3198090055677628E-4,1.0000000000021292,2.0636031564958129E-6,1,4.3651999999999998E-9,1,4.3651999999999998E-9,1.0000000033474716,8.7451083783815863E-5,83.133007087450352,-20.374856499143039,159.62514350085695,null,1000000000,19.054971039999998,null,55.308882335589324,-20.29341521801539,null,null,null,29.762325012022171,-8.1441281127644746E-2,null,0,0]
[4.7862999999999998,4.7862999999999994E-3,1.0000010712249381,1.4637103413703693E-3,1.0000000000005604,1.0585769850085328E-6,1,0,1.0792712939659668,0.38565804898579076,1.0000001121736017,4.7365301895098264E-4,1.0000000000025597,2.2626738266134599E-6,1,4.7862999999999995E-9,1,4.7862999999999995E-9,1.0000000040244679,9.5887272550858508E-5,83.028377477605119,-22.158867599199553,157.84113240080046,null,1000000000,22.908667689999998,null,55.20425429683155,-22.069569890074689,null,null,null,29.762323440934694,-8.9297709124866773E-2,null,0,0]
[5.2481,5.2481000000000003E-3,1.000001287908467,1.6049343193869764E-3,1.0000000000006737,1.1607124240066148E-6,1,0,1.0946081785356518,0.41882135815218957,1.0000001348636876,5.1935281347909067E-4,1.0000000000030775,2.4809850008244365E-6,1,5.2480999999999997E-9,1,5.2480999999999997E-9,1.0000000048385231,1.0513883267252167E-4,82.905814531579907,-24.064995115583308,155.93500488441668,null,1000000000,27.542553609999999,null,55.081693239963144,-23.967081645122907,null,null,null,29.76232155177788,-9.7913470460401178E-2,null,0,0]
[5.7544000000000004,5.7544000000000007E-3,1.000001548391694,1.7597668572813877E-3,1.00000000000081,1.2726898444585772E-6,1,0,1.1127654558452611,0.45408679451704331,1.000000162140279,5.6945633191800142E-4,1.0000000000037002,2.7203330898302648E-6,1,5.7544000000000007E-9,1,5.7544000000000007E-9,1.0000000058171292,1.1528189218271995E-4,82.762913568530905,-26.09214476740333,153.90785523259666,null,1000000000,33.113119360000006,null,54.938794547938379,-25.984785307311792,null,null,null,29.762319280753644,-0.10735946009153567,null,0,0]
[6.3095999999999997,6.3095999999999994E-3,1.0000018615912372,1.9295534972045792E-3,1.0000000000009737,1.3954823861036703E-6,1,0,1.1342125881003644,0.49140887323158955,1.0000001949370858,6.2439899786417982E-4,1.0000000000044484,2.9827981481274282E-6,1,6.3095999999999998E-9,1,6.3095999999999998E-9,1.0000000069937851,1.2640459933026962E-4,82.597094565852387,-28.237767724687028,151.76223227531298,null,1000000000,39.811052159999996,null,54.772978275890772,-28.120049958016427,null,null,null,29.762316550122737,-0.11771776667060069,null,0,0]
[6.9183000000000003,6.9183000000000005E-3,1.000002238099394,2.1157009333375473E-3,1.0000000000011706,1.5301074223056542E-6,1,0,1.1594699604804011,0.53068011280715321,1.0000002343632901,6.84636026591559E-4,1.0000000000053482,3.270554778144036E-6,1,6.9183E-9,1,6.9183E-9,1.0000000084082847,1.3859910910051738E-4,82.405790857334878,-30.495765613872312,149.50423438612768,null,1000000000,47.862874890000008,null,54.581677849959348,-30.366691404234459,null,null,null,29.762313267536662,-0.12907420963785252,null,0,0]
[7.5857999999999999,7.5858000000000002E-3,1.0000026908114494,2.3198299143313396E-3,1.0000000000014073,1.6777371441140741E-6,1,0,1.1891292280260894,0.57175709124871066,1.0000002817692344,7.5069190500306766E-4,1.00000000000643,3.5861085000689669E-6,1,7.5858E-9,1,7.5858E-9,1.0000000101090747,1.5197160006177901E-4,82.186396272302318,-32.857989931095034,147.14201006890497,null,1000000000,57.544361639999998,null,54.362287211894866,-32.716462263622034,null,null,null,29.762309320568583,-0.14152766747299994,null,0,0]
[8.3176000000000005,8.3176000000000014E-3,1.000003235016008,2.5436223331781484E-3,1.000000000001692,1.8395879762029814E-6,1,0,1.223831617956546,0.61442359863691587,1.000000338755882,8.2311091141855375E-4,1.0000000000077307,3.9320593820226982E-6,1,8.3176000000000003E-9,1,8.3176000000000003E-9,1.000000012153593,1.6663225751714316E-4,81.936539719059866,-35.312124333422958,144.68787566657704,null,1000000000,69.182469760000004,null,54.112435403295116,-35.156943584419921,null,null,null,29.762304575925871,-0.15518074900303702,null,0,0]
[9.1201000000000008,9.1201000000000008E-3,1.000003889371528,2.7890352891436427E-3,1.0000000000020344,2.0170753945567209E-6,1,0,1.2642974624632479,0.65843122371884666,1.0000004072770783,9.025263874566442E-4,1.0000000000092943,4.3114329578180991E-6,1,9.1201000000000004E-9,1,9.1201000000000004E-9,1.0000000146119383,1.8270929708914601E-4,81.653982665617875,-37.844019188653725,142.15598081134627,null,1000000000,83.176224010000013,null,53.829884054842665,-37.673866335784368,null,null,null,29.762298870936341,-0.17015285286935009,null,0,0]
[10,0.01,1.0000046760598289,3.0581175934631544E-3,1.0000000000024458,2.2116812255963941E-6,1,0,1.3112948406804361,0.70346559911119999,1.0000004896556274,9.8960136170742172E-4,1.0000000000111742,4.7273965831654211E-6,1,1E-8,1,1E-8,1.0000000175674459,2.0033694450144444E-4,81.336954798553336,-40.435749759125088,139.56425024087491,null,1000000000,100,null,53.512863046504258,-40.249180786151129,null,null,null,29.762292012210207,-0.18656897297395331,null,0,0]
[10.965,1.0964999999999999E-2,1.0000056220813549,3.3532238264250536E-3,1.0000000000029405,2.4251084638656463E-6,1,0,1.3656707661086382,0.74918977901608086,1.0000005887189298,1.0850978214499646E-3,1.0000000000134348,5.1835903534330726E-6,1,1.0964999999999999E-8,1,1.0964999999999999E-8,1.0000000211215554,2.1966945916238246E-4,80.984034202714753,-43.068110670929727,136.93188932907026,null,1000000000,120.23122499999999,null,53.159950698528249,-42.86353791326102,null,null,null,29.762283764347643,-0.2045727576687075,null,0,0]
[12.023,1.2022999999999999E-2,1.0000067593556994,3.6767696761058938E-3,1.0000000000035354,2.6591043375326131E-6,1,0,1.4283021399983433,0.79521400968752709,1.0000007078095154,1.1897975441415895E-3,1.0000000000161524,5.6837489119209217E-6,1,1.2023E-8,1,1.2023E-8,1.0000000253941874,2.408651072067203E-4,80.594543841845251,-45.718873477383845,134.28112652261615,null,1000000000,144.55252899999999,null,52.770470252943454,-45.494561893825896,null,null,null,29.762273849062908,-0.22431158355794936,null,0,0]
[13.183,1.3183E-2,1.0000081265799827,4.0315071496308972E-3,1.0000000000042504,2.9156593597002184E-6,1,0,1.5001398643237394,0.84115205865212828,1.0000008509796521,1.3045911608855914E-3,1.0000000000194196,6.2321269155527164E-6,1,1.3183E-8,1,1.3183E-8,1.0000000305307257,2.641041918162219E-4,80.168299862350551,-48.366025797152339,131.63397420284767,null,1000000000,173.79148899999998,null,52.344238193528831,-48.120072451553661,null,null,null,29.762261928982866,-0.24595334559868393,null,0,0]
[14.454000000000001,1.4454E-2,1.0000097691112204,4.4201881614820112E-3,1.0000000000051097,3.1967640434713511E-6,1,0,1.5821357849819677,0.88659151668019476,1.0000010229790388,1.4303692996458094E-3,1.0000000000233449,6.8329790212518581E-6,1,1.4453999999999998E-8,1,1.4453999999999998E-8,1.0000000367015767,2.8956701615147151E-4,79.706047005017126,-50.986055426112877,129.01394457388713,null,1000000000,208.91811600000003,null,51.881999656504654,-50.716389492674239,null,null,null,29.762247608673601,-0.26966593343863404,null,0,0]
[15.849,1.5848999999999999E-2,1.0000117457906199,4.8467877303071663E-3,1.0000000000061435,3.505293574439084E-6,1,0,1.6755008629154635,0.93124380930212014,1.0000012299694372,1.5684184240891772E-3,1.0000000000280684,7.4924508445744898E-6,1,1.5849000000000002E-8,1,1.5849000000000002E-8,1.0000000441278076,3.1751401811819122E-4,79.208013524212902,-53.562597417291109,126.4374025827089,null,1000000000,251.19080099999999,null,51.383983409229273,-53.266905561164201,null,null,null,29.762230375144743,-0.29569185612691234,null,0,0]
[17.378,1.7378000000000001E-2,1.0000141213947658,5.3143632900847226E-3,1.0000000000073861,3.8434596338287558E-6,1,0,1.7812455056639749,0.97471379223099119,1.0000014787342126,1.7197281124114365E-3,1.0000000000337455,8.2152697821012507E-6,1,1.7377999999999995E-8,1,1.7377999999999995E-8,1.0000000530527873,3.4814553450459836E-4,78.676412458910491,-56.073141772723815,123.92685822727618,null,1000000000,301.99488400000001,null,50.852403055406029,-55.748924129264537,null,null,null,29.762209663665587,-0.324217643459278,null,0,0]
[19.055,1.9054999999999999E-2,1.0000169783426478,5.8271952826579156E-3,1.0000000000088805,4.2143585753558504E-6,1,0,1.9006401835486679,1.0167429684701799,1.0000017779042842,1.8856837752477492E-3,1.0000000000405724,9.008054189045162E-6,1.0000000000000002,1.9054999999999998E-8,1.0000000000000002,1.9054999999999998E-8,1.0000000637861695,3.8174203682202998E-4,78.112867642213033,-58.503059850170132,121.49694014982987,null,1000000000,363.09302500000001,null,50.288883146672703,-58.147555411056175,null,null,null,29.762184755701462,-0.35550443911397167,null,0,{"$f":"IF(AJ45>0,W43,0)","v":0}]
[20.893000000000001,2.0893000000000002E-2,1.0000204116564846,6.3892580624290291E-3,1.0000000000106763,4.6208655846131923E-6,1,0,2.0348753154487333,1.0570646951739311,1.0000021374304924,2.0675718537543019E-3,1.000000000048777,9.8769496809599128E-6,1.0000000000000002,2.0892999999999997E-8,1.0000000000000002,2.0892999999999997E-8,1.0000000766849646,4.1856396282434347E-4,77.520082900632005,-60.837243255364349,119.16275674463566,null,1000000000,436.51744900000006,null,49.696128337941154,-60.447448541291429,null,null,null,29.762154822851979,-0.38979471407293254,null,0,0]
[22.909000000000002,2.2909000000000002E-2,1.0000245407601083,7.0057488171773276E-3,1.000000000012836,5.0667405196836837E-6,1,0,2.1854211626022235,1.0955272653787791,1.0000025698191597,2.2670746156129191E-3,1.0000000000586444,1.0829992832030929E-5,1.0000000000000002,2.2909E-8,1.0000000000000002,2.2909E-8,1.0000000921978673,4.589518849486193E-4,76.900103842054776,-63.067220968055423,116.93277903194458,null,1000000000,524.82228100000009,null,49.076185278220812,-62.639815424854547,null,null,null,29.762118823995095,-0.42740554320087532,null,0,0]
[25.119,2.5118999999999999E-2,1.0000295038954095,7.6815584392480206E-3,1.0000000000154319,5.5555220705274858E-6,1,0,2.3536674117235763,1.1319793067086386,1.0000030895475047,2.4857753519766956E-3,1.0000000000705049,1.187474747678353E-5,1.0000000000000004,2.5118999999999992E-8,1.0000000000000004,2.5118999999999992E-8,1.0000001108442829,5.0322634182689747E-4,76.255866086525572,-65.184528097672285,114.81547190232772,null,1000000000,630.96416099999999,null,48.431990792710344,-64.715892780925927,null,null,null,29.762075553976352,-0.46863531674636116,null,0,0]
[27.542000000000002,2.7542000000000001E-2,1.0000354702557863,8.4224945673878511E-3,1.0000000000185527,6.0914124314721808E-6,1,0,2.5412216719262308,1.1663481494206989,1.0000037143343756,2.725554211059487E-3,1.0000000000847629,1.3020195668715445E-5,1.0000000000000004,2.7541999999999996E-8,1.0000000000000004,2.7541999999999996E-8,1.0000001332599204,5.5176797301705494E-4,75.589870373937501,-67.185248086186689,112.81475191381331,null,1000000000,758.56176400000004,null,47.76604709625915,-66.671409730015583,null,null,null,29.762023537839482,-0.51383835617110263,null,0,0]
[30.2,3.0199999999999998E-2,1.0000426467264034,9.2352813534969311E-3,1.0000000000223064,6.6792773012126742E-6,1,0,2.7499226406434176,1.1986168114109581,1.0000044658463052,2.9885881902293066E-3,1.0000000001019127,1.4276737680295938E-5,1.0000000000000004,3.0199999999999992E-8,1.0000000000000004,3.0199999999999992E-8,1.0000001602221229,6.0501751894946436E-4,74.904255810500047,-69.068694033148986,110.93130596685101,null,1000000000,912.04,null,47.080495098576975,-68.505269132366223,null,null,null,29.761960972084207,-0.56342490078277108,null,0,0]
[33.113,3.3112999999999997E-2,1.0000512704347111,1.0126030244768793E-2,1.0000000000268172,7.3235400421983502E-6,1,0,2.9814498386249815,1.2287588000378946,1.0000053689177244,3.2768563299334207E-3,1.0000000001225211,1.5653828304673654E-5,1.0000000000000004,3.3112999999999987E-8,1.0000000000000004,3.3112999999999987E-8,1.0000001926218931,6.6337565241834939E-4,74.202047865851867,-70.833608036616056,109.16639196338394,null,1000000000,1096.470769,null,46.378362336371772,-70.21584022248328,null,null,null,29.761885789641227,-0.61776781413277426,null,0,0]
[36.308,3.6308E-2,1.0000616413786017,1.1102991703618052E-2,1.0000000000322418,8.030172193735876E-6,1,0,3.2380367306210682,1.2568346089606515,1.0000064549682164,3.593030335062552E-3,1.0000000001473053,1.7164231512599287E-5,1.0000000000000007,3.6307999999999983E-8,1.0000000000000007,3.6307999999999983E-8,1.0000002315864973,7.273832816978422E-4,73.484881606742235,-72.483807148148315,107.51619285185168,null,1000000000,1318.2708640000001,null,45.661286491445956,-71.806436685634026,null,null,null,29.761795375457396,-0.67737046251428823,null,0,0]
[39.811,3.9810999999999999E-2,1.0000741090345526,1.217410843153068E-2,1.0000000000387632,8.8049241270086229E-6,1,0,3.5218427052837535,1.2828932161873474,1.0000077606008033,3.9396828842927275E-3,1.0000000001771006,1.8820238535158005E-5,1.0000000000000009,3.9810999999999978E-8,1.0000000000000009,3.9810999999999978E-8,1.000000278429177,7.9756128092182011E-4,72.755020565285733,-74.022435499199673,105.97756450080033,null,1000000000,1584.9157210000001,null,44.931534142136812,-73.279718055581185,null,null,null,29.761686683310053,-0.74271744361847436,null,0,0]
[43.652000000000001,4.3652000000000003E-2,1.0000890984236805,1.3348543646603135E-2,1.0000000000466041,9.654430885689165E-6,1,0,3.8353540080300745,1.3070158460099341,1.0000093303325555,4.319782404274791E-3,1.000000000212923,2.0636031562058167E-5,1.0000000000000009,4.3651999999999973E-8,1.0000000000000009,4.3651999999999973E-8,1.0000003347471218,8.7451065837742571E-4,72.014193510119512,-75.454536701961317,104.54546329803868,null,1000000000,1905.497104,null,44.190837761629858,-74.640168875713343,null,null,null,29.761556008650771,-0.81436782624796267,null,0,0]
[47.863,4.7863000000000003E-2,1.0001071168141689,1.463606869115492E-2,1.0000000000560294,1.0585769849693874E-5,1,0,4.1812262074536459,1.3292912543577096,1.0000112172978819,4.7364951232810272E-3,1.0000000002559846,2.2626738262311811E-5,1.0000000000000011,4.7862999999999957E-8,1.0000000000000011,4.7862999999999957E-8,1.0000004024467057,9.5887248894019697E-4,71.26408866569119,-76.785611733885517,103.21438826611448,null,1000000000,2290.8667689999997,null,43.440889995548922,-75.892693941426273,null,null,null,29.761398930303397,-0.89291779245924063,null,0,0]
[52.481000000000002,5.2481E-2,1.0001287826371543,1.6047979179120021E-2,1.0000000000673626,1.1607124239550106E-5,1,0,4.5625328986993345,1.3498259568094391,1.0000134862787287,5.1934819079277449E-3,1.0000000003077645,2.4809850003204876E-5,1.0000000000000013,5.2480999999999952E-8,1.0000000000000013,5.2480999999999952E-8,1.0000004838522114,1.0513880148626674E-3,70.505872598021625,-78.02224393026458,101.97775606973542,null,1000000000,2754.255361,null,42.68286279961324,-77.043187395817398,null,null,null,29.761210058569517,-0.97905653444719021,null,0,0]
[57.544000000000004,5.7544000000000005E-2,1.000154827303521,1.7595870533449184E-2,1.000000000080987,1.2726898443905502E-5,1,0,4.9824387575013098,1.3687188914538742,1.0000162138977582,5.6945023813724047E-3,1.0000000003700105,2.7203330891659403E-5,1.0000000000000018,5.7543999999999936E-8,1.0000000000000018,5.7543999999999936E-8,1.000000581712774,1.1528185107181751E-3,69.740950046191003,-79.170595149832991,100.82940485016701,null,1000000000,3311.3119360000005,null,41.918167286692864,-78.09710359253954,null,null,null,29.760983019659257,-1.0734915572934707,null,0,0]
[63.095999999999997,6.3095999999999999E-2,1.0001861419725808,1.9293164755333395E-2,1.0000000000973686,1.3954823860139922E-5,1,0,5.4446138063716401,1.3860799363908229,1.0000194935204947,6.2439096462975543E-3,1.0000000004448542,2.982798147251667E-5,1.000000000000002,6.3095999999999919E-8,1.000000000000002,6.3095999999999919E-8,1.0000006993782735,1.2640454513488655E-3,68.97020334210508,-80.237531692591517,99.762468307408483,null,1000000000,3981.1052159999995,null,41.147693553889873,-79.060489860351439,null,null,null,29.760710048376321,-1.1770418322400842,null,0,0]
[69.183000000000007,6.9183000000000008E-2,1.0002237851499474,2.1153884974356805E-2,1.0000000001170615,1.5301074221874375E-5,1,0,5.9529034030162356,1.4020108026940175,1.0000234360571445,6.8462543695504002E-3,1.0000000005348264,3.2705547769895773E-5,1.0000000000000024,6.9182999999999899E-8,1.0000000000000024,6.9182999999999899E-8,1.0000008408281285,1.3859903765830349E-3,68.19467435380669,-81.229477369324698,98.770522630675302,null,1000000000,4786.2874890000012,null,40.372492691519511,-79.938914326465138,null,null,null,29.760381922448293,-1.2905630428595616,null,0,0]
[75.858000000000004,7.5858000000000009E-2,1.0002690453142749,2.3194180605037154E-2,1.0000000001407401,1.6777371439582317E-5,1,0,6.51174570254339,1.4166175690453242,1.0000281765304393,7.5067794503091995E-3,1.0000000006430088,3.5861084985470742E-5,1.0000000000000029,7.5857999999999858E-8,1.0000000000000029,7.5857999999999858E-8,1.000001010906971,1.5197150588131874E-3,67.41494908752864,-82.153196537123932,97.846803462876068,null,1000000000,5754.4361640000006,null,39.593161930264827,-80.738155891216536,null,null,null,29.759987417424931,-1.4150406459073985,null,0,0]
[83.176000000000002,8.3176E-2,1.0003234498141758,2.5430794524768843E-2,1.0000000001692042,1.8395879759975457E-5,1,0,7.1257549011324919,1.4299955533967756,1.0000338750201669,8.2309250914508435E-3,1.0000000007730545,3.9320593800164986E-5,1.0000000000000036,8.3175999999999818E-8,1.0000000000000036,8.3175999999999818E-8,1.0000012153585851,1.6663213336602666E-3,66.631855432186526,-83.014862031206661,96.985137968793339,null,1000000000,6918.2469760000004,null,38.810542462048979,-81.463365660039486,null,null,null,29.759513230298683,-1.551496371167167,null,0,0]
[91.201000000000008,9.1201000000000004E-2,1.0003888623022166,2.7883196819652775E-2,1.0000000002034297,2.0170753942859013E-5,1,0,7.800308157957657,1.4422424737515107,1.0000407268867797,9.0250212847410929E-3,1.0000000009294228,4.3114329551733844E-5,1.000000000000004,9.1200999999999759E-8,1.000000000000004,9.1200999999999759E-8,1.0000014611927863,1.8270913342437437E-3,65.845727244465394,-83.82089993600205,96.17910006399795,null,1000000000,8317.6224010000005,null,38.024984372685118,-82.119781513792958,null,null,null,29.758943131941397,-1.7011184222090849,null,0,0]
[100,0.1,1.0004674977990737,3.0571743267521361E-2,1.0000000002445768,2.2116812252393834E-5,1,0,8.5410430229283492,1.4534454488040225,1.000048964375968,9.8956938237119724E-3,1.0000000011174139,4.7273965796789981E-5,1.0000000000000049,9.9999999999999665E-8,1.0000000000000049,9.9999999999999665E-8,1.0000017567430985,2.0033672874873757E-3,65.057130510092492,-84.577166324856108,95.422833675143892,null,1000000000,10000,null,37.237072931985729,-82.712017170749135,null,null,null,29.758257838267891,-1.8651491541069596,null,0,0]
[109.65,0.10965000000000001,1.0005620517647726,3.3519804269988081E-2,1.0000000002940577,2.4251084633949865E-5,1,0,9.3544462230735785,1.4636906279092483,1.0000588701774689,1.0850556624656624E-2,1.0000000013434804,5.1835903488367977E-5,1.000000000000006,1.0964999999999957E-7,1.000000000000006,1.0964999999999957E-7,1.0000021121533795,2.1966917472807704E-3,64.266249131695986,-85.289589464034648,94.710410535965352,null,1000000000,12023.122500000001,null,36.447015502960006,-83.244574465710699,null,null,null,29.757433888897104,-2.0450149983239494,null,0,0]
[120.23,0.12023,1.0006757095626799,3.6751307344470796E-2,1.0000000003535416,2.6591043369121442E-5,1,0,10.247180115152885,1.4730529417658016,1.0000707784718055,1.1897419669618556E-2,1.0000000016152499,5.6837489058616763E-5,1.0000000000000071,1.2022999999999943E-7,1.0000000000000071,1.2022999999999943E-7,1.0000025394156031,2.4086473223856623E-3,63.473636492999518,-85.963477848590955,94.036522151409045,null,1000000000,14455.252900000001,null,35.655393183388028,-83.72130127225229,null,null,null,29.756443569772614,-2.2421765763386667,null,0,0]
[131.83000000000001,0.13183,1.0008123313592265,4.0293469403339555E-2,1.0000000004250533,2.9156593588822735E-5,1,0,11.226841107512156,1.4816058728860031,1.0000850943808817,1.3045178964539928E-2,1.0000000019419701,6.2321269075649974E-5,1.0000000000000087,1.3182999999999924E-7,1.0000000000000087,1.3182999999999924E-7,1.0000030530680497,2.6410369750743479E-3,62.679506440985193,-86.604196026357997,93.395803973642003,null,1000000000,17379.148900000004,null,34.862453391858196,-84.145900562345972,null,null,null,29.755253309288126,-2.458295464012024,null,0,0]
[144.54,0.14454,1.0009764391770837,4.4173415323144595E-2,1.000000000510965,3.1967640423932839E-5,1,0,12.301031022318847,1.4894125192806253,1.0001022927242991,1.4302727378069766E-2,1.0000000023344802,6.8329790107238983E-5,1.0000000000000104,1.4453999999999899E-7,1.0000000000000104,1.4453999999999899E-7,1.0000036701511441,2.8956636464399681E-3,61.884547546649642,-87.216508462332996,92.783491537667004,null,1000000000,20891.811599999997,null,34.068924005334324,-84.521480499605588,null,null,null,29.753823801476447,-2.6950279627274125,null,0,0]
[158.49,0.15849000000000002,1.0011738969431472,4.8430356815158102E-2,1.0000000006143541,3.50529357301778E-5,1,0,13.4807386356626,1.4965482150747385,1.0001229894561579,1.5682911218392805E-2,1.000000002806841,7.4924508306946125E-5,1.0000000000000124,1.5848999999999869E-7,1.0000000000000124,1.5848999999999869E-7,1.000004412771319,3.1751315918287634E-3,61.087564089628252,-87.806393196923096,92.193606803076904,null,1000000000,25119.080100000003,null,33.273660252039143,-84.851624893392028,null,null,null,29.75210409775023,-2.9547683035310777,null,0,0]
[173.78,0.17377999999999999,1.0014111537697741,5.309418618178726E-2,1.000000000738609,3.8434596319551381E-5,1,0,14.774422328633053,1.5030599991770954,1.0001478625989106,1.7195603028236691E-2,1.0000000033745329,8.2152697638042694E-5,1.0000000000000151,1.7377999999999826E-7,1.0000000000000151,1.7377999999999826E-7,1.0000053052650602,3.4814440222475994E-3,60.289777812610986,-88.377808625748514,91.622191374251486,null,1000000000,30199.488400000002,null,32.477939852448088,-85.138465928219361,null,null,null,29.750038220324029,-3.239342697529151,null,0,0]
[190.55,0.19055000000000002,1.0016964097749173,5.8206787742124122E-2,1.0000000008880408,4.2143585728857858E-5,1,0,16.19392820571931,1.50900547392424,1.0001777747845333,1.8854625531490345E-2,1.0000000040572519,9.008054164923518E-5,1.0000000000000182,1.9054999999999772E-7,1.0000000000000182,1.9054999999999772E-7,1.0000063785972158,3.8174054409398257E-3,59.490720392119258,-88.935825634718142,91.064174365281858,null,1000000000,36309.302500000005,null,31.68136561180858,-85.384515783162328,null,null,null,29.747555040471806,-3.551309851555807,null,0,0]
[208.93,0.20893,1.002039107500541,6.3806716776000041E-2,1.00000000106762,4.6208655813571955E-5,1,0,17.750260700684322,1.5144292821724812,1.0002137204394559,2.0672802553497543E-2,1.0000000048777067,9.8769496491631827E-5,1.0000000000000218,2.0892999999999696E-7,1.0000000000000218,2.0892999999999696E-7,1.0000076684679511,4.1856199513936009E-3,58.690999727567473,-89.484627452788928,90.515372547211072,null,1000000000,43651.744900000005,null,30.884627234675776,-85.591601075583597,null,null,null,29.744572753052822,-3.8930263772053362,null,0,0]
[229.09,0.22909000000000002,1.0024511021723428,6.9944349835748945E-2,1.000000001283593,5.0667405153912862E-5,1,0,19.457815031368899,1.5193804441201959,1.0002569492347113,2.2666902200405126E-2,1.0000000058644372,1.0829992790113131E-4,1.0000000000000262,2.29089999999996E-7,1.0000000000000262,2.29089999999996E-7,1.0000092197454939,4.5894929094401236E-3,57.890004422279134,-90.029145915461342,89.970854084538658,null,1000000000,52482.2281,null,30.087215925723481,-85.761574318868014,null,null,null,29.740988756716774,-4.2675715965933154,null,0,0]
[251.19,0.25119000000000002,1.0029460933319718,7.6666532211513691E-2,1.0000000015431911,5.5555220648691524E-5,1,0,21.330143658704127,1.5238971263362906,1.0003089075158031,2.4852686650794167E-2,1.0000000070504813,1.1874747421526557E-4,1.0000000000000315,2.5118999999999472E-7,1.0000000000000315,2.5118999999999472E-7,1.0000110843687036,5.0322292235996692E-3,57.088157330838285,-90.573534671133018,89.426465328866982,null,1000000000,63096.416100000002,null,29.289672895217024,-85.895723523782777,null,null,null,29.736684695782394,-4.6778111473502584,null,0,0]
[275.42,0.27542,1.0035408197832147,8.4028607236671118E-2,1.0000000018552653,6.0914124240133982E-5,1,0,23.38334361434983,1.5280177968264921,1.0003713651713262,2.7248863498963004E-2,1.0000000084762748,1.3020195595876027E-4,1.000000000000038,2.7541999999999303E-7,1.000000000000038,2.7541999999999303E-7,1.000013325905913,5.5176346550788735E-3,56.285274516560719,-91.122317640124209,88.877682359875791,null,1000000000,75856.176400000011,null,28.491958575559554,-85.995186024842468,null,null,null,29.731516201162293,-5.1271316152817503,null,0,0]
[302,0.30199999999999999,1.0042557080519883,9.2094192176392059E-2,1.0000000022306372,6.6792772913793047E-5,1,0,25.636057671809187,1.5317788700211046,1.0004464859528506,2.9877077881369417E-2,1.0000000101912618,1.4276737584267276E-4,1.0000000000000457,3.0199999999999082E-7,1.0000000000000457,3.0199999999999082E-7,1.0000160220877892,6.0501157644366433E-3,55.480825415300018,-91.680241689841182,88.319758310158818,null,1000000000,91204,null,27.693718218257338,-86.060813999168218,null,null,null,29.725307457203808,-5.6194276906729712,null,0,0]
[331.13,0.33112999999999998,1.0051140979052862,0.10091974633295878,1.000000002681712,7.3235400292361987E-5,1,0,28.105236416434803,1.5352082569600445,1.0005367491638781,3.2756959283087188E-2,1.0000000122521169,1.5653828178090583E-4,1.0000000000000548,3.3112999999998785E-7,1.0000000000000548,3.3112999999998785E-7,1.0000192620093822,6.6336781915591623E-3,54.675439719717495,-92.251248587220076,87.748751412779924,null,1000000000,109647.0769,null,26.895781772654061,-86.093087362097322,null,null,null,29.717858207224559,-6.1581612251227424,null,0,0]
[363.08,0.36307999999999996,{"$f":"SQRT(1+(A77/p_dom)^2)","v":1.0061454445984936},{"$f":"ATAN(A77/p_dom)","v":0.11058152367367746},{"$f":"SQRT(1+(A77/z_ESR)^2)","v":1.0000000032241831},{"$f":"ATAN(A77/z_ESR)","v":8.0301721766479838E-5},{"$f":"IF(VIN_nom>Vout, 1, SQRT(1+(A77/z_RHP)^2))","v":1},{"$f":"IF(VIN_nom>Vout, 0, -ATAN(A77/z_RHP))","v":0},{"$f":"SQRT(1+(A77/EA_p1)^2)","v":30.813766191186655},{"$f":"ATAN(A77/EA_p1)","v":1.5383376000620552},{"$f":"SQRT(1+(A77/EA_z1)^2)","v":1.0006452907049166},{"$f":"ATAN(A77/EA_z1)","v":3.5915007888235123E-2},{"$f":"SQRT(1+(A77/EA_hf_p)^2)","v":1.0000000147305421},{"$f":"ATAN(A77/EA_hf_p)","v":1.7164231345725918E-4},{"$f":"SQRT(1+(A77/Zero3)^2)","v":1.0000000000000659},{"$f":"ATAN(A77/Zero3)","v":3.6307999999998406E-7},{"$f":"SQRT(1+(A77/pole5)^2)","v":1.0000000000000659},{"$f":"ATAN(A77/pole5)","v":3.6307999999998406E-7},{"$f":"SQRT((1-(Z77/pterm2))^2+(A77/pterm1)^2)","v":1.0000231583896273},{"$f":"IF((ATAN((A77/pterm1)/(1-A77^2/pterm2))>0),ATAN((A77/pterm1)/(1-A77^2/pterm2)),PI()+ATAN((A77/pterm1)/(1-A77^2/pterm2)))","v":7.2737295522445943E-3},{"$f":"20*LOG10(((E77*K77*G77*O77)/(C77*I77*S77*M77*Q77))*Adc)","v":53.868289267854905},{"$f":"((F77+L77+H77+P77)-(D77+J77+T77+N77+R77))*radconv","v":-92.840315716443342},{"$f":"IF(V77>0,V77,V77+180)","v":87.159684283556658},null,{"$f":"IF(U77<0,A77,1000000000)","v":1000000000},{"$f":"A77^2","v":131827.0864},null,{"$f":"20*LOG10((K77/(I77*M77))*Aea_stability*Afb*0.8)","v":26.097573173148994},{"$f":"(L77-(J77+N77))*radconv","v":-86.092308055186564},null,null,null,{"$f":"20*LOG10((E77*G77/(C77*S77))*Am_stability)","v":29.708916354867036},{"$f":"(F77+H77-(D77+T77))*radconv","v":-6.748007661256783},null,{"$f":"SUM((U78<0)*(U77>0))*A77","v":0},{"$f":"IF(AJ77>0,W75,0)","v":0}]
[398.11,{"$f":"A78/1000","v":0.39811000000000002},1.0073839169479779,0.12115086638551009,1.0000000038763344,8.8049241044822757E-5,1,0,33.783688432082705,1.5411919191202716,1.0007757621881765,3.9376668577488762E-2,1.0000000177100687,1.8820238315174915E-4,1.0000000000000793,3.9810999999997899E-7,1.0000000000000793,3.9810999999997899E-7,1.0000278425417521,7.9754766798410572E-3,53.059450458134876,-93.451808405218713,86.548191594781287,null,1000000000,158491.57210000002,null,25.299459997948382,-86.058458765068792,null,null,null,29.698190720347625,-7.3933496401499204,null,0,0]
[436.52,0.43651999999999996,1.0088708929238832,0.1327087656839539,1.0000000046604016,9.6544308559934361E-5,1,0,37.040437857714856,1.5437955250929072,1.0009326027343737,4.3171252491103845E-2,1.0000000212922897,2.0636031272061849E-4,1.0000000000000953,4.3651999999997225E-7,1.0000000000000953,4.3651999999997225E-7,1.00003347416876,8.744927130209806E-3,52.248570096349994,-94.090429150839455,85.909570849160545,null,1000000000,190549.71039999998,null,24.501440130154748,-85.9912611282097,null,null,null,29.685330226356381,-8.0991680226297564,null,0,0]
[478.63,0.47863,1.0106554854325671,0.14533906357026133,1.0000000056029261,1.0585769810548424E-4,1,0,40.611146989339261,1.5461700565015262,1.0011211076384106,4.7329932125732325E-2,1.000000025598464,2.2626737880033389E-4,1.0000000000001146,4.7862999999996352E-7,1.0000000000001146,4.7862999999996352E-7,1.0000402438851079,9.5884883323744848E-3,51.435413144303666,-94.760807220707747,85.239192779292253,null,1000000000,229086.67689999999,null,23.703692872599404,-85.890177555586945,null,null,null,29.669920531865394,-8.8706296651207968,null,0,0]
[524.80999999999995,0.52481,1.0127972086887138,0.15913647484166624,1.0000000067362667,1.1607124187945571E-4,1,0,44.527189953683077,1.5483362505622382,1.00134772878042,5.1888666876490921E-2,1.0000000307764323,2.4809849499256157E-4,1.0000000000001377,5.2480999999995172E-7,1.0000000000001377,5.2480999999995172E-7,1.0000483840858037,1.0513568304083057E-2,50.619320566980129,-95.46792698767922,84.53207301232078,null,1000000000,275425.53609999997,null,22.906058151696222,-85.75434590239864,null,null,null,29.651462675445032,-9.7135810852806035,null,0,0]
[575.44000000000005,0.57544000000000006,1.0153658738866447,0.17419334876318648,1.000000008098697,1.2726898375878446E-4,1,0,48.820790624744291,1.5503118175012169,1.0016200905736004,5.6884204285588331E-2,1.0000000370010598,2.7203330227335048E-4,1.0000000000001656,5.7543999999993655E-7,1.0000000000001656,5.7543999999993655E-7,1.0000581696363766,1.1527774026693426E-2,49.800005990973006,-96.21643024226077,83.78356975773923,null,1000000000,331131.19360000006,null,22.108829897095443,-85.58268570345119,null,null,null,29.629376354038687,-10.633744538809573,null,0,0]
[630.96,0.63096000000000008,1.0184458058235453,0.19061300349309737,1.0000000097368553,1.3954823770461698E-4,1,0,53.529262558466733,1.5521138692578338,1.0019474747204484,6.2358951494472618E-2,1.0000000444854231,2.9827980596755852E-4,1.000000000000199,6.3095999999991628E-7,1.000000000000199,6.3095999999991628E-7,1.0000699354553559,1.263991260488493E-2,48.976706043448473,-97.011298322629173,82.988701677370827,null,1000000000,398110.52160000004,null,21.311939349038617,-85.373759568249284,null,null,null,29.602966954570991,-11.637538754379877,null,0,0]
[691.83,0.69183000000000006,1.0221360173522887,0.20849579728445033,1.0000000117061436,1.5301074103657439E-4,1,0,58.69161688490297,1.5537572939172186,1.0023408932861952,6.83569441242214E-2,1.0000000534826414,3.2705546615437625E-4,1.0000000000002394,6.9182999999988975E-7,1.0000000000002394,6.9182999999988975E-7,1.0000840793844128,1.3859189415367602E-2,48.148881387829206,-97.85714536199589,82.14285463800411,null,1000000000,478628.74890000006,null,20.515652878215477,-85.125909925542786,null,null,null,29.571428769774858,-12.731235436453112,null,0,0]
[758.58,0.75858000000000003,1.0265555520248715,0.2279513268022397,1.0000000140740095,1.6777371283739894E-4,1,0,64.35280265426853,1.5552563625928524,1.0028137341897256,7.4928664858780802E-2,1.0000000643008689,3.5861083463577519E-4,1.0000000000002878,7.5857999999985453E-7,1.0000000000002878,7.5857999999985453E-7,1.0001010857414785,1.5196208897127859E-2,47.315526978008961,-98.75879124556225,81.24120875443775,null,1000000000,575443.61640000006,null,19.719921434246643,-84.837076360732922,null,null,null,29.533805803923443,-13.921714884829331,null,0,0]
[831.76,0.83175999999999994,1.031843217166917,0.24908057699712419,1.0000000169204195,1.8395879554539897E-4,1,0,70.559466346489415,1.5566234095215266,1.0033818409683875,8.2125972563899072E-2,1.000000077305452,3.9320591793965548E-4,1.0000000000003459,8.3175999999980813E-7,1.0000000000003459,8.3175999999980813E-7,1.0001215286958332,1.6661972005467519E-2,46.475887034183984,-99.720395626361807,80.279604373638193,null,1000000000,691824.69759999996,null,18.925084161156171,-84.505009176667784,null,null,null,29.489003133188941,-15.215386449694021,null,0,0]
[912.01,0.91200999999999999,1.0381654886540677,0.27199232755904124,1.0000000203429655,2.0170753672039266E-4,1,0,77.365888710141988,1.5578703737175656,1.0040645114851323,9.0008801653895576E-2,1.0000000929422665,4.3114326907019304E-4,1.0000000000004159,9.1200999999974713E-7,1.0000000000004159,9.1200999999974713E-7,1.0001461089255195,1.8269276980044137E-2,45.62863895710894,-100.74618369772379,79.253816302276206,null,1000000000,831762.24009999994,null,18.131107007334169,-84.126975774498717,null,null,null,29.4357322099359,-16.619207923225087,null,0,0]
[1000,1,1.04571574303631,0.29678099020723603,1.000000024457669,2.2116811895382896E-4,1,0,84.828895972724425,1.5590076178746082,1.0048846276785213,9.8639010686273509E-2,1.0000001117413859,4.7273962310367674E-4,1.0000000000005,9.9999999999966665E-7,1.0000000000005,9.9999999999966665E-7,1.0001756593454241,2.0031515799994171E-2,44.77264681192829,-101.83939131826928,78.160608681730722,null,1000000000,1000000,null,17.338312628578734,-83.700043806143626,null,null,null,29.372534443510681,-18.139347512125653,null,0,0]
[1096.5,1.0965,1.0547236335520094,0.3235407590703413,1.0000000294057549,2.4251084163289714E-4,1,0,93.013796901521829,1.5600450264647421,1.0058699628001382,0.10808692962242095,1.0000001343480358,5.1835898892094211E-4,1.0000000000006013,1.0964999999995606E-6,1.0000000000006013,1.0964999999995606E-6,1.0002111937068496,2.1964073846459913E-2,43.906279019554013,-103.00284475874166,76.997155241258341,null,1000000000,1202312.25,null,16.546754005507896,-83.220770856343691,null,null,null,29.297725274207245,-19.782073902397972,null,0,0]
[1202.3,1.2022999999999999,1.0654518153709778,0.35233653148758715,1.0000000353541787,2.6591042748652486E-4,1,0,101.98759743830848,1.5609910558679656,1.0070532236780223,0.11842309771124149,1.0000001615249954,5.6837482999371846E-4,1.0000000000007228,1.2022999999994205E-6,1.0000000000007228,1.2022999999994205E-6,1.0002539102939851,2.4082724678204659E-2,43.028217095576132,-104.23762042176415,75.762379578235851,null,1000000000,1445525.2899999998,null,15.756965699107361,-82.685621236607219,null,null,null,29.209451656629895,-21.551999185156912,null,0,{"$f":"IF(AJ90>0,W90,0)","v":0}]
[1318.3,1.3183,1.0782078927873835,0.38322143508769241,1.0000000425053466,2.915659277087742E-4,1,0,111.8266342394891,1.5618537941409039,1.0084738966783933,0.12972653626891145,1.0000001941970107,6.232126108793232E-4,1.0000000000008691,1.3182999999992363E-6,1.0000000000008691,1.3182999999992363E-6,1.0003052616131438,2.6405428463030903E-2,42.136684002942573,-105.54374013418305,74.456259865816946,null,1000000000,1737914.89,null,14.969252310812655,-82.090555147853706,null,null,null,29.105631952291052,-23.45318498632934,null,0,0]
[1445.4,1.4454,1.0933358032934675,0.4161993908382543,1.0000000510965004,3.196763934586608E-4,1,0,122.6072445706414,1.562640111467686,1.0101779997802236,0.14207333712635467,1.0000002334479843,6.8329779579282565E-4,1.0000000000010445,1.4453999999989937E-6,1.0000000000010445,1.4453999999989937E-6,1.0003669498121501,2.8950124241599401E-2,41.230374148236997,-106.91850324650886,73.081496753491137,null,1000000000,2089181.1600000001,null,14.184499287281458,-81.431630859170212,null,null,null,28.984075121116668,-25.486872387338664,null,0,0]
[1584.9,1.5849000000000002,1.1112682808542567,0.45131874592564347,1.0000000614354134,3.5052934308873405E-4,1,0,134.43969434770608,1.5633579788693466,1.0122249769059211,0.15557455272031132,1.0000002806840589,7.4924494427072892E-4,1.0000000000012559,1.584899999998673E-6,1.0000000000012559,1.584899999998673E-6,1.0004411827364779,3.1742731085406636E-2,40.305777532116977,-108.36027750988916,71.639722490110842,null,1000000000,2511908.0100000002,null,13.401854065185111,-80.702977452151544,null,null,null,28.842123727092996,-27.657300057737608,null,0,0]
[1737.8,1.7378,1.1324442103039876,0.48848315785464641,1.0000000738609072,3.8434594445934143E-4,1,0,147.40880406027685,1.5640124194384171,1.0146796076185491,0.17030709310434097,1.0000003374532311,8.2152679341069494E-4,1.0000000000015099,1.7377999999982506E-6,1.0000000000015099,1.7377999999982506E-6,1.0005303900780067,3.4803124587146218E-2,39.362164261088651,-109.86057728791401,70.139422712085988,null,1000000000,3019948.84,null,12.622973102837619,-79.900503193164653,null,null,null,28.677391418412164,-29.960074094749356,null,0,0]
[1905.5,1.9055,1.1573978294414915,0.52762128131964303,1.000000088804087,4.2143583258793057E-4,1,0,161.6333229046509,1.5646094442780762,1.0176237601855003,0.18638005877499852,1.0000004057251191,9.0080517527602673E-4,1.0000000000018154,1.9054999999976938E-6,1.0000000000018154,1.9054999999976938E-6,1.0006376625278373,3.815913848104889E-2,38.396932183151172,-111.41102314342452,68.588976856575485,null,1000000000,3630930.25,null,11.847989063979682,-79.018339415233768,null,null,null,28.487143379332622,-32.392683728190768,null,0,0]
[2089.3000000000002,2.0893000000000002,1.1866917443245635,0.56855693761887816,1.0000001067619881,4.6208652557575746E-4,1,0,177.22351845685105,1.5651537048942741,1.0211506527118355,0.20388461294381963,1.0000004877705562,9.8769464694920309E-4,1.0000000000021827,2.0892999999969601E-6,1.0000000000021827,2.0892999999969601E-6,1.0007665618219144,4.183654065099339E-2,37.408950208935451,-112.99805915369259,67.001940846307406,null,1000000000,4365174.4900000012,null,11.078230902847402,-78.051564574271779,null,null,null,28.268919566249174,-34.946494579420801,null,0,0]
[2290.9,2.2909000000000002,1.2209919019610513,0.61111937510499248,1.0000001283592892,5.0667400861516059E-4,1,0,194.32358729576947,1.5656502484025772,1.0253762476443482,0.22293940276540511,1.0000005864435519,1.0829988598336437E-3,1.0000000000026241,2.2908999999959922E-6,1.0000000000026241,2.2908999999959922E-6,1.000921562682058,4.5869017551040753E-2,36.395892484666923,-114.60734776228746,65.392652237712539,null,1000000000,5248222.8100000005,null,10.314015426416017,-76.99371591331581,null,null,null,28.020077318412039,-37.61363184897165,null,0,0]
[2511.9,2.5119000000000002,1.2609863651072601,0.65502945261910706,1.0000001543191155,5.5555214990358679E-4,1,0,213.06924426133301,1.5661029996340659,1.030432455596175,0.24363990748453263,1.0000007050478896,1.1874741895834004E-3,1.0000000000031548,2.5118999999947171E-6,1.0000000000031548,2.5118999999947171E-6,1.0011078416736403,5.0288142726402675E-2,35.357143777988469,-116.21948177025754,63.780518229742455,null,1000000000,6309641.6100000003,null,9.556834994119491,-75.839591087991934,null,null,null,27.738509044030106,-40.379890682265604,null,0,0]
[2754.2,2.7542,1.3074470150322184,0.69998888098907064,1.0000001855265097,6.0914116781352935E-4,1,0,233.62165109140778,1.5665158885348862,1.036478087310247,0.26609271621096831,1.0000008476271172,1.3020188311941615E-3,1.000000000003793,2.7541999999930355E-6,1.000000000003793,2.7541999999930355E-6,1.0013317305191236,5.5131343003786179E-2,34.291891804963292,-117.81366031539065,62.186339684609351,null,1000000000,7585617.6399999987,null,8.8077991998880165,-74.583359624272148,null,null,null,27.4222928652364,-43.230300691118494,null,0,0]
[3020,3.02,1.3612320579166539,0.74567721779376117,1.0000002230637015,6.6792763080426106E-4,1,0,256.16741653698398,1.5668926197842841,1.043703562100242,0.29041032771427749,1.0000010191256747,1.4276727981412897E-3,1.0000000000045604,3.0199999999908185E-6,1.0000000000045604,3.0199999999908185E-6,1.0016009658028786,6.0441845948224972E-2,33.199518932134261,-119.36779842424168,60.632201575758316,null,1000000000,9120400,null,8.0679225364847245,-73.218847668320905,null,null,null,27.069796655810663,-46.148950755920801,null,0,0]
[3311.3,3.3113000000000001,1.4231777755416661,0.79167722186932854,1.0000002681711579,7.3235387330213865E-4,1,0,280.87618518195751,1.5672360316706511,1.0523205988395903,0.31666010055970945,1.0000012252109527,1.5653815519801977E-3,1.0000000000054823,3.311299999987898E-6,1.0000000000054823,3.311299999987898E-6,1.0019244050166785,6.6258628856994156E-2,32.081770954253237,-120.85655526118877,59.143444738811226,null,1000000000,10964707.690000001,null,7.3395182745339245,-71.742412651533897,null,null,null,26.680452939880439,-49.114142609654905,null,0,0]
[3630.8,3.6308000000000002,1.4942776076184912,0.8376381582321123,1.0000003224182754,8.0301704678593586E-4,1,0,307.97697752999625,1.5675493251352524,1.0625910695054315,0.34493981006823066,1.0000014730531324,1.7164214658418923E-3,1.0000000000065914,3.6307999999840453E-6,1.0000000000065914,3.6307999999840453E-6,1.0023132439937585,7.263431523496662E-2,30.939251403542368,-122.2574705003744,57.742529499625604,null,1000000000,13182708.640000001,null,6.6238112293711229,-70.148708991891553,null,null,null,26.253640434332372,-52.108761508482878,null,0,0]
[3981.1,3.9811000000000001,1.5755112226020695,0.88315717455766118,1.0000003876333694,8.8049218518485082E-4,1,0,337.69033212042638,1.5678350295162058,1.0748081774589231,0.37529759983384914,1.0000017710053248,1.8820216316912494E-3,1.0000000000079245,3.9810999999789672E-6,1.0000000000079245,3.9810999999789672E-6,1.0027805050451264,7.9619087940493161E-2,29.774685376258358,-123.54776164021872,56.452238359781276,null,1000000000,15849157.209999999,null,5.9230971562273371,-68.435193606825052,null,null,null,25.789788480192151,-55.112568033393671,null,0,0]
[4365.2,4.3651999999999997,1.6679471990753605,0.92787089094639608,1.0000004660400701,9.654427886422335E-4,1,0,370.27071673185765,1.5680955968411903,1.0893151617694263,0.40776866559496439,1.0000021292267269,2.0636002272504451E-3,1.0000000000095275,4.3651999999722742E-6,1.0000000000095275,4.3651999999722742E-6,1.0033420007490566,8.7270531197051748E-2,28.59104173199734,-124.7080750424759,55.291924957524103,null,1000000000,19054971.039999999,null,5.2395309828695407,-66.600071675500558,null,null,null,25.289711009288926,-58.108003366975339,null,0,0]
[4786.3,4.7862999999999998,1.7726959760471606,0.97143828847065905,1.0000005602924598,1.058576589600615E-3,1,0,405.98956387938347,1.5683332068033251,1.1065022439723398,0.44234877612761009,1.0000025598431463,2.2626699652308485E-3,1.0000000000114544,4.7862999999634508E-6,1.0000000000114544,4.7862999999634508E-6,1.0040165654524722,9.5649455906382436E-2,27.392226830468353,-125.72276941032108,54.277230589678922,null,1000000000,22908667.690000001,null,4.5755921883776969,-64.643797188464333,null,null,null,24.75483490225178,-61.078972221856752,null,0,0]
[5248.1,5.2481,1.8909834988082306,1.0135803737187661,1.0000006736264389,1.1607119027496643E-3,1,0,445.16071762582277,1.5685499452040585,1.1268218108337043,0.47900975858987727,1.0000030776385513,2.4809799104571041E-3,1.0000000000137712,5.2480999999518189E-6,1.0000000000137712,5.2480999999518189E-6,1.0048271098261845,0.1048256267777382,26.182164042985438,-126.58164384275302,53.418356157246976,null,1000000000,27542553.610000003,null,3.9336073264704892,-62.568204052309227,null,null,null,24.186756976676076,-64.013439790443798,null,0,0]
[5370.3,5.3703000000000003,1.9228023906209459,1.0238584537479445,1.0000007053619175,1.1877386100602591E-3,1,0,455.52606285732384,1.5686010609588947,1.132446303646967,0.48848663614652277,1.0000032226302029,2.5387483327787876E-3,1.00000000001442,5.3702999999483734E-6,1.00000000001442,5.3702999999483734E-6,1.00505396156307,0.10725144276340415,25.878583604150144,-126.77122846857912,53.228771531420875,null,1000000000,28840122.090000004,null,3.7769256204339885,-62.031457568544766,null,null,null,24.039858243877283,-64.739770900034372,null,0,0]
[5432.85,5.4328500000000002,1.9391660364659431,1.028988663296688,1.0000007218888587,1.2015726563821679E-3,1,0,460.83172896693054,1.5686263356203469,1.1353643472803232,0.49330097380555049,1.0000032981377538,2.5683180055937277E-3,1.000000000014758,5.432849999946548E-6,1.000000000014758,5.432849999946548E-6,1.0051720796845645,0.1084927387142499,25.725725309469926,-126.86279733035734,53.137202669642662,null,1000000000,29515859.122500002,null,3.6986947777831785,-61.758758688103697,null,null,null,23.965230791847873,-65.104038642253641,null,0,0]
[5495.4,5.4954000000000001,1.9555798644213584,1.0340328846684741,1.0000007386071805,1.2154067022441606E-3,1,0,466.137395364219,1.5686510349196003,1.1383085709421137,0.49809051752794598,1.0000033745196726,2.5978876739173604E-3,1.0000000000150997,5.4953999999446802E-6,1.0000000000150997,5.4953999999446802E-6,1.0052915517770762,0.10973376236835564,25.574544887805494,-126.95081145291967,53.049188547080334,null,1000000000,30199421.159999996,null,3.6217577476646974,-61.487447429507739,null,null,null,23.890987400301924,-65.463364023411941,null,0,0]
[5559.4,5.5593999999999992,1.9724248225883012,1.0391070119425796,1.0000007559111446,1.229561440933949E-3,1,0,471.56605511510605,1.568675731517436,1.1413479320584103,0.50296539896853998,1.0000034535772422,2.6281428054691371E-3,1.0000000000154534,5.559399999942725E-6,1.0000000000154534,5.559399999942725E-6,1.0054151943287737,0.11100326978385143,25.42156727301095,-127.03730231071658,52.962697689283416,null,1000000000,30906928.359999996,null,3.5443462593852408,-61.211285799190314,null,null,null,23.815421273786836,-65.826016511526234,null,0,0]
[5623.4,5.6233999999999993,1.9893197035238754,1.0440950788063645,1.0000007734154657,1.2437161791310355E-3,1,0,476.99471514706482,1.5686998659730682,1.1444142722569342,0.50781427164234261,1.000003533550188,2.6583979322094419E-3,1.0000000000158114,5.623399999940724E-6,1.0000000000158114,5.623399999940724E-6,1.0055402533463398,0.11227248577210276,25.270287450773942,-127.12030355660805,52.87969644339195,null,1000000000,31622627.559999995,null,3.4682291118460467,-60.936582152790649,null,null,null,23.740258599089017,-66.18372140381743,null,0,0]
[5688.9,5.6888999999999994,2.0066609339502115,1.0491129565701298,1.0000007915374995,1.258202668488539E-3,1,0,482.55060967965409,1.5687240038184156,1.1475801890912325,0.51274984011656821,1.0000036163453079,2.6893621584429769E-3,1.0000000000161817,5.6888999999386289E-6,1.0000000000161817,5.6888999999386289E-6,1.005669709547115,0.1135711439085632,25.117189993580173,-127.20175426329985,52.798245736700153,null,1000000000,32363583.209999997,null,3.3916379049483063,-60.656952025544186,null,null,null,23.663752348792997,-66.544802237755661,null,0,0]
[5754.4,5.7543999999999995,2.0240518237829201,1.0540447283571521,1.0000008098693922,1.2726891573179534E-3,1,0,488.10650448699397,1.5687475921634997,1.15077390658059,0.51765813245665349,1.0000037000992146,2.7203263795194691E-3,1.0000000000165565,5.7543999999364839E-6,1.0000000000165565,5.7543999999364839E-6,1.005800648285804,0.11486949000099596,24.965810690522119,-127.27978490518025,52.72021509481975,null,1000000000,33113119.359999996,null,3.3163419195407151,-60.378853221325741,null,null,null,23.587669031142532,-66.900931683854481,null,0,0]
[5821.4,5.8213999999999997,2.041891033737147,1.0590024019142417,1.0000008288382214,1.2875073972472429E-3,1,0,493.7896338011555,1.5687711715160289,1.1540692849413872,0.5226505987836203,1.0000037867631226,2.7519996994979788E-3,1.0000000000169442,5.8213999999342396E-6,1.0000000000169442,5.8213999999342396E-6,1.0059361188840257,0.11619724279003292,24.812711670160784,-127.35618277977831,52.643817220221692,null,1000000000,33888697.959999993,null,3.2406312343010191,-60.095971716047643,null,null,null,23.510280696020892,-67.260211063730651,null,0,0]
[5888.4,5.8883999999999999,2.0597795603460378,1.0638740818670311,1.0000008480266311,1.3023256366111102E-3,1,0,499.47276338360945,1.5687942142846936,1.1573932639381781,0.52761451198870779,1.0000038744302335,2.783673013954868E-3,1.0000000000173366,5.8883999999319428E-6,1.0000000000173366,5.8883999999319428E-6,1.0060731394935283,0.11752466182666603,24.661348899957133,-127.42923969027773,52.570760309722274,null,1000000000,34673254.559999995,null,3.1662149824769612,-59.814695439839817,null,null,null,23.433334177641303,-67.614544250437902,null,0,0]
[5957,5.9569999999999999,2.078145042883047,1.068775082850048,1.0000008679007801,1.3174977437850626E-3,1,0,505.291609761931,1.5688172702789001,1.1608259982287323,0.53266738417939696,1.0000039652303117,2.8161027002830781E-3,1.0000000000177429,5.9569999999295369E-6,1.0000000000177429,5.9569999999295369E-6,1.0062150375653984,0.1188834307988946,24.508139063273134,-127.5006996361829,52.499300363817099,null,1000000000,35485849,null,3.091332185183445,-59.528366283885177,null,null,null,23.355007138250812,-67.97233335229771,null,0,0]
[6025.6,6.0256000000000007,2.0965595668565955,1.0735901047574252,1.0000008880051221,1.3326698503524576E-3,1,0,511.11045640273892,1.5688398013012939,1.1642881949639468,0.53769033293767388,1.0000040570820785,2.8485323806879703E-3,1.0000000000181539,6.0255999999270751E-6,1.0000000000181539,6.0255999999270751E-6,1.006358559239968,0.12024184213266846,24.356686386246228,-127.56889726016161,52.431102739838394,null,1000000000,36307855.360000007,null,3.017745166028718,-59.243721535309618,null,null,null,23.277141480378635,-68.325175724851988,null,0,0]
[6095.8,6.0958000000000006,2.1154530184472646,1.0784305326243213,1.000000908816679,1.3481958246593716E-3,1,0,517.0650198457696,1.5688623328386098,1.1678613704671315,0.54279947101669868,1.0000041521649283,2.8817184322750765E-3,1.0000000000185794,6.0957999999244956E-6,1.0000000000185794,6.0957999999244956E-6,1.0065071084959465,0.12163156219899619,24.203488275905727,-127.63542920356393,52.36457079643607,null,1000000000,37158777.640000001,null,2.9437524837093179,-58.95418186878986,null,null,null,23.197936052357541,-68.681247334774127,null,0,0]
[6166,6.1660000000000004,2.1343951564055863,1.0831851554639802,1.000000929869292,1.3637217983163044E-3,1,0,523.01958354532155,1.5688843513340607,1.171464844564561,0.5478773091296677,1.0000042483490967,2.9149044775148123E-3,1.0000000000190097,6.1659999999218569E-6,1.0000000000190097,6.1659999999218569E-6,1.0066573565254022,0.1230208994653551,24.052065761883878,-127.69878690871228,52.301213091287721,null,1000000000,38019556,null,2.8710551317604374,-58.666406162728748,null,null,null,23.11921089028457,-69.032380745983531,null,0,0]
[6237.8,6.2378,2.1538180486015244,1.087961523595812,1.0000009516510968,1.3796016396385204E-3,1,0,529.10986405276151,1.5689063590145373,1.175181500918743,0.55303853174909012,1.0000043478647531,2.9488468932118198E-3,1.0000000000194551,6.2377999999190955E-6,1.0000000000194551,6.2377999999190955E-6,1.0068127855275211,0.12444150219651316,23.898995951929251,-127.76042676826425,52.239573231735747,null,1000000000,38910148.840000004,null,2.7980098451571607,-58.373895593548248,null,null,null,23.039186366933215,-69.386531174715969,null,0,0]
[6309.6,6.3096000000000005,2.1732891984172453,1.0926524113240468,1.000000973685071,1.3954814802649498E-3,1,0,535.20014481063697,1.5689278658246333,1.1789292641496187,0.55816707567334367,1.0000044485325015,2.9827893021141492E-3,1.0000000000199054,6.3095999999162696E-6,1.0000000000199054,6.3095999999162696E-6,1.0069699900380162,0.12586169564564198,23.747717713322167,-127.81898916452738,52.18101083547262,null,1000000000,39811052.160000004,null,2.7262577216524804,-58.083228677534834,null,null,null,22.959660251830812,-69.735760486992561,null,0,0]
[6383.05,6.3830499999999999,2.1932563987530358,1.097364809899845,1.0000009964863255,1.4117262468627059E-3,1,0,541.43038352427391,1.5689493662271594,1.1827950319048763,0.56337970631932233,1.0000045527057551,3.0175117174792983E-3,1.0000000000203717,6.3830499999133111E-6,1.0000000000203717,6.3830499999133111E-6,1.0071326435183776,0.12731409770999197,23.594783283202556,-127.87583506024956,52.124164939750443,null,1000000000,40743327.302500002,null,2.654163662881488,-57.787788271199624,null,null,null,22.878819880482197,-70.088046789049926,null,0,0]
[6456.5,6.4565000000000001,2.2132714246605398,1.1019920794937095,1.0000010195514728,1.427971012715374E-3,1,0,547.66062248250194,1.5689703774484762,1.186692728101908,0.56855823510211456,1.00000465808466,3.052234125568324E-3,1.0000000000208433,6.4564999999102839E-6,1.0000000000208433,6.4564999999102839E-6,1.007297153315946,0.12876606204525726,23.443656396086965,-127.92970420900133,52.070295790998671,null,1000000000,41686392.25,null,2.5833606907189748,-57.494273729265117,null,null,null,22.79849596552911,-70.435430479736198,null,0,0]
[6531.7,6.5316999999999998,2.2338115291108633,1.106643587114575,1.0000010434395628,1.444602821221363E-3,1,0,554.03930168792351,1.5689913997077496,1.1907160409103896,0.57382487698925888,1.0000047672233761,3.0877838128139383E-3,1.0000000000213316,6.5316999999071123E-6,1.0000000000213316,6.5316999999071123E-6,1.0074675049362094,0.13025216203670062,23.290767135293748,-127.98189527055476,52.018104729445241,null,1000000000,42663104.890000001,null,2.5121770577744575,-57.195758710358213,null,null,null,22.716790337680418,-70.786136560196539,null,0,0]
[6606.9,6.6068999999999996,2.2543990841566499,1.1112102353309399,1.0000010676042701,1.4612346289281481E-3,1,0,560.41798113262109,1.5690119434161731,1.194772158257025,0.57905590383931704,1.0000048776258779,3.1233334922549688E-3,1.0000000000218257,6.6068999999038662E-6,1.0000000000218257,6.6068999999038662E-6,1.0076398004844251,0.1317377931271751,23.139703666886348,-128.03121055229536,51.968789447704637,null,1000000000,43651127.609999992,null,2.4422841250629754,-56.899256863374681,null,null,null,22.6356198019845,-71.131953688920674,null,0,0]
[6683.85,6.6838500000000005,2.2755135141044507,1.1157975175962849,1.0000010926176692,1.4782534791954484E-3,1,0,566.94510083025955,1.5690324866681229,1.1989562778194511,0.58437187548607905,1.0000049919058296,3.1597104499462981E-3,1.0000000000223368,6.6838499999004689E-6,1.0000000000223368,6.6838499999004689E-6,1.0078181168623963,0.1332575060586226,22.986979675926086,-128.07881904275089,51.921180957249106,null,1000000000,44673850.822500005,null,2.3720692693056149,-56.597935411441142,null,null,null,22.553110666781599,-71.48088363130978,null,0,0]
[6760.8,6.7608000000000006,2.2966749470217347,1.12030035924925,1.0000011179207098,1.4952723286064213E-3,1,0,573.4722207617167,1.5690525622835874,1.2031740431422235,0.58965072482420944,1.0000051075090708,3.1960873992752182E-3,1.0000000000228542,6.760799999896992E-6,1.0000000000228542,6.760799999896992E-6,1.0079984666170587,0.13477671726937174,22.836096995319934,-128.12366085359929,51.87633914640071,null,1000000000,45708416.640000001,null,2.3031428536496881,-56.29871411704427,null,null,null,22.47115440183137,-71.82494673655502,null,0,0]
[6839.55,6.83955,2.318378706268001,1.1248233288215947,1.0000011441155179,1.5126892788611072E-3,1,0,580.15202209501297,1.5690726398006294,1.207524937266143,0.59501472160662217,1.0000052271865632,3.2333152626368915E-3,1.0000000000233897,6.8395499998933505E-6,1.0000000000233897,6.8395499998933505E-6,1.0081851392440633,0.13633094047200797,22.683555442466737,-128.16680941268731,51.833190587312686,null,1000000000,46779444.202500001,null,2.2339064017727637,-55.994663096183373,null,null,null,22.387849300855102,-72.172146316503969,null,0,0]
[6918.3,6.9183000000000003,2.3401290128708321,1.1292623104087933,1.0000011706136767,1.5301062281980432E-3,1,0,586.83182365684866,1.5690922602401169,1.2119103248082332,0.60034005065068541,1.0000053482499767,3.2705431170363432E-3,1.0000000000239315,6.9182999998896235E-6,1.0000000000239315,6.9182999998896235E-6,1.0083739392126512,0.13788462674463939,22.532870355121609,-128.20730436000557,51.792695639994434,null,1000000000,47862874.890000001,null,2.1659559489872473,-55.692801384407424,null,null,null,22.305114666295491,-72.514502975598134,null,0,0]
[6998.9,6.9988999999999999,2.3624371377523303,1.1337208430820966,1.0000011980484556,1.5479323366532703E-3,1,0,593.66854776969365,1.5691118843957701,1.2164340632212423,0.60575056468973476,1.0000054735925592,3.3086455211668265E-3,1.0000000000244924,6.9988999998857209E-6,1.0000000000244924,6.9988999998857209E-6,1.0085693761533403,0.13947425028553354,22.380531100530728,-128.24612469298725,51.753875307012748,null,1000000000,48984601.209999993,null,2.0977089426028908,-55.386109252864586,null,null,null,22.221022418088964,-72.860015440122652,null,0,0]
[7079.5,7.0795000000000003,2.3847913452428426,1.1380958758923287,1.0000012258010047,1.5657584441247231E-3,1,0,600.50527210595931,1.5691310617112484,1.2209931466447663,0.61112083017424235,1.0000056003869424,3.3467479156903393E-3,1.0000000000250595,7.0794999998817268E-6,1.0000000000250595,7.0794999998817268E-6,1.0087670390681476,0.14106329914047566,22.230062992154494,-128.28240837889908,51.717591621100922,null,1000000000,50119320.25,null,2.0307452319766295,-55.081697591024515,null,null,null,22.137518020338995,-73.200710787874527,null,0,0]
[7161.95,7.16195,2.4077049886631454,1.1424871842202984,1.0000012545193491,1.5839937106014751E-3,1,0,607.49891899831209,1.5691502325874314,1.2256930340358216,0.6165728608829073,1.0000057315937858,3.3857248588414781E-3,1.0000000000256468,7.1619499998775462E-6,1.0000000000256468,7.1619499998775462E-6,1.0089715407745592,0.1426882201499983,22.078039859660645,-128.31702140000579,51.682978599994215,null,1000000000,51293527.802499995,null,1.9635402272899065,-54.772650865924895,null,null,null,22.052699892531869,-73.544370534080898,null,0,0]
[7244.4,7.2443999999999997,2.4306641853926996,1.1467956168286957,1.0000012835702188,1.6022289760247912E-3,1,0,614.4925661088522,1.5691689670894478,1.2304290757512768,0.62198308058421525,1.0000058643198395,3.4247017917053793E-3,1.0000000000262408,7.2443999998732674E-6,1.0000000000262408,7.2443999998732674E-6,1.0091783690867631,0.14431252675477724,21.927899710544789,-128.34922138068714,51.65077861931286,null,1000000000,52481331.359999992,null,1.8976139438326625,-54.465974732099269,null,null,null,21.968486026873254,-73.883246648587829,null,0,0]
[7328.75,7.3287500000000003,2.4541982668802738,1.151119832720594,1.0000013136346524,1.6208844587116676E-3,1,0,621.64737692458425,1.5691876970983814,1.2353112360928811,0.62747488066424895,1.0000060016765948,3.464576908735844E-3,1.0000000000268554,7.3287499998687894E-6,1.0000000000268554,7.3287499998687894E-6,1.0093923697920402,0.14597362166516459,21.776210116504387,-128.37978640820432,51.620213591795675,null,1000000000,53710576.5625,null,1.8314594375023829,-54.154675591603592,null,null,null,21.882950939163134,-74.225110816600761,null,0,0]
[7413.1,7.4131,2.4777773667963965,1.1553618262125633,1.0000013440471132,1.6395399402703197E-3,1,0,628.80218795343535,1.5692060008693816,1.2402303592834001,0.63292327975508167,1.0000061406233844,3.5044520147487408E-3,1.0000000000274771,7.4130999998642073E-6,1.0000000000274771,7.4130999998642073E-6,1.0096088025879264,0.14763405964174028,21.626414779152455,-128.40806507099344,51.591934929006555,null,1000000000,54954051.610000007,null,1.7665787850867543,-53.845838722352731,null,null,null,21.798036254226826,-74.562226348640706,null,0,0]
[7499.45,7.4994499999999995,2.5019608477204494,1.1596215005700345,1.0000013755411792,1.6586377557163059E-3,1,0,636.12664498163963,1.5692243121343559,1.245303949001165,0.6384561089121138,1.0000062845117352,3.5452725770534371E-3,1.0000000000281208,7.4994499998594059E-6,1.0000000000281208,7.4994499998594059E-6,1.009832884838995,0.14933318002793816,21.474990921251905,-128.43476488127106,51.565235118728936,null,1000000000,56241750.302499995,null,1.7014468236868661,-53.532218966667493,null,null,null,21.711744357726165,-74.902545914603564,null,0,0]
[7585.8,7.5857999999999999,2.5261888566195636,1.1637995427118821,1.0000014073999719,1.6777355699523929E-3,1,0,643.45110221828281,1.5692422065220415,1.2504153501753621,0.64394387113792095,1.0000064300664144,3.5860931275429825E-3,1.0000000000287721,7.5857999998544936E-6,1.0000000000287721,7.5857999998544936E-6,1.010059512617181,0.15103159714455325,21.325474119358901,-128.45930547477766,51.540694525222335,null,1000000000,57544361.640000001,null,1.637584938604371,-53.221157469953781,null,null,null,21.626089440915656,-75.238148004823898,null,0,0]
[7674.15,7.67415,2.5510227874611751,1.1679921405706244,1.0000014403741602,1.6972757179358445E-3,1,0,650.94520545919272,1.5692600985763823,1.2556837929657338,0.64951232517016699,1.0000065807170322,3.6278591329574833E-3,1.0000000000294462,7.6741499998493501E-6,1.0000000000294462,7.6741499998493501E-6,1.0102940223446324,0.1527686165621038,21.174428412954573,-128.48229719143052,51.517702808569481,null,1000000000,58892578.222499996,null,1.5735258102697474,-52.90552671017074,null,null,null,21.539102862845958,-75.576770481259757,null,0,0]
[7762.5,7.7625000000000002,2.5759006947888641,1.1721038257867433,1.0000014737301663,1.7168158646231966E-3,1,0,658.43930890374349,1.569277583349741,1.2609908455475747,0.65503407802206759,1.0000067331120603,3.6696251257150644E-3,1.0000000000301283,7.7624999998440873E-6,1.0000000000301283,7.7624999998440873E-6,1.0105311933108885,0.1545048839717611,21.025299543171467,-128.50326231267076,51.496737687329244,null,1000000000,60256406.25,null,1.5107310263487905,-52.59254839471626,null,null,null,21.452768776983802,-75.91071391795451,null,0,0]
[7852.9,7.8529,2.6014000512813777,1.1762294430616682,1.0000015082553475,1.7368094032834656E-3,1,0,666.10729950223447,1.5692950665979617,1.2664604962481703,0.66063587734057561,1.0000068908487287,3.7123602086171293E-3,1.000000000030834,7.8528999998385748E-6,1.000000000030834,7.8528999998385748E-6,1.0107766200612145,0.15628065161415977,20.874654061323916,-128.52273201394794,51.477267986052055,null,1000000000,61668038.409999996,null,1.4477550867748492,-52.275039191946334,null,null,null,21.36509923471019,-76.247692822001596,null,0,0]
[7943.3,7.9432999999999998,{"$f":"SQRT(1+(A141/p_dom)^2)","v":2.6269428254412381},{"$f":"ATAN(A141/p_dom)","v":1.1802748981594482},{"$f":"SQRT(1+(A141/z_ESR)^2)","v":1.0000015431802705},{"$f":"ATAN(A141/z_ESR)","v":1.7568029405551834E-3},{"$f":"IF(VIN_nom>Vout, 1, SQRT(1+(A141/z_RHP)^2))","v":1},{"$f":"IF(VIN_nom>Vout, 0, -ATAN(A141/z_RHP))","v":0},{"$f":"SQRT(1+(A141/EA_p1)^2)","v":673.77529029969605},{"$f":"ATAN(A141/EA_p1)","v":1.5693121519052469},{"$f":"SQRT(1+(A141/EA_z1)^2)","v":1.2719695461621665},{"$f":"ATAN(A141/EA_z1)","v":0.66618932557016997},{"$f":"SQRT(1+(A141/EA_hf_p)^2)","v":1.0000070504116967},{"$f":"ATAN(A141/EA_hf_p)","v":3.755095277959464E-3},{"$f":"SQRT(1+(A141/Zero3)^2)","v":1.0000000000315481},{"$f":"ATAN(A141/Zero3)","v":7.943299999832937E-6},{"$f":"SQRT(1+(A141/pole5)^2)","v":1.0000000000315481},{"$f":"ATAN(A141/pole5)","v":7.943299999832937E-6},{"$f":"SQRT((1-(Z141/pterm2))^2+(A141/pterm1)^2)","v":1.0110248290766266},{"$f":"IF((ATAN((A141/pterm1)/(1-A141^2/pterm2))>0),ATAN((A141/pterm1)/(1-A141^2/pterm2)),PI()+ATAN((A141/pterm1)/(1-A141^2/pterm2)))","v":0.15805561513650704},{"$f":"20*LOG10(((E141*K141*G141*O141)/(C141*I141*S141*M141*Q141))*Adc)","v":20.725934362727124},{"$f":"((F141+L141+H141+P141)-(D141+J141+T141+N141+R141))*radconv","v":-128.54031020040696},{"$f":"IF(V141>0,V141,V141+180)","v":51.459689799593036},null,{"$f":"IF(U141<0,A141,1000000000)","v":1000000000},{"$f":"A141^2","v":63096014.890000001},null,{"$f":"20*LOG10((K141/(I141*M141))*Aea_stability*Afb*0.8)","v":1.386037276132267},{"$f":"(L141-(J141+N141))*radconv","v":-51.960277501396156},null,null,null,{"$f":"20*LOG10((E141*G141/(C141*S141))*Am_stability)","v":21.278097346755981},{"$f":"(F141+H141-(D141+T141))*radconv","v":-76.5800326990108},null,{"$f":"SUM((U142<0)*(U141>0))*A141","v":0},0]
[8035.8,{"$f":"A142/1000","v":8.0358000000000001},2.6531225946811219,1.1843336315225268,1.0000015793302817,1.7772609280130788E-3,1,0,681.62140940091888,1.5693292362004201,1.2776468228514988,0.67182202947822578,1.000007215571755,3.7988230725457869E-3,1.0000000000322871,8.0357999998270327E-6,1.0000000000322871,8.0357999998270327E-6,1.0112816818816288,0.15987097003425432,20.575712159167491,-128.55645262482756,51.443547375172443,null,1000000000,64574081.640000001,null,1.3241550969691616,-51.641031615939518,null,null,null,21.189757322359458,-76.915421008888032,null,0,0]
[8128.3,8.1282999999999994,2.6793452151404402,1.1883129841249507,1.0000016158988227,1.7977189139833016E-3,1,0,689.46752869656052,1.5693459316580898,1.2833642765016333,0.6774047212322335,1.0000073826439466,3.8425508526044338E-3,1.0000000000330345,8.1282999998209895E-6,1.0000000000330345,8.1282999998209895E-6,1.0115414434473806,0.1616854651199523,20.427423773631837,-128.5708408089408,51.429159191059199,null,1000000000,66069260.890000001,null,1.2635242944954281,-51.324628936257199,null,null,null,21.102099739297543,-77.246211872683588,null,0,0]
[8222.9500000000007,8.2229500000000009,2.7062203917201417,1.1923049376052495,1.0000016537505703,1.8186524083398914E-3,1,0,697.496017445912,1.5693626263613878,1.2892556532883239,0.68306573711454677,1.0000075555787529,3.8872949928789305E-3,1.0000000000338085,8.222949999814663E-6,1.0000000000338085,8.222949999814663E-6,1.011810251386754,0.16354123553687736,20.277648596300519,-128.58385917576908,51.416140824230922,null,1000000000,67616906.702500015,null,1.2027464604109448,-51.003796804512383,null,null,null,21.013102396050698,-77.580062371256687,null,0,0]
[8270.2750000000015,8.2702750000000016,2.7196739122891094,1.1942713130397136,1.0000016728407735,1.8291191549216171E-3,1,0,701.51026189223694,1.569370830415163,1.2922167294298932,0.68587684308103558,1.0000076427969258,3.9096670571904645E-3,1.0000000000341989,8.2702749998114464E-6,1.0000000000341989,8.2702749998114464E-6,1.0119457958359868,0.16446877660799994,20.203491408414926,-128.58975605228125,51.410243947718754,null,1000000000,68397448.575625017,null,1.1728260757780153,-50.844484179206752,null,null,null,20.968865592798039,-77.745271873074486,null,0,0]
[8317.6,8.3176000000000005,2.7331378452865049,1.1962183224964396,1.0000016920405297,1.8395859011025718E-3,1,0,705.52450638524056,1.5693789411112242,1.2951879703390625,0.6886750733755258,1.0000077305156114,3.932039117588328E-3,1.0000000000345912,8.3175999998081892E-6,1.0000000000345912,8.3175999998081892E-6,1.0120821002068052,0.16539608665412983,20.12981428860013,-128.59526247570503,51.404737524294973,null,1000000000,69182469.760000005,null,1.1432126665036362,-50.685903926338632,null,null,null,20.924801882257622,-77.909358549366345,null,0,0]
[8366.0499999999993,8.3660499999999995,2.7469324668680719,1.1981918358991881,1.0000017118101887,1.8503014601666142E-3,1,0,709.63417670611432,1.5693871495543004,1.2982403001832785,0.69152653090473293,1.000007820838029,3.9549429978482115E-3,1.0000000000349956,8.3660499998048175E-6,1.0000000000349956,8.3660499998048175E-6,1.0122224316962061,0.16634519994219552,20.054877764858183,-128.60050881681104,51.399491183188957,null,1000000000,69990792.602499992,null,1.1132091732674663,-50.524310049087617,null,null,null,20.879868851751841,-78.07619876772344,null,0,0]
[8414.5,8.4145000000000003,2.7607376801388273,1.2001456195340403,1.000001731694671,1.8610170188057414E-3,1,0,713.7438470742519,1.5693952634704809,1.3013031362038305,0.69436458864861028,1.0000079116850382,3.9778468739586452E-3,1.0000000000354019,8.4144999998014068E-6,1.0000000000354019,8.4144999998014068E-6,1.0123635590270181,0.16729406855300627,19.980433731905421,-128.60537304145166,51.394626958548344,null,1000000000,70803810.25,null,1.0835191048331871,-50.363478506753331,null,null,null,20.83511488723336,-78.241894534698289,null,0,0]
[8462.9500000000007,8.4629500000000011,2.7745533269970801,1.2020799531004365,1.000001751693977,1.8717325770174925E-3,1,0,717.85351748884102,1.5694032844832477,1.3043764043913431,0.69718929544223063,1.0000080030566392,4.0007507458955987E-3,1.0000000000358109,8.4629499997979572E-6,1.0000000000358109,8.4629499997979572E-6,1.0125054818735264,0.16824269120600149,19.906476897101278,-128.60986839682732,51.390131603172676,null,1000000000,71621522.702500015,null,1.0541383542130709,-50.203406594309506,null,null,null,20.79053880304933,-78.406461802517796,null,0,0]
[8511.4,8.5114000000000001,2.7883792523562252,1.2039951113388634,1.0000017718081062,1.8824481347994059E-3,1,0,721.96318794908859,1.5694112141791177,1.3074600311813971,0.70000070051450947,1.0000080949528314,4.0236546136350445E-3,1.0000000000362219,8.511399999794467E-6,1.0000000000362219,8.511399999794467E-6,1.0126481999083639,0.16919106662286915,19.833002037900908,-128.61400782145694,51.385992178543063,null,1000000000,72443929.959999993,null,1.0250628806822211,-50.04409158204637,null,null,null,20.746139417379812,-78.569916239410574,null,0,0]
[8560.9500000000007,8.5609500000000001,2.8025295516709794,1.2059341989102261,1.0000017924976663,1.8934069762117768E-3,1,0,726.16616366744142,1.5694192310747999,1.3106243059185252,0.70286222876764792,1.00000818947801,4.0470784822610245E-3,1.0000000000366449,8.5609499997908571E-6,1.0000000000366449,8.5609499997908571E-6,1.0127949803186442,0.17016071673347816,19.758352162378493,-128.61788625022501,51.382113749774987,null,1000000000,73289864.902500018,null,0.99563889210698697,-49.881939513098338,null,null,null,20.700913530432636,-78.735946737126667,null,0,0]
[8610.5,8.6105,2.8166902827667419,1.2078537963603961,1.0000018133073227,1.904365817169365E-3,1,0,730.36913943192815,1.5694271557025692,1.313799260752023,0.70570994978689927,1.0000082845518705,4.0705023464458982E-3,1.0000000000370703,8.6104999997872033E-6,1.0000000000370703,8.6104999997872033E-6,1.0129425917369199,0.17113010555696215,19.684195567212306,-128.62141881609469,51.378581183905311,null,1000000000,74140710.25,null,0.96652585774433342,-49.720573253563224,null,null,null,20.655869969629101,-78.900845562531458,null,0,0]
[8660.0499999999993,8.66005,2.8308612890957781,1.2097541821321518,1.0000018342370758,1.9153246576695386E-3,1,0,734.57211524175693,1.5694349896462028,1.316984818439946,0.70854391741009382,1.0000083801744131,4.0939262061639621E-3,1.0000000000374982,8.6600499997835071E-6,1.0000000000374982,8.6600499997835071E-6,1.01309103380768,0.17209923173331032,19.610526886407886,-128.62461840080118,51.375381599198818,null,1000000000,74996466.002499983,null,0.93771966173436083,-49.559989809502859,null,null,null,20.611007484834651,-79.064628591298316,null,0,0]
[8709.6,8.7096,2.8450424171169053,1.2116356296777886,1.0000018552869252,1.9262834977096656E-3,1,0,738.77509109615414,1.5694427344534372,1.3201809022291691,0.71136418583996963,1.0000084763456374,4.1173500613895138E-3,1.0000000000379285,8.7095999997797719E-6,1.0000000000379285,8.7095999997797719E-6,1.0132403061736224,0.17306809390501424,19.537340825940831,-128.62749757731672,51.372502422683283,null,1000000000,75857132.160000011,null,0.909216254976839,-49.400186164006421,null,null,null,20.566324831125119,-79.227311413310304,null,0,{"$f":"IF(AJ154>0,W154,0)","v":0}]
[8760.3250000000007,8.7603249999999999,2.8595701555436182,1.2135423559579672,1.0000018769603405,1.9375022088557138E-3,1,0,743.077733930921,1.5694505721636112,1.3234635999541728,0.71423719911090988,1.0000085753657626,4.1413293716700767E-3,1.0000000000383715,8.760324999775902E-6,1.0000000000383715,8.760324999775902E-6,1.0133939779854171,0.1740596562288754,19.462913743746153,-128.63012594342058,51.36987405657942,null,1000000000,76743294.105625018,null,0.88034642084456094,-49.237397609899183,null,null,null,20.520767583062721,-79.392728333521418,null,0,0]
[8811.0499999999993,8.8110499999999998,2.8741081851163619,1.2154297995506909,1.0000018987596155,1.9487209195140551E-3,1,0,747.38037681080937,1.5694583196309349,1.3267571677093353,0.71709597183349949,1.0000086749609001,4.1653086771880222E-3,1.0000000000388174,8.8110499997719848E-6,1.0000000000388174,8.8110499997719848E-6,1.013548519174063,0.17505093900776519,19.388981440907813,-128.6324442287073,51.3675557712927,null,1000000000,77634602.102499992,null,0.85178552765081639,-49.075419808303977,null,null,null,20.475396173418122,-79.557024420403295,null,0,0]
[8861.7749999999996,8.8617749999999997,2.8886563504553027,1.2172982382464062,1.0000019206847501,1.9599396296818665E-3,1,0,751.68301973504435,1.5694659784050611,1.330061524743851,0.71994056324337119,1.0000087751310496,4.1892879779157777E-3,1.0000000000392655,8.8617749997680252E-6,1.0000000000392655,8.8617749997680252E-6,1.0137039293504297,0.1760419407935134,19.315538464796688,-128.63446496125835,51.365535038741655,null,1000000000,78531056.15062499,null,0.82352944001834516,-48.914249454056048,null,null,null,20.430209284939473,-79.720215507202298,null,0,0]
[8912.5,8.9124999999999996,2.9032144991878224,1.2191479448002656,1.0000019427357445,1.9711583393563228E-3,1,0,755.98566270286869,1.5694735500003634,1.3333765908441546,0.72277103290794809,1.0000088758762109,4.2132672738257665E-3,1.0000000000397162,8.9124999997640181E-6,1.0000000000397162,8.9124999997640181E-6,1.0138602081234385,0.1770326601407452,19.242579436926398,-128.63620035978283,51.363799640217167,null,1000000000,79432656.25,null,0.79557409010362179,-48.753883220959082,null,null,null,20.385205606983906,-79.882317138823765,null,0,0]
[8964.4,8.9643999999999995,2.9181200517407451,1.2210213894564701,1.0000019654277976,1.9826369200572243E-3,1,0,760.3879726541636,1.5694812082972096,1.3367794484724425,0.72565251416123178,1.0000089795501905,4.237802024014658E-3,1.0000000000401803,8.964399999759873E-6,1.0000000000401803,8.964399999759873E-6,1.014021005556895,0.17804603479753589,19.168425737531901,-128.6376930595726,51.362306940427402,null,1000000000,80360467.359999999,null,0.7672782736074244,-48.590631031938088,null,null,null,20.339347724085602,-80.047062027634524,null,0,0]
[9016.2999999999993,9.0162999999999993,2.9330357421768656,1.2228757860963535,1.0000019882516085,1.9941155002356696E-3,1,0,764.79028264954138,1.5694887784281957,1.3401933488754847,0.72851933901106347,1.0000090838261293,4.262336769101596E-3,1.0000000000406468,9.0162999997556754E-6,1.0000000000406468,9.0162999997556754E-6,1.0141827114590984,0.17905911072711891,19.094767507611405,-128.63891197087716,51.36108802912284,null,1000000000,81293665.689999983,null,0.73928888386584513,-48.428213541154705,null,null,null,20.293678883906686,-80.210698429722441,null,0,0]
[9068.2000000000007,9.0682000000000009,2.9479614166133796,1.2247114111916335,1.0000020112071775,2.0055940798886338E-3,1,0,769.19259268824555,1.5694962619071162,1.3436182078799683,0.73137157223166782,1.0000091887040272,4.2868715090570459E-3,1.000000000041116,9.0681999997514338E-6,1.000000000041116,9.0681999997514338E-6,1.0143453254048598,0.18007188639049665,19.021599219542559,-128.63986922162374,51.360130778376259,null,1000000000,82232251.24000001,null,0.71160177444206574,-48.266627124051546,null,null,null,20.248197705261624,-80.373242097572216,null,0,0]
[9120.1,9.1201000000000008,2.9628969241662637,1.2265285361510412,1.0000020342945044,2.0170726590130915E-3,1,0,773.59490276953591,1.5695036602133074,1.3470539418997891,0.73420927888923881,1.0000092941838841,4.3114062438514697E-3,1.0000000000415881,9.120099999747143E-6,1.0000000000415881,9.120099999747143E-6,1.0145088469668777,0.18108436025178651,18.948915421869692,-128.64057663112757,51.359423368872427,null,1000000000,83176224.010000005,null,0.68421286707234708,-48.105868137368347,null,null,null,20.20290281495847,-80.534708493759226,null,0,0]
[9173.2000000000007,9.1732000000000014,2.9781877838620798,1.2283688067188852,1.0000020580520055,2.0288166382608159E-3,1,0,778.09900041047752,1.5695111429368587,1.3505802833879863,0.73709763115136173,1.0000094027255784,4.3365082503787648E-3,1.0000000000420739,9.173199999742699E-6,1.0000000000420739,9.173199999742699E-6,1.0146770882632887,0.18211992996492385,18.87504689013597,-128.64105383447983,51.358946165520166,null,1000000000,84147598.24000001,null,0.65649513092640088,-47.942244710324751,null,null,null,20.156752019370693,-80.698809124155119,null,0,0]
[9226.2999999999993,9.2262999999999984,2.9934886264176717,1.2301902707773751,1.0000020819474278,2.0405606169489059E-3,1,0,782.60309809448427,1.5695185395301154,1.3541178334600883,0.73997091599249787,1.0000095118973888,4.3616102514410652E-3,1.0000000000425624,9.2262999997382042E-6,1.0000000000425624,9.2262999997382042E-6,1.014846278720192,0.18315518051587865,18.801674206001113,-128.64129358201973,51.358706417980272,null,1000000000,85124611.689999983,null,0.62908112176629283,-47.779479647697329,null,null,null,20.110793344395944,-80.861813934322399,null,0,0]
[9279.4,9.279399999999999,3.0087992995335879,1.2319932032454375,1.0000021059807713,2.0523045950741237E-3,1,0,787.10719582081697,1.5695258514716783,1.3576665045004874,0.74282920393474206,1.000009621699316,4.3867122470067389E-3,1.0000000000430536,9.2793999997336586E-6,1.0000000000430536,9.2793999997336586E-6,1.0150164178731258,0.18419011026996096,18.728791770668867,-128.64130757587816,51.358692424121841,null,1000000000,86107264.359999999,null,0.60196668450699387,-47.617568993583468,null,null,null,20.065025346323001,-81.023738582294669,null,0,0]
[9332.5,9.3324999999999996,3.0241196538977881,1.2337778739582699,1.0000021301520363,2.0640485726332283E-3,1,0,791.61129358875314,1.569533080206496,1.361226209533213,0.74567256574613838,1.000009732131359,4.411814237044156E-3,1.0000000000435478,9.3324999997290587E-6,1.0000000000435478,9.3324999997290587E-6,1.0151875052553381,0.18522471759595072,18.656394063521361,-128.64110721108858,51.358892788911419,null,1000000000,87095556.25,null,0.57514773287112675,-47.456508776060545,null,null,null,20.019446590811359,-81.184598435028065,null,0,0]
[9386.85,9.3868500000000008,3.0398105299109393,1.2355859214524083,1.0000021550351343,2.0760690085847807E-3,1,0,796.22142006589002,1.5695403944151678,1.3648810483255327,0.74856747846873628,1.0000098458155668,4.4375071344600345E-3,1.0000000000440563,9.386849999724299E-6,1.0000000000440563,9.386849999724299E-6,1.0153636016034293,0.18628334448351014,18.58278837628734,-128.64069172095893,51.359308279041073,null,1000000000,88112952.922499999,null,0.54799925715418596,-47.292533662682352,null,null,null,19.972989379294283,-81.348158058276596,null,0,0]
[9441.2000000000007,9.4412000000000003,3.0555112410935998,1.2373753934817602,1.0000021800627235,2.0880894439363864E-3,1,0,800.83154658513229,1.5695476244128033,1.3685472643797916,0.75144690478900011,1.0000099601599062,4.4632000260172574E-3,1.0000000000445681,9.4411999997194834E-6,1.0000000000445681,9.4411999997194834E-6,1.0155406903530217,0.18734163013719304,18.509679049412377,-128.64007486408866,51.35992513591134,null,1000000000,89136257.440000013,null,0.52115189475596879,-47.129441029526106,null,null,null,19.926727414817535,-81.51063383456254,null,0,0]
[9495.5499999999993,9.4955499999999997,3.0712216366075986,1.2391465635574999,1.0000022052348039,2.100109878684571E-3,1,0,805.44167314575691,1.5695547716454041,1.3722247665050276,0.754310921277068,1.0000100751643763,4.4888929116819049E-3,1.0000000000450826,9.4955499997146084E-6,1.0000000000450826,9.4955499997146084E-6,1.0157187709962057,0.18839957281923439,18.437060409350636,-128.63926790764933,51.360732092350673,null,1000000000,90165469.80249998,null,0.49460147891158024,-46.96722657229391,null,null,null,19.880659190600177,-81.672041335355473,null,0,0]
[9549.9,9.5498999999999992,3.0869415685933146,1.2408997000839719,1.0000022305513752,2.1121303128258618E-3,1,0,810.05179974705777,1.5695618375260545,1.3759134642059812,0.75715960469694066,1.0000101908289774,4.5145857914200595E-3,1.0000000000456004,9.549899999709681E-6,1.0000000000456004,9.549899999709681E-6,1.0158978430225842,0.18945717079573995,18.364926862870398,-128.63828181344118,51.361718186558818,null,1000000000,91200590.00999999,null,0.46834391241377715,-46.805885973694302,null,null,null,19.834783210617747,-81.832395839746908,null,0,0]
[9605.5249999999996,9.6055250000000001,3.103039998854582,1.2426755653158255,1.0000022566114652,2.1244327344405408E-3,1,0,814.77007563385348,1.5695689863697062,1.3797001941975109,0.76005931901260482,1.0000103098905029,4.540881395835571E-3,1.0000000000461331,9.6055249997045784E-6,1.0000000000461331,9.6055249997045784E-6,1.0160821419168033,0.19053922029293036,18.291597673931509,-128.6370982224272,51.362901777572802,null,1000000000,92266110.52562499,null,0.44176939876857951,-46.641660807147815,null,null,null,19.788028535324052,-81.995437415279383,null,0,0]
[9661.15,9.6611499999999992,3.1191481141321105,1.2444330939565444,1.0000022828229049,2.1367351554121557E-3,1,0,819.48835156180905,1.5695760528931721,1.3834984616195225,0.76294313566930227,1.0000104296434942,4.5671769939713757E-3,1.0000000000466689,9.6611499996994166E-6,1.0000000000466689,9.6611499996994166E-6,1.0162674781639078,0.19162090505942639,18.218765002304092,-128.63574927644166,51.364250723558342,null,1000000000,93337819.32249999,null,0.41549316861679264,-46.47834179240629,null,null,null,19.741472093848426,-82.157407484035375,null,0,0]
[9716.7749999999996,9.7167750000000002,3.1352657651492204,1.2461725578560596,1.0000023091856947,2.149037575736981E-3,1,0,824.20662753021804,1.5695830385102085,1.3873081717081148,0.76581113747459351,1.000010550087951,4.5934725857911113E-3,1.000000000047208,9.7167749996941938E-6,1.000000000047208,9.7167749996941938E-6,1.0164538512086911,0.19270222324911765,18.146423104564587,-128.63424578204061,51.365754217959392,null,1000000000,94415716.40062499,null,0.38951104679094878,-46.315924265946151,null,null,null,19.695112317934761,-82.318321516094457,null,0,0]
[9772.4,9.7723999999999993,3.1513928055956333,1.2478942237418342,1.0000023356998342,2.1613399954112937E-3,1,0,828.92490353838946,1.5695899446023831,1.3911292304535299,0.76866340737099759,1.000010671223873,4.619768171258417E-3,1.0000000000477498,9.7723999996889117E-6,1.0000000000477498,9.7723999996889117E-6,1.0166412604932511,0.19378317302020856,18.07456631970485,-128.63259824295477,51.367401757045229,null,1000000000,95499801.75999999,null,0.36381892840763624,-46.154403554667049,null,null,null,19.648947651458343,-82.478194688287701,null,0,0]
[9829.2999999999993,9.8292999999999999,3.1678990647765208,1.249637210736037,1.0000023629783068,2.173924402455142E-3,1,0,833.75132883482479,1.5695969281190862,1.3950495176233189,0.77156486479653086,1.0000107958518145,4.646666480388935E-3,1.0000000000483076,9.8292999996834461E-6,1.0000000000483076,9.8292999996834461E-6,1.0168340370068507,0.19488851651953276,18.001558583012603,-128.63077454618139,51.369225453818615,null,1000000000,96615138.48999998,null,0.3378337552019941,-45.990103575181834,null,null,null,19.601925087971736,-82.640670970999551,null,0,0]
[9886.2000000000007,9.8862000000000005,3.1844148482574237,1.2513621231228136,1.0000023904151474,2.1865088088104325E-3,1,0,838.57775417145388,1.5696038312486777,1.3989814830774678,0.77445003677414803,1.0000109212032824,4.6735647827955036E-3,1.0000000000488685,9.8861999996779177E-6,1.0000000000488685,9.8861999996779177E-6,1.0170278966191582,0.19599347063271907,17.929046728309853,-128.62882142174877,51.371178578251232,null,1000000000,97736950.440000013,null,0.31214356248626662,-45.826732076903262,null,null,null,19.555103425984711,-82.802089344845513,null,0,0]
[9943.1,9.9431000000000012,3.2009400086117039,1.2530692304933166,1.0000024180103553,2.1990932144731793E-3,1,0,843.4041795475863,1.5696106553712155,1.4029250286241099,0.77731901240078149,1.0000110472782768,4.7004630784392024E-3,1.0000000000494325,9.9430999996723233E-6,1.0000000000494325,9.9430999996723233E-6,1.0172228387243203,0.19709803340252055,17.857024955103771,-128.62674917814144,51.373250821858562,null,1000000000,98865237.610000014,null,0.28674417564299792,-45.664284034022415,null,null,null,19.508481039621898,-82.962465144119022,null,0,0]
[10000,10,3.2174744013586478,1.2547587973168861,1.0000024457639309,2.2116776194393956E-3,1,0,848.23060496254811,1.5696174018353473,1.4068800568847504,0.78017188084238598,1.0000111740767974,4.7273613672811094E-3,1.00000000005,9.9999999996666679E-6,1.00000000005,9.9999999996666679E-6,1.0174188627135696,0.19820220287648796,17.785487547225998,-128.62456782490617,51.375432175093835,null,1000000000,100000000,null,0.26163149091159765,-45.502754414975989,null,null,null,19.462056316475529,-83.121813409930226,null,0,0]
[10058.25,10.058249999999999,3.2344105021089633,1.2564705516588393,1.0000024743400318,2.2245605991931942E-3,1,0,853.1715413891036,1.5696242292969649,1.4109407152753,0.78307584416386611,1.0000113046331975,4.7548978333940188E-3,1.0000000000505842,1.0058249999660807E-5,1.0000000000505842,1.0058249999660807E-5,1.0176206575884574,0.19933216025612474,17.712748713264929,-128.62223183862091,51.377768161379095,null,1000000000,101168393.0625,null,0.23621576125818117,-45.338338480632963,null,null,null,19.414733212167874,-83.283893357987921,null,0,0]
[10116.5,10.1165,3.2513559812670896,1.25816446821323,1.000002503082104,2.2374435782085656E-3,1,0,858.11247785497108,1.5696309781347311,1.4150132037847789,0.78596311617388515,1.0000114359478631,4.7824342922960072E-3,1.0000000000511717,1.011649999965488E-5,1.0000000000511717,1.011649999965488E-5,1.0178235849931971,0.20046170133053615,17.640505642476654,-128.61980180637545,51.380198193624551,null,1000000000,102343572.25,null,0.21109201726453869,-45.174874382764273,null,null,null,19.367613885373242,-83.444927423611176,null,0,0]
[10174.75,10.17475,3.268310692958023,1.2598408147891389,1.0000025319901478,2.2503265564812343E-3,1,0,863.05341435947525,1.5696376496989979,1.4190974205638975,0.78883379264126441,1.0000115680207937,4.809970743945317E-3,1.0000000000517628,1.0174749999648884E-5,1.0000000000517628,1.0174749999648884E-5,1.0180276442652221,0.20159082402072434,17.568752467492196,-128.61728754360021,51.382712456399787,null,1000000000,103525537.5625,null,0.18625607751359244,-45.012356711587721,null,null,null,19.320696650139734,-83.604930832012457,null,0,0]
[10233,10.233000000000001,3.2852744942394363,1.261499854063749,1.0000025610641632,2.2632095340069228E-3,1,0,867.99435090195652,1.5696442453093706,1.4231932646408583,0.79168796933118268,1.0000117008519889,4.8375071883001927E-3,1.0000000000523572,1.023299999964282E-5,1.0000000000523572,1.023299999964282E-5,1.0182328347388054,0.20271952625304165,17.497483407416844,-128.61469857044287,51.385301429557131,null,1000000000,104714289,null,0.16170383223028612,-44.850780055768162,null,null,null,19.273979835347681,-83.763918514674728,null,0,0]
[10292.5,10.2925,3.3026115642168845,1.2631768945420536,1.0000025909334367,2.2763689695021552E-3,1,0,873.04131616414452,1.5696509053810983,1.4273889025337243,0.79458645931625138,1.0000118373164857,4.8656345359038029E-3,1.0000000000529679,1.0292499999636554E-5,1.0000000000529679,1.0292499999636554E-5,1.0184435956200024,0.20387201332399918,17.425178855692554,-128.61198650611632,51.388013493883676,null,1000000000,105935556.25,null,0.13691340630782498,-44.686701984783134,null,null,null,19.22646570954586,-83.925284521333168,null,0,0]
[10352,10.352,3.3199578256475752,1.264836415097689,1.0000026209758814,2.2895284042089852E-3,1,0,878.08828146461258,1.5696574888929824,1.431596461920789,0.79746793567253893,1.0000119745721394,4.8937618758084838E-3,1.000000000053582,1.0351999999630213E-5,1.000000000053582,1.0351999999630213E-5,1.0186555353589457,0.20502405734158533,17.353367496075457,-128.60921566124654,51.390784338753463,null,1000000000,107163904,null,0.11241053540498681,-44.523594335925551,null,null,null,19.179157220831598,-84.085621325321,null,0,0]
[10411.5,10.4115,3.3373131352090137,1.2664786798490031,1.0000026511914972,2.3026878381228553E-3,1,0,883.13524680270416,1.569663997157601,1.4358158379967039,0.8003325003321704,1.0000121126189494,4.9218892079697322E-3,1.0000000000541998,1.0411499999623801E-5,1.0000000000541998,1.0411499999623801E-5,1.0188686532359812,0.20617565611318847,17.282043437402596,-128.60639527799523,51.393604722004767,null,1000000000,108399332.25,null,8.8191061568334825E-2,-44.361451344117455,null,null,null,19.132052635995393,-84.244943933877721,null,0,0]
[10471,10.471,3.3546773524706102,1.2681039478225171,1.0000026815802843,2.315847271239208E-3,1,0,888.18221217777818,1.5696704314576984,1.4400469268918286,0.80318025514450342,1.0000122514569156,4.9500165323430462E-3,1.000000000054821,1.0470999999617314E-5,1.000000000054821,1.0470999999617314E-5,1.0190829485280617,0.20732680745210774,17.21120087633253,-128.60353431015517,51.396465689844831,null,1000000000,109641841,null,6.425089862353589E-2,-44.200267247313818,null,null,null,19.085150237870121,-84.403267062841323,null,0,0]
[10532,10.532,3.372488426446107,1.2697528099475439,1.0000027129149498,2.3293384539375584E-3,1,0,893.35641201180874,1.5696769524943515,1.4443967336001102,0.80608245775439558,1.0000123946163237,4.9788529407959531E-3,1.0000000000554614,1.0531999999610587E-5,1.0000000000554614,1.0531999999610587E-5,1.0193038677752693,0.20850651263551379,17.139066242488788,-128.60056816270466,51.399431837295339,null,1000000000,110923024,null,3.9992960403312176E-2,-44.036009118666392,null,null,null,19.037273542246606,-84.564559044038248,null,0,0]
[10593,10.593,3.390308573009075,1.2713843429648637,1.0000027444316277,2.342829635787972E-3,1,0,898.53061188339086,1.5696833984280614,1.4487586330304139,0.80896720872944561,1.0000125386072805,5.0076893409685781E-3,1.0000000000561058,1.059299999960378E-5,1.0000000000561058,1.059299999960378E-5,1.0195260230013155,0.20968574290675965,17.067425613017601,-128.59757752157188,51.402422478428122,null,1000000000,112211649,null,1.6020120717203372E-2,-43.872746591486056,null,null,null,18.989605752461522,-84.724830930085844,null,0,0]
[10654,10.654,3.4081376498458642,1.27299881008233,1.0000027761303183,2.3563208167855379E-3,1,0,903.70481179187948,1.5696897705488422,1.4531325162857847,0.81183461742730223,1.0000126834297851,5.0365257328129692E-3,1.0000000000567537,1.0653999999596897E-5,1.0000000000567537,1.0653999999596897E-5,1.019749413416049,0.21086449592904852,16.996273012073438,-128.59457114174563,51.405428858254368,null,1000000000,113507716,null,-7.6717981198913413E-3,-43.710473473950699,null,null,null,18.942145070354456,-84.884097667794919,null,0,0]
[10715,10.715,3.4259755175346953,1.2745964693860585,1.000002808011021,2.3698119969253455E-3,1,0,908.87901173664432,1.5696960701173328,1.4575182754790341,0.81468479303546837,1.0000128290838375,5.0653621162811708E-3,1.0000000000574056,1.0714999999589933E-5,1.0000000000574056,1.0714999999589933E-5,1.019974038225623,0.21204276937220801,16.925602554233858,-128.59155749320576,51.408442506794245,null,1000000000,114811225,null,-3.1086900841124449E-2,-43.549183582303776,null,null,null,18.894889715236111,-85.042373910901972,null,0,0]
[10777.5,10.7775,3.444260996252229,1.2762162471533629,1.0000028408644568,2.3836349265016674E-3,1,0,914.18044614326141,1.5697024506311192,1.4620240870244079,0.81758729496018767,1.0000129791820178,5.0949075824083092E-3,1.0000000000580771,1.0777499999582714E-5,1.0000000000580771,1.0777499999582714E-5,1.0202054660611006,0.21324951690933408,16.853688310227689,-128.58847076501667,51.411529234983334,null,1000000000,116154506.25,null,-5.4794891651961171E-2,-43.384940878824999,null,null,null,18.846683462040772,-85.203529886191674,null,0,0]
[10840,10.84,3.4625554161512251,1.2778189128891215,1.0000028739089664,2.3974578551670895E-3,1,0,919.48188058666653,1.5697087575689577,1.466542139672173,0.82047193728486267,1.0000131301531436,5.124453039640332E-3,1.0000000000587528,1.0839999999575412E-5,1.0000000000587528,1.0839999999575412E-5,1.0204381880467071,0.21445575606039147,16.782267988239266,-128.58539352492267,51.414606475077335,null,1000000000,117505600,null,-7.8220780865155881E-2,-43.221717238952778,null,null,null,18.79868902926555,-85.363676285969859,null,0,0]
[10902.5,10.9025,3.4808586362546365,1.2794047282327212,1.00000290714455,2.411280782916329E-3,1,0,924.78331506622715,1.5697149921961975,1.471072320635332,0.82333883677731801,1.0000132819972147,5.153998487925659E-3,1.0000000000594322,1.0902499999568026E-5,1.0000000000594322,1.0902499999568026E-5,1.0206722033166014,0.21566148434083959,16.711335542940311,-128.58233400359558,51.417665996404423,null,1000000000,118864506.25,null,-0.10136875500963419,-43.059506044879782,null,null,null,18.750904558111074,-85.522827958715766,null,0,0]
[10965,10.965,3.499170518467956,1.2809739496896648,1.0000029405712072,2.4251037097441043E-3,1,0,930.08474958132456,1.569721155749338,1.4756145182110103,0.82618810994005765,1.0000134347142307,5.1835439272127143E-3,1.0000000000601155,1.0964999999560553E-5,1.0000000000601155,1.0964999999560553E-5,1.0209075110009307,0.21686669927354113,16.640885021780971,-128.57930015153042,51.420699848469582,null,1000000000,120231225,null,-0.12424292669027164,-42.898300692347476,null,null,null,18.703328208632371,-85.680999459182942,null,0,0]
[11028.75,11.02875,3.517857421747232,1.2825577213428216,1.000002974863242,2.4392030941536636E-3,1,0,935.49221282270776,1.569727370606125,1.4802598245310443,0.82907633044681206,1.0000135913848942,5.213680265961999E-3,1.0000000000608167,1.1028749999552846E-5,1.0000000000608167,1.1028749999552846E-5,1.0211488553780375,0.21809548709283114,16.569515890217367,-128.57624002845156,51.423759971548435,null,1000000000,121633326.5625,null,-0.14729670011767676,-42.73490061690508,null,null,null,18.655012850496167,-85.8413394115465,null,0,0]
[11092.5,11.092499999999999,3.5365530557199425,1.2841247519912176,1.0000030093540702,2.4533024775934297E-3,1,0,940.89967609980852,1.5697335140278574,1.4849174015912983,0.83194645644370802,1.0000137489637688,5.2438165952410831E-3,1.0000000000615219,1.1092499999545046E-5,1.0000000000615219,1.1092499999545046E-5,1.0213915425423565,0.2193237356427819,16.498635930343678,-128.57322246423109,51.426777535768906,null,1000000000,123043556.25,null,-0.17007402420307846,-42.57253318704138,null,null,null,18.606910214707884,-86.000689277189721,null,0,0]
[11156.25,11.15625,3.5552572826527244,1.2856752981011279,1.0000030440436913,2.4674018600577977E-3,1,0,946.30713941201464,1.5697395872391349,1.4895871342889067,0.83479861059698324,1.0000139074508538,5.2739529149952325E-3,1.0000000000622311,1.1156249999537158E-5,1.0000000000622311,1.1156249999537158E-5,1.0216355715579974,0.22055144231860416,16.428239113020012,-128.57025504596459,51.429744954035414,null,1000000000,124461914.0625,null,-0.19257903537434928,-42.411191444659899,null,null,null,18.559018408555492,-86.15906360130468,null,0,0]
[11220,11.22,3.5739699676328578,1.2872096110883473,1.0000030789321057,2.4815012415411613E-3,1,0,951.71460275872755,1.5697455914367244,1.4942689086612995,0.83763291521111549,1.000014066846149,5.3040892251697107E-3,1.0000000000629443,1.1219999999529176E-5,1.0000000000629443,1.1219999999529176E-5,1.0218809414847962,0.22177860452363168,16.358319502523223,-128.56734509097444,51.432654909025558,null,1000000000,125888400,null,-0.21481579651268598,-42.250868450796808,null,null,null,18.511335559197036,-86.31647664017764,null,0,0]
[11285.5,11.285500000000001,3.593205004773945,1.2887693938508091,1.0000031149852948,2.4959876638415059E-3,1,0,957.27050631106829,1.5697516898032782,1.4990916257891294,0.84052656117136015,1.0000142315629501,5.3350527965686139E-3,1.0000000000636813,1.1285499999520885E-5,1.0000000000636813,1.1285499999520885E-5,1.0221344426943213,0.22303888371827374,16.286971424621949,-128.56442251991868,51.435577480081321,null,1000000000,127362510.25,null,-0.23738777607757683,-42.087198242307949,null,null,null,18.462559460860653,-86.47722427761073,null,0,0]
[11351,11.351000000000001,3.6124486907950484,1.2903125622604743,1.0000031512483412,2.5104740850942502E-3,1,0,962.82640989859942,1.5697577177896762,1.5039268145269373,0.84340162468645286,1.0000143972385074,5.3660163577375361E-3,1.0000000000644227,1.1350999999512492E-5,1.0000000000644227,1.1350999999512492E-5,1.0223893574180947,0.22429858260817329,16.216114704384029,-128.56157543022405,51.438424569775947,null,1000000000,128845201,null,-0.25968503976987889,-41.924588696428529,null,null,null,18.414000004315032,-86.636986733795538,null,0,0]
[11416.5,11.416499999999999,3.6317008882099047,1.291839373134247,1.0000031877212445,2.5249605052933143E-3,1,0,968.38231352071466,1.5697636766072944,1.5087743549709376,0.84625823710760095,1.0000145638728202,5.3969799086171118E-3,1.0000000000651683,1.1416499999504004E-5,1.0000000000651683,1.1416499999504004E-5,1.0226456846224028,0.22555769840386991,16.14574320079835,-128.5588109201249,51.441189079875102,null,1000000000,130336472.25,null,-0.28171176179083007,-41.763032356692037,null,null,null,18.365655222750309,-86.795778563432847,null,0,0]
[11482,11.481999999999999,3.6509614623720381,1.2933500781783638,1.0000032244040049,2.539446924432618E-3,1,0,973.93821717682272,1.5697695674398684,1.5136341284490049,0.84909652931007229,1.000014731465888,5.4279434491479733E-3,1.0000000000659182,1.1481999999495419E-5,1.0000000000659182,1.1481999999495419E-5,1.0229034232688492,0.22681622832507534,16.075850869593268,-128.5561358212469,51.443864178753103,null,1000000000,131836324,null,-0.30347204105200648,-41.602521792317638,null,null,null,18.3175231708064,-86.953614028929294,null,0,0]
[11548.75,11.54875,3.6705980862815264,1.2948732990800151,1.0000032620027206,2.5542098008558582E-3,1,0,979.60014956303087,1.5697755019469966,1.5185991095429925,0.85197027439535211,1.0000149032436714,5.459497886232568E-3,1.0000000000666867,1.1548749999486568E-5,1.0000000000666867,1.1548749999486568E-5,1.0231675316148356,0.22809817037146776,16.005111532512437,-128.55350846199957,51.44649153800043,null,1000000000,133373626.5625,null,-0.32537764151337184,-41.44001628563074,null,null,null,18.268689434186939,-87.113492176368823,null,0,0]
[11615.5,11.615500000000001,3.6902431360714916,1.2963803056809375,1.0000032998193795,2.5689726761657541E-3,1,0,985.26208198334234,1.5697813682473423,1.5235765500543028,0.85482526619704513,1.0000150760171518,5.4910523124452049E-3,1.0000000000674598,1.1615499999477612E-5,1.0000000000674598,1.1615499999477612E-5,1.0234331035966922,0.22937949816762074,15.934857456258506,-128.55098747328819,51.449012526711812,null,1000000000,134919840.25,null,-0.34701489567890853,-41.27858135436292,null,null,null,18.220072612098541,-87.272406118925261,null,0,0]
[11682.25,11.68225,{"$f":"SQRT(1+(A205/p_dom)^2)","v":3.709896477889004},{"$f":"ATAN(A205/p_dom)","v":1.297871348769122},{"$f":"SQRT(1+(A205/z_ESR)^2)","v":1.0000033378539814},{"$f":"ATAN(A205/z_ESR)","v":2.5837355503558709E-3},{"$f":"IF(VIN_nom>Vout, 1, SQRT(1+(A205/z_RHP)^2))","v":1},{"$f":"IF(VIN_nom>Vout, 0, -ATAN(A205/z_RHP))","v":0},{"$f":"SQRT(1+(A205/EA_p1)^2)","v":990.92401443717279},{"$f":"ATAN(A205/EA_p1)","v":1.5697871675100632},{"$f":"SQRT(1+(A205/EA_z1)^2)","v":1.5285663282688731},{"$f":"ATAN(A205/EA_z1)","v":0.85766164159735425},{"$f":"SQRT(1+(A205/EA_hf_p)^2)","v":1.0000152497863286},{"$f":"ATAN(A205/EA_hf_p)","v":5.5226067277230548E-3},{"$f":"SQRT(1+(A205/Zero3)^2)","v":1.0000000000682374},{"$f":"ATAN(A205/Zero3)","v":1.1682249999468554E-5},{"$f":"SQRT(1+(A205/pole5)^2)","v":1.0000000000682374},{"$f":"ATAN(A205/pole5)","v":1.1682249999468554E-5},{"$f":"SQRT((1-(Z205/pterm2))^2+(A205/pterm1)^2)","v":1.0237001381005502},{"$f":"IF((ATAN((A205/pterm1)/(1-A205^2/pterm2))>0),ATAN((A205/pterm1)/(1-A205^2/pterm2)),PI()+ATAN((A205/pterm1)/(1-A205^2/pterm2)))","v":0.23066020880060137},{"$f":"20*LOG10(((E205*K205*G205*O205)/(C205*I205*S205*M205*Q205))*Adc)","v":15.865082542663071},{"$f":"((F205+L205+H205+P205)-(D205+J205+T205+N205+R205))*radconv","v":-128.54857928151949},{"$f":"IF(V205>0,V205,V205+180)","v":51.451420718480506},null,{"$f":"IF(U205<0,A205,1000000000)","v":1000000000},{"$f":"A205^2","v":136474965.0625},null,{"$f":"20*LOG10((K205/(I205*M205))*Aea_stability*Afb*0.8)","v":-0.36838791038730528},{"$f":"(L205-(J205+N205))*radconv","v":-41.118209222725845},null,null,null,{"$f":"20*LOG10((E205*G205/(C205*S205))*Am_stability)","v":18.171670713211501},{"$f":"(F205+H205-(D205+T205))*radconv","v":-87.430370058793613},null,{"$f":"SUM((U206<0)*(U205>0))*A205","v":0},0]
[11749,{"$f":"A206/1000","v":11.749000000000001},3.7295579806466401,1.2993466741314181,1.0000033761065266,2.5984984234197744E-3,1,0,996.5859469239507,1.5697929008777469,1.5335683237569846,0.86047953689739265,1.0000154245512016,5.5541611320032852E-3,1.0000000000690195,1.1748999999459394E-5,1.0000000000690195,1.1748999999459394E-5,1.0239686340075791,0.23194029936749569,15.795780790417925,-128.54629005890158,51.453709941098424,null,1000000000,138039001,null,-0.3895007179269267,-40.958892146702837,null,null,null,18.123481768505979,-87.587397912198739,null,0,0]
[11817.5,11.817500000000001,3.7497433035615506,1.3008445898137706,1.0000034155885364,2.6136483369219462E-3,1,0,1002.3963196219537,1.5697987172204242,1.5387140346730219,0.86335223872235289,1.000015604933119,5.5865427938098077E-3,1.0000000000698268,1.1817499999449883E-5,1.0000000000698268,1.1817499999449883E-5,1.0242456873308738,0.23325330266359351,15.725147876177443,-128.54407072088682,51.455929279113178,null,1000000000,139653306.25,null,-0.41090066716276274,-40.79648704059025,null,null,null,18.074248803501337,-87.747583680296543,null,0,0]
[11886,11.885999999999999,3.7699369498607798,1.3023264616374219,1.0000034553000667,2.6287982492243472E-3,1,0,1008.2066923534767,1.5698044665230408,1.5438723589908101,0.8662057676530901,1.0000157863636248,5.6189244439004277E-3,1.0000000000706386,1.188599999944026E-5,1.0000000000706386,1.188599999944026E-5,1.0245242772863359,0.23456564679271469,15.655000758004308,-128.54198905420068,51.458010945799316,null,1000000000,141276996,null,-0.4320349566239664,-40.635176618615148,null,null,null,18.025235974789403,-87.90681243558555,null,0,0]
[11954.5,11.954499999999999,3.7901387865047598,1.3037925395879546,1.0000034952411176,2.643948160320023E-3,1,0,1014.0170651179434,1.5698101499380264,1.5490431707022134,0.86904026898779396,1.0000159688427177,5.6513060822072419E-3,1.0000000000714551,1.1954499999430528E-5,1.0000000000714551,1.1954499999430528E-5,1.024804402648658,0.23587732865070096,15.585333256527232,-128.54005094515978,51.459949054840223,null,1000000000,142910070.25,null,-0.45290770954679088,-40.474952621829921,null,null,null,17.976441226235149,-88.065098323329849,null,0,0]
[12023,12.023,3.8103486832219451,1.3052430686221219,1.0000035354116894,2.6590980702020186E-3,1,0,1019.8274379147911,1.5698157685915464,1.5542263451729548,0.87185588731645458,1.0000161523703976,5.6836877086623491E-3,1.0000000000722764,1.2022999999420682E-5,1.0000000000722764,1.2022999999420682E-5,1.0250860621871298,0.23718834514464213,15.516139292003512,-128.53826203166628,51.461737968333722,null,1000000000,144552529,null,-0.47352297330543852,-40.31580683035903,null,null,null,17.927862525470076,-88.222455201307255,null,0,0]
[12093,12.093,3.8310093264329184,1.3067095474658341,1.0000035766990232,2.6745797286743724E-3,1,0,1025.7650451853251,1.5698214445223011,1.5595356633402007,0.87471380345117866,1.0000163410002123,5.7167784095136518E-3,1.0000000000731202,1.2092999999410503E-5,1.0000000000731202,1.2092999999410503E-5,1.025375473103012,0.23852737944360519,15.445913111328046,-128.53659369207276,51.463406307927244,null,1000000000,146240649,null,-0.49432779175965158,-40.154281461829392,null,null,null,17.878441163248823,-88.382312230243357,null,0,0]
[12163,12.163,3.8516781200627452,1.3081602906261349,1.0000036182260394,2.6900613858646272E-3,1,0,1031.7026524885248,1.5698270551213489,1.5648576328077566,0.87755230349992353,1.0000165307250386,5.7498690978451412E-3,1.0000000000739693,1.2162999999400208E-5,1.0000000000739693,1.2162999999400208E-5,1.0256664835052112,0.23986571242508622,15.376168906882357,-128.53509229760672,51.464907702393276,null,1000000000,147938569,null,-0.51487203097393608,-39.993864809133896,null,null,null,17.829241198017421,-88.541227488472813,null,0,0]
[12233,12.233000000000001,3.8723549336022209,1.3095955440136109,1.0000036599927382,2.7055430417653619E-3,1,0,1037.6402598238296,1.5698326015102164,1.5701921249356363,0.88037153937921375,1.0000167215448765,5.782959773584357E-3,1.0000000000748233,1.2232999999389792E-5,1.0000000000748233,1.2232999999389792E-5,1.0259590920630675,0.24120334082513048,15.306900501108728,-128.53376311097534,51.466236889024657,null,1000000000,149646289,null,-0.53515977495467126,-39.834548232351402,null,null,null,17.780260536224528,-88.699214878623948,null,0,0]
[12303,12.303000000000001,3.8930396392646878,1.3110155485708255,1.0000037019991197,2.7210246963691553E-3,1,0,1043.5778671906917,1.5698380847849065,1.5755390125254083,0.88317166217550636,1.000016913459725,5.8160504366588373E-3,1.0000000000756819,1.2302999999379258E-5,1.0000000000756819,1.2302999999379258E-5,1.0262532974401442,0.24254026139219376,15.238101817102628,-128.53261115704723,51.467388842952772,null,1000000000,151363809,null,-0.55519503186010688,-39.676323137657775,null,null,null,17.731497109123858,-88.856288019389453,null,0,0]
[12374.5,12.374499999999999,3.9141756061376891,1.3124504847782892,1.0000037451530794,2.7368380993678162E-3,1,0,1049.642709033151,1.5698436215146441,1.5810131422489133,0.88601221199352098,1.0000171106174929,5.8498501722205627E-3,1.0000000000765641,1.2374499999368371E-5,1.0000000000765641,1.2374499999368371E-5,1.0265554543347633,0.24390509614208322,15.168307588158701,-128.53162247262793,51.46837752737207,null,1000000000,153128250.25,null,-0.57540304489485239,-39.515825434848104,null,null,null,17.681910893214681,-89.015797037779805,null,0,0]
[12446,12.446,3.9353195458806924,1.3138700044461009,1.000003788557104,2.7526515009977061E-3,1,0,1055.7075509074182,1.5698490946294339,1.5864999406371809,0.88883313675865661,1.0000173089177018,5.8836498944161457E-3,1.0000000000774514,1.244599999935736E-5,1.0000000000774514,1.244599999935736E-5,1.0268592743801099,0.24526918558053423,15.098990924394526,-128.53082856949948,51.469171430500523,null,1000000000,154902916,null,-0.59535585220252552,-39.356448519108547,null,null,null,17.632547036758183,-89.174380050390909,null,0,0]
[12517.5,12.5175,3.9564713306692814,1.3152743490633432,1.0000038322111928,2.7684649012509163E-3,1,0,1061.7723928129476,1.5698545052193811,1.5919992767032041,0.89163459471839535,1.0000175083603515,5.9174496031683651E-3,1.000000000078344,1.2517499999346219E-5,1.000000000078344,1.2517499999346219E-5,1.0271647561335007,0.24663252628279422,15.030145662756301,-128.53023408328485,51.469765916715147,null,1000000000,156687806.25,null,-0.61505749054177961,-39.198183385980272,null,null,null,17.583403413459209,-89.332050697304609,null,0,0]
[12589,12.589,3.9776308353510323,1.3166637552228659,1.0000038761153465,2.784278300119538E-3,1,0,1067.8372347492068,1.5698598543498257,1.5975110209663725,0.89441674316596542,1.0000177089454407,5.9512492984000031E-3,1.0000000000792415,1.2588999999334951E-5,1.0000000000792415,1.2588999999334951E-5,1.0274718981460915,0.24799511483777159,14.961765741599955,-128.52984342311217,51.470156576887831,null,1000000000,158482921,null,-0.63451192102164333,-39.04102108426018,null,null,null,17.534477922782724,-89.488822338851975,null,0,{"$f":"IF(AJ218>0,W218,0)","v":0}]
[12662.25,12.66225,3.9993161075305905,1.3180719187831396,1.0000039213533973,2.8004787387751065E-3,1,0,1074.05051690404,1.569865271757225,1.6031704017199271,0.89724712537509321,1.0000179156246796,5.985876244797802E-3,1.0000000000801663,1.2662249999323277E-5,1.0000000000801663,1.2662249999323277E-5,1.0277882778094183,0.24939026992411156,14.89218851737326,-128.529658950906,51.470341049094003,null,1000000000,160332575.0625,null,-0.65419021456508464,-38.88114650155147,null,null,null,17.484578992099472,-89.648512449354513,null,0,0]
[12735.5,12.7355,4.0210092245068241,1.3194648911555236,1.0000039668539034,2.8166791759606765E-3,1,0,1080.2637990900321,1.5698706268467335,1.6088425351578854,0.90005757238222839,1.0000181235029648,6.0205031768409993E-3,1.0000000000810965,1.2735499999311464E-5,1.0000000000810965,1.2735499999311464E-5,1.0281063968997874,0.25078462839046212,14.823087129487488,-128.52969707643251,51.470302923567488,null,1000000000,162192960.25,null,-0.67361723122752848,-38.722410550407382,null,null,null,17.434904620876143,-89.807286526025095,null,0,0]
[12808.75,12.80875,4.0427100599945778,1.320842911524305,1.0000040126168648,2.8328796116677438E-3,1,0,1086.4770813066486,1.5698759206874906,1.6145272868726255,0.90284825013101855,1.0000183325802956,6.0551300944465675E-3,1.0000000000820322,1.2808749999299514E-5,1.0000000000820322,1.2808749999299514E-5,1.0284262538394462,0.25217818661393432,14.754455378675228,-128.52996184974782,51.470038150252179,null,1000000000,164064076.5625,null,-0.69279699376047432,-38.56480378420968,null,null,null,17.385452632596831,-89.965158065538148,null,0,0]
[12882,12.882,4.0644184903612972,1.3222062141936315,1.0000040586422811,2.8490800458878061E-3,1,0,1092.6903635533672,1.5698811543243185,1.6202245240459485,0.9056193234705151,1.0000185428566712,6.0897569975314793E-3,1.000000000082973,1.2881999999287428E-5,1.000000000082973,1.2881999999287428E-5,1.0287478470440015,0.25357094098684879,14.686287168961542,-128.53045710349076,51.469542896509239,null,1000000000,165945924,null,-0.71173344861698773,-38.408316817662623,null,null,null,17.336220877739656,-90.122140285828152,null,0,0]
[12957.25,12.95725,4.0867274239593954,1.3235916553593907,1.0000041061976661,2.8657228112254213E-3,1,0,1099.0732917625464,1.5698864692399288,1.6260901807421915,0.90844581494448007,1.0000187601229802,6.1253293298612031E-3,1.0000000000839453,1.2957249999274867E-5,1.0000000000839453,1.2957249999274867E-5,1.0290800273004226,0.25500088193567855,14.616734111154404,-128.53120969061587,51.468790309384133,null,1000000000,167890327.5625,null,-0.73093764460442978,-38.248713451935203,null,null,null,17.28587201591996,-90.282496238680679,null,0,0]
[13032.5,13.032500000000001,4.1090441166298639,1.324962050150168,1.000004154030034,2.8823655749755277E-3,1,0,1105.4562200024138,1.5698917227786628,1.631968734915995,0.91125196595564728,1.0000189786547029,6.1609016466888681E-3,1.0000000000849232,1.3032499999262159E-5,1.0000000000849232,1.3032499999262159E-5,1.0294140365179991,0.25642996686920083,14.547657536646611,-128.53221304313195,51.467786956868053,null,1000000000,169846056.25,null,-0.74989326839573467,-38.090271991356602,null,null,null,17.235751065203473,-90.441941051775359,null,0,0]
[13107.75,13.107749999999999,4.1313684426345825,1.3263176372911378,1.0000042021393842,2.8990083371289053E-3,1,0,1111.8391482724414,1.5698969159975911,1.6378600476937399,0.91403795156266121,1.000019198451839,6.1964739479244604E-3,1.0000000000859064,1.3107749999249305E-5,1.0000000000859064,1.3107749999249305E-5,1.0297498729573373,0.25785819192648635,14.479051163686112,-128.53347064820863,51.466529351791365,null,1000000000,171813110.0625,null,-0.76860435800330174,-37.932982466365836,null,null,null,17.185855781850542,-90.600488181842778,null,0,0]
[13183,13.183,4.1537002788960358,1.3276586505939025,1.0000042505257174,2.9156510976763353E-3,1,0,1118.2220765721127,1.5699020499296481,1.6437639818934633,0.91680394556943323,1.0000194195143874,6.2320462334779633E-3,1.0000000000868958,1.3182999999236302E-5,1.0000000000868958,1.3182999999236302E-5,1.0300875348718157,0.25928555326371755,14.410908816766426,-128.53498578297686,51.465014217023139,null,1000000000,173791489,null,-0.7870748737148624,-37.776834977909914,null,null,null,17.136183950642412,-90.758150805066919,null,0,0]
[13259.75,13.25975,4.1764848794239109,1.3290116200199953,1.0000043001618817,2.9326256059396026E-3,1,0,1124.7322393529519,1.5699072261745346,1.6497984632958069,0.91960466125178475,1.0000196462869975,6.2683275848880787E-3,1.0000000000879106,1.3259749999222886E-5,1.0000000000879106,1.3259749999222886E-5,1.0304338061900664,0.26074047330129407,14.341879848265908,-128.53679958798531,51.463200412014686,null,1000000000,175820970.0625,null,-0.80566978493252028,-37.618741134810968,null,null,null,17.085749893359555,-90.918058453174353,null,0,0]
[13336.5,13.336499999999999,4.1992770421460861,1.3303499050126455,1.0000043500861813,2.949600112512888E-3,1,0,1131.2424021635802,1.569912342842098,1.6558457913487776,0.92238494157662987,1.0000198743759692,6.3046089197955285E-3,1.0000000000889311,1.3336499999209314E-5,1.0000000000889311,1.3336499999209314E-5,1.0307819727923293,0.26219448681924795,14.273320941727473,-128.53888754254501,51.461112457454988,null,1000000000,177862232.25,null,-0.82402251770851909,-37.461814736976628,null,null,null,17.035543719597118,-91.077072805568363,null,0,0]
[13413.25,13.41325,4.2220766445929003,1.33167373863075,1.0000044002986157,2.966574617386409E-3,1,0,1137.7525650034856,1.5699174009550338,1.6619058258135493,0.92514496687434855,1.0000201037813019,6.3408902381048076E-3,1.0000000000899576,1.3413249999195584E-5,1.0000000000899576,1.3413249999195584E-5,1.0311320328024791,0.26364758979456271,14.205225873029569,-128.54125249586667,51.458747504133328,null,1000000000,179915275.5625,null,-0.84213703502711112,-37.306045510827829,null,null,null,16.985563168217809,-91.235206985038843,null,0,0]
[13490,13.49,4.2448835668863225,1.3329833491295606,1.0000044507991854,2.9835491205503837E-3,1,0,1144.2627278721689,1.5699224015127629,1.6679784281968015,0.92788491609184498,1.0000203345029941,6.3771715397204116E-3,1.0000000000909901,1.3489999999181696E-5,1.0000000000909901,1.3489999999181696E-5,1.0314839843367556,0.26509977822291625,14.137588524119188,-128.5438971009375,51.4561028990625,null,1000000000,181980100,null,-0.86001722301078187,-37.151423260719334,null,null,null,16.935806007291099,-91.392473840218187,null,0,0]
[13568.5,13.5685,4.2682179665205808,1.3343083401862257,1.0000045027492983,3.0009106627244585E-3,1,0,1150.9213309658153,1.5699274575690711,1.6742023523120071,0.93066675684698941,1.0000205718471651,6.4142800849163861E-3,1.0000000000920521,1.3568499999167328E-5,1.0000000000920521,1.3568499999167328E-5,1.0318459155627906,0.26658412822138705,14.06887618116661,-128.54689386268444,51.453106137315558,null,1000000000,184104192.25,null,-0.87806666964109059,-36.99445137970374,null,null,null,16.885143110968826,-91.55244248298068,null,0,0]
[13647,13.647,4.2915597779500487,1.3356189202592339,1.0000045550008361,3.0182722030894405E-3,1,0,1157.5799340885449,1.5699324554587315,1.6804391364430242,0.93342796978306519,1.0000208105684079,6.4513886124466339E-3,1.0000000000931202,1.3646999999152791E-5,1.0000000000931202,1.3646999999152791E-5,1.0322098215443196,0.26806751307820875,14.000630053367626,-128.55018819070759,51.449811809292413,null,1000000000,186240609,null,-0.89587896368977915,-36.8386580519471,null,null,null,16.834709277218533,-91.711530138760523,null,0,0]
[13725.5,13.7255,4.3149088808908012,1.3369153187543406,1.0000046075537978,3.0356337416348623E-3,1,0,1164.2385372398592,1.5699373961797574,1.6866886379343495,0.93616874185100463,1.0000210506667213,6.4884971222089671E-3,1.0000000000941947,1.3725499999138087E-5,1.0000000000941947,1.3725499999138087E-5,1.0325757002412925,0.26954992856982141,13.932843925201738,-128.55378233267382,51.446217667326181,null,1000000000,188389350.25,null,-0.91345802472695081,-36.684032623126072,null,null,null,16.784502210089812,-91.869749709547762,null,0,0]
[13804,13.804,4.3382651576112758,1.3381977603300148,1.0000046604081843,3.0529952783502597E-3,1,0,1170.8971404192698,1.5699422807074601,1.6929507159481698,0.9388892584725067,1.0000212921421046,6.525605614101199E-3,1.0000000000952753,1.3803999999123214E-5,1.0000000000952753,1.3803999999123214E-5,1.0329435496055139,0.27103137049330644,13.865511688142378,-128.55767835175084,51.442321648249163,null,1000000000,190550416,null,-0.93080769551119014,-36.530564525235256,null,null,null,16.734519643814696,-92.027113826515588,null,0,0]
[13884.25,13.88425,4.3621494111107095,1.3394945933746711,1.0000047147524318,3.0707438537904961E-3,1,0,1177.7041838254945,1.5699472170321069,1.699365249842518,0.941649677231293,1.0000215404241566,6.5635413467883003E-3,1.0000000000963862,1.3884249999107834E-5,1.0000000000963862,1.3884249999107834E-5,1.033321634346916,0.27254482747135528,13.797141344260735,-128.56197523417649,51.438024765823513,null,1000000000,192772398.0625,null,-0.94831094756422019,-36.374860568434421,null,null,null,16.683652551986086,-92.187114665742058,null,0,0]
[13964.5,13.964499999999999,4.3860409208626203,1.340777300417358,1.0000047694116927,3.0884924272960848E-3,1,0,1184.5112272600866,1.5699520966214937,1.705792635304729,0.94438931435262663,1.0000217901453587,6.6014770605836957E-3,1.0000000000975038,1.3964499999092274E-5,1.0000000000975038,1.3964499999092274E-5,1.0337017742444909,0.27405725817341092,13.729232776969816,-128.56659140348009,51.433408596519911,null,1000000000,195007260.25,null,-0.96558235106451518,-36.220344059978984,null,null,null,16.633015388195457,-92.346247343501091,null,0,0]
[14044.75,14.044750000000001,4.409939568931498,1.3420461068602465,1.0000048243859669,3.1062409988558441E-3,1,0,1191.3182707225606,1.5699569204481549,1.7122327276080218,0.94710836297195311,1.0000220413057099,6.6394127553782096E-3,1.0000000000986276,1.4044749999076534E-5,1.0000000000986276,1.4044749999076534E-5,1.0340839670839421,0.27556865817633069,13.661779792825525,-128.57152851069796,51.428471489302041,null,1000000000,197255002.5625,null,-0.9826257737285411,-36.067003989738893,null,null,null,16.582605826715195,-92.50452452095908,null,0,0]
[14125,14.125,4.4338452398896848,1.3433012334255745,1.0000048796752545,3.123989568458592E-3,1,0,1198.1253142124403,1.5699616894625232,1.71868538391085,0.94980701455058314,1.0000222939052088,6.6773484310626704E-3,1.0000000000997578,1.4124999999060613E-5,1.0000000000997578,1.4124999999060613E-5,1.0344682106423155,0.27707902307970234,13.594776305993079,-128.57678803468289,51.423211965317108,null,1000000000,199515625,null,-0.9994450067293893,-35.914829442238634,null,null,null,16.532421572883599,-92.661958592444279,null,0,0]
[14207.25,14.20725,4.4583538602152455,1.3445736710234018,1.0000049366693555,3.1421804679715782E-3,1,0,1205.1020036739467,1.5699665214243022,1.7253117441630423,0.95255195492901745,1.0000225542934162,6.7162295242027539E-3,1.0000000001009228,1.4207249999044108E-5,1.0000000001009228,1.4207249999044108E-5,1.0348641560473515,0.2786259507794418,13.526563134139849,-128.58251458023514,51.417485419764859,null,1000000000,201845952.5625,null,-1.0164546584492302,-35.760060516918934,null,null,null,16.481218052750208,-92.822454063316229,null,0,0]
[14289.5,14.2895,4.4828696201136857,1.3458321933162993,1.0000049939943669,3.1603713654050083E-3,1,0,1212.0786931632654,1.5699712977608198,1.7319510045882915,0.9552758707933906,1.0000228161933962,6.7551105970361661E-3,1.0000000001020948,1.4289499999027409E-5,1.0000000001020948,1.4289499999027409E-5,1.035262250905453,0.28017178185622738,13.458809535576963,-128.5885824334627,51.411417566537295,null,1000000000,204189810.25,null,-1.0332366318318995,-35.606493019266445,null,null,null,16.430246427569987,-92.982089414196295,null,0,0]
[14371.75,14.37175,4.5073924030883497,1.3470770234062663,1.0000050516502885,3.1785622607468419E-3,1,0,1219.0553826799194,1.5699760194271113,1.7386030173996607,0.9579789628134574,1.0000230796051477,6.7939916494453648E-3,1.0000000001032736,1.4371749999010518E-5,1.0000000001032736,1.4371749999010518E-5,1.0356624927953704,0.28171651164699574,13.391509295578622,-128.5949926671781,51.405007332821896,null,1000000000,206547198.0625,null,-1.0497947696115622,-35.454115506463843,null,null,null,16.379504325351309,-93.14087716071424,null,0,0]
[14454,14.454000000000001,4.5319220951310717,1.3483083797368356,1.0000051096371207,3.1967531539850414E-3,1,0,1226.0320722234419,1.5699806873564728,1.7452676367816362,0.9606614298198427,1.0000233445286697,6.832872681312812E-3,1.0000000001044591,1.4453999998993431E-5,1.0000000001044591,1.4453999998993431E-5,1.036064879286569,0.28326013551395585,13.324656308651184,-128.60174619286011,51.398253807139895,null,1000000000,208918116,null,-1.0661328375336989,-35.302916639822698,null,null,null,16.328989406346011,-93.298829553037422,null,0,0]
[14622.5,14.6225,4.582195520304734,1.3507897971983636,1.0000052294641673,3.2340195973424991E-3,1,0,1240.324743285174,1.5699900862407585,1.7589597539096968,0.96609323929968516,1.0000238919804276,6.9125255512560322E-3,1.0000000001069087,1.4622499998957817E-5,1.0000000001069087,1.4622499998957817E-5,1.0368959080066291,0.28641898015317857,13.189070627148098,-128.61665672803736,51.383343271962644,null,1000000000,213817506.25,null,-1.0989317756793273,-34.99679917083435,null,null,null,16.226202662988555,-93.619857557202991,null,0,0]
[14706.75,14.70675,4.6073426401597066,1.3520101950231245,1.0000052898984886,3.2526528156591604E-3,1,0,1247.4710788564223,1.5699947049184069,1.7658250474603234,0.96877751599951367,1.0000241680855788,6.9523519533975144E-3,1.0000000001081442,1.4706749998939699E-5,1.0000000001081442,1.4706749998939699E-5,1.0373147871858033,0.28799664237577344,13.121956529585264,-128.62465494436248,51.375345055637524,null,1000000000,216288495.5625,null,-1.1150003359024676,-34.845547960208123,null,null,null,16.175157125648859,-93.779106984154339,null,0,0]
[14791,14.791,4.6324965475505424,1.3532173413983515,1.0000053506800086,3.2712860317171935E-3,1,0,1254.6174144539787,1.5699992709798232,1.7727029657803188,0.97144098229190623,1.0000244457769099,6.9921783334838134E-3,1.0000000001093867,1.4790999998921372E-5,1.0000000001093867,1.4790999998921372E-5,1.0377359060451092,0.28957312469285251,13.055286744578716,-128.63301563764472,51.366984362355282,null,1000000000,218773681,null,-1.1308532896000425,-34.695486082147582,null,null,null,16.124340294339888,-93.93752955549715,null,0,0]
[14877.25,14.87725,4.6582544966774755,1.3544396375117775,1.000005413264073,3.2903615769604953E-3,1,0,1261.9333960272243,1.5700038918630634,1.7797570831782334,0.97414633166266251,1.0000247317034265,7.0329501239466425E-3,1.0000000001106661,1.4877249998902393E-5,1.0000000001106661,1.4877249998902393E-5,1.0381693390745002,0.29118580361106911,12.987488287712722,-128.64195050132997,51.358049498670027,null,1000000000,221332567.5625,null,-1.1468630454203685,-34.543081789544715,null,null,null,16.072551593294222,-94.098868711785244,null,0,0]
[14963.5,14.9635,4.684019328725082,1.3556484887349056,1.0000054762120156,3.3094371198092191E-3,1,0,1269.2493776271046,1.5700084594765567,1.7868241235634061,0.9768303007772885,1.0000250192923221,7.0737218910268051E-3,1.0000000001119531,1.4963499998883192E-5,1.0000000001119531,1.4963499998883192E-5,1.038605113724921,0.29279723569296295,12.920142875429484,-128.65126553619348,51.348734463806522,null,1000000000,223906332.25,null,-1.1626545083093134,-34.391899441913033,null,null,null,16.020997643899921,-94.259366094280438,null,0,0]
[15049.75,15.04975,4.7097909307346582,1.3568441122135089,1.0000055395238365,3.3285126602494827E-3,1,0,1276.5653592531621,1.5700129747361673,1.7939039342064727,0.97949310387482535,1.0000253085435955,7.1144936345887708E-3,1.0000000001132476,1.5049749998863769E-5,1.0000000001132476,1.5049749998863769E-5,1.039043227119246,0.29440741580104729,12.853244297496824,-128.66096066689062,51.339039333109383,null,1000000000,226494975.0625,null,-1.1782314407774659,-34.24192681672703,null,null,null,15.969675998435415,-94.419033850163586,null,0,0]
[15136,15.135999999999999,4.7355691921770866,1.3580267205183385,1.0000056031995357,3.3475881982674041E-3,1,0,1283.8813409049487,1.570017438536885,1.8009963645057898,0.98213495302932929,1.0000255994572449,7.1552653544970056E-3,1.0000000001145493,1.5135999998844122E-5,1.0000000001145493,1.5135999998844122E-5,1.0394836763697999,0.29601633882879369,12.786786455084609,-128.67103568056959,51.328964319430412,null,1000000000,229098496,null,-1.1935975282404379,-34.093151814309692,null,null,null,15.918584243486171,-94.577883866259882,null,0,0]
[15224,15.224,4.7618772420705122,1.3592201257254113,1.0000056685422332,3.3670507736761708E-3,1,0,1291.3457627902271,1.5700219407793456,1.8082455514388145,0.98480902673900017,1.0000258979868011,7.1968643021741103E-3,1.0000000001158851,1.5223999998823844E-5,1.0000000001158851,1.5223999998823844E-5,1.0399354666929368,0.29765660580727582,12.71942821809408,-128.68170627986268,51.318293720137319,null,1000000000,231770176,null,-1.2090618314898716,-33.942580080092021,null,null,null,15.86669030974508,-94.739126199770652,null,0,0]
[15312,15.311999999999999,4.7881919993751856,1.3604004152592921,1.0000057342637245,3.3865133465341046E-3,1,0,1298.8101847013806,1.5700263912719241,1.8155075652273427,0.98746172674994659,1.0000261982468734,7.2384632249428487E-3,1.0000000001172287,1.5311999998803327E-5,1.0000000001172287,1.5311999998803327E-5,1.040389682516041,0.29929555353500875,12.652516300663116,-128.69277147533549,51.307228524664509,null,1000000000,234457344,null,-1.2243141602737428,-33.793230002128276,null,null,null,15.815030721097987,-94.899541473207222,null,0,0]
[15400,15.4,4.8145133541087155,1.3615678009177548,1.0000058003640098,3.4059759168264632E-3,1,0,1306.2746066379652,1.5700307909017601,1.8227822525637634,0.99009327141085046,1.0000265002374604,7.280062122659272E-3,1.00000000011858,1.5399999998782582E-5,1.00000000011858,1.5399999998782582E-5,1.0408463207386878,0.30093317668820413,12.586044568569644,-128.70423063743996,51.295769362560037,null,1000000000,237160000,null,-1.2393581923356451,-33.645089120781584,null,null,null,15.763603021066412,-95.059141516658372,null,0,0]
[15488,15.488,4.8408411986534841,1.362722490033383,1.0000058668430887,3.4254384845385016E-3,1,0,1313.739028599548,1.5700351405358315,1.830069462312675,0.9927038767737002,1.0000268039585605,7.3216609951794335E-3,1.0000000001199392,1.5487999998761592E-5,1.0000000001199392,1.5487999998761592E-5,1.0413053782494024,0.3025694699768024,12.520006998306517,-128.7160830131597,51.283916986840296,null,1000000000,239878144,null,-1.2541975294984224,-33.498145106850792,null,null,null,15.712404787966065,-95.21793790630889,null,0,0]
[15578.25,15.578250000000001,4.867848828839958,1.3638937274181528,1.0000059354153621,3.4453986720248807E-3,1,0,1321.3943022845331,1.5700395503401148,1.8375558434703374,0.99535970527175033,1.0000271172427033,7.3643234489139979E-3,1.0000000001213409,1.5578249998739814E-5,1.0000000001213409,1.5578249998739814E-5,1.0417786826191473,0.30424621350119418,12.452725726664243,-128.7286459425693,51.271354057430699,null,1000000000,242681873.0625,null,-1.2692073641013757,-33.348674384347731,null,null,null,15.660133350926746,-95.37997155822157,null,0,0]
[15668.5,15.6685,4.894863063032564,1.3650520385055376,1.0000060043860468,3.4653588567658922E-3,1,0,1329.0495759949183,1.5700439093437968,1.8450550804572607,0.99799396296436071,1.0000274323469791,7.4069858758407051E-3,1.0000000001227509,1.5668499998717786E-5,1.0000000001227509,1.5668499998717786E-5,1.042254524907964,0.30592154712588215,12.385888616307554,-128.74162047246563,51.258379527534373,null,1000000000,245501892.25,null,-1.2840093389387077,-33.200436665762446,null,null,null,15.608098215407384,-95.54118380670316,null,0,0]
[15758.75,15.758749999999999,4.921883792491129,1.3661976330543624,1.0000060737551428,3.4853190387456336E-3,1,0,1336.7048497302676,1.5700482184196787,1.85256701715131,1.0006068754695974,1.0000277492713865,7.4496482758042845E-3,1.0000000001241691,1.57587499986955E-5,1.0000000001241691,1.57587499986955E-5,1.0427329017239837,0.30759546525537712,12.319489517165948,-128.75500542358293,51.244994576417071,null,1000000000,248338201.5625,null,-1.2986071021109822,-33.053419074130879,null,null,null,15.556296879438055,-95.701586349452043,null,0,0]
[15849,15.849,4.9489109108244733,1.3673307163764614,1.0000061435226502,3.5052792179482003E-3,1,0,1344.3601234901544,1.5700524784206811,1.8600914996900668,1.0031986659299317,1.0000280680159235,7.4923106486494617E-3,1.0000000001255955,1.584899999867296E-5,1.0000000001255955,1.584899999867296E-5,1.0432138096635468,0.30926796233167364,12.253522391390963,-128.76879950471152,51.231200495288476,null,1000000000,251190801,null,-1.3130042254702488,-32.907608873191052,null,null,null,15.504726877022339,-95.861190631520486,null,0,0]
[15941.25,15.94125,4.976543462511831,1.3684761886140375,1.0000062152480043,3.5256817251050902E-3,1,0,1352.185043230864,1.5700567829756833,1.8677955378654676,1.0058262925859367,1.000028395705129,7.535918419851525E-3,1.0000000001270617,1.5941249998649649E-5,1.0000000001270617,1.5941249998649649E-5,1.0437079871690429,0.3109760486684553,12.186533657704297,-128.78332064663363,51.216679353366374,null,1000000000,254123451.5625,null,-1.3275166809369068,-32.759802129575156,null,null,null,15.45225059880233,-96.023518517058463,null,0,0]
[16033.5,16.0335,5.0041824718367778,1.3696090090216178,1.0000062873896232,3.5460842293267513E-3,1,0,1360.0099629963404,1.5700610379975226,1.8755123660913455,1.0084323142808351,1.0000287252960252,7.5795261623918904E-3,1.0000000001285365,1.6033499998626073E-5,1.0000000001285365,1.6033499998626073E-5,1.0442048019954657,0.31268263864833779,12.119983846833559,-128.79826619073211,51.201733809267893,null,1000000000,257073122.25,null,-1.3418268160378102,-32.613230419365244,null,null,null,15.400010923032497,-96.185035771366856,null,0,0]
[16125.75,16.12575,5.0318278323870631,1.3707293831987526,1.0000063599475071,3.5664867305961988E-3,1,0,1367.8348827861582,1.5700652443362864,1.8832418271410232,1.0110169614212898,1.0000290567886099,7.6231338761047355E-3,1.00000000013002,1.612574999860222E-5,1.00000000013002,1.612574999860222E-5,1.0447042504703423,0.31438772645721963,12.053866858409281,-128.81363443123851,51.186365568761488,null,1000000000,260039813.0625,null,-1.355938210135649,-32.467880589928875,null,null,null,15.348005328706058,-96.345753841309644,null,0,0]
[16218,16.218,5.0594794400520309,1.3718375123768722,1.0000064329216554,3.5868892288964485E-3,1,0,1375.6598025999022,1.57006940282272,1.8909837661032043,1.0135804617922839,1.0000293901828812,7.6667415608242381E-3,1.0000000001315117,1.6217999998578096E-5,1.0000000001315117,1.6217999998578096E-5,1.0452063289088118,0.31609130632206989,11.988176704196047,-128.82942356356577,51.170576436434231,null,1000000000,263023524,null,-1.3698543671096033,-32.323739637736566,null,null,null,15.296231331466776,-96.505683925829203,null,0,0]
[16312.5,16.3125,5.0878118482256829,1.3729601783429686,1.0000065081072786,3.6077893460099947E-3,1,0,1383.6755741408047,1.5700736139670191,1.8989273114432295,1.0161847952128631,1.0000297336805444,7.7114128173740339E-3,1.0000000001330487,1.6312499998553095E-5,1.0000000001330487,1.6312499998553095E-5,1.0457233762621576,0.31783486736269434,11.921320783906154,-128.84603222751136,51.153967772488642,null,1000000000,266097656.25,null,-1.3839110897254947,-32.177323079386312,null,null,null,15.243432133792773,-96.66870914812506,null,0,0]
[16407,16.407,5.1161505979416644,1.3740704086300732,1.0000065837297196,3.6286894599716559E-3,1,0,1391.6913457059622,1.5700777766011789,1.9068836290014219,1.0187674132879698,1.0000300791737868,7.756084043146665E-3,1.0000000001345948,1.6406999998527803E-5,1.0000000001345948,1.6406999998527803E-5,1.0462431755672905,0.31957683387233016,11.854900401986638,-128.86307843627708,51.136921563722922,null,1000000000,269189649,null,-1.3977701437964398,-32.032147937494074,null,null,null,15.190870805944206,-96.830930498783047,null,0,0]
[16501.5,16.5015,5.1444955844017244,1.3751684060315457,1.0000066597889778,3.6495895707631728E-3,1,0,1399.7071172949584,1.570081891558615,1.9148525595699848,1.0213285524644733,1.0000304266626061,7.8007552379638799E-3,1.0000000001361498,1.6501499998502217E-5,1.0000000001361498,1.6501499998502217E-5,1.0467657228234664,0.32131719977941059,11.788909471346562,-128.88055996152579,51.11944003847421,null,1000000000,272299502.25,null,-1.411435061325341,-31.888200712393125,null,null,null,15.138544792833031,-96.992359249132676,null,0,0]
[16596,16.596,5.1728467050817999,1.3762543690143565,1.0000067362850538,3.6704896783662884E-3,1,0,1407.7228889073856,1.5700859596537615,1.9228339463300721,1.0238684463998691,1.0000307761470004,7.845426401647428E-3,1.0000000001377136,1.6595999998476335E-5,1.0000000001377136,1.6595999998476335E-5,1.0472910140168452,0.32305595905772411,11.723342017817515,-128.89847448836679,51.101525511633213,null,1000000000,275427216,null,-1.4249092990125392,-31.745468063148532,null,null,null,15.08645157699118,-97.153006425218294,null,0,0]
[16692.5,16.692499999999999,5.2018040755750032,1.3773510980373587,1.0000068148508767,3.6918321129797357E-3,1,0,1415.9083065036307,1.5700900663128154,1.930996945225107,1.0264404101941571,1.0000311350872613,7.891042954470337E-3,1.0000000001393197,1.6692499998449604E-5,1.0000000001393197,1.6692499998449604E-5,1.0478302499600831,0.32482985326620156,11.656817815675947,-128.91721251240753,51.082787487592469,null,1000000000,278639556.25,null,-1.4384754455164608,-31.600954322694619,null,null,null,15.033493521353535,-97.316258189712926,null,0,0]
[16789,16.789000000000001,5.2307676335945006,1.3784356828412256,1.0000068938722022,3.7131745442299138E-3,1,0,1424.0937241234803,1.5700941257632921,1.9391726100704387,1.0289907036415864,1.0000314961084553,7.9366594744521204E-3,1.0000000001409353,1.6788999998422558E-5,1.0000000001409353,1.6788999998422558E-5,1.0483723387142589,0.32660205956453131,11.590722963286,-128.93639692669362,51.063603073306382,null,1000000000,281870521,null,-1.4518498088943184,-31.457679494923823,null,null,null,14.980773032341448,-97.478717431769795,null,0,0]
[16885.5,16.8855,5.2597372769225794,1.3795083215172266,1.0000069733490302,3.7345169720973794E-3,1,0,1432.2791417665294,1.5700981388145767,1.9473607813385236,1.0315195667132198,1.0000318592105801,7.9822759614029699E-3,1.0000000001425602,1.6885499998395201E-5,1.0000000001425602,1.6885499998395201E-5,1.0489172759638732,0.32837257168230938,11.525051447595212,-128.95602501878642,51.04397498121358,null,1000000000,285120110.25,null,-1.4650358386873945,-31.315629876870503,null,null,null,14.928287546443732,-97.64039514191596,null,0,0]
[16982,16.981999999999999,{"$f":"SQRT(1+(A269/p_dom)^2)","v":5.2887129055599251},{"$f":"ATAN(A269/p_dom)","v":1.3805692079267764},{"$f":"SQRT(1+(A269/z_ESR)^2)","v":1.0000070532813605},{"$f":"ATAN(A269/z_ESR)","v":3.7558593965626901E-3},{"$f":"IF(VIN_nom>Vout, 1, SQRT(1+(A269/z_RHP)^2))","v":1},{"$f":"IF(VIN_nom>Vout, 0, -ATAN(A269/z_RHP))","v":0},{"$f":"SQRT(1+(A269/EA_p1)^2)","v":1440.4645594323827},{"$f":"ATAN(A269/EA_p1)","v":1.570102106257657},{"$f":"SQRT(1+(A269/EA_z1)^2)","v":1.9555613019316624},{"$f":"ATAN(A269/EA_z1)","v":1.0340272364605425},{"$f":"SQRT(1+(A269/EA_hf_p)^2)","v":1.0000322243936337},{"$f":"ATAN(A269/EA_hf_p)","v":8.027892415133079E-3},{"$f":"SQRT(1+(A269/Zero3)^2)","v":1.0000000001441942},{"$f":"ATAN(A269/Zero3)","v":1.6981999998367531E-5},{"$f":"SQRT(1+(A269/pole5)^2)","v":1.0000000001441942},{"$f":"ATAN(A269/pole5)","v":1.6981999998367531E-5},{"$f":"SQRT((1-(Z269/pterm2))^2+(A269/pterm1)^2)","v":1.0494650573797921},{"$f":"IF((ATAN((A269/pterm1)/(1-A269^2/pterm2))>0),ATAN((A269/pterm1)/(1-A269^2/pterm2)),PI()+ATAN((A269/pterm1)/(1-A269^2/pterm2)))","v":0.33014138339854565},{"$f":"20*LOG10(((E269*K269*G269*O269)/(C269*I269*S269*M269*Q269))*Adc)","v":11.459797367745461},{"$f":"((F269+L269+H269+P269)-(D269+J269+T269+N269+R269))*radconv","v":-128.97609400295138},{"$f":"IF(V269>0,V269,V269+180)","v":51.023905997048615},null,{"$f":"IF(U269<0,A269,1000000000)","v":1000000000},{"$f":"A269^2","v":288388324},null,{"$f":"20*LOG10((K269/(I269*M269))*Aea_stability*Afb*0.8)","v":-1.4780369103298698},{"$f":"(L269-(J269+N269))*radconv","v":-31.174791931794392},null,null,null,{"$f":"20*LOG10((E269*G269/(C269*S269))*Am_stability)","v":14.876034538236457},{"$f":"(F269+H269-(D269+T269))*radconv","v":-97.801302071157011},null,{"$f":"SUM((U270<0)*(U269>0))*A269","v":0},0]
[17081,{"$f":"A270/1000","v":17.081},5.3184453155203641,1.3816455643904597,1.0000071357578324,3.7777547300230328E-3,1,0,1448.8620345740119,1.5701061298986205,1.9639869424652734,1.0365780931553761,1.0000326011998777,8.0746906075540859E-3,1.0000000001458802,1.7080999998338814E-5,1.0000000001458802,1.7080999998338814E-5,1.0500299811175582,0.33195424573406052,11.393280495816214,-128.99713808986442,51.002861910135579,null,1000000000,291760561,null,-1.4911860513769266,-31.031550485434114,null,null,null,14.82266680735427,-97.96558760443034,null,0,0]
[17180,17.18,5.348183818616028,1.3827099519450423,1.0000072187137132,3.7996500598612057E-3,1,0,1457.2595097388273,1.5701101071670267,1.9724252531780948,1.0391071403469196,1.0000329801962624,8.1214887646060621E-3,1.0000000001475762,1.7179999998309761E-5,1.0000000001475762,1.7179999998309761E-5,1.0505978890225263,0.33376530531817517,11.327190738304107,-129.01864005247543,50.981359947524567,null,1000000000,295152400,null,-1.5041474925179528,-30.889555972588735,null,null,null,14.769538490983187,-98.129084079886709,null,0,0]
[17279,17.279,5.3779283137667004,1.3837625667531577,1.000007302149003,3.8215453860562152E-3,1,0,1465.6569849264308,1.5701140388599495,1.9808760721494905,1.0416146246065356,1.0000333613827852,8.1682868860840658E-3,1.0000000001492819,1.7278999998280369E-5,1.0000000001492819,1.7278999998280369E-5,1.0511687763765831,0.33557455559600396,11.261522075534231,-129.04059667266813,50.95940332733187,null,1000000000,298563841,null,-1.5169246471335815,-30.748794311417054,null,null,null,14.716646982828941,-98.291802361251044,null,0,0]
[17378,17.378,5.4076787020959562,1.3848036007663411,1.0000073860637015,3.8434407085870688E-3,1,0,1474.0544601364325,1.5701179257562998,1.9893392399722225,1.0441007894036094,1.0000337447594434,8.2150849717831549E-3,1.0000000001509974,1.7377999998250642E-5,1.0000000001509974,1.7377999998250642E-5,1.0517426384471957,0.33738199006745273,11.196268601285118,-129.06300467087686,50.936995329123135,null,1000000000,301994884,null,-1.5295208543883745,-30.609251596767407,null,null,null,14.663989715834621,-98.453753074109471,null,0,0]
[17479.25,17.47925,5.4381112304188504,1.3858565118099695,1.0000074723814281,3.8658336482726391E-3,1,0,1482.642787078523,1.5701218554491796,1.9980073619993011,1.0466216567021112,1.00003413911457,8.2629466131175673E-3,1.0000000001527622,1.747924999821989E-5,1.0000000001527622,1.747924999821989E-5,1.052332614786101,0.33922861770037316,11.129955504266213,-129.08638534661898,50.913614653381018,null,1000000000,305524180.5625,null,-1.5422195805233063,-30.467783964554883,null,null,null,14.610375344950647,-98.618601382064142,null,0,0]
[17580.5,17.580500000000001,5.468549720445063,1.3868977027826423,1.0000075592006021,3.8882265840811943E-3,1,0,1491.231114043246,1.5701257398781332,2.0066880711693584,1.0491207297849086,1.0000345357605096,8.3108082165946791E-3,1.0000000001545368,1.7580499998188775E-5,1.0000000001545368,1.7580499998188775E-5,1.052925692534372,0.34107333247544092,11.064064538824763,-129.1102310342774,50.889768965722595,null,1000000000,309073980.25,null,-1.5547358759832983,-30.327562453320436,null,null,null,14.557000674969187,-98.782668580956965,null,0,0]
[17681.75,17.681750000000001,5.4989940731754423,1.3879273660671685,1.0000076465212235,3.910619515990278E-3,1,0,1499.8194410302119,1.5701295798207375,2.0153812048352644,1.0515982592549666,1.0000349346972595,8.3586697819952576E-3,1.0000000001563221,1.7681749998157301E-5,1.0000000001563221,1.7681749998157301E-5,1.0535218665837478,0.34291612761707946,10.998589738529812,-129.13453805441137,50.865461945588635,null,1000000000,312644283.0625,null,-1.5670730838677285,-30.188572749111156,null,null,null,14.503863082558663,-98.945965305300263,null,0,0]
[17783,17.783000000000001,5.5294441917722814,1.3889456899076247,1.000007734343292,3.9330124439774334E-3,1,0,1508.407768039041,1.5701333760368594,2.024086602913258,1.0540544924711337,1.0000353359248171,8.406531309100072E-3,1.0000000001581175,1.7782999998125464E-5,1.0000000001581175,1.7782999998125464E-5,1.0541211318109571,0.34475699640965679,10.933525250153714,-129.1593026787427,50.840697321257295,null,1000000000,316235089,null,-1.5792344739512467,-30.050800722833564,null,null,null,14.450959984266088,-99.108501955909119,null,0,0]
[17886.5,17.886500000000002,5.5605768405279221,1.3899751147295949,1.0000078246352477,3.9559029885095163E-3,1,0,1517.1869467813885,1.5701372121916983,2.0329979664873949,1.0565435514624804,1.0000357484362732,8.4554563858860923E-3,1.0000000001599636,1.7886499998092542E-5,1.0000000001599636,1.7886499998092542E-5,1.0547369036735137,0.34663677543147897,10.86743299576872,-129.18508666990303,50.814913330096971,null,1000000000,319926882.25,null,-1.5914877251244299,-29.911211143404831,null,null,null,14.397120981054277,-99.273875526498173,null,0,0]
[17990,17.989999999999998,5.5917153162931523,1.390993075544563,1.0000079154511843,3.9787935288959735E-3,1,0,1525.9661255458061,1.5701410042062534,2.0419218153450349,1.0590108696672738,1.000036163341476,8.5043814221921511E-3,1.0000000001618199,1.7989999998059236E-5,1.0000000001618199,1.7989999998059236E-5,1.0553558947529584,0.34851452753825773,10.801757474471444,-129.21134081234791,50.788659187652087,null,1000000000,323640100,null,-1.6035639403692259,-29.772864687919007,null,null,null,14.343521675001794,-99.438476124428931,null,0,0]
[18093.5,18.093499999999999,5.6228595222608977,1.3919997607175303,1.0000080067911021,4.0016840651128181E-3,1,0,1534.7453043319151,1.570144752838009,2.0508579865054464,1.0614567010401781,1.0000365806404228,8.5533064177840817E-3,1.0000000001636873,1.8093499998025548E-5,1.0000000001636873,1.8093499998025548E-5,1.0559780995294461,0.35039024575077499,10.736492784275502,-129.23806099157548,50.76193900842452,null,1000000000,327374742.25,null,-1.6154663866244618,-29.635746849232884,null,null,null,14.290159431061092,-99.602314142342607,null,0,0]
[18197,18.196999999999999,5.6540093637394477,1.3929953545549996,1.0000080986550004,4.0245745971360632E-3,1,0,1543.5244831393452,1.5701484588272168,2.0598063195930623,1.0638812961603077,1.0000370003331103,8.6022313724277155E-3,1.0000000001655653,1.819699999799147E-5,1.0000000001655653,1.819699999799147E-5,1.0566035124675901,0.35226392315519828,10.671633135839443,-129.26524305671256,50.734756943287437,null,1000000000,331130809,null,-1.6271982585964893,-29.499843312620623,null,null,null,14.237031654597059,-99.765399744091923,null,0,0]
[18303,18.303000000000001,5.6859173614108762,1.3940036885452016,1.0000081932809519,4.0480180361890071E-3,1,0,1552.5157194276142,1.5701522108889294,2.0689832372342156,1.0663427028209578,1.0000374326444679,8.6523380465722589E-3,1.0000000001674998,1.8302999997956168E-5,1.0000000001674998,1.8302999997956168E-5,1.0572473515338667,0.35418073596682714,10.60562073114378,-129.29355607776486,50.706443922235138,null,1000000000,334999809,null,-1.6390399689118265,-29.361900977396886,null,null,null,14.18286096021674,-99.931655100368005,null,0,{"$f":"IF(AJ282>0,W282,0)","v":0}]
[18409,18.408999999999999,5.717831075641973,1.3950007676343725,1.0000082884565025,4.0714614707923879E-3,1,0,1561.5069557374877,1.5701559197415182,2.0781725791078731,1.06878235627206,1.000037867466596,8.7024446772692721E-3,1.0000000001694458,1.8408999997920449E-5,1.0000000001694458,1.8408999997920449E-5,1.0578945438159089,0.35609539372106219,10.540021231286882,-129.32234465395968,50.677655346040325,null,1000000000,338891281,null,-1.6507093235580639,-29.22520253108274,null,null,null,14.128930815006074,-100.09714212287695,null,0,0]
[18515,18.515000000000001,5.749750411244265,1.3959867772656753,1.0000083841816521,4.0949049009204397E-3,1,0,1570.4981920685946,1.5701595861271114,2.0873741811267568,1.0712005149581194,1.0000383047994916,8.7525512642672096E-3,1.0000000001714024,1.8514999997884323E-5,1.0000000001714024,1.8514999997884323E-5,1.058545083318168,0.35800788920392868,10.474828767835994,-129.35160423180568,50.64839576819432,null,1000000000,342805225,null,-1.6622095306745894,-29.089733208405182,null,null,null,14.075238558671714,-100.2618710234005,null,0,0]
[18621,18.620999999999999,5.7816752751147558,1.396961898873585,1.0000084804564007,4.1183483265473915E-3,1,0,1579.4894284205727,1.5701632107709382,2.0965878818671926,1.0735974337951999,1.0000387446431511,8.8026578073145279E-3,1.0000000001733709,1.8620999997847774E-5,1.0000000001733709,1.8620999997847774E-5,1.0591989640289472,0.35991821527323503,10.410037585206984,-129.3813302334402,50.618669766559805,null,1000000000,346741641,null,-1.6735437267775641,-28.955478445287781,null,null,null,14.021781572145674,-100.42585178815243,null,0,0]
[18729.5,18.729500000000002,5.8143587142186535,1.3979489276758021,1.0000085795709752,4.1423446584676294E-3,1,0,1588.692722254927,1.5701668784113132,2.1060312512291852,1.0760291489957572,1.000039197460765,8.8539460626723219E-3,1.000000000175397,1.8729499997809933E-5,1.000000000175397,1.8729499997809933E-5,1.0598717205038293,0.36187134205793414,10.344128005390287,-129.41223557408992,50.58776442591008,null,1000000000,350794170.25,null,-1.6849765092414459,-28.819300168047281,null,null,null,13.967304774792861,-100.59293540604263,null,0,0]
[18838,18.838000000000001,5.8470477544918751,1.3989249210729173,1.0000086792613783,4.1663409856173188E-3,1,0,1597.896016110406,1.5701705038031666,2.1154869628315809,1.0784391399916087,1.0000396529089646,8.9052342714485942E-3,1.000000000177435,1.8837999997771654E-5,1.000000000177435,1.8837999997771654E-5,1.0605479648533787,0.36382218097906555,10.278627006136855,-129.4436198298614,50.556380170138596,null,1000000000,354870244,null,-1.6962417855865077,-28.684364172720219,null,null,null,13.91306905188449,-100.75925565714121,null,0,0]
[18946.5,18.9465,5.8797423025135673,1.3998900612783283,1.0000087795276102,4.1903373079688238E-3,1,0,1607.0993099866464,1.5701740876723258,2.1249548519113568,1.0808276689811827,1.0000401109877466,8.9565224333735833E-3,1.0000000001794849,1.8946499997732925E-5,1.0000000001794849,1.8946499997732925E-5,1.061227690579438,0.36577072461040161,10.213528765390112,-129.47547803403154,50.524521965968461,null,1000000000,358969862.25,null,-1.7073426982614768,-28.550655478014633,null,null,null,13.859071723812715,-100.92482255601692,null,0,0]
[19055,19.055,5.912442266913696,1.4008445265562599,1.0000088803696705,4.2143336254945136E-3,1,0,1616.3026038832932,1.5701776307280866,2.1344347564185844,1.0831949944933219,1.0000405716971073,9.0078105481775292E-3,1.0000000001815466,1.9054999997693753E-5,1.0000000001815466,1.9054999997693753E-5,1.0619108911671835,0.36771696560425848,10.148827573800137,-129.50780520741091,50.492194792589089,null,1000000000,363093025,null,-1.7182823189300913,-28.418159311943121,null,null,null,13.805310152891357,-101.08964589546778,null,0,0]
[19165.75,19.165749999999999,5.9458258343988284,1.4018079567225272,1.0000089838967892,4.2388275575024007E-3,1,0,1625.6967495173772,1.570181205885441,2.1441234750681333,1.0855898091093084,1.0000410446733159,9.0601621925220158E-3,1.0000000001836629,1.9165749997653307E-5,1.0000000001836629,1.9165749997653307E-5,1.0626118364244783,0.36970118412768671,10.083188323576046,-129.54128123741498,50.458718762585022,null,1000000000,367325973.0625,null,-1.7292855720670266,-28.28415091127674,null,null,null,13.750674155804198,-101.25713032613825,null,0,0]
[19276.5,19.276499999999999,5.9792148591557357,1.4027606278258185,1.0000090880238661,4.2633214844240664E-3,1,0,1635.0908951720012,1.5701847399618389,2.1538243798870136,1.0879630645667633,1.000041520390329,9.1125137872029131E-3,1.0000000001857918,1.9276499997612391E-5,1.0000000001857918,1.9276499997612391E-5,1.0633163883881334,0.37168298830210494,10.01795108779582,-129.57523537898521,50.424764621014788,null,1000000000,371583452.25,null,-1.7401270238882984,-28.15137540279455,null,null,null,13.696278371845246,-101.42385997619068,null,0,0]
[19387.25,19.387250000000002,6.0126092502689907,1.4037027173917507,1.0000091927509005,4.287815406230122E-3,1,0,1644.4850408468137,1.5701882336613071,2.1635373069535815,1.0903150243120225,1.000041998848143,9.1648653319333362E-3,1.0000000001879328,1.9387249997571001E-5,1.0000000001879328,1.9387249997571001E-5,1.0640245400775676,0.37366237056583435,9.9531101409854301,-129.60966231629777,50.390337683702228,null,1000000000,375865462.5625,null,-1.750809724689659,-28.019817732454658,null,null,null,13.642120125836216,-101.58984458384313,null,0,0]
[19498,19.498000000000001,6.0460089188173578,1.4046343990992383,1.0000092980778927,4.3123093228911776E-3,1,0,1653.8791865414707,1.5701916876718767,2.173262095075299,1.0926459480271886,1.0000424800467536,9.2172168264263964E-3,1.0000000001900859,1.9497999997529132E-5,1.0000000001900859,1.9497999997529132E-5,1.0647362844952728,0.37563932344208384,9.8886598689154201,-129.64455673275086,50.355443267249143,null,1000000000,380172004,null,-1.7613366556471364,-27.889463060973416,null,null,null,13.588196784723683,-101.75509367177744,null,0,0]
[19611.75,19.611750000000001,6.0803187212467451,1.4055806621381142,1.0000094068825414,4.3374667262645961E-3,1,0,1663.5278012143015,1.5701951946349793,2.1832624894691661,1.0950183822497896,1.0000429771332517,9.2709863674946998E-3,1.0000000001923104,1.9611749997485638E-5,1.0000000001923104,1.9611749997485638E-5,1.0654710413300135,0.37766729133551191,9.8228646752184723,-129.68087743330065,50.319122566699349,null,1000000000,384620738.0625,null,-1.7719896445002377,-27.75681429464866,null,null,null,13.533054579879835,-101.92406313865199,null,0,0]
[19725.5,19.7255,6.1146339069761053,1.4065163051938672,1.0000095163200906,4.3626241241476599E-3,1,0,1673.1764159073559,1.5701986611512582,2.1932750601344551,1.0973691686946323,1.0000434771110347,9.3247558549536466E-3,1.0000000001945477,1.9725499997441631E-5,1.0000000001945477,1.9725499997441631E-5,1.0662095731521073,0.37969268073053486,9.75746995196379,-129.71767992267553,50.282320077324471,null,1000000000,389095350.25,null,-1.7824844689287449,-27.625403534122828,null,null,null,13.47815468105366,-102.0922763885527,null,0,0]
[19839.25,19.83925,6.1489543858784401,1.4074415044412283,1.0000096263905405,4.3877815165085272E-3,1,0,1682.8250306202856,1.5702020879164289,2.2032996410713568,1.0996985766809624,1.0000439799800984,9.3785252884924022E-3,1.0000000001967979,1.983924999739712E-5,1.0000000001967979,1.983924999739712E-5,1.0669518723260367,0.38171548380506709,9.692469965591604,-129.75495845576103,50.245041544238973,null,1000000000,393595840.5625,null,-1.7928241430947205,-27.495215388383528,null,null,null,13.42349436884745,-102.2597430673775,null,0,0]
[19953,19.952999999999999,6.1832800698140078,1.4083564322153104,1.0000097370938907,4.4129389033153547E-3,1,0,1692.473645352751,1.5702054756103421,2.2133360690901003,1.1020068715799021,1.0000444857404385,9.4322946678001389E-3,1.0000000001990612,1.9952999997352091E-5,1.0000000001990612,1.9952999997352091E-5,1.0676979311987607,0.38373569283095715,9.6278590950123206,-129.79270729813254,50.207292701867459,null,1000000000,398122209,null,-1.8030116120446631,-27.366234691720202,null,null,null,13.369070967218113,-102.42647260641235,null,0,0]
[20069,20.068999999999999,6.2182899944515677,1.4092790539811759,1.0000098506387798,4.4385939030093923E-3,1,0,1702.3131118249739,1.5702088907641412,2.2235830544658102,1.1043393524570051,1.0000450044824514,9.4871275610751253E-3,1.0000000002013825,2.0068999997305639E-5,1.0000000002013825,2.0068999997305639E-5,1.068462611314275,0.38579318259925544,9.5623652315553169,-129.83168124556627,50.168318754433727,null,1000000000,402764761,null,-1.8132468233126291,-27.235930748780557,null,null,null,13.313812315029072,-102.59575049678574,null,0,0]
[20185,20.184999999999999,6.2533051530179309,1.4101913441412164,1.0000099648418543,4.4642488968606149E-3,1,0,1712.1525783168231,1.5702122666652572,2.2338420261489347,1.1066504218655733,1.0000455262312429,9.5419603972995894E-3,1.000000000203717,2.0184999997258646E-5,1.000000000203717,2.0184999997258646E-5,1.0692311852056888,0.38784795874707345,9.4972645685455799,-129.87113229142366,50.128867708576337,null,1000000000,407434225,null,-1.8233297228089964,-27.1068513403407,null,null,null,13.258794551515702,-102.76428095108294,null,0,0]
[20301,20.300999999999998,6.2883254580811512,1.411093473777254,1.0000100797031137,4.4899038848352528E-3,1,0,1721.9920448279624,1.5702156039865596,2.2441128197531066,1.108940348934319,1.0000460509868079,9.5967931761438922E-3,1.0000000002060654,2.0300999997211114E-5,1.0000000002060654,2.0300999997211114E-5,1.0700036447026164,0.3899000133793431,9.432551489050601,-129.91105440421316,50.088945595786839,null,1000000000,412130601,null,-1.8332632233839594,-26.978981084994953,null,null,null,13.20401497259569,-102.93207331921823,null,0,0]
[20417,20.417000000000002,6.3233508241334517,1.4119856102475785,1.0000101952225582,4.5155588668995359E-3,1,0,1731.8315113580627,1.5702189033856266,2.2543952736999544,1.1112093987773131,1.0000465787491419,9.6516258972784048E-3,1.0000000002084271,2.0416999997163034E-5,1.0000000002084271,2.0416999997163034E-5,1.0707799816171579,0.39194933870188503,9.3682204865658179,-129.95144157402711,50.048558425972885,null,1000000000,416853889,null,-1.8430501707891633,-26.852304830483522,null,null,null,13.149470917516107,-103.0991367435436,null,0,0]
[20536,20.536000000000001,6.3592871899860279,1.4128906066230931,1.0000103144135124,4.5418773337022704E-3,1,0,1741.9254468695146,1.5702222493814662,2.2649556033184206,1.1135157105375142,1.0000471232849131,9.707876645715147E-3,1.0000000002108638,2.0535999997113137E-5,1.0000000002108638,2.0535999997113137E-5,1.0715804167421854,0.3940488196536342,9.3026171204000114,-129.9933502193177,50.006649780682295,null,1000000000,421727296,null,-1.852940855178062,-26.723577542155265,null,null,null,13.093758235739196,-103.26977267716248,null,0,0]
[20655,20.655000000000001,6.3952287056753372,1.4137854314718759,1.0000104342971352,4.5681957942129946E-3,1,0,1752.0193824002438,1.5702255568226338,2.2755278685456246,1.1158006037785646,1.0000476709849768,9.7641273327157326E-3,1.0000000002133145,2.065499999706266E-5,1.0000000002133145,2.065499999706266E-5,1.0723849149226659,0.39614541200679293,9.2374044548485372,-130.03573555311928,49.964264446880719,null,1000000000,426629025,null,-1.8626831661579137,-26.596075232039166,null,null,null,13.038287881167578,-103.43966032108014,null,0,0]
[20774,20.774000000000001,6.4311752848596457,1.4146702539077778,1.0000105548734262,4.5945142483952506E-3,1,0,1762.1133179499193,1.570228826371689,2.2861119037906987,1.1180643519606903,1.0000482218493274,9.8203779579242971E-3,1.0000000002157794,2.0773999997011598E-5,1.0000000002157794,2.0773999997011598E-5,1.07319346726378,0.39823910767635134,9.1725768901577389,-130.07859117153151,49.921408828468486,null,1000000000,431559076,null,-1.8722799675220247,-26.469782269959833,null,null,null,12.98305711784089,-103.60880890157165,null,0,0]
[20893,20.893000000000001,6.4671268431048672,1.4155452393475969,1.0000106761423857,4.6208326962125816E-3,1,0,1772.2072535182172,1.5702320586760967,2.2967075463325184,1.1203072243730929,1.0000487758779601,9.8766285209849706E-3,1.0000000002182587,2.0892999996959949E-5,1.0000000002182587,2.0892999996959949E-5,1.0740060648529164,0.40032989868811747,9.1081289375353478,-130.12191070329507,49.878089296704928,null,1000000000,436517449,null,-1.8817340564167842,-26.344683263859171,null,null,null,12.92806325411326,-103.77722743943595,null,0,0]
[21014.75,21.014749999999999,6.5039142815443363,1.4164304331688211,1.0000108009306423,4.6477593368289827E-3,1,0,1782.5344523223719,1.5702353277908379,2.3075598921569771,1.1225805994303231,1.0000493459845832,9.9341789273256331E-3,1.0000000002208098,2.1014749996906491E-5,1.0000000002208098,2.1014749996906491E-5,1.0748416181966516,0.40246599197850308,9.0425789030185637,-130.16670482651546,49.833295173484544,null,1000000000,441619717.5625,null,-1.8912617737513489,-26.217913169554709,null,null,null,12.87204093693104,-103.94879165696071,null,0,0]
[21136.5,21.136500000000002,6.5407067589146237,1.4173056689677752,1.0000109264439507,4.6746859707056786E-3,1,0,1792.8616511453577,1.5702385592442258,2.3184240523062409,1.1248326799160004,1.0000499194034151,9.9917292678592239E-3,1.0000000002233758,2.1136499996852412E-5,1.0000000002233758,2.1136499996852412E-5,1.0756813869844812,0.40459902827819461,8.9774149490194795,-130.21197117227874,49.788028827721263,null,1000000000,446751632.25,null,-1.9006458240150479,-26.092361002721098,null,null,null,12.816261033195657,-104.11961016955763,null,0,0]
[21258.25,21.25825,6.5775041906571747,1.4181711125207341,1.0000110526823105,4.7016125978036243E-3,1,0,1803.1888499868503,1.5702417536833415,2.3292998614696327,1.1270637411061049,1.0000504961344501,1.0049279542204642E-2,1.0000000002259566,2.1258249996797703E-5,1.0000000002259566,2.1258249996797703E-5,1.0765253616163255,0.40672899940575763,8.9126315407620442,-130.25770303500781,49.742296964992192,null,1000000000,451913193.0625,null,-1.9098889977395583,-25.968011028259642,null,null,null,12.76072079866273,-104.28969200674818,null,0,0]
[21380,21.38,6.6143064940838778,1.4190269259738486,1.0000111796457212,4.7285392180837754E-3,1,0,1813.5160488465342,1.5702449117405262,2.3401871572339239,1.1292740539991883,1.0000510761776826,1.0106829749980782E-2,1.0000000002285523,2.1379999996742367E-5,1.0000000002285523,2.1379999996742367E-5,1.0773735324743832,0.40885589730001159,8.8482232536906693,-130.30389375225874,49.696106247741255,null,1000000000,457104400,null,-1.9189940200366573,-25.844847755305679,null,null,null,12.705417533888452,-104.45904599695308,null,0,0]
[21504.5,21.5045,6.6519450147730899,1.4198922763258894,1.0000113102266899,4.7560740300880847E-3,1,0,1824.0765109433046,1.5702481041495788,2.3513320797356307,1.1315131132159495,1.0000516727477644,1.0165679790541853E-2,1.0000000002312217,2.1504499996685127E-5,1.0000000002312217,2.1504499996685127E-5,1.0782451906252399,0.41102764959448401,8.7827425463474391,-130.35159541470216,49.64840458529784,null,1000000000,462443520.25,null,-1.9281646052358323,-25.720113882476394,null,null,null,12.649107411744403,-104.63148153222581,null,0,0]
[21629,21.629000000000001,6.6895884605917226,1.4207478883670324,1.0000114415658328,4.7836088348805553E-3,1,0,1834.6369730584511,1.5702512598066034,2.3624886791189117,1.1337310360307313,1.0000522727813483,1.022452976068643E-2,1.0000000002339067,2.1628999996627219E-5,1.0000000002339067,2.1628999996627219E-5,1.0791212163093975,0.41319617159001565,8.7176429659644814,-130.39976294780632,49.600237052193677,null,1000000000,467813641,null,-1.9371962893938874,-25.596588926505326,null,null,null,12.593039515519497,-104.80317402130099,null,0,0]
[21753.5,21.753499999999999,6.7272367488614719,1.4215939243322699,1.0000115736631496,4.8111436324194384E-3,1,0,1845.1974351916579,1.5702543793426191,2.373656790733655,1.1359280988095981,1.0000528762784282,1.0283379660007008E-2,1.0000000002366074,2.1753499996568643E-5,1.0000000002366074,2.1753499996568643E-5,1.0800015991879173,0.41536145505476624,8.6529190524424173,-130.44838937682641,49.551610623173588,null,1000000000,473214762.25,null,-1.946091785657341,-25.474257088914772,null,null,null,12.537211098260885,-104.97413228791166,null,0,0]
[21878,21.878,6.7648897987340169,1.42243054290016,1.00001170651864,4.8386784226629852E-3,1,0,1855.7578973426168,1.5702574633742814,2.3848362528456346,1.1381045735500748,1.0000534832389976,1.0342229488096088E-2,1.0000000002393234,2.1877999996509387E-5,1.0000000002393234,2.1877999996509387E-5,1.0808863289044346,0.41752349188693377,8.5885654548786849,-130.49746778017578,49.502532219824218,null,1000000000,478646884,null,-1.9548537431450943,-25.353102820702897,null,null,null,12.481619458184905,-105.14436495947285,null,0,0]
[22005.25,22.00525,6.8033793807085532,1.4232760708382042,1.0000118430921681,4.8668214035023118E-3,1,0,1866.5516227318089,1.5702605794650832,2.3962742148304983,1.1403081264907609,1.0000541071854083,1.040237913795317E-2,1.0000000002421157,2.2005249996448127E-5,1.0000000002421157,2.2005249996448127E-5,1.0817950819651985,0.41972992126085057,8.5231676094008293,-130.54809015593062,49.451909844069377,null,1000000000,484231027.5625,null,-1.9636739345333138,-25.230473397055349,null,null,null,12.425041804095269,-105.31761675887527,null,0,0]
[22132.5,22.1325,6.8418737718118976,1.4241120849913642,1.0000119804577325,4.8949643766322696E-3,1,0,1877.3453481389167,1.5702636597241948,2.4077237016916735,1.1424907327648326,1.0000547347499911,1.0462528712536424E-2,1.0000000002449236,2.2132499996386149E-5,1.0000000002449236,2.2132499996386149E-5,1.0827083540833242,0.42193294229224582,8.4581456542595657,-130.59917024703941,49.40082975296059,null,1000000000,489847556.25,null,-1.9723600215429868,-25.109042071683525,null,null,null,12.368705935963678,-105.49012817535588,null,0,0]
[22259.75,22.25975,6.8803728913255382,1.4249387438842298,1.0000121186153332,4.9231073420082797E-3,1,0,1888.139073563633,1.5702667047661216,2.419184549794787,1.1446526691321306,1.0000553659327385,1.0522678211410756E-2,1.0000000002477483,2.2259749996323457E-5,1.0000000002477483,2.2259749996323457E-5,1.0836261341476554,0.42413254674905604,8.3934942126580054,-130.65070084264497,49.349299157355034,null,1000000000,495496470.0625,null,-1.9809146366072097,-24.988793022600273,null,null,null,12.312609109426342,-105.66190782004469,null,0,0]
[22387,22.387,6.9188766603177472,1.4257562025644097,1.0000122575649699,4.9512502995857667E-3,1,0,1898.9327990056579,1.5702697151913982,2.4306565984308395,1.1467942079082367,1.0000560007336439,1.0582827634141067E-2,1.0000000002505889,2.2386999996260046E-5,1.0000000002505889,2.2386999996260046E-5,1.0845484110301542,0.42632872653935,8.3292080157152313,-130.70267479453955,49.297325205460453,null,1000000000,501177769,null,-1.989340349667281,-24.869710681655199,null,null,null,12.25674862554364,-105.83296411288435,null,0,0]
[22517.5,22.517499999999998,6.9583685744313311,1.4265851425302969,1.0000124008860554,4.980112027893952E-3,1,0,1910.0021991819465,1.5702727671643819,2.44243311430718,1.1489695371325324,1.0000566555054828,1.064451321013025E-2,1.000000000253519,2.2517499996194256E-5,1.000000000253519,2.2517499996194256E-5,1.0854989020040655,0.42857743205277099,8.2636538799973938,-130.75642924090991,49.24357075909009,null,1000000000,507037806.25,null,-1.9978500033296651,-24.748782686245576,null,null,null,12.199704143488185,-106.00764655466432,null,0,0]
[22648,22.648,6.9978652159598607,1.4274047258162048,1.0000125450401505,5.0089737479052116E-3,1,0,1921.0715993758204,1.5702757839658392,2.4542210769661179,1.1511239796571782,1.0000573140826428,1.0706198705109382E-2,1.000000000256466,2.2647999996127708E-5,1.000000000256466,2.2647999996127708E-5,1.0864540986708584,0.43082251894360779,8.198472996532054,-130.8106349575977,49.189365042402301,null,1000000000,512931904,null,-2.0062293670750462,-24.629049390753657,null,null,null,12.142902623768226,-106.18158556684403,null,0,0]
[22778.5,22.778500000000001,7.0373665053066512,1.428215108871036,1.0000126900272548,5.0378354595714643E-3,1,0,1932.1409995869781,1.570278766200272,2.4660203222554276,1.1532578151491555,1.0000579764651161,1.0767884118609192E-2,1.00000000025943,2.2778499996060381E-5,1.00000000025943,2.2778499996060381E-5,1.0874139889760912,0.43306397893999399,8.1336600188114918,-130.86528444539528,49.134715554604725,null,1000000000,518860062.25,null,-2.014481019209954,-24.510494806050239,null,null,null,12.086341298182573,-106.35478963934503,null,0,0]
[22909,22.908999999999999,7.0768723646429095,1.4290164446992131,1.0000128358473677,5.0666971628446312E-3,1,0,1943.2103998151238,1.570281714458408,2.4778306889939765,1.1553713187017092,1.000058642652895,1.0829569450160401E-2,1.000000000262411,2.2908999995992281E-5,1.000000000262411,2.2908999995992281E-5,1.0883785608490173,0.43530180392288048,8.0692097083573788,-130.92037027776325,49.079629722236746,null,1000000000,524822281,null,-2.022607476279223,-24.393103204272727,null,null,null,12.030017444797727,-106.52726707349051,null,0,0]
[23042.25,23.042249999999999,7.1172153593139891,1.4298254871875302,1.0000129855998421,5.0961670542198608E-3,1,0,1954.5130632836974,1.5702846903866199,2.4899012442084287,1.157508661708553,1.0000593268055396,1.0892554579132515E-2,1.0000000002654725,2.3042249995921944E-5,1.0000000002654725,2.3042249995921944E-5,1.0893682769780169,0.43758302713945135,8.0037701278606015,-130.97705951641854,49.022940483581465,null,1000000000,530945285.0625,null,-2.0307785525298074,-24.274421760662026,null,null,null,11.972748940551538,-106.7026377557565,null,0,0]
[23175.5,23.1755,7.1575629600395363,1.4306254089549468,1.0000131362208022,5.1256369367432336E-3,1,0,1965.8157267693809,1.5702876320940093,2.5019830640973444,1.159625372286569,1.0000600149255401,1.0955539621677045E-2,1.0000000002685518,2.3175499995850781E-5,1.0000000002685518,2.3175499995850781E-5,1.0903628485767722,0.43986044390497298,7.9386979551715244,-131.03418826862003,48.965811731379972,null,1000000000,537103800.25,null,-2.038824214923018,-24.156920502484972,null,null,null,11.915722430255668,-106.87726776613503,null,0,0]
[23308.75,23.30875,7.1979150893624366,1.4314163623636891,1.0000132877102474,5.1551068103635666E-3,1,0,1977.1183902718817,1.5702905401674709,2.5140759862577999,1.1617217290615094,1.0000607070128888,1.1018524577294435E-2,1.0000000002716489,2.3308749995778801E-5,1.0000000002716489,2.3308749995778801E-5,1.0913622627464667,0.44213404606559931,7.8739879452318116,-131.09174886642052,48.908251133579483,null,1000000000,543297826.5625,null,-2.0467469541092203,-24.040583499259863,null,null,null,11.858935159502161,-107.05116536716065,null,0,0]
[23442,23.442,7.2382716715442177,1.4321984964234946,1.0000134400681775,5.1845766750296769E-3,1,0,1988.4210537909125,1.5702934151805548,2.5261798512487701,1.1637980060420936,1.0000614030675778,1.1081509445485128E-2,1.0000000002747638,2.3441999995705994E-5,1.0000000002747638,2.3441999995705994E-5,1.0923665065731352,0.44440382563097841,7.8096349591942582,-131.14973372292874,48.850266277071256,null,1000000000,549527364,null,-2.0545492008082169,-23.925395084276857,null,null,null,11.802384420163603,-107.22433863865189,null,0,0]
[23578.5,23.578499999999998,7.2796171002885375,1.4329907146247534,1.0000135970426709,5.2147653075447819E-3,1,0,1999.9993920467668,1.5702963266220749,2.5385901152738768,1.1659043851906206,1.0000621202128683,1.114603043879973E-2,1.0000000002779728,2.3578499995630548E-5,1.0000000002779728,2.3578499995630548E-5,1.0934002384255712,0.44672499390906867,7.7440773172956234,-131.20956490567787,48.790435094322135,null,1000000000,555945662.25,null,-2.0624192892262543,-23.80857204279674,null,null,null,11.744696866683002,-107.40099286288115,null,0,0]
[23715,23.715,7.3209670461848884,1.433773984172916,1.00001375492853,5.2449539305548139E-3,1,0,2011.5777303193788,1.5702992045479578,2.5510115329823706,1.1679902607027739,1.0000628415213699,1.1210551339309696E-2,1.0000000002812006,2.3714999995554218E-5,1.0000000002812006,2.3714999995554218E-5,1.0944390109214059,0.44904213439851393,7.6788837411677688,-131.26982543983425,48.73017456016575,null,1000000000,562401225,null,-2.0701679138970599,-23.692921847524961,null,null,null,11.687251915225955,-107.57690359230931,null,0,0]
[23851.5,23.851500000000001,7.3623214331224931,1.434548454893287,1.0000139137257544,5.2751425440047527E-3,1,0,2023.1560686084606,1.5703020495336242,2.563443942235474,1.1700559126156183,1.0000635669930737,1.1275072146478033E-2,1.0000000002844471,2.3851499995477007E-5,1.0000000002844471,2.3851499995477007E-5,1.0954828101332748,0.45135523903902108,7.6140490363915161,-131.33050743593432,48.669492564065678,null,1000000000,568894052.25,null,-2.0777975029742075,-23.578428486458009,null,null,null,11.63004679952685,-107.75207894947633,null,0,0]
[23988,23.988,7.4036801866830118,1.4353142733060917,1.0000140734343435,5.3053311478395791E-3,1,0,2034.7344069137318,1.5703048621413978,2.575887183882533,1.1721016162526936,1.0000642966279707,1.1339592859767756E-2,1.0000000002877121,2.3987999995398908E-5,1.0000000002877121,2.3987999995398908E-5,1.0965316221199592,0.45366429994719332,7.5495681142833018,-131.3916030945976,48.608396905402401,null,1000000000,575424144,null,-2.0853104257452548,-23.465076216907029,null,null,null,11.573078800189684,-107.92652687769058,null,0,0]
[24127.75,24.127749999999999,7.4460281203021292,1.4360895113422116,1.0000142378896895,5.3362385179374968E-3,1,0,2046.5884199570417,1.5703077087464214,2.5886377524053219,1.1741756433921726,1.0000650479481761,1.1405649682697992E-2,1.0000000002910743,2.4127749995318022E-5,1.0000000002910743,2.4127749995318022E-5,1.0976105844724469,0.45602414115145484,7.4839132447490293,-131.45457391564807,48.545426084351931,null,1000000000,582148320.0625,null,-2.0928837755778407,-23.35019109070376,null,null,null,11.514997280487995,-108.10438282494428,null,0,0]
[24267.5,24.267499999999998,7.4883804783241841,1.4368559807399226,1.0000144033003142,5.3671458778402721E-3,1,0,2058.4424330167444,1.570310522565789,2.6013993469976397,1.1762293303276359,1.0000658036321628,1.1471706406086871E-2,1.0000000002944558,2.4267499995236196E-5,1.0000000002944558,2.4267499995236196E-5,1.0986947715296558,0.45837972761358392,7.4186187387428371,-131.51796207620458,48.482037923795417,null,1000000000,588911556.25,null,-2.1003396815332014,-23.236469488163337,null,null,null,11.457158680437168,-108.28149258804125,null,0,0]
[24407.25,24.407250000000001,7.5307371861015469,1.4376138285488647,1.0000145696662173,5.3980532274888592E-3,1,0,2070.2964460925582,1.570313304162668,2.6141718061816999,1.1782629577455217,1.0000665636799206,1.153776302935814E-2,1.0000000002978569,2.4407249995153419E-5,1.0000000002978569,2.4407249995153419E-5,1.0997841682901448,0.46073105144438226,7.3536794628408106,-131.58175949966244,48.418240500337561,null,1000000000,595713852.5625,null,-2.1076805051258791,-23.123895359371552,null,null,null,11.399560228127816,-108.45786414029088,null,0,0]
[24547,24.547000000000001,{"$f":"SQRT(1+(A333/p_dom)^2)","v":7.5730981706490343},{"$f":"ATAN(A333/p_dom)","v":1.4383631985686451},{"$f":"SQRT(1+(A333/z_ESR)^2)","v":1.0000147369873982},{"$f":"ATAN(A333/z_ESR)","v":5.4289605668242169E-3},{"$f":"IF(VIN_nom>Vout, 1, SQRT(1+(A333/z_RHP)^2))","v":1},{"$f":"IF(VIN_nom>Vout, 0, -ATAN(A333/z_RHP))","v":0},{"$f":"SQRT(1+(A333/EA_p1)^2)","v":2082.1504591842086},{"$f":"ATAN(A333/EA_p1)","v":1.5703160540874019},{"$f":"SQRT(1+(A333/EA_z1)^2)","v":2.626954971484039},{"$f":"ATAN(A333/EA_z1)","v":1.1802768015394769},{"$f":"SQRT(1+(A333/EA_hf_p)^2)","v":1.0000673280914398},{"$f":"ATAN(A333/EA_hf_p)","v":1.1603819551935558E-2},{"$f":"SQRT(1+(A333/Zero3)^2)","v":1.0000000003012777},{"$f":"ATAN(A333/Zero3)","v":2.4546999995069693E-5},{"$f":"SQRT(1+(A333/pole5)^2)","v":1.0000000003012777},{"$f":"ATAN(A333/pole5)","v":2.4546999995069693E-5},{"$f":"SQRT((1-(Z333/pterm2))^2+(A333/pterm1)^2)","v":1.1008787597403473},{"$f":"IF((ATAN((A333/pterm1)/(1-A333^2/pterm2))>0),ATAN((A333/pterm1)/(1-A333^2/pterm2)),PI()+ATAN((A333/pterm1)/(1-A333^2/pterm2)))","v":0.46307810494526641},{"$f":"20*LOG10(((E333*K333*G333*O333)/(C333*I333*S333*M333*Q333))*Adc)","v":7.2890903885798544},{"$f":"((F333+L333+H333+P333)-(D333+J333+T333+N333+R333))*radconv","v":-131.64595820799698},{"$f":"IF(V333>0,V333,V333+180)","v":48.354041792003017},null,{"$f":"IF(U333<0,A333,1000000000)","v":1000000000},{"$f":"A333^2","v":602555209},null,{"$f":"20*LOG10((K333/(I333*M333))*Aea_stability*Afb*0.8)","v":-2.114908550234806},{"$f":"(L333-(J333+N333))*radconv","v":-23.012452928286194},null,null,null,{"$f":"20*LOG10((E333*G333/(C333*S333))*Am_stability)","v":11.342199198975786},{"$f":"(F333+H333-(D333+T333))*radconv","v":-108.6335052797108},null,{"$f":"SUM((U334<0)*(U333>0))*A333","v":0},0]
[24690,{"$f":"A334/1000","v":24.69},7.6164486470477799,1.4391213666717964,1.0000149091886286,5.460586670755576E-3,1,0,2094.2801470150325,1.5703188357393543,2.6400463399493788,1.1823172826852801,1.0000681147971262,1.1671412167877673E-2,1.000000000304798,2.4689999994983023E-5,1.000000000304798,2.4689999994983023E-5,1.1020041684364763,0.46547531280400223,7.223356617273935,-131.71205708189413,48.28794291810587,null,1000000000,609596100,null,-2.1221902909137529,-22.899574118863342,null,null,null,11.283747168348814,-108.81248296303077,null,0,0]
[24833,24.832999999999998,7.6598034519682292,1.4398709526760118,1.0000150823900842,5.4922127637633588E-3,1,0,2106.4098348618745,1.5703215853552144,2.6531485919131099,1.1843376188373684,1.0000689060718781,1.1739004677167311E-2,1.0000000003083389,2.4832999994895347E-5,1.0000000003083389,2.4832999994895347E-5,1.1031349844041121,0.46786803370116387,7.1579791981900112,-131.77855953588272,48.221440464117279,null,1000000000,616677889,null,-2.1293586494677101,-22.787847690916379,null,null,null,11.225538107818851,-108.99071184496634,null,0,0]
[24976,24.975999999999999,7.7031625123252523,1.4406121006508275,1.0000152565917642,5.5238388457843051E-3,1,0,2118.5395227244594,1.5703243034852497,2.6662615669277328,1.1863380906061349,1.0000697019156852,1.1806597079187098E-2,1.0000000003119003,2.4975999994806651E-5,1.0000000003119003,2.4975999994806651E-5,1.1042711915232755,0.47025626000180609,7.0929530681784829,-131.84545734079404,48.154542659205958,null,1000000000,623800576,null,-2.1364159174050634,-22.677257598146703,null,null,null,11.167569245744671,-109.16819974264736,null,0,0]
[25119,25.119,7.7465257566629191,1.4413449514774648,1.0000154317936683,5.5554649167551557E-3,1,0,2130.669210602518,1.5703269906671971,2.6793851075566466,1.1883189737470121,1.0000705023285361,1.1874189373319671E-2,1.0000000003154821,2.5118999994716938E-5,1.0000000003154821,2.5118999994716938E-5,1.1054127736640644,0.47263998427554843,7.0282732680016702,-131.91274237395393,48.087257626046068,null,1000000000,630964161,null,-2.1433643299729668,-22.567788071706499,null,null,null,11.109837858135766,-109.34495430224743,null,0,0]
[25265.25,25.265250000000002,7.7908787841678544,1.442086019430773,1.0000156120120141,5.5878097505706681E-3,1,0,2143.0745732208102,1.5703297074579941,2.6928176780140145,1.1903248978788779,1.0000713256585636,1.1943317743718799E-2,1.0000000003191665,2.5265249994624119E-5,1.0000000003191665,2.5265249994624119E-5,1.1065858436828191,0.47507321990252949,6.9624766360569401,-131.98194878734583,48.018051212654171,null,1000000000,638332857.5625,null,-2.1503603388172658,-22.456973509315496,null,null,null,11.051037235035333,-109.5249752780303,null,0,0]
[25411.5,25.4115,7.8352360418396216,1.4428186970355383,1.0000157932765641,5.6201545726942597E-3,1,0,2155.479935854738,1.5703323929770781,2.7062609760606002,1.1923109011587236,1.0000721537676558,1.201244599996487E-2,1.0000000003228722,2.5411499994530223E-5,1.0000000003228722,2.5411499994530223E-5,1.1077645016642712,0.47750173146903041,6.8970320842933566,-132.05154338358759,47.948456616412415,null,1000000000,645744332.25,null,-2.1572470439830522,-22.347298529393193,null,null,null,10.992479388437534,-109.70424485419439,null,0,0]
[25557.75,25.557749999999999,7.879597458238556,1.443543125209112,1.0000159755873177,5.6524993830582614E-3,1,0,2167.8852985040335,1.5703350477612905,2.7197148426199749,1.1942772634359609,1.0000729866558005,1.2081574141397476E-2,1.0000000003265992,2.5557749994435239E-5,1.0000000003265992,2.5557749994435239E-5,1.1089487303268075,0.47992551168284037,6.8319346280628723,-132.12151781537042,47.878482184629576,null,1000000000,653198585.0625,null,-2.164026664333857,-22.238747128470298,null,null,null,10.934161552557857,-109.88277068690013,null,0,0]
[25704,25.704000000000001,7.9239629635181572,1.4442594417479935,1.0000161589442744,5.6848441815950009E-3,1,0,2180.2906611684339,1.5703376723352547,2.73317912162404,1.1962242596596506,1.0000738243229861,1.2150702167356224E-2,1.0000000003303477,2.570399999433916E-5,1.0000000003303477,2.570399999433916E-5,1.1101385123816099,0.48234455347039884,6.7671793853320601,-132.191863849171,47.808136150829,null,1000000000,660695616,null,-2.1707013639689432,-22.131303583146856,null,null,null,10.87608100946213,-110.06056026602413,null,0,0]
[25853.75,25.853750000000002,7.9693943728938939,1.4449846364930876,1.000016347773319,5.7179630313605708E-3,1,0,2192.9929043222382,1.5703403289516364,2.7469762519803109,1.1981980659995477,1.0000746869888597,1.2221484418893461E-2,1.0000000003342082,2.5853749994239644E-5,1.0000000003342082,2.5853749994239644E-5,1.1113625041242792,0.4848165698161333,6.7012240466084991,-132.26426994498843,47.735730055011572,null,1000000000,668416389.0625,null,-2.1774292872780858,-22.022420547354155,null,null,null,10.816853594047712,-110.24184939763428,null,0,0]
[26003.5,26.003499999999999,8.0148299259174358,1.4457016094473765,1.0000165376992391,5.7510818685824186E-3,1,0,2205.6951474913417,1.5703429549699666,2.760783977321557,1.2001521363842464,1.000075554665226,1.2292266547962432E-2,1.0000000003380909,2.6003499994138965E-5,1.0000000003380909,2.6003499994138965E-5,1.1125922815376792,0.48728360391216063,6.6356174558793155,-132.33704853251254,47.66295146748746,null,1000000000,676182012.25,null,-2.1840516308940918,-21.914666538344122,null,null,null,10.757869346934534,-110.4223819941684,null,0,0]
[26153.25,26.15325,8.0602695525158428,1.4464104989180353,1.0000167287220347,5.7842006931879001E-3,1,0,2218.3973906754809,1.5703455509158455,2.7746021394708977,1.2020867506474657,1.0000764273520719,1.2363048553854205E-2,1.0000000003419962,2.6153249994037124E-5,1.0000000003419962,2.6153249994037124E-5,1.1138278260442365,0.4897456488685849,6.5703546898475231,-132.41019113818589,47.589808861814106,null,1000000000,683992485.5625,null,-2.1905705497140047,-21.808025552899768,null,null,null,10.699125499722655,-110.60216558528612,null,0,0]
[26303,26.303000000000001,8.1057131841812424,1.4471114401435503,1.0000169208417045,5.8173195051043668E-3,1,0,2231.0996338743998,1.5703481173029048,2.788430583268469,1.204002183660754,1.0000773050493843,1.2433830435859852E-2,1.000000000345924,2.6302999993934108E-5,1.000000000345924,2.6302999993934108E-5,1.1150691190624233,0.49220269802983146,6.5054309269797264,-132.48368940967947,47.516310590320529,null,1000000000,691847809,null,-2.1969881451181412,-21.702481871429736,null,null,null,10.640619332258993,-110.78120753824972,null,0,0]
[26456,26.456,8.1521471383432491,1.4478195224789765,1.0000171182637565,5.8511570760520571E-3,1,0,2244.0775518155101,1.5703507093819482,2.8025696040001122,1.2059396576629351,1.0000782069699641,1.2506148356902712E-2,1.0000000003499598,2.6455999993827639E-5,1.0000000003499598,2.6455999993827639E-5,1.1163432693331943,0.49470790584492397,6.4394433412624661,-132.55914156734406,47.440858432655943,null,1000000000,699919936,null,-2.2034425064120273,-21.595764814914762,null,null,null,10.581086107835622,-110.96337675242927,null,0,{"$f":"IF(AJ346>0,W346,0)","v":0}]
[26609,26.609000000000002,8.1985851335340119,1.4485195837965654,1.0000173168308089,5.8849946336006695E-3,1,0,2257.0554697715252,1.5703532716524293,2.8167190393930372,1.2078576734887461,1.0000791141208252,1.2578466147127635E-2,1.0000000003540195,2.6608999993719931E-5,1.0000000003540195,2.6608999993719931E-5,1.1176233811182155,0.49720788536125338,6.3737997715067944,-132.63494775183702,47.365052248162982,null,1000000000,708038881,null,-2.2097953690828573,-21.490160914383964,null,null,null,10.521795400750776,-111.14478683745304,null,0,0]
[26762,26.762,8.2450271014733598,1.4492117589448292,1.0000175165428609,5.9188321776727261E-3,1,0,2270.0333877421881,1.5703558046256003,2.8308787332820526,1.2097565089014486,1.0000800265019534,1.2650783805778556E-2,1.0000000003581022,2.6761999993610975E-5,1.0000000003581022,2.6761999993610975E-5,1.1189094345932706,0.49970263022809697,6.3084953879919574,-132.71109944013048,47.288900559869518,null,1000000000,716204644,null,-2.216048811143275,-21.385654284424,null,null,null,10.462744459296358,-111.32544515570648,null,0,0]
[26915,26.914999999999999,8.2914729754051475,1.4498961797814038,1.0000177173999119,5.9526697081907489E-3,1,0,2283.0113057272506,1.5703583088010882,2.8450485324987764,1.2116364366899723,1.0000809441133343,1.2723101332099413E-2,1.0000000003622085,2.6914999993500769E-5,1.0000000003622085,2.6914999993500769E-5,1.1202014099340931,0.50219213434313137,6.2435254610004911,-132.78758823640641,47.212411763593593,null,1000000000,724417225,null,-2.2222048587985963,-21.282229323963669,null,null,null,10.403930579960218,-111.50535891244269,null,0,0]
[27071.75,27.071750000000002,8.3390612111308773,1.4505894687153083,1.0000179243673677,5.9873365758095348E-3,1,0,2296.3073099521139,1.5703608449988524,2.8595759535347791,1.2135431127910326,1.0000818896392876,1.2797191208785121E-2,1.0000000003664398,2.7071749993386557E-5,1.0000000003664398,2.7071749993386557E-5,1.1215311719713676,0.50473721459444654,6.1773051444221458,-132.86629271528852,47.133707284711477,null,1000000000,732879648.0625,null,-2.2284128512119135,-21.17737518102129,null,null,null,10.343918255795185,-111.68891753426725,null,0,0]
[27228.5,27.2285,8.3866534095345475,1.451274889486684,1.0000181325366362,6.0220034290370938E-3,1,0,2309.6033141915782,1.5703633519956746,2.8741136651985206,1.2154305071703209,1.0000828406549898,1.2871280944967931E-2,1.0000000003706955,2.722849999327101E-5,1.0000000003706955,2.722849999327101E-5,1.1228671075978447,0.50727678187042113,6.1114261405826378,-132.94533359240896,47.054666407591043,null,1000000000,741391212.25,null,-2.234522761864949,-21.073624118218479,null,null,null,10.284149162608715,-111.8717094741905,null,0,0]
[27385.25,27.385249999999999,8.4342495035351863,1.4519525746506623,1.0000183419077167,6.0566702677901062E-3,1,0,2322.8993184453921,1.5703658302929833,2.8886615121216668,1.2172988975978589,1.0000837971604253,1.2945370539834846E-2,1.0000000003749758,2.7385249993154127E-5,1.0000000003749758,2.7385249993154127E-5,1.1242091955022762,0.50981083040828723,6.0458836734949104,-133.02470224607299,46.975297753927009,null,1000000000,749951917.5625,null,-2.2405366101942539,-20.970960249188462,null,null,null,10.224620543850293,-112.0537419968845,null,0,0]
[27542,27.542000000000002,8.4818494275520937,1.4526226538155784,1.0000185524806082,6.0913370919852593E-3,1,0,2336.1953227133104,1.5703682803807912,2.9032193419428083,1.2191485568088607,1.0000847591555782,1.3019459992572877E-2,1.0000000003792808,2.75419999930359E-5,1.0000000003792808,2.75419999930359E-5,1.1255574143779632,0.51233935471090242,5.9806730664875989,-133.1043901887852,46.895609811214797,null,1000000000,758561764,null,-2.2464563649667526,-20.869367975383632,null,null,null,10.165329691615481,-112.23502221340158,null,0,0]
[27702.5,27.702500000000001,8.5305920073228627,1.4533010148211278,1.0000187693364107,6.1268332508700868E-3,1,0,2349.809413222099,1.5703707603533983,2.9181356331516235,1.2210233371668999,1.0000857498532407,1.3095321772137812E-2,1.0000000003837142,2.7702499992913439E-5,1.0000000003837142,2.7702499992913439E-5,1.1269442177829267,0.51492264050684233,5.9142414782016157,-133.18630665450291,46.813693345497086,null,1000000000,767428506.25,null,-2.252422248201551,-20.766439624995467,null,null,null,10.104863986564293,-112.41986702950746,null,0,0]
[27863,27.863,8.5793384680410654,1.4539716674498888,1.0000189874522134,6.1623293943153861E-3,1,0,2363.4235037451731,1.5703732117551024,2.9330620766847275,1.2228790423618454,1.0000867463063949,1.3171183400967026E-2,1.0000000003881733,2.7862999992789551E-5,1.0000000003881733,2.7862999992789551E-5,1.1283374038243768,0.51750012376826304,5.8481482030357155,-133.26854028362041,46.73145971637959,null,1000000000,776346769,null,-2.2582935031011555,-20.664602555318663,null,null,null,10.044641966297998,-112.60393772830176,null,0,0]
[28023.5,28.023499999999999,8.6280887439276661,1.4546347417546108,1.0000192068280154,6.1978255222317185E-3,1,0,2377.037594282287,1.5703756350768092,2.9479985183309583,1.2247159494558193,1.0000877485150235,1.3247044878187807E-2,1.0000000003926581,2.8023499992664227E-5,1.0000000003926581,2.8023499992664227E-5,1.1297369496517833,0.52007179944601833,5.7823885278447351,-133.35108239190828,46.648917608091722,null,1000000000,785316552.25,null,-2.2640720875813125,-20.563840919939761,null,null,null,9.9846608755871724,-112.78724147196851,null,0,0]
[28184,28.184000000000001,8.6768427706768385,1.4552903648920477,1.0000194274638166,6.2333216345296467E-3,1,0,2390.6516848332017,1.5703780307982418,2.9629448068864583,1.2265343304335536,1.0000887564791092,1.3322906202927446E-2,1.000000000397169,2.818399999253746E-5,1.000000000397169,2.818399999253746E-5,1.1311428324245774,0.52263766277367418,5.7169578378391055,-133.43392443567927,46.566075564320727,null,1000000000,794337856,null,-2.2697599101548951,-20.464139162717608,null,null,null,9.9249180081551298,-112.96978527296164,null,0,0]
[28348,28.347999999999999,8.7266637783858823,1.4559527177938472,1.0000196542125024,6.2695917891251477E-3,1,0,2404.5626558774302,1.5703804507409367,2.9782270440648624,1.2283735058544512,1.0000897923687906,1.3400421666055172E-2,1.0000000004018046,2.8347999992406431E-5,1.0000000004018046,2.8347999992406431E-5,1.1325858950596139,0.52525347098552522,5.6504354337081573,-133.51887407735748,46.481125922642519,null,1000000000,803609104,null,-2.2754799494851303,-20.363342134588116,null,null,null,9.864115643354415,-113.15553194276937,null,0,0]
[28512,28.512,8.7764885711146245,1.4566075505246778,1.0000198822767377,6.3058619272248432E-3,1,0,2418.4736269355781,1.5703828428447897,2.9935192524155112,1.2301938967523784,1.0000908342676458,1.3477936968136784E-2,1.0000000004064671,2.8511999992273874E-5,1.0000000004064671,2.8511999992273874E-5,1.1340355258529715,0.52786320141605836,5.5842470812056124,-133.60411928431606,46.395880715683944,null,1000000000,812934144,null,-2.2811091025035442,-20.26361977607079,null,null,null,9.8035564438702849,-113.34049950824529,null,0,0]
[28676,28.675999999999998,8.8263170847634633,1.4572549898823388,1.0000201116565215,6.3421320487333137E-3,1,0,2432.384598007407,1.5703852075874369,3.008821279904212,1.2319957775681658,1.0000918821756564,1.3555452108241267E-2,1.0000000004111564,2.8675999992139786E-5,1.0000000004111564,2.8675999992139786E-5,1.1354917004771365,0.53046684987935055,5.5183881590451804,-133.6896513847154,46.310348615284596,null,1000000000,822312976,null,-2.2866492547991832,-20.164956390177519,null,null,null,9.7432376740054902,-113.5246949945379,null,0,0]
[28840,28.84,8.8761492566674089,1.4578951598422873,1.000020342351853,6.3784021535551426E-3,1,0,2446.2955690926824,1.5703875454356508,3.0241329774772825,1.2337794176706327,1.0000929360928033,1.3632967085437618E-2,1.0000000004158727,2.883999999200415E-5,1.0000000004158727,2.883999999200415E-5,1.1369543946207279,0.53306441248715386,5.4528541425059549,-133.77546185204551,46.22453814795449,null,1000000000,831745600,null,-2.2921022442210846,-20.067336569902537,null,null,null,9.6831566468881682,-113.70812528214294,null,0,0]
[29008,29.007999999999999,8.9272005765423419,1.45854353289725,1.0000205800379676,6.4155568776781127E-3,1,0,2460.5458321693527,1.570389912894999,3.0398280050855799,1.2355879240650267,1.0000940219459971,1.3712372501944061E-2,1.0000000004207319,2.9007999991863606E-5,1.0000000004207319,2.9007999991863606E-5,1.138459498814179,0.53571901620737594,5.3860539935479022,-133.86364512935677,46.136354870643231,null,1000000000,841464064,null,-2.297599728116511,-19.968402026833409,null,null,null,9.621853981825538,-113.89524310252337,null,0,0]
[29176,29.175999999999998,8.9782556066223442,1.4591845322464427,1.0000208191045832,6.4527115840878353E-3,1,0,2474.7960952596554,1.5703922530899446,3.0555328728868112,1.2373778454940634,1.0000951141049899,1.3791777745520989E-2,1.0000000004256195,2.9175999991721418E-5,1.0000000004256195,2.9175999991721418E-5,1.1399713928424422,0.53836722626668709,5.3195854804199048,-133.9521028637115,46.047897136288498,null,1000000000,851238976,null,-2.3030095021687571,-19.870530751799532,null,null,null,9.5607952427497906,-114.08157211191194,null,0,0]
[29344,29.344000000000001,9.0293142839708658,1.4598182824483847,1.0000210595516994,6.4898662726817413E-3,1,0,2489.0463583633559,1.5703945664887691,3.0712474299270771,1.2391494556791394,1.0000962125697614,1.3871182815167636E-2,1.0000000004305352,2.9343999991577584E-5,1.0000000004305352,2.9343999991577584E-5,1.1414900506326187,0.54100903943928824,5.2534440383032646,-134.04082635066067,45.959173649339334,null,1000000000,861070336,null,-2.3083333953069616,-19.773707088493321,null,null,null,9.4999776937713492,-114.26711926216736,null,0,0]
[29512,29.512,9.0803765470624729,1.4604449052834372,1.0000213013793147,6.5270209433572618E-3,1,0,2503.2966214802254,1.5703968535490911,3.0869715282340744,1.2409030232295841,1.0000973173402907,1.3950587709883253E-2,1.000000000435479,2.9511999991432097E-5,1.000000000435479,2.9511999991432097E-5,1.1430154461352198,0.54364445281515827,5.1876251981114336,-134.12980703696039,45.870192963039614,null,1000000000,870958144,null,-2.3135731898891727,-19.677915672896116,null,null,null,9.4393986481617347,-114.45189136406429,null,0,0]
[29684,29.684000000000001,9.132658230339457,1.4610791881020162,1.0000215503949235,6.5650602303783537E-3,1,0,2517.8861765894785,1.5703991682435741,3.1030797431062958,1.2426799254958842,1.0000984549476095,1.4031883015057058E-2,1.0000000004405698,2.9683999991281414E-5,1.0000000004405698,2.9683999991281414E-5,1.1445841136578068,0.54633598124341931,5.1205688887715892,-134.22116399400309,45.778836005996908,null,1000000000,881139856,null,-2.3188524292939681,-19.580897172424443,null,null,null,9.3776215782266856,-114.64026682157862,null,0,0]
[29856,29.856000000000002,9.1849435459902757,1.4617062498572082,1.0000218008575499,6.6030994984000646E-3,1,0,2532.4757317120657,1.570401456268216,3.1191976543737159,1.2444384696001658,1.0000995991644903,1.4113178134747741E-2,1.0000000004456904,2.985599999112898E-5,1.0000000004456904,2.985599999112898E-5,1.146159788377425,0.549020796322502,5.0538415426481933,-134.31277287561116,45.687227124388841,null,1000000000,891380736,null,-2.3240471551305646,-19.48492897846053,null,null,null,9.316088957939888,-114.82784389715063,null,0,0]
[30028,30.027999999999999,9.2372324323341743,1.4623262126797294,1.0000220527671932,6.6411387473123236E-3,1,0,2547.0652868477591,1.57040371808131,3.1353251124962136,1.2461789278729143,1.0001007499909107,1.4194473067881399E-2,1.0000000004508403,3.0027999990974777E-5,1.0000000004508403,3.0027999990974777E-5,1.1477424424245242,0.55169889593809252,4.9874386596501568,-134.40462498103363,45.595375018966365,null,1000000000,901680784,null,-2.329159137350417,-19.389995513813624,null,null,null,9.2547980571617021,-115.01462946721998,null,0,0]
[30200,30.2,9.2895248290749972,1.4629391959724252,1.0000223061238522,6.6791779770050599E-3,1,0,2561.6548419963347,1.5704059541307094,3.1514619709070484,1.2479015675100655,1.000101907426848,1.4275767813384145E-2,1.0000000004560199,3.0199999990818795E-5,1.0000000004560199,3.0199999990818795E-5,1.1493320479612876,0.55437027830916286,4.9213558343307993,-134.49671176590954,45.503288234090462,null,1000000000,912040000,null,-2.3341901006110359,-19.296081494882873,null,null,null,9.193746195102964,-115.20063027102667,null,0,0]
[30375.75,30.37575,9.3429608863814142,1.463558455740839,1.0000225664989566,6.7180465304012664E-3,1,0,2576.5624833894253,1.5704082127741608,3.1679602108440741,1.2496436318477266,1.0001030969247984,1.4358834778467394E-2,1.000000000461343,3.0375749990657574E-5,1.000000000461343,3.0375749990657574E-5,1.1509634621462377,0.55709296300204403,4.854158363270388,-134.59103993801642,45.408960061983578,null,1000000000,922686188.0625,null,-2.3392488112160836,-19.201157357839584,null,null,null,9.1316074346475968,-115.38988258017687,null,0,0]
[30551.5,30.551500000000001,9.396400485800017,1.4641706719820162,1.0000228283848585,6.7569150634984067E-3,1,0,2591.470124795509,1.5704104454315542,3.1844679652340799,1.2513676402264211,1.0001042933235644,1.4441901545382111E-2,1.0000000004666971,3.0551499990494468E-5,1.0000000004666971,3.0551499990494468E-5,1.152602075586564,0.55980863164408401,4.7872860502082526,-134.68559558679925,45.314404413200748,null,1000000000,933394152.25,null,-2.3442264333148297,-19.107266250795664,null,null,null,9.0697127436842084,-115.57832933600358,null,0,0]
[30727.25,30.727250000000002,9.4498435672380428,1.4647759637359581,1.0000230917815569,6.7957835761790538E-3,1,0,2606.377766214363,1.5704126525487849,3.2009850868765213,1.2530738618248032,1.0001054966231213,1.4524968112982673E-2,1.0000000004720819,3.0727249990329482E-5,1.0000000004720819,3.0727249990329482E-5,1.1542478586958278,0.56251728339085427,4.720734485678248,-134.78037008705363,45.219629912946374,null,1000000000,944163892.5625,null,-2.3491246689817138,-19.014392776432548,null,null,null,9.0080594148210889,-115.7659773106211,null,0,0]
[30903,30.902999999999999,9.5032900719506284,1.4653744473853005,1.0000233566890508,6.8346520683257826E-3,1,0,2621.2854076457688,1.5704148345616056,3.2175114315107973,1.2547625607100834,1.0001067068234442,1.4608034480123476E-2,1.0000000004774976,3.0902999990162592E-5,1.0000000004774976,3.0902999990162592E-5,1.1559007819285017,0.56521891774592459,4.654499353018581,-134.87535497354122,45.124645026458779,null,1000000000,954995409,null,-2.3539451766088155,-18.922521829714679,null,null,null,8.9466447897885217,-115.95283314382657,null,0,0]
[31083,31.082999999999998,9.558032512587527,1.4659804654605808,1.0000236295685951,6.8744604599277823E-3,1,0,2636.5535468201683,1.5704170437626281,3.2344468299903677,1.256474203079226,1.0001079534419939,1.4693109355548383E-2,1.0000000004830765,3.108299998998969E-5,1.0000000004830765,3.108299998998969E-5,1.1576010466552489,0.56797860908734787,4.586986104084624,-134.97284619088066,45.027153809119341,null,1000000000,966152889,null,-2.3588033722760802,-18.829452955019839,null,null,null,8.8839897365218317,-116.14339323586083,null,0,0]
[31263,31.263000000000002,9.6127784235065068,1.4665795810644695,1.0000239040328842,6.9142688297414243E-3,1,0,2651.8216860072876,1.5704192275242415,3.2513916057613281,1.2581680097630674,1.0001092072990414,1.4778184018268871E-2,1.0000000004886875,3.1262999989814776E-5,1.0000000004886875,3.1262999989814776E-5,1.1593087384119674,0.57073093959124255,4.5197958985828359,-135.07054062180035,44.929459378199653,null,1000000000,977375169,null,-2.3635834216090688,-18.737404520060775,null,null,null,8.821579580353033,-116.33313610173957,null,0,0]
[31443,31.443000000000001,9.667527745752345,1.4671719110337906,1.0000241800819165,6.9540771776405597E-3,1,0,2667.0898252069082,1.5704213862833403,3.2683456129736537,1.2598442485253822,1.0001104683945592,1.4863258467054248E-2,1.000000000494331,3.144299998963783E-5,1.000000000494331,3.144299998963783E-5,1.1610238256009193,0.57347590983387497,4.4529243861498919,-135.1684296768095,44.831570323190505,null,1000000000,988662249,null,-2.3682869722313797,-18.646361208065027,null,null,null,8.7594116185423978,-116.52206846874449,null,0,0]
[31623,31.623000000000001,9.722280421694169,1.467757569592715,1.0000244577156909,6.9938855034990359E-3,1,0,2682.3579644188162,1.5704235204668715,3.2853087087093411,1.2615031819991736,1.0001117367285202,1.494833270067385E-2,1.0000000005000069,3.162299998945885E-5,1.0000000005000069,3.162299998945885E-5,1.1627462766760548,0.57621352075713972,4.3863673082387384,-135.266504931074,44.733495068926004,null,1000000000,1000014129,null,-2.37291562926917,-18.556307995661665,null,null,null,8.697483197669035,-116.71019693541236,null,0,0]
[31807,31.806999999999999,9.7782532314224397,1.4683494636232286,1.0000247431570612,7.034578435908892E-3,1,0,2697.9653956256948,1.5704256771103164,3.3026580100297491,1.2631813624708585,1.0001130407291634,1.5035297249145837E-2,1.0000000005058425,3.180699998927378E-5,1.0000000005058425,3.180699998927378E-5,1.1645145828179724,0.57900436239053177,4.3186518369103375,-135.36694348452909,44.633056515470912,null,1000000000,1011685249,null,-2.3775713649976278,-18.465261605430822,null,null,null,8.6344234620690941,-116.90168187909823,null,0,0]
[31991,31.991,9.8342294278533746,1.468934619763747,1.0000250302543865,7.0752713450210527E-3,1,0,2713.572826844977,1.5704278089453878,3.3200165153663042,1.2648419990487396,1.0001143522934746,1.5122261570182406E-2,1.000000000511712,3.1990999989086549E-5,1.000000000511712,3.1990999989086549E-5,1.1662905172786773,0.58178751712996102,4.2512562148102537,-135.46755931670296,44.53244068329704,null,1000000000,1023424081,null,-2.3821521029573893,-18.375218971826126,null,null,null,8.5716085779287727,-117.09234034487685,null,0,0]
[32175,32.174999999999997,9.8902089534832189,1.4695131520214042,1.0000253190076649,7.1159642307007708E-3,1,0,2729.1802580764506,1.5704299163977025,3.3373840811023685,1.2664853563939604,1.0001156714214237,1.5209225662469069E-2,1.0000000005176153,3.2174999988897156E-5,1.0000000005176153,3.2174999988897156E-5,1.1680740465399013,0.58456298713764099,4.1841761752069386,-135.568343943961,44.431656056039003,null,1000000000,1035230625,null,-2.3866594282137652,-18.286164955191747,null,null,null,8.5090358635818326,-117.28217898876927,null,0,0]
[32359,32.359000000000002,9.9461917520994039,1.4700851718545136,1.0000256094168953,7.1566570928132981E-3,1,0,2744.7876893199077,1.5704319998831966,3.3547605665211209,1.2681116940618782,1.0001169981129809,1.5296189524691353E-2,1.0000000005235523,3.2358999988705574E-5,1.0000000005235523,3.2358999988705574E-5,1.1698651371467728,0.58733077495575625,4.1174075414785003,-135.66928905038785,44.330710949612154,null,1000000000,1047104881,null,-2.3910948848267801,-18.198084707857248,null,null,null,8.4467026864664092,-117.47120434253058,null,0,0]
[32547.5,32.547499999999999,10.00354703183433,1.4706645419404472,1.0000259086457193,7.1983451362130435E-3,1,0,2760.7768240570767,1.5704341098952352,3.3725711257646158,1.2697604232645658,1.0001183650941072,1.5385279980553385E-2,1.0000000005296699,3.2547499988507043E-5,1.0000000005296699,3.2547499988507043E-5,1.1717078376867609,0.59015828998258513,4.0493246279477475,-135.77286081683681,44.227139183163189,null,1000000000,1059339756.25,null,-2.3955658630651713,-18.108844884781639,null,null,null,8.3830907511740484,-117.66401593205515,null,0,0]
[32736,32.735999999999997,10.06090563117086,1.4712373060805821,1.0000262096124801,7.2400331545924646E-3,1,0,2776.7659588063957,1.5704361956075907,3.3903907563604352,1.2713918256777772,1.0001197400132604,1.5474370192167517E-2,1.0000000005358227,3.2735999988306202E-5,1.0000000005358227,3.2735999988306202E-5,1.1735584030734136,0.59297774906857792,3.9815599440870613,-135.87658386614149,44.123416133858512,null,1000000000,1071645696,null,-2.3999645684259514,-18.020596407353001,null,null,null,8.3197247726741388,-117.85598745878849,null,0,0]
[32924.5,32.924500000000002,10.118267493654363,1.4718035762459558,1.0000265123171763,7.2817211478066858E-3,1,0,2792.7550935676554,1.5704382574376257,3.4082193160218344,1.2730061644606858,1.0001211228704079,1.556346015812053E-2,1.0000000005420113,3.2924499988103029E-5,1.0000000005420113,3.2924499988103029E-5,1.1754167975547125,0.59578915615566674,3.9141092781859554,-135.98044978555629,44.019550214443711,null,1000000000,1084022700.25,null,-2.4042925352053532,-17.933324221493468,null,null,null,8.2566020735524361,-118.0471255640628,null,0,0]
[33113,33.113,10.175632564100006,1.472363461899536,1.0000268167598065,7.3234091157108328E-3,1,0,2808.7442283406526,1.5704402957931998,3.4260566653532423,1.274603697651925,1.000122513665517,1.5652549876999228E-2,1.0000000005482352,3.3112999987897518E-5,1.0000000005482352,3.3112999987897518E-5,1.1772829854557583,0.5985925155827363,3.8469685077075129,-136.0844503342183,43.915549665781697,null,1000000000,1096470769,null,-2.4085512578101116,-17.847013565966076,null,null,null,8.1937200256787541,-118.23743676825228,null,0,0]
[33305.75,33.305750000000003,10.234294272534175,1.4729294804023227,1.0000271298636778,7.3660369716872735E-3,1,0,2825.0938608591882,1.5704423562473204,3.4443051299312639,1.2762201348707864,1.0001239440264789,1.5743647993051717E-2,1.0000000005546363,3.3305749987684939E-5,1.0000000005546363,3.3305749987684939E-5,1.1791992710974191,0.60145076378258833,3.7786302039199016,-136.19092653049901,43.809073469500987,null,1000000000,1109272983.0625,null,-2.4128359122049328,-17.759736128274117,null,null,null,8.1296663762859591,-118.43119040222489,null,0,0]
[33498.5,33.4985,10.292959222426191,1.4734890470126052,1.0000274447847315,7.4086648008930937E-3,1,0,2841.4434933895795,1.5704443929897833,3.4625624991558435,1.2778195299599928,1.0001253826873122,1.5834745847774483E-2,1.0000000005610747,3.3498499987469887E-5,1.0000000005610747,3.3498499987469887E-5,1.1811236303577821,0.60430060776233474,3.7106074842155703,-136.2975266043133,43.702473395686695,null,1000000000,1122149502.25,null,-2.4170512026981315,-17.67343375913542,null,null,null,8.0658589470748296,-118.62409284517787,null,0,0]
[33691.25,33.691249999999997,10.351627358665883,1.4740422710757941,1.0000277615229658,7.4512926031733966E-3,1,0,2857.7931259316229,1.5704464064275567,3.4808286329091236,1.2794021429646747,1.0001268296479813,1.5925843439656664E-2,1.00000000056755,3.3691249987252348E-5,1.00000000056755,3.3691249987252348E-5,1.1830560253555946,0.60714205341311434,3.6428962150236428,-136.40424228198052,43.595757718019485,null,1000000000,1135100326.5625,null,-2.4211986054881089,-17.588091582292495,null,null,null,8.0022950806728783,-118.81615069968804,null,0,0]
[33884,33.884,10.410298627382446,1.4745892594879977,1.0000280800783787,7.4939203783732887E-3,1,0,2874.1427584851203,1.5704483969583485,3.4991033939324705,1.280968228837605,1.0001282849084501,1.6016940767187401E-2,1.0000000005740626,3.3883999987032308E-5,1.0000000005740626,3.3883999987032308E-5,1.1849964183014432,0.60997510703614488,3.5754923503263187,-136.51106546422113,43.488934535778867,null,1000000000,1148125456,null,-2.4252795582800344,-17.503695012727871,null,null,null,7.9389721687674815,-119.00737045149326,null,0,0]
[34081.5,34.081499999999998,10.470418945120111,1.4751433687511799,1.0000284083689555,7.5375986152421519E-3,1,0,2890.8953002831304,1.5704504131881865,3.5178373139329171,1.2825560265859768,1.0001297846404529,1.6110282759561237E-2,1.0000000005807743,3.4081499986804232E-5,1.0000000005807743,3.4081499986804232E-5,1.1869928855716496,0.61286927873501684,3.5067421500269398,-136.62062434539072,43.379375654609277,null,1000000000,1161548642.25,null,-2.4293936170831465,-17.41818452660269,null,null,null,7.8743360272712151,-119.20243981878802,null,0,0]
[34279,34.279000000000003,10.530542440956468,1.4756911508742343,1.0000287385673736,7.5812768233502036E-3,1,0,2907.6478420927565,1.5704524061848293,3.536580008786371,1.2841269986627255,1.0001312930862878,1.6203624471182624E-2,1.0000000005875249,3.4278999986573493E-5,1.0000000005875249,3.4278999986573493E-5,1.1889976698149087,0.61575465438327204,3.4383063632616833,-136.73027942592734,43.269720574072664,null,1000000000,1175049841,null,-2.4334408476649112,-17.333636733200137,null,null,null,7.809947471087721,-119.39664269272723,null,0,0]
[34476.5,34.476500000000001,10.590669060765077,1.4762327132891908,1.0000290706736312,7.6249550025308151E-3,1,0,2924.4003839137999,1.570454376347554,3.5553313397172515,1.2856814034748185,1.0001328102459155,1.6296965900426313E-2,1.0000000005943144,3.4476499986340077E-5,1.0000000005943144,3.4476499986340077E-5,1.1910107306904067,0.6186312420598401,3.370180908505354,-136.8400225412862,43.159977458713797,null,1000000000,1188629052.25,null,-2.4374226785184652,-17.250036849675318,null,null,null,7.7458038471849502,-119.58998569161092,null,0,0]
[34674,34.673999999999999,10.650798751638948,1.4767681610168071,1.0000294046877263,7.6686331526173573E-3,1,0,2941.1529257460661,1.5704563240665403,3.5740911707990253,1.2872194943278721,1.000134336119296,1.6390307045667109E-2,1.0000000006011431,3.4673999986103978E-5,1.0000000006011431,3.4673999986103978E-5,1.1930320279663531,0.6214990502690747,3.3023617908635683,-136.94984570490638,43.05015429509362,null,1000000000,1202286276,null,-2.4413405007068394,-17.167370384948011,null,null,null,7.6819025517315342,-119.78247531995837,null,0,0]
[34875.75,34.875749999999996,10.712225489695582,1.477308924323578,1.0000297478593259,7.7132511820495282E-3,1,0,2958.2659653253509,1.5704582909215958,3.5932633324911492,1.2887740972224666,1.0001359038249225,1.648565650290492E-2,1.0000000006081589,3.4875749985859997E-5,1.0000000006081589,3.4875749985859997E-5,1.1951052839569878,0.62441951520052696,3.2333955044215812,-137.06210667953277,42.937893320467225,null,1000000000,1216317938.0625,null,-2.445277949542096,-17.08387401414571,null,null,null,7.6168737141248064,-119.97823266538705,null,0,0]
[35077.5,35.077500000000001,10.77365532455315,1.4778435210758238,1.0000300930217518,7.7578691807705154E-3,1,0,2975.3790049159484,1.5704602351517232,3.6124440861564304,1.2903121950586907,1.000137480623275,1.6581005660357192E-2,1.0000000006152154,3.5077499985613184E-5,1.0000000006152154,3.5077499985613184E-5,1.1971870501286097,0.62733083801713474,3.1647407206239291,-137.17443489046994,42.825565109530061,null,1000000000,1230431006.25,null,-2.4491514251343012,-17.001322000040378,null,null,null,7.5520924059193559,-120.17311289042958,null,0,0]
[35279.25,35.279249999999998,10.835088203539454,1.4783720558549034,1.0000304401750022,7.8024871486027034E-3,1,0,2992.492044517664,1.5704621571450745,3.6316332956573487,1.2918340421343557,1.0001390665143104,1.6676354516291632E-2,1.0000000006223126,3.5279249985363517E-5,1.0000000006223126,3.5279249985363517E-5,1.1992772839602339,0.63023302911595325,3.0963934463682308,-137.28682237745483,42.713177622545174,null,1000000000,1244625480.5625,null,-2.4529622966690603,-16.9196997945809,null,null,null,7.4875560031984172,-120.36712258287392,null,0,0]
[35481,35.481000000000002,{"$f":"SQRT(1+(A397/p_dom)^2)","v":10.896524075167546},{"$f":"ATAN(A397/p_dom)","v":1.4788946308973314},{"$f":"SQRT(1+(A397/z_ESR)^2)","v":1.0000307893190747},{"$f":"ATAN(A397/z_ESR)","v":7.8471050853684745E-3},{"$f":"IF(VIN_nom>Vout, 1, SQRT(1+(A397/z_RHP)^2))","v":1},{"$f":"IF(VIN_nom>Vout, 0, -ATAN(A397/z_RHP))","v":0},{"$f":"SQRT(1+(A397/EA_p1)^2)","v":3009.605084130309},{"$f":"ATAN(A397/EA_p1)","v":1.5704640572809749},{"$f":"SQRT(1+(A397/EA_z1)^2)","v":3.6508308276592145},{"$f":"ATAN(A397/EA_z1)","v":1.2933398877031175},{"$f":"SQRT(1+(A397/EA_hf_p)^2)","v":1.0001406614979855},{"$f":"ATAN(A397/EA_hf_p)","v":1.6771703068975959E-2},{"$f":"SQRT(1+(A397/Zero3)^2)","v":1.0000000006294507},{"$f":"ATAN(A397/Zero3)","v":3.5480999985110978E-5},{"$f":"SQRT(1+(A397/pole5)^2)","v":1.0000000006294507},{"$f":"ATAN(A397/pole5)","v":3.5480999985110978E-5},{"$f":"SQRT((1-(Z397/pterm2))^2+(A397/pterm1)^2)","v":1.2013759430574942},{"$f":"IF((ATAN((A397/pterm1)/(1-A397^2/pterm2))>0),ATAN((A397/pterm1)/(1-A397^2/pterm2)),PI()+ATAN((A397/pterm1)/(1-A397^2/pterm2)))","v":0.63312609932817365},{"$f":"20*LOG10(((E397*K397*G397*O397)/(C397*I397*S397*M397*Q397))*Adc)","v":3.0283497731962257},{"$f":"((F397+L397+H397+P397)-(D397+J397+T397+N397+R397))*radconv","v":-137.3992613592518},{"$f":"IF(V397>0,V397,V397+180)","v":42.600738640748204},null,{"$f":"IF(U397<0,A397,1000000000)","v":1000000000},{"$f":"A397^2","v":1258901361},null,{"$f":"20*LOG10((K397/(I397*M397))*Aea_stability*Afb*0.8)","v":-2.4567118973950985},{"$f":"(L397-(J397+N397))*radconv","v":-16.838993138219248},null,null,null,{"$f":"20*LOG10((E397*G397/(C397*S397))*Am_stability)","v":7.4232619307524494},{"$f":"(F397+H397-(D397+T397))*radconv","v":-120.5602682210326},null,{"$f":"SUM((U398<0)*(U397>0))*A397","v":0},0]
[35687.75,{"$f":"A398/1000","v":35.687750000000001},10.959485573227449,1.4794240784213002,1.0000311491814762,7.892828762623828E-3,1,0,3027.1422387383018,1.5704659822192797,3.6705126327717177,1.2948667071426521,1.0001423054437795,1.6869414342473049E-2,1.0000000006368077,3.5687749984849173E-5,1.0000000006368077,3.5687749984849173E-5,1.2035353103811024,0.63608141795127549,2.9589307424928695,-137.51453240292926,42.485467597070738,null,1000000000,1273615500.0625,null,-2.4604922156778413,-16.75722156258486,null,null,null,7.3576232183318417,-120.7573108403444,null,0,0]
[35894.5,35.894500000000001,11.022450108295121,1.4799474772689847,1.0000315111345959,7.9385524068761593E-3,1,0,3044.6793933573827,1.5704678849825466,3.6902029032155577,1.2963772363949315,1.0001439589383934,1.6967125293819409E-2,1.0000000006442076,3.5894499984584326E-5,1.0000000006442076,3.5894499984584326E-5,1.2057034360233323,0.63902718239513523,2.8898224997116007,-137.62984154071091,42.370158459289087,null,1000000000,1288415130.25,null,-2.4642109125955609,-16.676382056934791,null,null,null,7.2922336724682904,-120.95345948377611,null,0,0]
[36101.25,36.10125,11.085417628620476,1.4804649302244346,1.0000318751784314,7.9842760179343244E-3,1,0,3062.2165479873606,1.5704697659517612,3.7099015042017172,1.2978717280012046,1.0001456219817804,1.7064835921150864E-2,1.0000000006516501,3.6101249984316415E-5,1.0000000006516501,3.6101249984316415E-5,1.207880274785097,0.64196340568762866,2.8210211006035699,-137.74518096031656,42.25481903968344,null,1000000000,1303300251.5625,null,-2.4678693127042428,-16.596460173443347,null,null,null,7.2270906734689397,-121.14872078687324,null,0,0]
[36308,36.308,11.148388083620164,1.4809765377623438,1.0000322413129807,8.0299995956071724E-3,1,0,3079.7537026280493,1.5704716254992319,3.729608303732399,1.2993504294550891,1.0001472945738923,1.7162546222603287E-2,1.0000000006591354,3.6307999984045408E-5,1.0000000006591354,3.6307999984045408E-5,1.2100657816150076,0.64489010130329383,2.7525226846510273,-137.86054303145244,42.139456968547563,null,1000000000,1318270864,null,-2.4714687056302638,-16.517441752995666,null,null,null,7.1621916504424208,-121.34310127845677,null,0,0]
[36519.5,36.519500000000001,11.212808245108631,1.4814939532838907,1.0000326180226407,8.0767736197643481E-3,1,0,3097.6937665156324,1.5704735059827886,3.7497762077088628,1.3008470178994063,1.0001490154734134,1.7262501040693667E-2,1.0000000006668368,3.6519499983764969E-5,1.0000000006668368,3.6519499983764969E-5,1.2123104218634955,0.64787419257647105,2.6827601092753173,-137.97857117014871,42.021428829851288,null,1000000000,1333673880.25,null,-2.4750910460830902,-16.437528284366746,null,null,null,7.0960514155195362,-121.54104288578198,null,0,0]
[36731,36.731000000000002,11.277231374180515,1.4820054572902774,1.0000329969201796,8.1235476085799001E-3,1,0,3115.6338304140436,1.5704753648104017,3.76995242047711,1.3023275906022658,1.0001507463653545,1.7362455513812863E-2,1.0000000006745831,3.6730999983481256E-5,1.0000000006745831,3.6730999983481256E-5,1.2145640381540377,0.65084834327673458,2.6133066847877373,-138.09660742695857,41.90339257304143,null,1000000000,1349166361,null,-2.4786542597304697,-16.358531189570602,null,null,null,7.0301612046793363,-121.738076237388,null,0,0]
[36942.5,36.942500000000003,11.341657420266218,1.4825111502522532,1.000033378005595,8.1703215618492038E-3,1,0,3133.5738943230967,1.5704772023540194,3.7901368093454018,1.3037923968958824,1.0001524872496637,1.7462409639965405E-2,1.0000000006823742,3.6942499983194264E-5,1.0000000006823742,3.6942499983194264E-5,1.2168265827502822,0.65381256922751152,2.5441585359998538,-138.21464420057237,41.785355799427634,null,1000000000,1364748306.25,null,-2.4821596206301955,-16.28043620412036,null,null,null,6.9645184167911793,-121.93420799645196,null,0,0]
[37154,37.154000000000003,11.406086333936431,1.4830111303825166,1.0000337612788845,8.2170954793676365E-3,1,0,3151.5139582426104,1.5704790189771205,3.8103292443804144,1.3052416811010894,1.0001542381262889,1.7562363417155849E-2,1.0000000006902099,3.7153999982903958E-5,1.0000000006902099,3.7153999982903958E-5,1.2190980080857003,0.65676688670625627,2.4753118699279724,-138.33267407296313,41.66732592703687,null,1000000000,1380419716,null,-2.4856083691471089,-16.203229350174865,null,null,null,6.8991204992362096,-122.12944472278826,null,0,0]
[37370.25,37.370249999999999,11.471965147247525,1.483516532662011,1.0000341554220946,8.2649198377616733E-3,1,0,3169.8569314097172,1.5704808551385332,3.8309833605409738,1.3067077147146897,1.0001560386566042,1.7664561656245061E-2,1.0000000006982677,3.7370249982603705E-5,1.0000000006982677,3.7370249982603705E-5,1.2214295793031238,0.6597773267601289,2.4052268499227951,-138.4533400597318,41.546659940268199,null,1000000000,1396535585.0625,null,-2.4890772958876211,-16.125192543475016,null,null,null,6.8325044059715454,-122.32814751625679,null,0,0]
[37586.5,37.586500000000001,11.537846857396168,1.4840161633209161,1.0000345518525506,8.3127441583483366E-3,1,0,3188.1999045873881,1.5704826701716221,3.8516456221440833,1.3081580222602052,1.0001578496329917,1.7766759526302894E-2,1.0000000007063725,3.7586499982299949E-5,1.0000000007063725,3.7586499982299949E-5,1.2237703346179398,0.66277744411374384,2.3354492404409708,-138.57398371762983,41.426016282370171,null,1000000000,1412744982.25,null,-2.4924895580338537,-16.048055542398078,null,null,null,6.7661390586359493,-122.52592817523177,null,0,0]
[37802.75,37.802750000000003,11.603731415040833,1.4845101204192888,1.0000349505702493,8.3605684409089089E-3,1,0,3206.5428777754419,1.5704844644389804,3.8723158988001263,1.3095928494226532,1.0001596710553948,1.7868957025196579E-2,1.000000000714524,3.7802749981992689E-5,1.000000000714524,3.7802749981992689E-5,1.2261202237491013,0.66576725758156097,2.2659752395430761,-138.69459768702464,41.30540231297536,null,1000000000,1429047907.5625,null,-2.4958463788726952,-15.971804290882295,null,null,null,6.7000218785769006,-122.72279339614235,null,0,0]
[38019,38.018999999999998,11.669618771952178,1.4849984998137933,1.0000353515751881,8.4083926852246711E-3,1,0,3224.8858509737015,1.5704862382949505,3.8929940628387114,1.3110124369251011,1.0001615029237561,1.7971154150793364E-2,1.0000000007227221,3.8018999981681886E-5,1.0000000007227221,3.8018999981681886E-5,1.2284791966091511,0.66874678643614627,2.1968011258037432,-138.81517479211197,41.184825207888025,null,1000000000,1445444361,null,-2.4991489492690921,-15.896425016691998,null,null,null,6.6341503352339632,-122.91874977542001,null,0,0]
[38240.5,38.240499999999997,11.737108559076809,1.4854930512795275,1.0000357646867106,8.4573779406811132E-3,1,0,3243.6741449189653,1.5704880344168206,3.9141822864012146,1.3124509357707967,1.0001633900946005,1.8075831973446494E-2,1.0000000007311678,3.8240499981359848E-5,1.0000000007311678,3.8240499981359848E-5,1.2309048043902211,0.67178800911633896,2.1262547298928554,-138.93863367468663,41.061366325313372,null,1000000000,1462335840.25,null,-2.5024766672064103,-15.820105611561271,null,null,null,6.5669316572603904,-123.11852806312535,null,0,{"$f":"IF(AJ410>0,W410,0)","v":0}]
[38462,38.462000000000003,11.804601184051863,1.4859819476829632,1.0000361801978723,8.5063631555487296E-3,1,0,3262.4624388745729,1.5704898098512092,3.9353785222725404,1.3138739418152272,1.0001652882246408,1.8180509399928053E-2,1.0000000007396628,3.8461999981034064E-5,1.0000000007396628,3.8461999981034064E-5,1.2333398365705424,0.67481848411583911,2.0560153050657517,-139.0620392157619,40.937960784238101,null,1000000000,1479325444,null,-2.5057498977942916,-15.744672670552568,null,null,null,6.4999654630211694,-123.31736654520934,null,0,0]
[38683.5,38.683500000000002,11.872096598477977,1.4864652852390976,1.0000365981086701,8.5553483295924861E-3,1,0,3281.2507328403472,1.570491564953483,3.9565826416818783,1.3152816983356648,1.000167197313814,1.8285186427946319E-2,1.0000000007482066,3.8683499980704505E-5,1.0000000007482066,3.8683499980704505E-5,1.235784239969036,0.67783823357818029,1.986079100907743,-139.18538427826439,40.814615721735606,null,1000000000,1496413172.25,null,-2.5089698214874376,-15.670112275134588,null,null,null,6.4332491825563061,-123.51527200312978,null,0,0]
[38905,38.905000000000001,11.939594755048228,1.4869431579977215,1.000037018419101,8.6043334625773484E-3,1,0,3300.0390268161132,1.570493300070916,3.9777945185567432,1.3166744436648814,1.0001691173620575,1.8389863055209638E-2,1.0000000007567995,3.8904999980371144E-5,1.0000000007567995,3.8904999980371144E-5,1.2382379616255645,0.68084728010963946,1.9164424463899878,-139.30866191041187,40.691338089588129,null,1000000000,1513599025,null,-2.5121375873333882,-15.596410789611435,null,null,null,6.3667802938845046,-123.71225112080049,null,0,0]
[39131.5,39.131500000000003,12.008619359553121,1.4874262625087216,1.000037450698845,8.6544243120673155E-3,1,0,3319.2514357902019,1.5704950540427498,3.9994931123475954,1.3180833479104999,1.000171092085119,1.849690216920866E-2,1.0000000007656371,3.9131499980026316E-5,1.0000000007656371,3.9131499980026316E-5,1.2407566532360195,0.68391320690999702,1.845539883165872,-139.43464554943486,40.565354450565138,null,1000000000,1531274292.25,null,-2.5153240884250687,-15.521919907172739,null,null,null,6.2990642317520695,-123.91272564226213,null,0,0]
[39358,39.357999999999997,12.077646734713772,1.4879038449556397,1.0000378854877741,8.7045151181267197E-3,1,0,3338.4638447743855,1.5704967878268412,4.0211995594889309,1.3194770443592017,1.0001730782674676,1.8603940859309241E-2,1.000000000774526,3.9357999979677469E-5,1.000000000774526,3.9357999979677469E-5,1.2432849772500469,0.6869679913707134,1.7749430268534636,-139.56054455256364,40.439455447436359,null,1000000000,1549052164,null,-2.5184583841680723,-15.448299186354024,null,null,null,6.231601671182661,-124.11224536620962,null,0,0]
[39584.5,39.584499999999998,12.146676833294769,1.4883759992651375,1.0000383227858847,8.7546058805042567E-3,1,0,3357.676253768489,1.570498501769729,4.0429137334865821,1.3208557725923977,1.0001750759090346,1.8710979123061175E-2,1.0000000007834662,3.9584499979324583E-5,1.0000000007834662,3.9584499979324583E-5,1.2458228777677725,0.69001165909816742,1.7046481958843398,-139.68635206126248,40.313647938737518,null,1000000000,1566932640.25,null,-2.5215416076155117,-15.375534919866402,null,null,null,6.1643900636609796,-124.31081714139614,null,0,0]
[39811,39.811,12.215709609126554,1.4888428172505097,1.0000387625931739,8.8046965989486154E-3,1,0,3376.8886627723437,1.5705001962100658,4.0646355105048713,1.3222197673004876,1.0001770850097516,1.88180169580143E-2,1.0000000007924579,3.9810999978967646E-5,1.0000000007924579,3.9810999978967646E-5,1.2483702991384555,0.69304423615999444,1.6346517864094265,-139.81206140211927,40.187938597880731,null,1000000000,1584915721,null,-2.5245748616117494,-15.303613680203458,null,null,null,6.097426908182304,-124.5084477219158,null,0,0]
[40042.75,40.042749999999998,12.286345206394891,1.4893150258376791,1.0000392151917603,8.8559483148011528E-3,1,0,3396.5463925246186,1.5705019100848385,4.0868685153795665,1.3236003678252346,1.0001791525395987,1.892753535600878E-2,1.0000000008017109,4.0042749978598193E-5,1.0000000008017109,4.0042749978598193E-5,1.2509865633509827,0.69613565315732229,1.5633381412100409,-139.94057615752516,40.059423842474843,null,1000000000,1603421827.5625,null,-2.5276278222124402,-15.230884236634013,null,null,null,6.0291662235836103,-124.70969192089116,null,0,0]
[40274.5,40.274500000000003,12.356983511963085,1.4897818357970301,1.0000396704171859,8.9071999841279972E-3,1,0,3416.204122286756,1.5705036042354461,4.1091092257572557,1.3249660258236038,1.0001812320658241,1.9037053299906615E-2,1.0000000008110177,4.0274499978224445E-5,1.0000000008110177,4.0274499978224445E-5,1.2536126778302783,0.69921551603772303,1.4923295188999774,-140.06897458243904,39.93102541756096,null,1000000000,1622035350.25,null,-2.5306307131553005,-15.159009780633022,null,null,null,5.961160492216405,-124.909964801806,null,0,0]
[40506.25,40.506250000000001,12.427624479649412,1.4902433389838261,1.0000401282694469,8.9584516066599611E-3,1,0,3435.8618520585856,1.5705052790004346,4.1313575171927504,1.3263169775666861,1.0001833235883537,1.9146570787083497E-2,1.000000000820378,4.0506249977846374E-5,1.000000000820378,4.0506249977846374E-5,1.2562485837862885,0.702283854151457,1.4216222982291724,-140.19725010335182,39.80274989664818,null,1000000000,1640756289.0625,null,-2.5335846236583937,-15.087976794111022,null,null,null,5.893407182048696,-125.10927330924082,null,0,0]
[40738,40.738,12.498268064314512,1.490699625185727,1.0000405887485395,9.0097031821278657E-3,1,0,3455.5195818399434,1.570506934710646,4.153613267865186,1.3276534544789711,1.0001854271071116,1.9256087814915168E-2,1.0000000008297922,4.0737999977463952E-5,1.0000000008297922,4.0737999977463952E-5,1.2588942227091422,0.70534069730626436,1.3512129341864811,-140.32539633174963,39.67460366825037,null,1000000000,1659584644,null,-2.5364906138253414,-15.017772036226969,null,null,null,5.8259038081729484,-125.30762429552264,null,0,0]
[40975.25,40.975250000000003,12.570590860568892,1.4911614276488092,1.0000410628770184,9.0621710350563718E-3,1,0,3475.6438381198786,1.5705086103140451,4.1764048048516749,1.3290068917592008,1.0001875929741442,1.9368203473794462E-2,1.0000000008394856,4.0975249977067908E-5,1.0000000008394856,4.0975249977067908E-5,1.2616126705753254,0.70845821108835128,1.279437502435494,-140.45644337483844,39.543556625161557,null,1000000000,1678971112.5625,null,-2.5394170078048166,-14.946745551227011,null,null,null,5.757054770401437,-125.50969782361142,null,0,0]
[41212.5,41.212499999999999,12.642916306975316,1.4916179466062676,1.000041539758483,9.1146388380895019E-3,1,0,3495.7680944094609,1.5705102666253912,4.1992039090915343,1.3303456347993161,1.0001897714134009,1.9480318645701409E-2,1.0000000008492351,4.1212499976667263E-5,1.0000000008492351,4.1212499976667263E-5,1.2643411956760997,0.71156374246781051,1.2079669499776196,-140.58734194180064,39.412658058199355,null,1000000000,1698470156.25,null,-2.5422953387777869,-14.876559850915026,null,null,null,5.6884625489165339,-125.71078209088563,null,0,0]
[41449.75,41.449750000000002,12.715244358310883,1.4920692720285778,1.0000420193929298,9.1671065909384487E-3,1,0,3515.8923507085233,1.5705119039759554,4.2220104579939317,1.3316699168883683,1.0001919624248004,1.9592433327820659E-2,1.0000000008590408,4.1449749976261984E-5,1.0000000008590408,4.1449749976261984E-5,1.2670797361588975,0.71465732483826494,1.1367977082605036,-140.71808575323607,39.281914246763932,null,1000000000,1718081775.0625,null,-2.5451266552108036,-14.807201587632111,null,null,null,5.6201246236324369,-125.91088416560395,null,0,0]
[41687,41.686999999999998,12.787574970374223,1.4925154918591821,1.0000425017803547,9.2195742933144174E-3,1,0,3536.0166070169034,1.5705135226894675,4.2448243315630458,1.3329799665054962,1.0001941660082594,1.970454751733695E-2,1.0000000008689029,4.1686999975852028E-5,1.0000000008689029,4.1686999975852028E-5,1.2698282304854769,0.71773899204424818,1.0659262836473842,-140.84866871459491,39.151331285405092,null,1000000000,1737805969,null,-2.5479119774615948,-14.738657688874936,null,null,null,5.5520385212701049,-126.11001102571996,null,0,0]
[41929.75,41.929749999999999,12.861584977578683,1.492966861249581,1.0000429982000727,9.2732582650150077E-3,1,0,3556.6073898245268,1.57051515996832,4.2681745419583432,1.3343058882677161,1.0001964336883697,1.9819260258508695E-2,1.0000000008790519,4.1929749975427719E-5,1.0000000008790519,4.1929749975427719E-5,1.2726506800165898,0.72087980243855287,0.99371658228854476,-140.98210623481106,39.017893765188944,null,1000000000,1758103935.0625,null,-2.5507152996878575,-14.669354332949652,null,null,null,5.4826321421375273,-126.31275190186142,null,0,0]
[42172.5,42.172499999999999,12.935597575144973,1.4934130656001003,1.0000434975018804,9.3269421832636382E-3,1,0,3577.1981726415743,1.5705167783984246,4.2915321744336152,1.3356173790578463,1.0001987145300184,1.9933972478010705E-2,1.0000000008892598,4.2172499974998464E-5,1.0000000008892598,4.2172499974998464E-5,1.2754834209180512,0.72400821189963993,0.92181149785755923,-141.11536302591992,38.884636974080081,null,1000000000,1778519756.25,null,-2.5534725453963594,-14.600876700977141,null,null,null,5.4134843034150446,-126.51448632494279,null,0,0]
[42415.25,42.41525,13.009612718862849,1.4938541928873823,1.0000439996857735,9.3806260477509572E-3,1,0,3597.7889554678845,1.5705183783034053,4.3148971084560568,1.3369146687561135,1.0002010085331152,2.0048684172827583E-2,1.0000000008995267,4.2415249974564228E-5,1.0000000008995267,4.2415249974564228E-5,1.278326388302754,0.72712425806433734,0.85020751839956654,-141.24843313226361,38.751566867736386,null,1000000000,1799053432.5625,null,-2.5561847218966798,-14.533211640160122,null,null,null,5.344592500457372,-126.71522149210347,null,0,0]
[42658,42.658000000000001,13.083630365520959,1.4942903291052447,1.0000445047517481,9.4343098581676169E-3,1,0,3618.3797383032988,1.5705199599995203,4.3382692260522413,1.3381979824824208,1.0002033156975694,2.0163395339944025E-2,1.0000000009098524,4.2657999974125004E-5,1.0000000009098524,4.2657999974125004E-5,1.2811795176339391,0.73022797900869296,0.77890120538503593,-141.38131078206666,38.618689217933337,null,1000000000,1819704964,null,-2.5588528094296419,-14.466346270025756,null,null,null,5.2759542749758044,-126.91496451204091,null,0,0]
[42906.5,42.906500000000001,13.159403810785975,1.4947317139957363,1.0000450247664667,9.489265216414574E-3,1,0,3639.4582533881621,1.5705215606228566,4.3622022774231484,1.3394974476450603,1.0002056911442276,2.0280823111633647E-2,1.0000000009204839,4.290649997367017E-5,1.0000000009204839,4.290649997367017E-5,1.2841106876619854,0.73339249114522187,0.70621067672818783,-141.5171307083734,38.482869291626599,null,1000000000,1840967742.25,null,-2.5615394237487701,-14.398712225182148,null,null,null,5.2059503606380817,-127.11841848319126,null,0,0]
[43155,43.155000000000001,13.235179790418508,1.4951680448082598,1.0000455478014099,9.5442205173429731E-3,1,0,3660.5367684822422,1.570523142812414,4.3861426144579685,1.3407827295399941,1.0002080803829383,2.0398250323933283E-2,1.0000000009311769,4.3154999973210038E-5,1.0000000009311769,4.3154999973210038E-5,1.2870523710159207,0.73654416935292677,0.63382501813928449,-141.65273728382172,38.347262716178278,null,1000000000,1862354025,null,-2.5641818312654157,-14.331889733490293,null,null,null,5.1362071095658273,-127.32084755033145,null,0,0]
[43403.5,43.403500000000001,13.310958261135987,1.4955994076929084,1.0000460738565724,9.599175760620967E-3,1,0,3681.6152835853809,1.5705247068848114,4.4100901185052148,1.3420540549381628,1.0002104834136023,2.0515676973608506E-2,1.0000000009419319,4.3403499972744572E-5,1.0000000009419319,4.3403499972744572E-5,1.2900044996121198,0.73968305582087657,0.56174076700231934,-141.78812488666082,38.211875113339175,null,1000000000,1883863812.25,null,-2.5667810009143026,-14.265865819887976,null,null,null,5.0667220280777503,-127.52225906677286,null,0,0]
[43652,43.652000000000001,13.386739180634468,1.4960258868565206,1.0000466029319495,9.6541309459167064E-3,1,0,3702.6937986974235,1.5705262531494582,4.4340446734415249,1.3433116458927308,1.0002129002361204,2.0633103057424985E-2,1.0000000009527485,4.3651999972273747E-5,1.0000000009527485,4.3651999972273747E-5,1.2929670057566267,0.74280919316200911,0.48995453277793566,-141.92328807798106,38.076711922018944,null,1000000000,1905497104,null,-2.5693378755216054,-14.200627779208553,null,null,null,4.9974926684606702,-127.72266029877242,null,0,0]
[43906,43.905999999999999,13.464199831456694,1.4964568438319787,1.0000471468384626,9.7103023828937485E-3,1,0,3724.2388403099239,1.5705278155487346,4.4585365780587987,1.3445831034318338,1.0002153848026865,2.075312752074087E-2,1.0000000009638683,4.3905999971786935E-5,1.0000000009638683,4.3905999971786935E-5,1.2960057349988541,0.74599138994712288,0.41688399582110269,-142.06120541633325,37.938794583666748,null,1000000000,1927736836,null,-2.5719085864434672,-14.134745042383352,null,null,null,4.9269928424256975,-127.92646037394991,null,0,0]
[44160,44.16,13.54166295429455,1.4968828704318096,1.0000476939003515,9.7664737585924505E-3,1,0,3745.7838819314111,1.5705293599747598,4.4830356116039169,1.3458406663834099,1.0002178837781555,2.0873151386040099E-2,1.0000000009750527,4.4159999971294444E-5,1.0000000009750527,4.4159999971294444E-5,1.2990551644783679,0.74916035833185035,0.34411787258318333,-142.19887737413768,37.80112262586232,null,1000000000,1950105600,null,-2.5744370213275767,-14.069657342727163,null,null,null,4.8567551540718874,-128.12922003141054,null,0,0]
[44414,44.414000000000001,13.619128506966915,1.4973040506319069,1.0000482441176108,9.8226450726584466E-3,1,0,3767.3289235617303,1.5705308867358965,4.5075416578371268,1.3470845573582402,1.0002203971624195,2.0993174649869092E-2,1.0000000009863017,4.4413999970796261E-5,1.0000000009863017,4.4413999970796261E-5,1.3021152231745194,0.75231614510235134,0.2716527630991763,-142.33629870634007,37.663701293659926,null,1000000000,1972603396,null,-2.5769241077392815,-14.005351943051737,null,null,null,4.7867771309995808,-128.33094676328832,null,0,0]
[44668,44.667999999999999,13.696596448245629,1.4977204665152613,1.0000487974902355,9.8788163247373745E-3,1,0,3788.8739652007316,1.5705323961334932,4.5320546029999216,1.3483149943221915,1.0002229249553696,2.1113197308774395E-2,1.0000000009976151,4.4667999970292352E-5,1.0000000009976151,4.4667999970292352E-5,1.3051858404957728,0.75545879744596234,0.19948533770405902,-142.47346434814875,37.526535651851248,null,1000000000,1995230224,null,-2.579370748221701,-13.941816371900947,null,null,null,4.7170563460868875,-128.53164797624783,null,0,0]
[44928.25,44.928249999999998,13.775973024219763,1.4981422711451959,1.0000493677520903,9.9363696787877973E-3,1,0,3810.9491505897008,1.5705339249700596,4.5571777602622472,1.3495619762912006,1.0002255298927003,2.1236172650091544E-2,1.0000000010092738,4.4928249969770063E-5,1.0000000010092738,4.4928249969770063E-5,1.3083428925134826,0.75866520539688964,0.12584749062202594,-142.61373481205612,37.386265187943877,null,1000000000,2018547648.0625,null,-2.5818365587858718,-13.877503131798806,null,null,null,4.6458843095690252,-128.73623168025733,null,0,0]
[45188.5,45.188499999999998,13.855352023119597,1.4985592427084353,1.0000499413264934,9.9939229670098929E-3,1,0,3833.0243359874748,1.5705354361968498,4.5823079260629598,1.3507952828327392,1.0002281499562973,2.135914734900898E-2,1.0000000010210002,4.5188499969241689E-5,1.0000000010210002,4.5188499969241689E-5,1.3115108805106257,0.76185792611127945,5.2515298500338613E-2,-142.75372664302876,37.246273356971244,null,1000000000,2042000532.25,null,-2.5842617496939861,-13.813972390201988,null,null,null,4.574977308355451,-128.93975425282679,null,45188.5,37.246273356971244]
[45448.75,45.448749999999997,13.934733403538647,1.4989714636556855,1.0000505182134392,1.0051476189022499E-2,1,0,3855.0995213939027,1.5705369301163765,4.6074449857230571,1.3520151339930204,1.0002307851460417,2.148212140181233E-2,1.0000000010327943,4.5448749968707189E-5,1.0000000010327943,4.5448749968707189E-5,1.3146897299613243,0.76503701155921999,-2.0514603142636065E-2,-142.89343495223329,37.106565047766708,null,45448.75,2065588876.5625,null,-2.5866472151718067,-13.751211556511096,null,null,null,4.5043328721902967,-129.14222339572217,null,0,0]
[45709,45.709000000000003,14.014117125007376,1.4993790145760082,1.0000510984129218,1.0109029344444458E-2,1,0,3877.1747068088362,1.570538407024263,4.6325888270214737,1.353221745203115,1.0002334354618139,2.1605094804787336E-2,1.0000000010446564,4.5708999968166536E-5,1.0000000010446564,4.5708999968166536E-5,1.3178793668150792,0.76820251408794282,-9.3245509580992064E-2,-143.0328550298141,36.967144970185899,null,45709,2089312681,null,-2.5889938252395002,-13.689208304160097,null,null,null,4.4339485758196364,-129.343646725654,null,0,0]
[45975.25,45.975250000000003,14.095333400112601,1.4997912108561997,1.0000516954167269,1.0167909304457969E-2,1,0,3899.7588302246963,1.5705399006786946,4.6583192568715752,1.3544426931402649,1.0002361625329796,2.1730902653098162E-2,1.0000000010568617,4.597524996760701E-5,1.0000000010568617,4.597524996760701E-5,1.3211536265655477,0.77142699521338931,-0.1673471604503374,-143.17518639859264,36.824813601407357,null,45975.25,2113723612.5625,null,-2.5913552090761387,-13.626546979117425,null,null,null,4.3622083087869283,-129.54863941947519,null,0,0]
[46241.5,46.241500000000002,14.176552042655999,1.5001986841916048,1.0000522958875571,1.0226789193967908E-2,1,0,3922.3429536491567,1.5705413771327559,4.6840565546448767,1.3556502254736851,1.0002389054354117,2.1856709813407739E-2,1.0000000010691381,4.6241499967040966E-5,1.0000000010691381,4.6241499967040966E-5,1.324439021584042,0.77463737187998039,-0.24114263455904239,-143.3172066731876,36.682793326812401,null,46241.5,2138276322.25,null,-2.5936776931766281,-13.564653286620761,null,null,null,4.2907353187787143,-129.75255338656686,null,0,0]
[46507.75,46.507750000000001,14.257773012179612,1.5006015151600658,1.0000528998254057,1.0285669012566149E-2,1,0,3944.9270770820699,1.5705428366818552,4.7098006077494912,1.3568445586441997,1.0002416641689797,2.1982516281739341E-2,1.0000000010814853,4.6507749966468363E-5,1.0000000010814853,4.6507749966468363E-5,1.3277354741259233,0.77783370126291951,-0.31463524786721869,-143.45891136184269,36.541088638157305,null,46507.75,2162970810.0625,null,-2.5959621354459554,-13.503514842222165,null,null,null,4.2195271477398659,-129.95539651962051,null,0,0]
[46774,46.774000000000001,14.338996269141012,1.5009997825197967,1.0000535072302665,1.0344548759844566E-2,1,0,3967.5112005232909,1.5705442796146754,4.7355513060126455,1.3580259045373184,1.0002444387335525,2.2108322054116357E-2,1.0000000010939034,4.6773999965889173E-5,1.0000000010939034,4.6773999965889173E-5,1.3310429069681615,0.78101604088256193,-0.38782824864111476,-143.60029614893506,36.399703851064942,null,46774,2187807076,null,-2.5982093705241605,-13.443119522088637,null,null,null,4.148581382044175,-130.15717662684642,null,0,0]
[47046.25,47.046250000000001,14.422052234434185,1.5014023860877448,1.000054131908205,1.0404755300493352E-2,1,0,3990.6042619659979,1.5705457381760259,4.7618890608590245,1.3592206588262341,1.0002472921935441,2.2236962162353269E-2,1.0000000011066748,4.7046249965290067E-5,1.0000000011066748,4.7046249965290067E-5,1.3344361478553748,0.78425568925934208,-0.46236416797874613,-143.74453195915544,36.255468040844562,null,47046.25,2213349639.0625,null,-2.6004696191333054,-13.382119248396545,null,null,null,4.0763057113156878,-130.36241271075892,null,0,0]
[47318.5,47.3185,14.505110510621446,1.5018003789917613,1.0000547602111627,1.0464961765708623E-2,1,0,4013.6973234170964,1.5705471799535264,4.7882335382229568,1.3604022679016099,1.0002501622058109,2.2365601534506226E-2,1.0000000011195203,4.7318499964683989E-5,1.0000000011195203,4.7318499964683989E-5,1.3378407078695964,0.78748083291738913,-0.53659347956669101,-143.88842470438539,36.111575295614614,null,47318.5,2239040442.25,null,-2.6026926584777046,-13.321871136143663,null,null,null,4.0042994390721427,-130.56655356824174,null,0,0]
[47590.75,47.59075,14.588171058231319,1.5021938398597696,1.0000553921391329,1.0525168155054047E-2,1,0,4036.7903848764431,1.5705486052352204,4.8145846277514908,1.3615709442749167,1.0002530487702102,2.2494240166324116E-2,1.0000000011324397,4.7590749964070897E-5,1.0000000011324397,4.7590749964070897E-5,1.3412565061395139,0.79069153436742934,-0.61051944877826814,-144.03197031154852,35.96802968845148,null,47590.75,2264879485.5625,null,-2.6048793102160199,-13.262363025579726,null,null,null,3.9325601215988764,-130.76960728596879,null,0,0]
[47863,47.863,14.671233838685128,1.5025828455447383,1.0000560276921084,1.0585374468093297E-2,1,0,4059.883446343897,1.5705500143025979,4.8409422214670466,1.3627268959724177,1.0002559518865988,2.2622878053555961E-2,1.0000000011454333,4.7862999963450744E-5,1.0000000011454333,4.7862999963450744E-5,1.344683462363053,0.7938878564269789,-0.68414527492378363,-144.17516488005683,35.824835119943174,null,47863,2290866769,null,-2.6070303736970057,-13.203583013562408,null,null,null,3.8610853589343503,-130.97158186649446,null,0,0]
[48141.75,48.141750000000002,14.756282026623092,1.5029766012289048,1.0000566821748369,1.0647018134250764E-2,1,0,4083.5278573128612,1.5705514404992873,4.8679357343946181,1.3638974748032431,1.0002589414645517,2.2754586409207873E-2,1.0000000011588139,4.814174996280844E-5,1.0000000011588139,4.814174996280844E-5,1.3482037150242006,0.79714565849686736,-0.75922122230616451,-144.3214106276379,35.678589372362097,null,48141.75,2317628093.0625,null,-2.6091967332685067,-13.144141834857347,null,null,null,3.7881757711234716,-131.17726879278055,null,0,0]
[48420.5,48.420499999999997,14.841332476205825,1.5033658440225406,1.0000573404577173,1.0708661719489188E-2,1,0,4107.1722682900354,1.5705528502751507,4.8949358440612585,1.3650551415506391,1.0002619483939836,2.2886293975276483E-2,1.0000000011722723,4.8420499962158656E-5,1.0000000011722723,4.8420499962158656E-5,1.3517354962456056,0.80038852055106713,-0.8339891072106691,-144.46728063223063,35.532719367769374,null,48420.5,2344544820.25,null,-2.6113274123105517,-13.08543947795455,null,null,null,3.7155385652610096,-131.38184115427609,null,0,0]
[48699.25,48.699249999999999,14.926385148772811,1.5037506509519603,1.0000580025407422,1.0770305223340243E-2,1,0,4130.81667927528,1.570554243912162,4.9219424419045392,1.3662001056308195,1.0002649726747379,2.3018000747199507E-2,1.0000000011858083,4.8699249961501343E-5,1.0000000011858083,4.8699249961501343E-5,1.3552787216859195,0.80361651090417974,-0.90845216022491293,-144.61277123851224,35.387228761487762,null,48699.25,2371616950.5625,null,-2.6134232007137639,-13.027463960083297,null,null,null,3.6431713006499762,-131.58530727842896,null,0,0]
[48978,48.978000000000002,15.011440006538715,1.5041310973030766,1.0000586684239039,1.0831948645335612E-2,1,0,4154.4610902684553,1.5705556216858756,4.9489554217059384,1.3673325720226304,1.0002680143066573,2.314970672041481E-2,1.0000000011994221,4.897799996083646E-5,1.0000000011994221,4.897799996083646E-5,1.3588333076262358,0.80682969813475769,-0.98261354714213767,-144.75787896044017,35.242121039559834,null,48978,2398844484,null,-2.6154848668685697,-12.970203552347497,null,null,null,3.5710715798875592,-131.7876754080927,null,0,0]
[49263.25,49.263249999999999,15.098480429976586,1.5045159775332466,1.0000593537684679,1.0895029407188221E-2,1,0,4178.656850763713,1.5705570154455184,4.9766047990832156,1.3684787167959593,1.000271144827142,2.3284483032684791E-2,1.0000000012134338,4.9263249960148207E-5,1.0000000012134338,4.9263249960148207E-5,1.3624824550321484,0.81010255858606683,-1.0581951949972408,-144.9059705149827,35.094029485017302,null,49263.25,2426867800.5625,null,-2.6175600625391815,-12.912336264475247,null,null,null,3.4975651277030693,-131.99363425050745,null,0,0]
[49548.5,49.548499999999997,15.185523064355047,1.5048964455920131,1.0000600430924451,1.0958110082330899E-2,1,0,4202.8526112669942,1.5705583931574536,5.0042606417200357,1.3696121947997704,1.0002742935170921,2.3419258498898001E-2,1.000000001227527,4.9548499959451925E-5,1.000000001227527,4.9548499959451925E-5,1.3661433235417904,0.81336006356993051,-1.1334674515653291,-145.05365425670794,34.946345743292056,null,49548.5,2455053852.25,null,-2.6196010881149379,-12.855193761095858,null,null,null,3.4243338967107348,-132.19846049561207,null,0,0]
[49833.75,49.833750000000002,15.272567871871795,1.505272576808752,1.0000607363958274,1.1021190670261806E-2,1,0,4227.0483717781626,1.5705597550972543,5.031922843015681,1.3707332119979654,1.0002774603763362,2.3554033114166227E-2,1.0000000012417012,4.9833749958747578E-5,1.0000000012417012,4.9833749958747578E-5,1.3698158254587811,0.81660228731983386,-1.2084335102291903,-145.20092696961211,34.799073030387888,null,49833.75,2483402639.0625,null,-2.6216087015199054,-12.798764256856124,null,null,null,3.3513754514518417,-132.402162712756,null,0,0]
[50119,50.119,15.359614815580509,1.5056444448101673,1.0000614336786062,1.108427117047911E-2,1,0,4251.2441322970808,1.5705611015342194,5.0595912986764491,1.3718419699760116,1.000280645404702,2.3688806873601424E-2,1.0000000012559571,5.011899995803512E-5,1.0000000012559571,5.011899995803512E-5,1.3734998737637381,0.81982930428330658,-1.2830965009744053,-145.34778560290579,34.652214397094212,null,50119,2511914161,null,-2.6235836400101027,-12.743036216909168,null,null,null,3.2786873991968219,-132.60474938599663,null,0,0]
[50410.75,50.41075,15.448647472638747,1.5060204515437301,1.000062150966827,1.1148788996621747E-2,1,0,4275.9912423186161,1.5705624628900274,5.0878965996516614,1.3729635174668551,1.0002839218050894,2.3826650836188137E-2,1.0000000012706218,5.0410749957297998E-5,1.0000000012706218,5.0410749957297998E-5,1.3772797246392574,0.82311420266681767,-1.3591505316132078,-145.49755935582277,34.502440644177227,null,50410.75,2541243715.5625,null,-2.6255705287151803,-12.686752156325834,null,null,null,3.2046202572631004,-132.81080719949694,null,0,0]
[50702.5,50.702500000000001,15.537682288812215,1.506392149103581,1.0000628724178506,1.1213306729945891E-2,1,0,4300.7383523479839,1.5705638085789337,5.1162082297138065,1.3740726536952406,1.0002872172117052,2.3964493893151043E-2,1.0000000012853716,5.070249995655229E-5,1.0000000012853716,5.070249995655229E-5,1.3810714721392601,0.82638335147395892,-1.434893952627635,-145.64689399575687,34.353106004243131,null,50702.5,2570743506.25,null,-2.6275247331260547,-12.631178259164813,null,null,null,3.1308310406595496,-133.01571573659203,null,0,0]
[50994.25,50.994250000000001,15.626719227195579,1.5067596110437422,1.0000635980316679,1.1277824369914631E-2,1,0,4325.4854623850515,1.5705651388698407,5.1445260843711802,1.3751695808615279,1.0002905316243609,2.4102336039260874E-2,1.0000000013002066,5.0994249955797949E-5,1.0000000013002066,5.0994249955797949E-5,1.3848750253451698,0.82963683093703089,-1.5103299184665688,-145.79578676392617,34.204213236073826,null,50994.25,2600413533.0625,null,-2.6294469792299613,-12.576302955306215,null,null,null,3.0573173209245197,-133.21948380861994,null,0,0]
[51286,51.286000000000001,{"$f":"SQRT(1+(A461/p_dom)^2)","v":15.715758251718979},{"$f":"ATAN(A461/p_dom)","v":1.5071229092559639},{"$f":"SQRT(1+(A461/z_ESR)^2)","v":1.0000643278082695},{"$f":"ATAN(A461/z_ESR)","v":1.1342341915991053E-2},{"$f":"IF(VIN_nom>Vout, 1, SQRT(1+(A461/z_RHP)^2))","v":1},{"$f":"IF(VIN_nom>Vout, 0, -ATAN(A461/z_RHP))","v":0},{"$f":"SQRT(1+(A461/EA_p1)^2)","v":4350.2325724296852},{"$f":"ATAN(A461/EA_p1)","v":1.5705664540255315},{"$f":"SQRT(1+(A461/EA_z1)^2)","v":5.1728500613974404},{"$f":"ATAN(A461/EA_z1)","v":1.3762544968564694},{"$f":"SQRT(1+(A461/EA_hf_p)^2)","v":1.0002938650428681},{"$f":"ATAN(A461/EA_hf_p)","v":2.4240177269288593E-2},{"$f":"SQRT(1+(A461/Zero3)^2)","v":1.0000000013151269},{"$f":"ATAN(A461/Zero3)","v":5.1285999955034941E-5},{"$f":"SQRT(1+(A461/pole5)^2)","v":1.0000000013151269},{"$f":"ATAN(A461/pole5)","v":5.1285999955034941E-5},{"$f":"SQRT((1-(Z461/pterm2))^2+(A461/pterm1)^2)","v":1.3886902940709815},{"$f":"IF((ATAN((A461/pterm1)/(1-A461^2/pterm2))>0),ATAN((A461/pterm1)/(1-A461^2/pterm2)),PI()+ATAN((A461/pterm1)/(1-A461^2/pterm2)))","v":0.83287472144556662},{"$f":"20*LOG10(((E461*K461*G461*O461)/(C461*I461*S461*M461*Q461))*Adc)","v":-1.5854615216843957},{"$f":"((F461+L461+H461+P461)-(D461+J461+T461+N461+R461))*radconv","v":-145.94423506188815},{"$f":"IF(V461>0,V461,V461+180)","v":34.055764938111849},null,{"$f":"IF(U461<0,A461,1000000000)","v":51286},{"$f":"A461^2","v":2630253796},null,{"$f":"20*LOG10((K461/(I461*M461))*Aea_stability*Afb*0.8)","v":-2.6313379731921249},{"$f":"(L461-(J461+N461))*radconv","v":-12.522114921201872},null,null,null,{"$f":"20*LOG10((E461*G461/(C461*S461))*Am_stability)","v":2.9840767116688549},{"$f":"(F461+H461-(D461+T461))*radconv","v":-133.4221201406863},null,{"$f":"SUM((U462<0)*(U461>0))*A461","v":0},0]
[51584.75,{"$f":"A462/1000","v":51.58475},15.806935727447929,1.5074906827551016,1.0000650794082975,1.1408407343034317E-2,1,0,4375.5734434771002,1.5705677853199054,5.2018598597142827,1.3773531987907783,1.0002972981357068,2.4381324789132755E-2,1.0000000013304933,5.1584749954244559E-5,1.0000000013304933,5.1584749954244559E-5,1.3926091501842401,0.8361742287643209,-1.6620835313540205,-146.09578195602049,33.904218043979512,null,51584.75,2660986432.5625,null,-2.633242669637164,-12.46732737208522,null,null,null,2.9093593984442712,-133.62845458393528,null,0,0]
[51883.5,51.883499999999998,15.898115316657508,1.5078542377605686,1.0000658353732437,1.1474472670486211E-2,1,0,4400.9143145321814,1.5705691012828471,5.230875867781128,1.3784397128826391,1.0003007511569537,2.4522471337311211E-2,1.0000000013459487,5.1883499953444974E-5,1.0000000013459487,5.1883499953444974E-5,1.3965401016892711,0.83945756113423053,-1.7383927697861299,-146.24685777550749,33.753142224492507,null,51883.5,2691897572.25,null,-2.6351160340109168,-12.413237200804323,null,null,null,2.8349235243859172,-133.83362057470319,null,0,0]
[52182.25,52.182250000000003,15.989296983191101,1.5082136463454474,1.0000665957030981,1.1540537897770266E-2,1,0,4426.2551855947968,1.5705704021776803,5.2598979828304993,1.379514238288932,1.0003042241064029,2.4663616908210121E-2,1.0000000013614936,5.2182249952636133E-5,1.0000000013614936,5.2182249952636133E-5,1.4004830541233548,0.84272480526507187,-1.8143923669305939,-146.39746022188692,33.602539778113083,null,52182.25,2722987215.0625,null,-2.6369587640420362,-12.359833011276146,null,null,null,2.7607666572725691,-134.03762721061076,null,0,0]
[52481,52.481000000000002,16.080480691711358,1.5085689789524119,1.0000673603978507,1.1606603024310007E-2,1,0,4451.5960566648173,1.570571688261732,5.2889261043291986,1.3805769699063926,1.0003077169838459,2.4804761496215862E-2,1.0000000013771275,5.2480999951817975E-5,1.0000000013771275,5.2480999951817975E-5,1.4044379138178611,0.84597604796097314,-1.8900853920291039,-146.54758715243159,33.452412847568411,null,52481,2754255361,null,-2.6387715383640509,-12.307103651162398,null,null,null,2.6868864064960762,-134.24048350126915,null,0,0]
[52786.5,52.786499999999997,16.173726693641896,1.5089281965732091,1.000068146884159,1.1674160730932163E-2,1,0,4477.5094829882983,1.5705729883492467,5.3186162004119941,1.3816517152517285,1.0003113093881064,2.4949094102817884E-2,1.0000000013932073,5.2786499950971639E-5,1.0000000013932073,5.2786499950971639E-5,1.4084943472582532,0.8492842923930799,-1.9671747318412602,-146.70061224469208,33.299387755307919,null,52786.5,2786414582.25,null,-2.6405949799127137,-12.253869417494499,null,null,null,2.6116205082325812,-134.44674282719757,null,0,0]
[53092,53.091999999999999,16.266974758659813,1.5092832959139419,1.0000689379348149,1.1741718330986885E-2,1,0,4503.4229093192607,1.5705742734749322,5.348312371696994,1.382714526900197,1.0003149226306034,2.5093425669737542E-2,1.0000000014093802,5.3091999950115457E-5,1.0000000014093802,5.3091999950115457E-5,1.4125630365226054,0.85257598795951384,-2.0439497941306941,-146.85313603647805,33.146863963521952,null,53092,2818760464,null,-2.6423884736661067,-12.201318017472785,null,null,null,2.536638939696541,-134.65181801900522,null,0,0]
[53397.5,53.397500000000001,16.360224851488283,1.509634347304464,1.0000697335498074,1.1809275823857761E-2,1,0,4529.3363356575755,1.5705755438955893,5.378014517546549,1.3837656001558958,1.0003185567111113,2.5237756190972814E-2,1.0000000014256465,5.3397499949249362E-5,1.0000000014256465,5.3397499949249362E-5,1.4166438840036579,0.85585122766846744,-2.1204136748757705,-147.0051567106745,32.994843289325502,null,53397.5,2851293006.25,null,-2.6441526873140226,-12.14943827536646,null,null,null,2.4619392725993787,-134.85571843530803,null,0,0]
[53703,53.703000000000003,16.453476937649452,1.50998141948426,1.000070533729126,1.1876833208928376E-2,1,0,4555.2497620031172,1.5705767998621754,5.4077225395140118,1.3848051261362546,1.0003222116294026,2.5382085660521948E-2,1.0000000014420061,5.3702999948373292E-5,1.0000000014420061,5.3702999948373292E-5,1.4207367929477637,0.85911010455221304,-2.196569410834261,-147.15667259996854,32.843327400031455,null,53703,2884012209,null,-2.6458882702563691,-12.098219254988292,null,null,null,2.3875191195832328,-135.05845334498028,null,0,0]
[54015.75,54.015749999999997,16.548944073528084,1.5103326764030063,1.0000713576260478,1.1945993725686617E-2,1,0,4581.7781551023509,1.5705780709182289,5.4381415664066779,1.3858575553984123,1.0003259748698909,2.5529839201829822E-2,1.0000000014588506,5.4015749947466063E-5,1.0000000014588506,5.4015749947466063E-5,1.4249392272092465,0.86242946698958911,-2.2742163527555999,-147.3112597172456,32.688740282754395,null,54015.75,2917701248.0625,null,-2.6476360428304808,-12.046457980443879,null,null,null,2.3116199502360084,-135.26480173680173,null,0,0]
[54328.5,54.328499999999998,16.644413227816219,1.5106799038798757,1.0000721863064801,1.2015154128160005E-2,1,0,4608.3065482089023,1.5705793273402409,5.4685665496112819,1.3868982751861909,1.0003297599484402,2.567759162821447E-2,1.0000000014757928,5.4328499946548257E-5,1.0000000014757928,5.4328499946548257E-5,1.4291540997182197,0.86573187806659269,-2.3515466085078165,-147.4653147307634,32.534685269236604,null,54328.5,2951585912.25,null,-2.6493551308138059,-11.995366707013265,null,null,null,2.2360087824671178,-135.46994802375016,null,0,0]
[54641.25,54.641249999999999,16.739884365980313,1.5110231707727204,1.0000730197704109,1.2084314415687213E-2,1,0,4634.834941322646,1.5705805693794939,5.4989973902621552,1.3879274776230637,1.0003335668648021,2.5825342933237495E-2,1.000000001492833,5.4641249945619819E-5,1.000000001492833,5.4641249945619819E-5,1.4333813094212653,0.86901743755539052,-2.4285632540219257,-147.61883630851264,32.381163691487359,null,54641.25,2985666201.5625,null,-2.6510461751902357,-11.944934440860814,null,null,null,2.1606831813294396,-135.67390186765181,null,0,0]
[54954,54.954000000000001,16.835357454269452,1.5113625443812062,1.0000738580178283,1.2153474587606921E-2,1,0,4661.3633344434575,1.5705817972815499,5.5294339916511994,1.3889453507011769,1.0003373956187278,2.5973093110460779E-2,1.000000001509971,5.4953999944680701E-5,1.000000001509971,5.4953999944680701E-5,1.4376207561840733,0.8722862451751815,-2.5052693071953804,-147.77182326255141,32.228176737448592,null,54954,3019942116,null,-2.6527097993510114,-11.895150424530712,null,null,null,2.0856407523167557,-135.87667283802071,null,0,0]
[55274,55.274000000000001,16.933045731696279,1.511705824062858,1.000074720648132,1.2224237872580184E-2,1,0,4688.5066943184656,1.5705830392658857,5.5605820216721931,1.3899752850726868,1.0003413357312489,2.6124267177710665E-2,1.0000000015276074,5.5273999943708684E-5,1.0000000015276074,5.5273999943708684E-5,1.4419710418625968,0.87561359357784463,-2.5834351311242365,-147.92780222637259,32.072197773627408,null,55274,3055215076,null,-2.6543842400652307,-11.8448723282962,null,null,null,2.0091493691021234,-136.08292989807637,null,0,{"$f":"IF(AJ474>0,W474,0)","v":0}]
[55594,55.594000000000001,17.030735981637701,1.5120451656010652,1.000075588286244,1.2295001035123224E-2,1,0,4715.6500542006224,1.5705842669524568,5.5917358844459875,1.3909937441377023,1.000345298704989,2.627544005063125E-2,1.0000000015453463,5.5593999942725343E-5,1.0000000015453463,5.5593999942725343E-5,1.446333929356171,0.87892361540668773,-2.6612820088558768,-148.08321941765513,31.91678058234487,null,55594,3090692836,null,-2.6560312409799556,-11.795250831061578,null,null,null,1.9329494922852053,-136.28796858659359,null,0,0]
[55914,55.914000000000001,17.128428170343611,1.5123806363007395,1.0000764609321506,1.2365764074527677E-2,1,0,4742.7934140898042,1.5705854805867445,5.6228954830228313,1.3920009165388705,1.0003492845396764,2.642661172232719E-2,1.0000000015631876,5.5913999941730618E-5,1.0000000015631876,5.5913999941730618E-5,1.4507093143589662,0.88221641718571953,-2.7388129948434119,-148.23807400134572,31.761925998654277,null,55914,3126375396,null,-2.6576514163301646,-11.746275138069295,null,null,null,1.8570386816478799,-136.49179886327641,null,0,0]
[56234,56.234000000000002,17.226122264828842,1.5127123019435043,1.0000773385858392,1.2436526990085191E-2,1,0,4769.9367739858935,1.5705866804086428,5.6540607225724777,1.3929969868523846,1.0003532932350376,2.6577782185903467E-2,1.0000000015811312,5.6233999940724435E-5,1.0000000015811312,5.6233999940724435E-5,1.4550970935499494,0.88549210530194122,-2.8160310867814191,-148.39236527993336,31.607634720066642,null,56234,3162262756,null,-2.659245363469505,-11.697934687232316,null,null,null,1.7814145368492129,-136.69443059270108,null,0,0]
[56561.5,56.561500000000002,17.326108004315916,1.5130478682169313,1.0000782419947347,1.2508948282501958E-2,1,0,4797.7163063865764,1.5705878942942275,5.6859621414688544,1.3940050955734555,1.0003574195545581,2.6732494449100641E-2,1.0000000015996016,5.6561499939682754E-5,1.0000000015996016,5.6561499939682754E-5,1.4596004378510681,0.88882695819670321,-2.8947380678310379,-148.54968890832518,31.45031109167482,null,56561.5,3199203282.25,null,-2.6608501174568673,-11.649108222409755,null,null,null,1.7043123097869568,-136.90058068591543,null,0,0]
[56889,56.889000000000003,17.426095672415936,1.5133795836946948,1.0000791506488744,1.2581369443697163E-2,1,0,4825.495838794247,1.5705890942035601,5.7178692744296731,1.3950019543033241,1.0003615698183204,2.6887205432271691E-2,1.0000000016181791,5.6888999938628936E-5,1.0000000016181791,5.6888999938628936E-5,1.4641165482814793,0.89214411078295275,-2.9731234940416251,-148.70642145981668,31.293578540183319,null,56889,3236358321,null,-2.6624286136024136,-11.600925460483042,null,null,null,1.6275053797219154,-137.10549599933364,null,0,0]
[57216.5,57.216500000000003,17.526085236120252,1.5137075142116707,1.0000800645482444,1.2653790472911493E-2,1,0,4853.2753712087851,1.5705902803766347,5.7497820263281545,1.3959877483650374,1.0003657440260261,2.7041915128026429E-2,1.000000001636864,5.7216499937562915E-5,1.000000001636864,5.7216499937562915E-5,1.4686453172484391,0.89544367654048229,-3.0511904043749216,-148.86256260352397,31.137437396476031,null,57216.5,3273727872.25,null,-2.6639814408556854,-11.553375796550919,null,null,null,1.5509912966418906,-137.30918680697303,null,0,0]
[57544,57.543999999999997,17.626076663168597,1.5140317241121279,1.0000809836928304,1.2726211369385641E-2,1,0,4881.0549036300745,1.5705914530479834,5.7817003041212054,1.3969626590763937,1.0003699421773757,2.7196623528975037E-2,1.0000000016556558,5.7543999936484628E-5,1.0000000016556558,5.7543999936484628E-5,1.4731866382126189,0.89872576872091181,-3.1289417822085563,-149.01811213925501,30.98188786074499,null,57544,3311311936,null,-2.6655091719548785,-11.5064488548831,null,null,null,1.4747676499074502,-137.51166328437191,null,0,0]
[57879,57.878999999999998,17.728359865197103,1.5143595748280891,1.0000819293132841,1.2800290621545836E-2,1,0,4909.4706085564267,1.5705926388442708,5.8143551571321472,1.3979488208659889,1.0003742612416959,2.7354873523076077E-2,1.0000000016749893,5.7878999935368865E-5,1.0000000016749893,5.7878999935368865E-5,1.4778448353862643,0.90206506272906062,-3.2081503253612498,-149.17661171592474,30.823388284075264,null,57879,3349978641,null,-2.6670465050927303,-11.459080944260679,null,null,null,1.397096439892608,-137.71753077166406,null,0,0]
[58214,58.213999999999999,17.830644950915701,1.5146836641623309,1.0000828804219126,1.2874369733209403E-2,1,0,4937.8863134896019,1.5705938109929221,5.847015601528053,1.3989239665277846,1.0003786053582326,2.7513122146747636E-2,1.0000000016944348,5.8213999934240111E-5,1.0000000016944348,5.8213999934240111E-5,1.482515943881872,0.9053863125816809,-3.2870348618785989,-149.33449225254702,30.665507747452978,null,58214,3388869796,null,-2.6685587420677037,-11.412343350796712,null,null,null,1.3197241403502316,-137.92214890175032,null,0,0]
[58549,58.548999999999999,17.932931888092057,1.5150040564093701,1.0000838370187002,1.2948448703563693E-2,1,0,4966.3020184294837,1.5705949697282007,5.8796815441318806,1.399888277799612,1.0003829745266597,2.7671369392081702E-2,1.0000000017139927,5.8548999933098293E-5,1.0000000017139927,5.8548999933098293E-5,1.4871998530462223,0.90868963863387942,-3.3655984142356878,-149.49175392897098,30.508246071029021,null,58549,3427985401,null,-2.6700464466124734,-11.366225674649653,null,null,null,1.2426482925379125,-138.12552825432138,null,0,0]
[58884,58.884,18.035220645224491,1.5153208144081858,1.0000847991036312,1.3022527531796068E-2,1,0,4994.7177233759585,1.5705961152790384,5.9123528938102927,1.4008419324838242,1.0003873687466487,2.7829615251170666E-2,1.0000000017336628,5.8883999931943336E-5,1.0000000017336628,5.8883999931943336E-5,1.4918964533476218,0.91197516091511455,-3.4438439505639091,-149.64839704817237,30.35160295182763,null,58884,3467325456,null,-2.6715101669275314,-11.320717741158855,null,null,null,1.1658664765247515,-138.32767930701351,null,0,0]
[59227,59.226999999999997,18.139953972459633,1.5156414354507275,1.0000857898500068,1.3098375258570754E-2,1,0,5023.8120123278677,1.5705972747594801,5.9458099640402224,1.4018075013211093,1.0003918938589642,2.7991638671294998E-2,1.0000000017539188,5.9226999930747102E-5,1.0000000017539188,5.9226999930747102E-5,1.4967182474116318,0.91532082182799501,-3.5236315829623184,-149.80814044856109,30.19185955143891,null,59227,3507837529,null,-2.6729845482860943,-11.274744413391673,null,null,null,1.0875532254849034,-138.53339603516937,null,0,0]
[59570,59.57,18.244689143033874,1.5159583754214854,1.0000867863497422,1.317422283463042E-2,1,0,5052.9063012864544,1.5705984208875037,5.9792725156471382,1.4027622635726396,1.0003964452329182,2.8153660621398752E-2,1.0000000017742925,5.9569999929536936E-5,1.0000000017742925,5.9569999929536936E-5,1.5015531171678458,0.9186480720329121,-3.6030919585122669,-149.96723641433442,30.032763585665577,null,59570,3548584900,null,-2.6744349016186213,-11.229389408116715,null,null,null,1.0095432032674827,-138.73784700621769,null,0,0]
[59913,59.912999999999997,18.349426125382884,1.5162716972899795,1.0000877886028201,1.3250070259102834E-2,1,0,5082.0005902516014,1.5705995538924353,6.0127404571149405,1.4037063979369668,1.0004010228681524,2.8315681092995541E-2,1.0000000017947837,5.9912999928312749E-5,1.0000000017947837,5.9912999928312749E-5,1.5064009486487828,0.92195703919222172,-3.6822280957117028,-150.12568564192472,29.874314358075281,null,59913,3589567569,null,-2.6758617679931089,-11.184642499314334,null,null,null,0.93183393244253288,-138.94104314261037,null,0,0]
[60256,60.256,18.454164888658376,1.5165814625990448,1.0000887966092233,1.3325917531115785E-2,1,0,5111.0948792231993,1.5706006739983804,6.0462136989392405,1.4046400792321254,1.000405626764306,2.8477700077599432E-2,1.0000000018153927,6.0255999927074462E-5,1.0000000018153927,6.0255999927074462E-5,1.5112616290825209,0.92524785053705594,-3.7610429596950383,-150.28348894335204,29.71651105664796,null,60256,3630785536,null,-2.6772656735422649,-11.140493683003051,null,null,null,0.85442297400835587,-139.14299526034898,null,0,0]
[60607,60.606999999999999,18.561348350804142,1.5168948335536137,1.0000898340821347,1.3403533676967354E-2,1,0,5140.8677522006956,1.5706018071039596,6.0804730536804703,1.405584894158975,1.0004103652263954,2.8643496382375549E-2,1.0000000018366042,6.0606999925792613E-5,1.0000000018366042,6.0606999925792613E-5,1.516248863718765,0.92859675182846058,-3.8413665098501228,-150.44430505203911,29.555694947960887,null,60607,3673208449,null,-2.6786790866401788,-11.09592412591264,null,null,null,0.77551283695118267,-139.34838092612648,null,0,0]
[60958,60.957999999999998,18.66853361476911,1.5172046061037294,1.0000908775798405,1.348114966131668E-2,1,0,5170.6406251847175,1.5706029271605528,6.1147377754844623,1.4065191211274055,1.0004151311879188,2.880929111200722E-2,1.0000000018579389,6.0957999924495844E-5,1.0000000018579389,6.0957999924495844E-5,1.5212493185168425,0.93192690863409855,-3.9213597432073746,-150.60444682409724,29.395553175902762,null,60958,3715877764,null,-2.6800695243280637,-11.051960376253051,null,null,null,0.69691004128181366,-139.55248644784419,null,0,0]
[61309,61.308999999999997,18.775720649695053,1.5175108418172556,1.0000919271023223,1.3558765483229117E-2,1,0,5200.4134981751522,1.5706040343922802,6.149007774628978,1.4074429355211169,1.0004199246484833,2.8975084257402344E-2,1.0000000018793966,6.1308999923184051E-5,1.0000000018793966,6.1308999923184051E-5,1.5262628764542683,0.93523845578727594,-4.0010256731390772,-150.76391547611246,29.236084523887541,null,61309,3758793481,null,-2.6814375049779811,-11.00859239759866,null,null,null,0.61861209200003253,-139.75532307851381,null,0,0]
[61660,61.66,18.8829094254239,1.5178136008667849,1.000092982649561,1.3636381141770026E-2,1,0,5230.1863711718888,1.5706051290181589,6.1832829633672057,1.4083565089070536,1.0004247456076933,2.9140875809469315E-2,1.0000000019009778,6.1659999921857147E-5,1.0000000019009778,6.1659999921857147E-5,1.5312894217770818,0.9385315275785856,-4.08036726069653,-150.92271233202413,29.077287667975867,null,61660,3801955600,null,-2.682783532635268,-10.965810371915477,null,null,null,0.54061653209986471,-139.95690196010867,null,0,0]
[62019,62.018999999999998,18.992543020221085,1.5181197252772045,1.0000940684871331,1.3715765648195943E-2,1,0,5260.6378281749594,1.5706062357757684,6.218344631907101,1.4092804856229411,1.000429704891814,2.9310444428679281E-2,1.0000000019231781,6.2018999920484278E-5,1.0000000019231781,6.2018999920484278E-5,1.5364438476744768,0.94188068272675463,-4.1611847212678086,-151.08443503924948,28.915564960750515,null,62019,3846356361,null,-2.6841380406085995,-10.922649384436014,null,null,null,0.46115357950191865,-140.16178565481343,null,0,0]
[62378,62.378,19.10217837442023,1.5184223357648408,1.0000951606271842,1.3795149981740631E-2,1,0,5291.089285184401,1.5706073297940799,6.2534115497193161,1.4101941004430021,1.0004346929415213,2.9480011361866471E-2,1.0000000019455073,6.2377999919095429E-5,1.0000000019455073,6.2377999919095429E-5,1.5416116187956121,0.94521079309432643,-4.24166899043996,-151.24545810427293,28.754541895727073,null,62378,3891014884,null,-2.6854706061905897,-10.880081263345831,null,null,null,0.38200187591175661,-140.36537684092707,null,0,0]
[62737,62.737000000000002,19.2118154579004,1.5187214924330594,1.0000962590696933,1.387453414140412E-2,1,0,5321.5407422001026,1.5706084112917877,6.2884836289881818,1.4110975252000035,1.0004397097563849,2.9649576599305082E-2,1.0000000019679656,6.2736999917690508E-5,1.0000000019679656,6.2736999917690508E-5,1.5467926153367439,0.94852200050270175,-4.3218230757017553,-151.40578326326943,28.594216736730573,null,62737,3935931169,null,-2.6867817251772768,-10.838096175325612,null,null,null,0.30315890963664877,-140.56768708794385,null,0,0]
[63096,63.095999999999997,19.321454241223854,1.5190172540235141,1.0000973638146402,1.3953918126186453E-2,1,0,5351.992199221957,1.5706094804826087,6.3235607838334369,1.4119909279814273,1.0004447553359719,2.9819140131269888E-2,1.0000000019905526,6.3095999916269391E-5,1.0000000019905526,6.3095999916269391E-5,1.5519867188340035,0.95181444611410526,-4.401649933306512,-151.56541235092942,28.434587649070579,null,63096,3981105216,null,-2.6880718796524725,-10.79668450135992,null,null,null,0.22462220650708936,-140.7687278495695,null,0,0]
[63463.25,63.463250000000002,19.433614307649748,1.519316359218517,1.0000985004685095,1.4035126212743412E-2,1,0,5383.1434460005712,1.57061056172737,6.3594491935900814,1.41289466295649,1.0004499466289143,2.9992598543364585E-2,1.000000002013792,6.3463249914798815E-5,1.000000002013792,6.3463249914798815E-5,1.5573136255320672,0.95516328676989137,-4.4829756883866247,-151.72799155746162,28.272008442538379,null,63463.25,4027584100.5625,null,-2.6893704785600931,-10.754904687138238,null,null,null,0.14459505033459411,-140.97308687032341,null,0,0]
[63830.5,63.830500000000001,19.545776092729433,1.5196120316599275,1.0000996437177667,1.4116334114172248E-2,1,0,5414.2946927854082,1.5706116305302071,6.3953427390473587,1.4137882543186902,1.0004551680229024,3.0166055150112853E-2,1.0000000020371662,6.3830499913311096E-5,1.0000000020371662,6.3830499913311096E-5,1.5626540019657504,0.95849279007983046,-4.5639651035396795,-151.88984651390081,28.110153486099193,null,63830.5,4074332730.25,null,-2.6906481169069076,-10.713705242814775,null,null,null,6.4883273528352783E-2,-141.17614127108598,null,0,0]
[64197.75,64.197749999999999,19.657939567044664,1.5199043300549995,1.0001007935623893,1.4197541829402508E-2,1,0,5445.4459395763588,1.570612687104646,6.4312413342163497,1.4146718704910015,1.0004604195174649,3.0339509941105403E-2,1.0000000020606754,6.4197749911806178E-5,1.0000000020606754,6.4197749911806178E-5,1.5680077255870501,0.96180310492957899,-4.6446211860258186,-152.05097947621772,27.949020523782281,null,64197.75,4121351105.0625,null,-2.6919052691182581,-10.673076530101692,null,null,null,-1.4515656746434045E-2,-141.37790294611608,null,0,0]
[64565,64.564999999999998,19.770104701844385,1.520193311781028,1.0001019500023542,1.4278749357363759E-2,1,0,5476.5971863733184,1.5706137316593543,6.4671448950054362,1.4155456762193721,1.0004657011121278,3.0512962905933597E-2,1.0000000020843196,6.456499991028394E-5,1.0000000020843196,6.456499991028394E-5,1.5733746752608844,0.9650943794230491,-4.7249468928456011,-152.21139278979189,27.788607210208113,null,64565,4168639225,null,-2.6931423964874117,-10.633009121110854,null,null,null,-9.3604236197062735E-2,-141.57838366868103,null,0,0]
[64941,64.941000000000003,19.884943944018936,1.5204858011232996,1.0001031408282466,1.4361891518972887E-2,1,0,5508.4906344275169,1.5706147888615756,6.5039089430237773,1.4164303054465275,1.00047113972853,3.0690546611764239E-2,1.0000000021086666,6.4940999908707386E-5,1.0000000021086666,6.4940999908707386E-5,1.5788830738996156,0.96844449852611758,-4.8068471782913971,-152.3748850342854,27.625114965714602,null,64941,4217333481,null,-2.6943887215025653,-10.592558969994473,null,null,null,-0.17425819662770622,-141.78232606429097,null,0,0]
[65317,65.316999999999993,19.999784867814487,1.5207749314793118,1.0001043385674544,1.4445033482012268E-2,1,0,5540.3840824878016,1.570615833892141,6.5406780235791517,1.4173049892871117,1.000476609895419,3.0868128381295563E-2,1.0000000021331552,6.5316999907112468E-5,1.0000000021331552,6.5316999907112468E-5,1.584405083840472,0.97177497078631725,-4.8884072750325469,-152.537628173592,27.462371826408003,null,65317,4266310489,null,-2.6956149943594667,-10.552677839228602,null,null,null,-0.25459202051195323,-141.98495033436336,null,0,0]
[65693,65.692999999999998,20.114627444428287,1.5210607603337554,1.000105543219953,1.4528175245333166E-2,1,0,5572.2775305540681,1.5706168669600473,6.5774520522733351,1.4181698932030582,1.0004821116122773,3.1045708203359234E-2,1.0000000021577851,6.5692999905499078E-5,1.0000000021577851,6.5692999905499078E-5,1.5899405795947525,0.97508595251746399,-4.9696302014527252,-152.69962498859363,27.300375011406373,null,65693,4315570249,null,-2.6968216701021448,-10.51335625987752,null,null,null,-0.33460827118945241,-142.18626872871613,null,0,0]
[66069,66.069000000000003,20.229471645711222,1.5213433438681274,1.0001067547857172,1.4611316807786859E-2,1,0,5604.1709786262127,1.5706178882695339,6.6142309465738309,1.4190251790353243,1.0004876448785847,3.1223286066787651E-2,1.0000000021825564,6.6068999903867121E-5,1.0000000021825564,6.6068999903867121E-5,1.5954894371651294,0.97837759912068556,-5.0505189264165669,-152.86087834040615,27.139121659593854,null,66069,4365112761,null,-2.6980091911589326,-10.474584970199583,null,null,null,-0.41430947509650684,-142.38629337020654,null,0,0]
[66453.75,66.453749999999999,20.346990071289923,1.5216292012793831,1.0001080017025956,1.4696392971405431E-2,1,0,5636.8066279560189,1.5706189213823558,6.6518706852689968,1.4198905771724095,1.0004933395698019,3.1404994354608341E-2,1.0000000022080504,6.6453749902177839E-5,1.0000000022080504,6.6453749902177839E-5,1.6011811277824355,0.98172599239513092,-5.1329471239541213,-153.02511771161019,26.974882288389807,null,66453.75,4416100889.0625,null,-2.6992049675887135,-10.435471620300564,null,null,null,-0.49554189620428446,-142.58964609130959,null,0,0]
[66838.5,66.838499999999996,20.46451014041623,1.5219117755679556,1.0001092558581914,1.4781468922265594E-2,1,0,5669.4422772917724,1.5706199426011302,6.6895153495800654,1.420746236039204,1.0004990672948335,3.1586700567916619E-2,1.0000000022336926,6.6838499900468893E-5,1.0000000022336926,6.6838499900468893E-5,1.6068865513682549,0.98505446641143624,-5.2150315209476981,-153.18858491525131,26.811415084748688,null,66838.5,4467385082.25,null,-2.7003815860717162,-10.396915489145838,null,null,null,-0.57644967471485309,-142.79166942610547,null,0,0]
[67223.25,67.223249999999993,20.582031824936966,1.5221911229273977,1.0001105172524771,1.4866544659136611E-2,1,0,5702.0779266333702,1.5706209521300827,6.7271648568170077,1.4215923178936412,1.0005048280531121,3.1768404694749397E-2,1.0000000022594826,6.7223249898740146E-5,1.0000000022594826,6.7223249898740146E-5,1.6126055798142558,0.98836318463355299,-5.2967751458253511,-153.35128325116906,26.648716748830935,null,67223.25,4518965340.5625,null,-2.7015394822855616,-10.358907291056447,null,null,null,-0.6570354033786634,-142.99237596011264,null,0,0]
[67608,67.608000000000004,20.699555097337932,1.5224672982771306,1.0001117858854254,1.4951620180787752E-2,1,0,5734.7135759807134,1.5706219501687899,6.7648191261201145,1.4224289814365665,1.0005106218440667,3.195010672314437E-2,1.0000000022854207,6.7607999896991504E-5,1.0000000022854207,6.7607999896991504E-5,1.6183380865792674,0.99165230947823158,-5.3781809782725603,-153.51321608974021,26.486783910259788,null,67608,4570841664,null,-2.7026790798168916,-10.321437943893272,null,null,null,-0.73730163829453987,-143.19177814584694,null,0,0]
[68001.75,68.001750000000001,20.81982906810638,1.5227467056982316,1.0001130916886007,1.5038685549006304E-2,1,0,5768.1126323361796,1.5706229598603809,6.8033590449997865,1.4232756266632212,1.0005165853624516,3.2136056906262561E-2,1.0000000023121189,6.8001749895181245E-5,1.0000000023121189,6.8001749895181245E-5,1.6242185115891965,0.994998255052711,-5.461144362807393,-153.67814785120677,26.321852148793226,null,68001.75,4624238003.0625,null,-2.7038268185681451,-10.283640757376997,null,null,null,-0.81911728407812023,-143.39450709382976,null,0,0]
[68395.5,68.395499999999998,20.940104645576369,1.5230229034252181,1.000114405072992,1.512575068921041E-2,1,0,5801.5116886974602,1.5706239579264687,6.8419037856403877,1.4241127331158141,1.0005225834757558,3.2322004866274887E-2,1.0000000023389721,6.8395499893349884E-5,1.0000000023389721,6.8395499893349884E-5,1.6301127896502927,0.99832402066630954,-5.5437601304850501,-153.84228523524982,26.157714764750182,null,68395.5,4677944420.25,null,-2.7049562531122513,-10.246389308889968,null,null,null,-0.90060361721167337,-143.59589592635984,null,0,0]
[68789.25,68.789249999999996,21.060381802220341,1.5232959464078764,1.0001157260385689,1.5212815600081007E-2,1,0,5834.9107450644524,1.5706249445666867,6.8804532670064731,1.4249404599413655,1.0005286161833578,3.2507950590362523E-2,1.0000000023659803,6.8789249891497314E-5,1.0000000023659803,6.8789249891497314E-5,1.6360207901184483,1.0016297769346214,-5.6260313246861777,-154.00563205814041,25.994367941859593,null,68789.25,4731960915.5625,null,-2.7060678006827632,-10.209674490683268,null,null,null,-0.98176326384228663,-143.79595756745707,null,0,0]
[69183,69.183000000000007,21.180660511135663,1.5235658883497243,1.000117054585302,1.5299880280299048E-2,1,0,5868.3098014370598,1.5706259199761232,6.919007409858712,1.4257589627917622,1.0005346834846316,3.2693894065707593E-2,1.0000000023931437,6.9182999889623426E-5,1.0000000023931437,6.9182999889623426E-5,1.6419423839934282,1.0049156932861645,-5.7079609407249308,-154.16819219672499,25.831807803275012,null,69183,4786287489,null,-2.7071618669216342,-10.173487395004042,null,null,null,-1.0625988136421676,-143.99470480172093,null,0,0]
[69586,69.585999999999999,21.303766395077542,1.5238390153884971,1.0001184221927009,1.5388990049292169E-2,1,0,5902.4934705682635,1.570626906869272,6.9584720152546353,1.4265873012800898,1.0005409291409078,3.2884203395000838E-2,1.0000000024211055,6.958599988768329E-5,1.0000000024211055,6.958599988768329E-5,1.648017031569494,1.0082584336462239,-5.7914646203613991,-154.33376069126277,25.666239308737232,null,69586,4842211396,null,-2.7082639444425509,-10.136987561755634,null,null,null,-1.1450004157577194,-144.19677312950714,null,0,0]
[69989,69.989000000000004,21.426873849984329,1.5241090039609562,1.0001197977415692,1.5478099573872545E-2,1,0,5936.6771397051489,1.5706278823972653,6.9979413413156095,1.4274062964451495,1.0005472110339628,3.307451034148845E-2,1.0000000024492299,6.9988999885720561E-5,1.0000000024492299,6.9988999885720561E-5,1.6541056504829719,1.0115807462722914,-5.8746166847915218,-154.49851350127653,25.501486498723466,null,69989,4898460121,null,-2.7093485339125905,-10.101022273797577,null,null,null,-1.2270678907178036,-144.39749122747898,null,0,0]
[70392,70.391999999999996,21.549982848932913,1.5243759078149286,1.0001211812318744,1.5567208852626043E-2,1,0,5970.8608088476203,1.5706288467553029,7.0374153086141229,1.4282161044034076,1.000553529163114,3.3264814891430836E-2,1.0000000024775169,7.0391999883735092E-5,1.0000000024775169,7.0391999883735092E-5,1.6602081076535169,1.014882808905887,-5.9574201970177771,-154.66245495579219,25.337545044207815,null,70392,4955033664,null,-2.7104160349693212,-10.06558259671211,null,null,null,-1.308803901887329,-144.59687235908004,null,0,0]
[70795,70.795000000000002,21.673093365611582,1.5246397794787991,1.0001225726635834,1.5656317884138547E-2,1,0,6005.0444779955806,1.570629800134139,7.0768938394855674,1.4290168778365568,1.0005598835276752,3.3455117031089464E-2,1.0000000025059659,7.0794999881726759E-5,1.0000000025059659,7.0794999881726759E-5,1.666324271721999,1.0181647979566073,-6.0398781725540349,-154.82558943419642,25.174410565803583,null,70795,5011932025,null,-2.7114668361350072,-10.030659792624895,null,null,null,-1.3902110762579001,-144.79492964157151,null,0,0]
[71207.25,71.207250000000002,21.799031163530277,1.5249066238894533,1.0001240042494985,1.5747471964912819E-2,1,0,6040.0127599025209,1.5706307642299948,7.1172831580157325,1.4298268390318245,1.00056642123483,3.3649784639673219E-2,1.0000000025352362,7.1207249879648533E-5,1.0000000025352362,7.1207249879648533E-5,1.6725948664630681,1.0215015305557944,-6.1238743651270147,-154.99163795703174,25.008362042968258,null,71207.25,5070472452.5625,null,-2.7125248707393999,-9.9954613055298047,null,null,null,-1.4731492342264865,-144.996176651502,null,0,0]
[71619.5,71.619500000000002,21.924970495837382,1.525170402754092,1.0001254441454868,1.5838625783972628E-2,1,0,6074.9810418150091,1.5706317172269599,7.1576770930514755,1.4306276588095856,1.0005729968584312,3.3844449696978078E-2,1.0000000025646762,7.1619499877546101E-5,1.0000000025646762,7.1619499877546101E-5,1.6788795319019534,1.024817626653648,-6.2075152134002378,-155.15685145012714,24.843148549872865,null,71619.5,5129352780.25,null,-2.7135662184476321,-9.9607858009800925,null,null,null,-1.5557487347914774,-145.19606564914713,null,0,0]
[72031.75,72.031750000000002,22.050911336242855,1.5254311685610622,1.0001268923515121,1.5929779339804311E-2,1,0,6109.9493237329534,1.5706326593155968,7.1980755668725136,1.4314194900497992,1.0005796103977311,3.4039112188301031E-2,1.0000000025942863,7.203174987541933E-5,1.0000000025942863,7.203174987541933E-5,1.685178132881612,1.0281132707292882,-6.2908037988648005,-155.32123474150472,24.678765258495275,null,72031.75,5188573008.0625,null,-2.7145912613985108,-9.9266245296753404,null,null,null,-1.6380122773051629,-145.39461021182942,null,0,0]
[72444,72.444000000000003,22.176853659053521,1.5256889726080465,1.0001283488675383,1.6020932630894231E-2,1,0,6144.9176056562565,1.5706335906821303,7.2384785034849752,1.4322024822647739,1.0005862618519779,3.4233772098940213E-2,1.0000000026240665,7.2443999873268082E-5,1.0000000026240665,7.2443999873268082E-5,1.6914905360395369,1.031388645784143,-6.3737431561168592,-155.48479269900463,24.515207300995371,null,72444,5248133136,null,-2.7156003710961434,-9.8929689350188035,null,null,null,-1.7199425248595874,-145.59182376398579,null,0,0]
[72865.75,72.865750000000006,22.305699738517681,1.5259497049159543,1.0001298475473284,1.6114186207425829E-2,1,0,6180.6917060890082,1.5706345326055218,7.2798170370021351,1.4329945235308164,1.0005931058189361,3.443291511906961E-2,1.0000000026547087,7.2865749871041768E-5,1.0000000026547087,7.2865749871041768E-5,1.6979625496407722,1.0347187137114462,-6.4582355142262573,-155.65127076245065,24.34872923754935,null,72865.75,5309417523.0625,null,-2.716616623364998,-9.8590523360434741,null,null,null,-1.8034186307001319,-145.79221842640717,null,0,0]
[73287.5,73.287499999999994,22.434547316935411,1.5262074423310878,1.0001313549244513,1.620743950366868E-2,1,0,6216.4658065271797,1.5706354636878781,7.3211600857877848,1.4337776198703962,1.0005999894668147,3.4632055407079539E-2,1.0000000026855287,7.3287499868789541E-5,1.0000000026855287,7.3287499868789541E-5,1.7044487321502568,1.0380279504172458,-6.5423686433384143,-155.81689543501469,24.183104564985314,null,73287.5,5371057656.25,null,-2.7176169536076795,-9.825647465918621,null,null,null,-1.8865514295696086,-145.99124796909607,null,0,0]
[73709.25,73.709249999999997,22.563396368627533,1.5264622361262232,1.0001328709988673,1.6300692518002168E-2,1,0,6252.2399069706771,1.5706363841152902,7.3625075737775019,1.4345519210177089,1.0006069127947943,3.4831192947231991E-2,1.0000000027165268,7.3709249866511239E-5,1.0000000027165268,7.3709249866511239E-5,1.710948946456408,1.0413165470308146,-6.6261456479035239,-155.98167203602691,{"$f":"IF(V524>0,V524,V524+180)","v":24.018327963973093},null,73709.25,5433053535.5625,null,-2.7186017273035801,-9.7927457552672816,null,null,null,-1.9693436604388159,-146.18892628075963,null,0,0]
[74131,74.131,{"$f":"SQRT(1+(A525/p_dom)^2)","v":22.692246868497801},{"$f":"ATAN(A525/p_dom)","v":1.5267141364111423},{"$f":"SQRT(1+(A525/z_ESR)^2)","v":1.0001343957705371},{"$f":"ATAN(A525/z_ESR)","v":1.6393945248805702E-2},{"$f":"IF(VIN_nom>Vout, 1, SQRT(1+(A525/z_RHP)^2))","v":1},{"$f":"IF(VIN_nom>Vout, 0, -ATAN(A525/z_RHP))","v":0},{"$f":"SQRT(1+(A525/EA_p1)^2)","v":6288.0140074194123},{"$f":"ATAN(A525/EA_p1)","v":1.5706372940696141},{"$f":"SQRT(1+(A525/EA_z1)^2)","v":7.4038594265979416},{"$f":"ATAN(A525/EA_z1)","v":1.4353175734045081},{"$f":"SQRT(1+(A525/EA_hf_p)^2)","v":1.0006138758020513},{"$f":"ATAN(A525/EA_hf_p)","v":3.5030327723790278E-2},{"$f":"SQRT(1+(A525/Zero3)^2)","v":1.0000000027477025},{"$f":"ATAN(A525/Zero3)","v":7.4130999864206713E-5},{"$f":"SQRT(1+(A525/pole5)^2)","v":1.0000000027477025},{"$f":"ATAN(A525/pole5)","v":7.4130999864206713E-5},{"$f":"SQRT((1-(Z525/pterm2))^2+(A525/pterm1)^2)","v":1.71746305731538},{"$f":"IF((ATAN((A525/pterm1)/(1-A525^2/pterm2))>0),ATAN((A525/pterm1)/(1-A525^2/pterm2)),PI()+ATAN((A525/pterm1)/(1-A525^2/pterm2)))","v":1.0445846930545271},{"$f":"20*LOG10(((E525*K525*G525*O525)/(C525*I525*S525*M525*Q525))*Adc)","v":-6.7095695859655526},{"$f":"((F525+L525+H525+P525)-(D525+J525+T525+N525+R525))*radconv","v":-156.14560591394201},{"$f":"IF(V525>0,V525,V525+180)","v":23.854394086057994},null,{"$f":"IF(U525<0,A525,1000000000)","v":74131},{"$f":"A525^2","v":5495405161},null,{"$f":"20*LOG10((K525/(I525*M525))*Aea_stability*Afb*0.8)","v":-2.7195712997546484},{"$f":"(L525-(J525+N525))*radconv","v":-9.760338823685915},null,null,null,{"$f":"20*LOG10((E525*G525/(C525*S525))*Am_stability)","v":-2.0517980260497755},{"$f":"(F525+H525-(D525+T525))*radconv","v":-146.38526709025606},null,{"$f":"SUM((U526<0)*(U525>0))*A525","v":0},0]
[74562.75,{"$f":"A526/1000","v":74.562749999999994},22.824153982150349,1.5269690633305328,1.0001359657046391,1.6489408774461967E-2,1,0,6324.6363378781925,1.570638214936642,7.4461962073748591,1.4360925706797023,1.0006210450080903,3.5234181252001361E-2,1.0000000027798017,7.4562749861820216E-5,1.0000000027798017,7.4562749861820216E-5,1.7241458779342811,1.0479093416553065,-6.794608988654133,-156.31255946236604,23.687440537633961,null,74562.75,5559603687.5625,null,-2.7205484759231413,-9.7276674592453585,null,null,null,-2.1358602525698638,-146.58489200312076,null,0,0]
[74994.5,74.994500000000002,22.956062562046718,1.5272210605783696,1.0001375447532366,1.6584871999546589E-2,1,0,6361.2586683422733,1.5706391252006437,7.4885374099212196,1.4368588045321251,1.0006282557956021,3.5438031850640504E-2,1.0000000028120875,7.4994499859405936E-5,1.0000000028120875,7.4994499859405936E-5,1.7308429809782482,1.0512129550484086,-6.8792847248829414,-156.47864127335231,23.521358726647691,null,74994.5,5624175030.25,null,-2.7215104437300468,-9.695497426583497,null,null,null,-2.2195740209917663,-146.78314384676881,null,0,0]
[75426.25,75.426249999999996,23.087972583055631,1.5274701783372213,1.0001391329162856,1.668033492232103E-2,1,0,6397.8809988115627,1.5706400250436985,7.5308829596549165,1.4376164218824352,1.0006355081636871,3.5641879502829169E-2,1.0000000028445595,7.5426249856963684E-5,1.0000000028445595,7.5426249856963684E-5,1.7375542272773596,1.0544957312415508,-6.9635999316659412,-156.64385715878777,23.356142841212232,null,75426.25,5689119189.0625,null,-2.7224575533708584,-9.6638203172319788,null,null,null,-2.3029421181339589,-146.98003684155589,null,0,0]
[75858,75.858000000000004,23.219884020616597,1.5277164656507627,1.0001407301937435,1.67757975410468E-2,1,0,6434.5033292859762,1.5706409146437406,7.5732327836543698,1.4383655664050194,1.0006428021114415,3.5845724191690298E-2,1.000000002877218,7.5857999854493337E-5,1.000000002877218,7.5857999854493337E-5,1.7442794796066636,1.0577578664593279,-7.0475576998918292,-156.80821294890086,23.191787051099141,null,75858,5754436164,null,-2.7233901452771998,-9.6326279084826769,null,null,null,-2.3859672944535033,-147.17558504041821,null,0,0]
[76299.75,76.299750000000003,23.354852172886346,1.5279655778116115,1.0001423739000894,1.6873470905656631E-2,1,0,6471.9738897707957,1.5706418144280343,7.6165678448437362,1.4391234393516472,1.0006503080327933,3.6054287155199982E-2,1.0000000029108258,7.6299749851936466E-5,1.0000000029108258,7.6299749851936466E-5,1.751174854492312,1.0610743969584366,-7.133093284232416,-156.97549136336181,23.024508636638188,null,76299.75,5821651850.0625,null,-2.7243296566201551,-9.601206318612201,null,null,null,-2.4705633674511307,-147.37428504474966,null,0,0]
[76741.5,76.741500000000002,23.489821757829883,1.5282118272528078,1.0001440271478486,1.6971143948288237E-2,1,0,6509.4444502607957,1.5706427038534039,7.6599072312712249,1.4398727367072928,1.0006578574802882,3.6262846980781589E-2,1.0000000029446288,7.6741499849349834E-5,1.0000000029446288,7.6741499849349834E-5,1.7580846072088341,1.0643697291487004,-7.2182610839242347,-157.14188177274355,22.858118227256455,null,76741.5,5889257822.25,null,-2.7252546610387491,-9.5702753005997359,null,null,null,-2.5548061627243572,-147.57160647214383,null,0,0]
[77183.25,77.183250000000001,23.624792750892411,1.528455263009308,1.0001456899369734,1.7068816667079611E-2,1,0,6546.9150107558871,1.5706435830977132,7.7032508699339566,1.4406136023794156,1.0006654504529411,3.6471403650362819E-2,1.0000000029786269,7.7183249846733251E-5,1.0000000029786269,7.7183249846733251E-5,1.7650085969248361,1.0676440674322367,-7.3030642668921644,-157.30739046189277,22.692609538107234,null,77183.25,5957254080.5625,null,-2.7261654935049107,-9.5398266183105829,null,null,null,-2.6386985132261236,-147.76756384358222,null,0,0]
[77625,77.625,23.759765128076822,1.5286959330032062,1.000147362267416,1.7166489060168783E-2,1,0,6584.3855712559807,1.5706444523347785,7.7465986894558254,1.4413461770919105,1.0006730869497611,3.667995714587298E-2,1.0000000030128202,7.7624999844086554E-5,1.0000000030128202,7.7624999844086554E-5,1.771946684825892,1.0708976142734041,-7.3875059552280042,-157.4720237230415,22.527976276958498,null,77625,6025640625,null,-2.7270624796449483,-9.5098522177830258,null,null,null,-2.7222432154219294,-147.96217150525845,null,0,0]
[78077,78.076999999999998,23.897870700374277,1.5289393733869694,1.0001490832771449,1.7266427423254273E-2,1,0,6622.7255675169681,1.5706453315598374,7.7909565704759132,1.4420873116410906,1.000680945687201,3.6893346439183849E-2,1.000000003048009,7.8076999841347075E-5,1.000000003048009,7.8076999841347075E-5,1.7790602083104345,1.0742053421917905,-7.473535994327535,-157.63957743293628,22.360422567063722,null,78077,6096017929,null,-2.7279662769111104,-9.4796650178142983,null,null,null,-2.8073694572552972,-148.15991241512199,null,0,0]
[78529,78.528999999999996,24.03597767266136,1.5291800162440383,1.0001508142760047,1.7366365441403697E-2,1,0,6661.0655637830159,1.5706462006635471,7.8353186824606036,1.4428200542579808,1.0006888499899214,3.7106732371146124E-2,1.0000000030834018,7.8528999838575693E-5,1.0000000030834018,7.8528999838575693E-5,1.7861882041264672,1.077491725289089,-7.5591940394103032,-157.80622795775849,22.193772042241505,null,78529,6166803841,null,-2.7288562389362978,-9.4499578676465976,null,null,null,-2.8921375403128802,-148.35627009011182,null,0,0]
[78981,78.980999999999995,24.174086020943573,1.5294179094937339,1.0001525552639436,1.7466303112622563E-2,1,0,6699.4055600540387,1.5706470598196778,7.8796849539497336,1.443544545900407,1.0006967998568426,3.7320114922407263E-2,1.0000000031189991,7.8980999835772219E-5,1.0000000031189991,7.8980999835772219E-5,1.7933305299442734,1.0807569741940686,-7.6444832929787285,-157.97198204389554,22.028017956104463,null,78981,6237998361,null,-2.7297326861452125,-9.4207226998388922,null,null,null,-2.976550346672389,-148.55125934405669,null,0,0]
[79433,79.433000000000007,24.312195721771399,1.5296530999677813,1.0001543062409097,1.756624043491643E-2,1,0,6737.7455563299491,1.5706479091980445,7.9240553150769184,1.444260924404142,1.0007047952868786,3.7533494073616544E-2,1.0000000031548006,7.9432999832936476E-5,1.0000000031548006,7.9432999832936476E-5,1.8004870455219968,1.0840012974414703,-7.7294069118966222,-158.1368464340957,21.863153565904298,null,79433,6309601489,null,-2.7305959300167753,-9.3919516256041096,null,null,null,-3.0606107217187173,-148.74489480849158,null,0,0]
[79895.5,79.895499999999998,24.453515099306415,1.5298910039966851,1.000156108232962,1.7668498946793284E-2,1,0,6776.9761941172428,1.5706487683595436,7.9694605656112154,1.444985687007887,1.0007130236133839,3.7751826501763647E-2,1.0000000031916454,7.9895499830001261E-5,1.0000000031916454,7.9895499830001261E-5,1.8078243514907819,1.0872995414854945,-7.8159280863636083,-158.30462672809767,21.695373271902326,null,79895.5,6383290920.25,null,-2.731465875988496,-9.3629845402189957,null,null,null,-3.1462619502139844,-148.94164218787864,null,0,{"$f":"IF(AJ538>0,W538,0)","v":0}]
[80358,80.358000000000004,24.594835844964461,1.5301261740685215,1.0001579206834119,1.7770757089120987E-2,1,0,6816.2068319094824,1.5706496176312448,8.0148699549183551,1.4457022374925921,1.0007212996421417,3.7970155329072011E-2,1.000000003228704,8.0357999827031866E-5,1.000000003228704,8.0357999827031866E-5,1.8151762236227063,1.0905763114397145,-7.9020729868956732,-158.47148977116149,21.528510228838513,null,80358,6457408164,null,-2.7323226304665131,-9.3344872016397353,null,null,null,-3.2315500962680299,-149.13700256952177,null,0,0]
[80820.5,80.820499999999996,24.73615793529677,1.5303586570158081,1.0001597435922032,1.7873014859762983E-2,1,0,6855.4374697065823,1.5706504571829332,8.0602834130482588,1.4464107139229534,1.0007296233719687,3.8188480534816882E-2,1.0000000032659766,8.0820499824028088E-5,1.0000000032659766,8.0820499824028088E-5,1.8225425182653388,1.0938318239661413,-7.9878448539625193,-158.63744275855021,21.362557241449792,null,80820.5,6531953220.25,null,-2.7331664999606007,-9.3064517078824345,null,null,null,-3.3164780938407907,-149.33099105066773,null,0,0]
[81283,81.283000000000001,24.877481347387182,1.5305884986080602,1.000161576959278,1.7975272256582756E-2,1,0,6894.6681075084571,1.5706512871805289,8.1057008716122798,1.4471112513021169,1.0007379948016746,3.8406802098275537E-2,1.0000000033034631,8.1282999820989738E-5,1.0000000033034631,8.1282999820989738E-5,1.8299230939235631,1.0970662934755333,-8.0732468824946437,-158.80249287082646,21.197507129173545,null,81283,6606926089,null,-2.7339977824174948,-9.2788703321558099,null,null,null,-3.401048839916021,-149.52362253867059,null,0,0]
[81756.25,81.756249999999994,25.022090918756685,1.5308209949663005,1.0001634637654253,1.8079906057765115E-2,1,0,6934.8105925722111,1.570652126749327,8.1521780504553512,1.4478199911577596,1.0007466101851219,3.8630194371066205E-2,1.0000000033420422,8.1756249817844777E-5,1.0000000033420422,8.1756249817844777E-5,1.8374898555042336,1.1003543814981775,-8.1602543844665512,-158.97045215791496,21.029547842085037,null,81756.25,6684084414.0625,null,-2.7348356594123802,-9.2511100677785372,null,null,null,-3.4872184648930471,-149.71934209013645,null,0,0]
[82229.5,82.229500000000002,25.166701827140393,1.5310508194325334,1.0001653615215533,1.8184539463019803E-2,1,0,6974.9530776407964,1.5706529566542957,8.1986592778081882,1.4485206951460732,1.0007552755090745,3.8853582786393746E-2,1.0000000033808454,8.2229499814663183E-5,1.0000000033808454,8.2229499814663183E-5,1.8450712767270587,1.1036208839616408,-8.2468812821471591,-159.13748126468232,20.862518735317678,null,82229.5,6761690670.25,null,-2.7356609623686001,-9.2238094499714798,null,null,null,-3.5730200596174315,-149.91367181471082,null,0,0]
[82702.75,82.702749999999995,25.311314049622059,1.5312780177785779,1.0001672702275997,1.8289172470058006E-2,1,0,7015.0955627141293,1.5706537770613331,8.2451444852015143,1.4492134984890792,1.000763990772235,3.9076967322063443E-2,1.0000000034198724,8.2702749811444754E-5,1.0000000034198724,8.2702749811444754E-5,1.8526672128042854,1.1068660233429164,-8.3331308570829705,-159.30358782136676,20.696412178633238,null,82702.75,6839744857.5625,null,-2.736473984474225,-9.1969607393170865,null,null,null,-3.6584566124476199,-150.10662708204976,null,0,0]
[83176,83.176000000000002,25.45592756380595,1.531502634737244,1.0001691898835015,1.8393805076590941E-2,1,0,7055.2380477921315,1.5706545881325618,8.2916336056956865,1.4498985334069026,1.0007727559732984,3.9300347955882858E-2,1.0000000034591234,8.3175999808189299E-5,1.0000000034591234,8.3175999808189299E-5,1.8602775211731684,1.1100900197102692,-8.419006345288409,-159.46877943244598,20.531220567554016,null,83176,6918246976,null,-2.7372750107211132,-9.1705563681776407,null,null,null,-3.7435310744061678,-150.29822306426837,null,0,0]
[83660.5,83.660499999999999,25.603980115470158,1.5317299627275236,1.0001711665163922,1.850092457026882E-2,1,0,7096.3347916326838,1.5706554089784925,8.3392318412427464,1.4505919401987026,1.0007817812702011,3.9529034682146628E-2,1.0000000034995395,8.3660499804817849E-5,1.0000000034995395,8.3660499804817849E-5,1.8680834824799779,1.1133689806171914,-8.5065390482715806,-159.63695802590732,20.363041974092681,null,83660.5,6999079260.25,null,-2.7380829410565015,-9.1439769007444589,null,null,null,-3.8302558470539538,-150.49298112516283,null,0,0]
[84145,84.144999999999996,25.752033975083048,1.5319546768164471,1.0001731546257873,1.860804363931904E-2,1,0,7137.4315354779619,1.5706562203716965,8.3868340408876882,1.4512774760062408,1.0007908589046624,3.9757717271781699E-2,1.0000000035401904,8.414499980140711E-5,1.0000000035401904,8.414499980140711E-5,1.8759042121135741,1.1166262404775791,-8.5936863898738718,-159.80419369536978,20.195806304630224,null,84145,7080381025,null,-2.7388788777797974,-9.117847628877902,null,null,null,-3.9166072519329465,-150.68634606649186,null,0,0]
[84629.5,84.629499999999993,25.900089120214556,1.5321768218074028,1.0001751542116184,1.8715162281285863E-2,1,0,7178.5282793278857,1.5706570224745231,8.4344401375129152,1.4519552734570822,1.0007999888752579,3.9986395700982724E-2,1.0000000035810761,8.4629499797956879E-5,1.0000000035810761,8.4629499797956879E-5,1.8837395641252921,1.1198620276927487,-8.6804517006617115,-159.97049450338895,20.029505496611051,null,84629.5,7162152270.25,null,-2.739663101744267,-9.0921609615162069,null,null,null,-4.0025883387563166,-150.87833354187268,null,0,0]
[85114,85.114000000000004,26.048145528944403,1.5323964414861653,1.0001771652738167,1.8822280493713608E-2,1,0,7219.6250231823751,1.5706578154456248,8.4820500655022073,1.4526254622298349,1.0008091711805553,4.0215069945946959E-2,1.0000000036221965,8.5113999794466912E-5,1.0000000036221965,8.5113999794466912E-5,1.891589394861773,1.1230765680930095,-8.7668382654940515,-160.13586847565853,19.864131524341474,null,85114,7244392996,null,-2.7404358859429205,-9.0669094763487621,null,null,null,-4.0882021193900036,-151.06895899930976,null,0,0]
[85609.5,85.609499999999997,26.19956466811832,1.5326184800004989,1.0001792338648952,1.8931830251743234E-2,1,0,7261.6548200495545,1.570658617136707,8.5307448166289461,1.4533031292267249,1.00081861608823,4.0448931616819117E-2,1.0000000036644932,8.5609499790856379E-5,1.0000000036644932,8.5609499790856379E-5,1.8996322749297121,1.1263423476416397,-8.8547977696020705,-160.30404675319548,19.695953246804521,null,85609.5,7328986490.25,null,-2.7412146595248243,-9.0415272377289906,null,null,null,-4.1753828499161196,-151.26251951546649,null,0,0]
[86105,86.105000000000004,26.350985084115145,1.5328379667299268,1.0001813144592242,1.9041379555313005E-2,1,0,7303.6846169213477,1.5706594096009632,8.5794434408798459,1.4539731033835612,1.000828115730922,4.0682788860952841E-2,1.0000000037070356,8.6104999787203805E-5,1.0000000037070356,8.6104999787203805E-5,1.9076900019109269,1.1295863742765173,-8.942367941934604,-160.47127248509045,19.528727514909548,null,86105,7414071025,null,-2.7419820214843109,-9.0165849840856573,null,null,null,-4.2621856602891661,-151.4546875010048,null,0,0]
[86600.5,86.600499999999997,26.502406755049641,1.5330549453920359,1.0001834070567293,1.915092840179634E-2,1,0,7345.7144137976748,1.5706601929967721,8.6281458726733256,1.4546355143627507,1.0008376701070729,4.0916641652895623E-2,1.0000000037498233,8.6600499783508948E-5,1.0000000037498233,8.6600499783508948E-5,1.9157624293573534,1.1328088813504533,-9.0295521542879111,-160.63755412496582,19.362445875034183,null,86600.5,7499646600.25,null,-2.7427382399951465,-8.9920752939261721,null,null,null,-4.3486136541316389,-151.64547883103961,null,0,0]
[87096,87.096000000000004,26.653829659533738,1.5332694587119164,1.0001855116573346,1.9260476788566749E-2,1,0,7387.7442106784583,1.5706609674789083,8.6768520478951494,1.4552904889422325,1.0008472792151151,4.1150489967197855E-2,1.0000000037928565,8.7095999779771563E-5,1.0000000037928565,8.7095999779771563E-5,1.9238494131746606,1.1360100994948048,-9.116353732677867,-160.80290007871164,19.197099921288356,null,87096,7585713216,null,-2.7434835757251541,-8.9679909108194771,null,null,null,-4.434669896791589,-151.83490916789219,null,0,0]
[87603.25,87.603250000000003,26.808844575019926,1.5334865487423288,1.0001876785985679,1.9372622463392851E-2,1,0,7430.7706778228103,1.5706617512513392,8.7267170253403954,1.4559534216208139,1.0008571728804343,4.1389878960240413E-2,1.0000000038371646,8.7603249775901264E-5,1.0000000038371646,8.7603249775901264E-5,1.9321430972692064,1.1392654152620147,-9.2048207469822447,-160.97120644323792,19.028793556762082,null,87603.25,7674329410.5625,null,-2.7442355775006826,-8.943768552023398,null,null,null,-4.5223849093204347,-152.02743789121453,null,0,0]
[88110.5,88.110500000000002,26.963860739428373,1.5337011426666292,1.0001898581187596,1.9484767650874629E-2,1,0,7473.7971449716724,1.5706625259994527,8.7765857944197023,1.4566088209862371,1.0008671239008298,4.1629263206799348E-2,1.00000000388173,8.8110499771985889E-5,1.00000000388173,8.8110499771985889E-5,1.9404517380756925,1.1424989009574027,-9.2928936761711167,-161.13854988639943,18.861450113600569,null,88110.5,7763460210.25,null,-2.7449767040414685,-8.9199770312687363,null,null,null,-4.6097167119685203,-152.21857285513076,null,0,0]
[88617.75,88.617750000000001,27.118878131341919,1.5339132832697338,1.000192050217827,1.9596912348194478E-2,1,0,7516.8236121249711,1.5706632918782151,8.8264582908658102,1.4572568141679816,1.0008771322745904,4.1868642679580896E-2,1.0000000039265529,8.861774976802514E-5,1.0000000039265529,8.861774976802514E-5,1.9487751884201943,1.1457107953071555,-9.3805759457586078,-161.30493926108832,18.695060738911678,null,88617.75,7853105615.0625,null,-2.745707212160498,-8.8966090718879762,null,null,null,-4.6966684734369846,-152.4083301892004,null,0,0]
[89125,89.125,27.273896729830152,1.5341230123647356,1.0001942548956875,1.9709056552534875E-2,1,0,7559.850079282628,1.5706640490390642,8.8763344518510596,1.457897525463363,1.0008871979999963,4.2108017351294567E-2,1.0000000039716328,8.9124999764018814E-5,1.0000000039716328,8.9124999764018814E-5,1.9571133035477393,1.1489013341565457,-9.4678709351378885,-161.47038336152002,18.529616638479979,null,89125,7943265625,null,-2.7464273514754471,-8.8736575592826288,null,null,null,-4.7832433235013125,-152.59672580223739,null,0,0]
[89644,89.644000000000005,27.432507425263569,1.5343351463246639,1.0001965236621175,1.9823797965531159E-2,1,0,7603.8732167041626,1.5706648148700679,8.9273696790168131,1.4585456681685824,1.0008975562470535,4.2352931929054732E-2,1.0000000040180232,8.9643999759872201E-5,1.0000000040180232,8.9643999759872201E-5,1.9656595935541616,1.1521439187750004,-9.556790672896641,-161.63869056595905,18.361309434040948,null,89644,8036046736,null,-2.7471536933793099,-8.8505981682562318,null,null,null,-4.8714367193562005,-152.7880923977028,null,0,0]
[90163,90.162999999999997,27.591119340989046,1.5345448413226626,1.0001988055966666,1.9938538856477374E-2,1,0,7647.8963541301055,1.5706655718844551,8.9784086138362333,1.4591864422369494,1.0009079745298546,4.2597841422955779E-2,1.0000000040646833,9.0162999755677301E-5,1.0000000040646833,9.0162999755677301E-5,1.974220936599054,1.1553646374724538,-9.6453119944116512,-161.80602662844854,18.193973371551465,null,90163,8129366569,null,-2.7478696871899895,-8.8279601725841381,null,null,null,-4.9592420470605338,-152.97806645586434,null,0,0]
[90682,90.682000000000002,27.749732456081738,1.5347521391623005,1.0002011006992453,2.0053279222355856E-2,1,0,7691.9194915603812,1.5706663202336066,9.0294511934368291,1.4598199721002478,1.0009184528465249,4.2842745803777241E-2,1.0000000041116126,9.0681999751433828E-5,1.0000000041116126,9.0681999751433828E-5,1.9827971852341764,1.1585637336859433,-9.7334383757095679,-161.97240076982743,18.027599230172569,null,90682,8223225124,null,-2.7485755784223014,-8.8057364498495634,null,null,null,-5.0466625371261387,-153.16666431997788,null,0,0]
[91201,91.200999999999993,27.908346750092356,1.5349570806976363,1.0002034089697625,2.0168019060149041E-2,1,0,7735.9426289949151,1.5706670600654566,9.0804973563553268,1.460446379415842,1.0009289911951791,4.3087645042302343E-2,1.0000000041588111,9.1200999747141498E-5,1.0000000041588111,9.1200999747141498E-5,1.9913881944876672,1.1617414478203825,-9.8211732463701544,-162.13782214156933,17.86217785843067,null,91201,8317622401,null,-2.7492716057090734,-8.783920036400982,null,null,null,-5.1337013804999518,-153.35390210516837,null,0,0]
[91732,91.731999999999999,28.070629625901386,1.5351643637498986,1.0002057842387508,2.0285411292480095E-2,1,0,7780.9836424438281,1.5706678083390426,9.1327274232639457,1.4610800227113032,1.0009398353331607,4.3338201338483255E-2,1.0000000042073798,9.1731999742699087E-5,1.0000000042073798,9.1731999742699087E-5,2.0001929676441774,1.1649707533222369,-9.9105350043467197,-162.30609168704862,17.693908312951379,null,91732,8414759824,null,-2.7499737593274465,-8.7620136410492577,null,null,null,-5.2223609848581418,-153.54407804599936,null,0,0]
[92263,92.263000000000005,28.232913693935238,1.5353692638661147,1.0002081732914458,2.0402802965633189E-2,1,0,7826.0246558970484,1.5706685479995708,9.1849611152940867,1.4617064593601226,1.0009507423072375,4.3588752189962485E-2,1.0000000042562305,9.2262999738204932E-5,1.0000000042562305,9.2262999738204932E-5,2.0090128926225188,1.1681781760863474,-9.9994940560792678,-162.47338304885676,17.526616951143239,null,92263,8512461169,null,-2.7506660718781779,-8.7405193506847318,null,null,null,-5.3106277240399615,-153.73286369817205,null,0,0]
[92794,92.793999999999997,28.395198933752535,1.5355718218860499,1.0002105761277487,2.0520194076376848E-2,1,0,7871.0656693545006,1.5706692791949022,9.2371983709486951,1.4623258111292894,1.0009617121153553,4.383929756546151E-2,1.0000000043053632,9.2793999733658763E-5,1.0000000043053632,9.2793999733658763E-5,2.017847821934414,1.1713639639375977,-10.088053929770659,-162.63970579639027,17.360294203609726,null,92794,8610726436,null,-2.7513487780335248,-8.7194301952525191,null,null,null,-5.3985048915760085,-153.92027560113775,null,0,0]
[93325,93.325000000000003,28.557485325376391,1.5357720777219124,1.0002129927475598,2.0637584621479674E-2,1,0,7916.1066828161129,1.5706700020695326,9.2894391301098409,1.4629381970687068,1.0009727447554482,4.4089837433705925E-2,1.0000000043547776,9.332499972906024E-5,1.0000000043547776,9.332499972906024E-5,2.0266976106221151,1.1745283615209843,-10.176218106776263,-162.80506941919117,17.19493058080883,null,93325,8709555625,null,-2.7520221058849841,-8.6987393601827137,null,null,null,-5.4859957407301527,-154.10633005900846,null,0,0]
[93868.5,93.868499999999997,28.723593190541852,1.5359747042751672,1.0002154805297139,2.0757738008350277E-2,1,0,7962.2079837928268,1.5706707334915486,9.3429132291711081,1.4635579066252553,1.0009841021751504,4.4346269397240755E-2,1.0000000044056476,9.3868499724298972E-5,1.0000000044056476,9.3868499724298972E-5,2.0357709671728039,1.1777453511113209,-10.266051518366034,-162.97334234452734,17.026657655472661,null,93868.5,8811295292.25,null,-2.7527018035317474,-8.6779669946821798,null,null,null,-5.5751494546731575,-154.29537534984519,null,0,0]
[94412,94.412000000000006,28.889702221465264,1.5361750007259869,1.000217982751743,2.0877890795785645E-2,1,0,8008.3092847737516,1.5706714564924347,9.3963908754447374,1.4641705625132313,1.0009955254154201,4.4602695524895868E-2,1.0000000044568129,9.4411999719482261E-5,1.0000000044568129,9.4411999719482261E-5,2.0448595915575409,1.1809404400879113,-10.355477618154364,-163.14063031500854,16.859369684991464,null,94412,8913625744,null,-2.7533721394965367,-8.6575979577549216,null,null,null,-5.6639052184966996,-154.48303235725362,null,0,0]
[94955.5,94.955500000000001,29.055812398153073,1.5363730070212902,1.0002204994135391,2.0998042980321069E-2,1,0,8054.4105857588147,1.5706721712167917,9.4498720087087822,1.4647762840285454,1.0010070144740042,4.4859115783149349E-2,1.0000000045082735,9.4955499714609754E-5,1.0000000045082735,9.4955499714609754E-5,2.0539633362872123,1.184113880670755,-10.444499992802008,-163.30694324197682,16.693056758023175,null,94955.5,9016546980.25,null,-2.7540333383493349,-8.6376254206130749,null,null,null,-5.7522663942915457,-154.66931782136373,null,0,0]
[95499,95.498999999999995,29.22192370106621,1.5365687622004136,1.0002230305149931,2.1118194558491944E-2,1,0,8100.511886747945,1.5706728778059289,9.5033565700930307,1.465375187802153,1.0010185693486364,4.5115530138483927E-2,1.0000000045600295,9.5498999709681167E-5,1.0000000045600295,9.5498999709681167E-5,2.0630820564585837,1.1872659217502692,-10.533122181565403,-163.47229094650481,16.527709053495187,null,95499,9120059001,null,-2.7546856183577066,-8.6180427069711847,null,null,null,-5.8402363030465674,-154.85424823953363,null,0,0]
[96611.5,96.611500000000007,29.561943369633028,1.5369625967231446,1.0002282565005403,2.1364133095931517E-2,1,0,8194.87747526155,1.5706742993447609,9.6128455376313298,1.4665803113215305,1.0010424264618301,4.564037078087757E-2,1.0000000046668909,9.6611499699416435E-5,1.0000000046668909,9.6611499699416435E-5,2.0817934332697141,1.1936521892137375,-10.71329125056578,-163.80777504559998,16.192224954400018,null,96611.5,9333781932.25,null,-2.7559938557028469,-8.5791468173760332,null,null,null,-6.0190971347018039,-155.22862822822401,null,0,0]
[97724,97.724000000000004,29.901967519144819,1.5373474744858986,1.0002335429850235,2.1610069048553195E-2,1,0,8289.2430637913385,1.5706756885177064,9.7223481516670152,1.4677582899552426,1.0010665593066808,4.6165186263023392E-2,1.00000000477499,9.7723999688912583E-5,1.00000000477499,9.7723999688912583E-5,2.1005657729105685,1.1999518850616835,-10.89182754100923,-164.13933791142935,15.860662088570649,null,97724,9549980176,null,-2.7572673507088057,-8.5418029191619453,null,null,null,-6.1963599301392946,-155.59753499226744,null,0,0]
[98862,98.861999999999995,30.249789959274676,1.5377322218729268,1.0002390132367636,2.1861639479466306E-2,1,0,8385.7716388609042,1.5706770771843139,9.8343743572920346,1.4689361261158203,1.0010915305723855,4.6702004892224973E-2,1.0000000048868474,9.8861999677917663E-5,1.0000000048868474,9.8861999677917663E-5,2.1198302797510737,1.2063085012954533,-11.072796588203973,-164.47452763709956,15.525472362900445,null,98862,9773695044,null,-2.7585358069777599,-8.5051548847140754,null,null,null,-6.3760605210650869,-155.96937275238548,null,0,0]
[100000,100,30.597616775491176,1.5381082218712812,1.0002445467906171,2.2113207142824047E-2,1,0,8482.3002139462751,1.5706784342448696,9.9464138987880393,1.4700874288081609,1.0011167903124418,4.72387965865649E-2,1.000000005,9.9999999666666668E-5,1.000000005,9.9999999666666668E-5,2.1391561935813237,1.2125787245264179,-11.252116878347831,-164.80578328004009,15.194216719959911,null,100000,10000000000,null,-2.7597712991850996,-8.4700237518665062,null,null,null,-6.5541453190016039,-156.33575952817353,null,0,0]
[101165,101.16500000000001,30.953700452322785,1.5384843893916442,1.000250277204332,2.2370740558978589E-2,1,0,8581.119010073211,1.5706797918766546,10.061125021016609,1.4712394842355889,1.0011429481601055,4.7788295890107663E-2,1.0000000051171785,1.0116499965488042E-4,1.0000000051171785,1.0116499965488042E-4,2.1590030503214117,1.218910344892949,-11.434014099973282,-165.14090950213478,14.859090497865225,null,101165,10234357225,null,-2.7610036002264127,-8.4355776155801774,null,null,null,-6.734810239585741,-156.7053318865546,null,0,0]
[102330,102.33,31.309788409537656,1.5388520006149682,1.0002560739573441,2.2628271007262436E-2,1,0,8679.9378062156011,1.570681118595882,10.175849195615585,1.4723655642100708,1.001169408286517,4.8337766313879663E-2,1.0000000052357143,1.0232999964281957E-4,1.0000000052357143,1.0232999964281957E-4,2.17891188919657,1.2251556758590894,-11.614244157784368,-165.47208649408046,14.527913505919543,null,102330,10471428900,null,-2.7622045976839522,-8.4026163372722333,null,null,null,-6.9138392999392906,-157.06947015680822,null,0,0]
[103520,103.52,31.673522008262001,1.5392189667731164,1.0002620635929547,2.2891324760463974E-2,1,0,8780.8771773979188,1.5706824429559636,10.293048284080481,1.4734898916413046,1.0011967482802278,4.8898997789834496E-2,1.0000000053581952,1.0351999963021309E-4,1.0000000053581952,1.0351999963021309E-4,2.199310768138564,1.231448082492361,-11.796651317449452,-165.80638143831632,14.193618561683678,null,103520,10716390400,null,-2.7634006148706876,-8.3704291957803019,null,null,null,-7.0950504424176373,-157.43595224253608,null,0,0]
[104710,104.71,32.037259775422775,1.5395776002153658,1.0002681224431447,2.3154375345115583E-2,1,0,8881.8165485952904,1.5706837372140781,10.410260091134129,1.4745889022499965,1.00122440361438,4.9460198438422205E-2,1.0000000054820919,1.0470999961731343E-4,1.0000000054820919,1.0470999961731343E-4,2.2197719697854938,1.2376547401632829,-11.977380483460182,-166.13673313708784,13.863266862912155,null,104710,10964184100,null,-2.764567058089364,-8.3396891103786714,null,null,null,-7.2746131652096899,-157.79704402670913,null,0,0]
[105930,105.93,32.410171582728204,1.5399369179741784,1.0002744058900725,2.3424054129686418E-2,1,0,8985.300609837941,1.5706850339127232,10.530439576675578,1.4756902190490713,1.0012530834797617,5.0035514632247202E-2,1.0000000056105824,1.0592999960378067E-4,1.0000000056105824,1.0592999960378067E-4,2.2408125268243251,1.2439310180696315,-12.160955130055298,-166.4714099881167,13.528590011883296,null,105930,11221164900,null,-2.7657337046776211,-8.3096257910018405,null,null,null,-7.457021165216549,-158.16178419711486,null,0,0]
[107150,107.15,32.783087479288959,1.54028806111703,1.000280762082687,2.3693729506571289E-2,1,0,9088.7846710953563,1.5706863010831864,10.650631546323334,1.4767666804934287,1.0012820947295737,5.0610797677934791E-2,1.0000000057405611,1.0714999958993258E-4,1.0000000057405611,1.0714999958993258E-4,2.2619162502189099,1.2501215140510131,-12.342828849539892,-166.80212423696926,13.197875763030737,null,107150,11481122500,null,-2.7668722304139459,-8.2809829874616785,null,null,null,-7.6377563589648192,-158.52114124950759,null,0,0]
[108400,108.4,33.165177535961092,1.5406396485780471,1.0002873500245921,2.3970032669825312E-2,1,0,9194.8134223984835,1.5706875698298521,10.77379156766194,1.477844699934606,1.0013121630484696,5.1200192252041095E-2,1.00000000587528,1.0839999957541311E-4,1.00000000587528,1.0839999957541311E-4,2.2836032661615553,1.25637746255692,-12.527442612100145,-167.13695370729786,12.863046292702137,null,108400,11750560000,null,-2.7680110254903538,-8.2530595386106782,null,null,null,-7.8212313264486655,-158.88389416868716,null,0,0]
[109650,109.65,33.547271598917405,1.5409832271145747,1.0002940143308634,2.4246332172517406E-2,1,0,9300.8421737160734,1.5706888096493254,10.896963826475298,1.4788983501027795,1.001342579188196,5.178955122472928E-2,1.0000000060115612,1.0964999956055487E-4,1.0000000060115612,1.0964999956055487E-4,2.305354268166012,1.2625477613107574,-12.710334792086996,-167.46780969975089,12.532190300249113,null,109650,12023122500,null,-2.769123143761977,-8.2265286490371512,null,null,null,-8.0030113881638947,-159.24128105071375,null,0,0]
[110925,110.925,33.937011530071494,1.541325706888109,1.000300890592247,2.4528153850478834E-2,1,0,9408.9915000744095,1.5706900454785755,11.022611712061046,1.4799488128907829,1.0013739619428652,5.2390660279077926E-2,1.0000000061521777,1.1092499954504645E-4,1.0000000061521777,1.1092499954504645E-4,2.3276050599277127,1.2687554369088809,-12.895143534320004,-167.80128350071371,12.198716499286292,null,110925,12304355625,null,-2.7702313916105754,-8.2008533843611762,null,null,null,-8.1867118825483018,-159.60043011635258,null,0,0]
[112200,112.2,34.326755351389693,1.5416604097125441,1.0003078462998907,2.4809971631491092E-2,1,0,9517.1408264467864,1.5706912532207975,11.148271486610968,1.480975595824966,1.0014057065033315,5.2991731440287931E-2,1.0000000062944199,1.1219999952917739E-4,1.0000000062944199,1.1219999952917739E-4,2.3499201415682038,1.2748784071895753,-13.078225725118394,-168.13081165669732,11.869188343302682,null,112200,12588840000,null,-2.7713145832113408,-8.1765310949850534,null,null,null,-8.3687108817459226,-159.95428056171227,null,0,0]
[113510,113.51,34.727201936848957,1.5419964754918933,1.0003150756942965,2.5099521481038594E-2,1,0,9628.2589578709685,1.5706924658574029,11.277392710432409,1.4820067308958405,1.0014386992869408,5.3609262673743205E-2,1.0000000064422601,1.1350999951249271E-4,1.0000000064422601,1.1350999951249271E-4,2.3729136172002203,1.2810834649598852,-13.264568345088403,-168.46537217009597,11.534627829904025,null,113510,12884520100,null,-2.7724027261546667,-8.1529028196430904,null,null,null,-8.5539653587726043,-160.31246935045289,null,0,0]
[114820,114.82,35.127652354983489,1.542324879100063,1.0003223889530171,2.5389067121120042E-2,1,0,9739.3770893089859,1.5706936508236731,11.406525653351148,1.4830145201182232,1.0014720739387679,5.4226752983471752E-2,1.0000000065918162,1.1481999949541845E-4,1.0000000065918162,1.1481999949541845E-4,2.3959726906893444,1.2872035753507622,-13.4491545101518,-168.79596047671964,11.204039523280358,null,114820,13183632400,null,-2.7734670194996851,-8.1306082327401281,null,null,null,-8.7374872304909861,-160.66535224397947,null,0,0]
[116155,116.155,35.535748765606101,1.5426519351684629,1.0003299280561218,2.5684134060453872E-2,1,0,9852.6157957881951,1.5706948309056381,11.538134614725951,1.4840183330391086,1.0015064783409999,5.4855984873480042E-2,1.000000006745992,1.1615499947761287E-4,1.000000006745992,1.1615499947761287E-4,2.4195381923275634,1.2933553246467686,-13.63548962543539,-169.12886829203072,10.871131707969283,null,116155,13491984025,null,-2.7745283394144398,-8.1092139342768412,null,null,null,-8.9227610258598258,-161.01965435775384,null,0,0]
[117490,117.49,35.943848891020345,1.5429715645964901,1.0003375542511328,2.5979196526519446E-2,1,0,9965.8545022808139,1.5706959841698414,11.669754940146806,1.4849995034069698,1.0015412792451335,5.5485173284310414E-2,1.0000000069019499,1.1748999945939327E-4,1.0000000069019499,1.1748999945939327E-4,2.4431696024844793,1.2994233130907638,-13.820067294339303,-169.45784500018641,10.54215499981359,null,117490,13803900100,null,-2.7755673562867829,-8.0891129308227629,null,null,null,-9.1062996778913927,-161.36873206936366,null,0,0]
[118860,118.86,36.362652001642566,1.5432921147433891,1.0003454709285517,2.6281990008174161E-2,1,0,10082.062013826029,1.5706971407355104,11.804837401912188,1.4859836489218128,1.0015774047201114,5.6130811549809118E-2,1.0000000070638497,1.1885999944026054E-4,1.0000000070638497,1.1885999944026054E-4,2.4674879858980807,1.3055655527795931,-14.007690827789286,-169.79145802308159,10.208541976918411,null,118860,14127699600,null,-2.7766116229437636,-8.0697841604102329,null,null,null,-9.2928789446843947,-161.72167386267137,null,0,0]
[120230,120.23,{"$f":"SQRT(1+(A589/p_dom)^2)","v":36.781458763528143},{"$f":"ATAN(A589/p_dom)","v":1.5436053651260704},{"$f":"SQRT(1+(A589/z_ESR)^2)","v":1.000353479320081},{"$f":"ATAN(A589/z_ESR)","v":2.6584778669525525E-2},{"$f":"IF(VIN_nom>Vout, 1, SQRT(1+(A589/z_RHP)^2))","v":1},{"$f":"IF(VIN_nom>Vout, 0, -ATAN(A589/z_RHP))","v":0},{"$f":"SQRT(1+(A589/EA_p1)^2)","v":10198.269525384425},{"$f":"ATAN(A589/EA_p1)","v":1.5706982709434492},{"$f":"SQRT(1+(A589/EA_z1)^2)","v":11.939931038451105},{"$f":"ATAN(A589/EA_z1)","v":1.4869455252395003},{"$f":"SQRT(1+(A589/EA_hf_p)^2)","v":1.0016139476711803},{"$f":"ATAN(A589/EA_hf_p)","v":5.6776402973385161E-2},{"$f":"SQRT(1+(A589/Zero3)^2)","v":1.0000000072276265},{"$f":"ATAN(A589/Zero3)","v":1.2022999942068166E-4},{"$f":"SQRT(1+(A589/pole5)^2)","v":1.0000000072276265},{"$f":"ATAN(A589/pole5)","v":1.2022999942068166E-4},{"$f":"SQRT((1-(Z589/pterm2))^2+(A589/pterm1)^2)","v":2.4918735892257775},{"$f":"IF((ATAN((A589/pterm1)/(1-A589^2/pterm2))>0),ATAN((A589/pterm1)/(1-A589^2/pterm2)),PI()+ATAN((A589/pterm1)/(1-A589^2/pterm2)))","v":1.3116240843178792},{"$f":"20*LOG10(((E589*K589*G589*O589)/(C589*I589*S589*M589*Q589))*Adc)","v":-14.193531642485432},{"$f":"((F589+L589+H589+P589)-(D589+J589+T589+N589+R589))*radconv","v":-170.12112868971613},{"$f":"IF(V589>0,V589,V589+180)","v":9.8788713102838699},null,{"$f":"IF(U589<0,A589,1000000000)","v":120230},{"$f":"A589^2","v":14455252900},null,{"$f":"20*LOG10((K589/(I589*M589))*Aea_stability*Afb*0.8)","v":-2.7776347701597892},{"$f":"(L589-(J589+N589))*radconv","v":-8.0517271269781396},null,null,null,{"$f":"20*LOG10((E589*G589/(C589*S589))*Am_stability)","v":-9.4776966121645145},{"$f":"(F589+H589-(D589+T589))*radconv","v":-162.06940156273802},null,{"$f":"SUM((U590<0)*(U589>0))*A589","v":0},0]
[126030,{"$f":"A590/1000","v":126.03},38.554546999324728,1.544856139825364,1.0003883994514349,2.7866602997415075E-2,1,0,10690.242932118123,1.5707027835510425,12.511975768169485,1.4907875642919717,1.0017732789501219,5.9509032547677615E-2,1.0000000079417803,1.2602999933273163E-4,1.0000000079417803,1.2602999933273163E-4,2.5958335255520222,1.3363946833602713,-14.961299995959658,-171.47529453224766,8.5247054677523408,null,126030,15883560900,null,-2.7817566198275441,-7.9884211994240362,null,null,null,-10.241343115970984,-163.48687333282359,null,0,0]
[131830,131.83000000000001,40.327690247398252,1.5459969271039165,1.0004249631782414,2.9148335734428755E-2,1,0,11182.216339050356,1.5707068990847708,13.084189039333902,1.4942936021762374,1.001940088323277,6.224077262386641E-2,1.0000000086895744,1.3182999923630226E-4,1.0000000086895744,1.3182999923630226E-4,2.7009104006855846,1.3598537007278662,-15.700038424144578,-172.76719344672375,7.232806553276248,null,131830,17379148900,null,-2.7855908250658841,-7.9442930055976477,null,null,null,-10.976247338917569,-164.82290044112614,null,0,0]
[144540,144.54,44.213479705104866,1.5481768613031375,1.0005108345415206,3.1956757543006718E-2,1,0,12260.316684818981,1.5707147628331479,14.338616125684364,1.5009979290724063,1.0023317615593312,6.8223744106118089E-2,1.0000000104459057,1.4453999899343253E-4,1.0000000104459057,1.4453999899343253E-4,2.9348096795816043,1.4072968983384724,-17.227377350088489,-175.40859869078929,4.5914013092107098,null,144540,20891811600,null,-2.7932530089918166,-7.9034129443977319,null,null,null,-12.495924080935545,-167.50518574639156,null,0,0]
[158490,158.49,48.478571764520368,1.5501671932627101,1.0006141655524923,3.5038589708226625E-2,1,0,13443.597552851927,1.5707219419438929,15.716043990837013,1.5071240684925653,1.002802912822877,7.4784778000143159E-2,1.0000000125595401,1.5848999867295902E-4,1.0000000125595401,1.5848999867295902E-4,3.1968604648600607,1.4541606980840158,-18.776895725677868,-178.05648722669204,1.9435127733079582,null,158490,25119080100,null,-2.800891236336005,-7.9287418950590984,null,null,null,-14.037804229180734,-170.12774533163292,null,0,0]
[173780,173.78,53.153540752335779,1.5519817946668082,1.0007383365274369,3.8415687666638124E-2,1,0,14740.541243279056,1.5707284866807336,17.226347876706949,1.5127130635212171,1.0033688582767428,8.1968624656396191E-2,1.0000000150997441,1.7377999825064433E-4,1.0000000150997441,1.7377999825064433E-4,3.4900663866433583,1.5005356308830329,-20.345525340585255,-180.71580394926144,-0.71580394926144209,null,173780,30199488400,null,-2.8087508483928527,-8.0204951481740565,null,null,null,-15.598574232031279,-172.69530880108741,null,0,0]
[190550,190.55,58.281192128839962,1.5536372907964393,1.0008876469515391,4.2118662156066106E-2,1,0,16163.022976287308,1.5707344571804003,18.883357035780641,1.5178148579437027,1.0040490545923124,8.983806836074934E-2,1.0000000181546511,1.9054999769375417E-4,1.0000000181546511,1.9054999769375417E-4,3.8185354128148088,1.5466309313446502,-21.933766381185404,-183.39847496296011,-3.3984749629601083,null,190550,36309302500,null,-2.8171005018855073,-8.1794118558115549,null,null,null,-17.178465619138766,-175.21906310714857,null,0,0]
[208930,208.93,63.90127510841041,1.5551465479957642,1.0010670506390351,4.617580906281369E-2,1,0,17722.069742054911,1.5707398999770879,20.699916795438423,1.5224681434080591,1.0048658684126235,9.8450184658406589E-2,1.0000000218258722,2.0892999695994706E-4,1.0000000218258722,2.0892999695994706E-4,4.186635318115103,1.5926040201171787,-23.540310168586913,-186.11369174484207,-6.1136917448420718,null,208930,43651744900,null,-2.8262128894560896,-8.4065480039044314,null,null,null,-18.775897018969697,-177.70714374093765,null,0,0]
[229090,229.09,70.0657708624165,1.5565235379483398,1.0012827702249871,5.0624114308949586E-2,1,0,19432.101450820122,1.5707448655567504,22.69282909493738,1.5267152681542973,1.0058473415360312,0.10787947118698274,1.0000000262411137,2.2908999599228225E-4,1.0000000262411137,2.2908999599228225E-4,4.6001156981510753,1.638684953025412,-25.16662394625952,-188.87516182142926,-8.8751618214292591,null,229090,52482228100,null,-2.8363981411139645,-8.7037485098835052,null,null,null,-20.392025544984428,-180.17141331154576,null,0,0]
[251190,251.19,76.823603989035831,1.5577791264829757,1.0015420023881552,5.54981714263083E-2,1,0,21306.689782811307,1.5707493931787151,24.877910994688328,1.5305891933810285,1.007025800446574,0.11819399876758133,1.0000000315482076,2.5118999471693726E-4,1.0000000315482076,2.5118999471693726E-4,5.065281962547008,1.685038398579106,-26.812437758118786,-191.69297438870296,-11.692974388702964,null,251190,63096416100,null,-2.847987568236845,-9.0730272563338907,null,null,null,-22.026249929720816,-182.61994713236902,null,0,0]
[275420,275.42,84.23287345903961,1.5589241983661841,1.0018535474514831,6.0838950366226226E-2,1,0,23361.951108303325,1.5707535221508979,27.273948279321111,1.5341230817107157,1.0084406524565932,0.12947359926681204,1.0000000379280876,2.7541999303589765E-4,1.0000000379280876,2.7541999303589765E-4,5.5900210639607915,1.731849628685834,-28.479046897692974,-194.57869719382666,-14.578697193826656,null,275420,75856176400,null,-2.8613630137639623,-9.5170604461590482,null,null,null,-23.679483623767883,-185.06163674766762,null,0,0]
[302000,302,92.360852935646321,1.5599690173134386,1.0022281549262035,6.669371107811696E-2,1,0,25616.546487618634,1.5707572895265147,29.902696457131313,1.5373482901727364,1.0101398536252135,0.1418090827752333,1.0000000456019988,3.0199999081879784E-4,1.0000000456019988,3.0199999081879784E-4,6.1841153851613049,1.7793019063142905,-30.168814704664143,-197.54411923587617,-17.544119235876167,null,302000,91204000000,null,-2.8769688217315359,-10.039256611840514,null,null,null,-25.353645622771481,-187.50486262403564,null,0,0]
[331130,331.13,101.26870102829031,1.5609214469728072,1.00267812575879,7.3104889326643455E-2,1,0,28087.440521053053,1.5707607236932377,32.783935508433665,1.5402888505258523,1.0121779656084315,0.15527814217703073,1.000000054823537,3.3112998789752197E-4,1.000000054823537,3.3112998789752197E-4,6.8584570564817593,1.8274786555951354,-31.88196324244818,-200.59511571158941,-20.595115711589415,null,331130,109647076900,null,-2.8952933134481351,-10.642691935886367,null,null,null,-27.048469668838919,-189.95242377570298,null,0,0]
[363080,363.08,111.03898273264399,1.5617903588597846,1.0032190022853347,8.0129781711485173E-2,1,0,30797.535419009066,1.5707638566642004,35.94437104647912,1.5429719689046371,1.0146236170854674,0.16998590816843431,1.0000000659135411,3.630799840454084E-4,1.0000000659135411,3.630799840454084E-4,7.6275023859104829,1.8765097972786831,-33.622044007836074,-203.74082256141523,-23.740822561415229,null,363080,131827086400,null,-2.9169349902013479,-11.331833001022448,null,null,null,-28.766908757473601,-192.4089895603928,null,0,{"$f":"IF(AJ602>0,W602,0)","v":0}]
[398110,398.11,121.75120584803537,1.5625827634310381,1.0038688504424462,8.7822754995307867E-2,1,0,33768.885161877028,1.5707667137355565,39.409721939208353,1.545419153540676,1.0175559630115625,0.18602639435303026,1.0000000792457828,3.9810997896764209E-4,1.0000000792457828,3.9810997896764209E-4,8.5079715284339432,1.9264232114035713,-35.390881173089305,-206.98427957860741,-26.984279578607413,null,398110,158491572100,null,-2.9425672806540475,-12.110835508424024,null,null,null,-30.51011363227413,-194.87344407018338,null,0,0]
[436520,436.52,133.49711078908564,1.5633054579188859,1.0046495924317265,9.6246018428876479E-2,1,0,37026.936650109681,1.5707693194297028,43.209665777549304,1.5476512903845885,1.0210703109360861,0.20350370082000824,1.0000000952748507,4.3651997227374997E-4,1.0000000952748507,4.3651997227374997E-4,9.5206449587275124,1.9772172628703202,-37.191324609917864,-210.32698742804271,-30.326987428042713,null,436520,190549710400,null,-2.9729846489873029,-12.984468682062282,null,null,null,-32.280139700769432,-197.34251874598041,null,0,0]
[478630,478.63,146.37455460201392,1.5639644851420123,1.0055873171097107,0.10546492736017707,1,0,40598.83324419213,1.5707716955451736,47.375860511005286,1.5496869630680188,1.0252789515329916,0.22252042749687351,1.0000001145433319,4.7862996345075299E-4,1.0000001145433319,4.7862996345075299E-4,10.690640670411906,2.0288219259193152,-39.025961933100753,-213.76635059976098,-33.766350599760983,null,478630,229086676900,null,-3.0091038167093509,-13.957547550069895,null,null,null,-34.078657856230272,-199.80880304969105,null,0,0]
[524810,524.80999999999995,160.49668509863426,1.5645656282002045,1.0067137295738273,0.1155541579778251,1,0,44515.959454687429,1.570773862941206,51.944912491075421,1.551543974057608,1.0303168763751329,0.24318821699183971,1.0000001377127585,5.2480995181798282E-4,1.0000001377127585,5.2480995181798282E-4,12.049169325094137,2.0811299586746772,-40.898215948523955,-217.29765514286163,-37.297655142861629,null,524810,275425536100,null,-3.0520048120370729,-15.035449951660281,null,null,null,-35.908010876325747,-202.26220519120142,null,0,0]
[575440,575.44000000000005,175.97970864162053,1.5651138228883512,1.0080661656865075,0.12658844411263964,1,0,48810.548022175688,1.5707758394199216,56.954418974013983,1.5532375244206427,1.0363407360499826,0.26560601533566197,1.000000165565583,5.7543993648463459E-4,1.000000165565583,5.7543993648463459E-4,13.633506703672269,2.1339462752236047,-42.810400825275615,-220.91052357795851,-40.910523577958514,null,575440,331131193600,null,-3.1029107085941483,-16.222975139787565,null,null,null,-37.769289856520345,-204.68754843817098,null,0,0]
[630960,630.96,192.95818044221585,1.5656138334997431,1.0096899082883226,0.13865283694614666,1,0,53519.921067330317,1.5707776421634525,62.447915086763423,1.5547822974808376,1.0435376600416737,0.28987789672015563,1.000000199055241,6.3095991626941511E-4,1.000000199055241,6.3095991626941511E-4,15.489777104684231,2.1870460553625746,-44.76552155042134,-224.59259726031297,-44.592597260312971,null,630960,398110521600,null,-3.1632471111107066,-17.525245818390452,null,null,null,-39.664074179149502,-207.06735144192251,null,0,0]
[691830,691.83,211.57277227658136,1.5660698030906075,1.0116384172410542,0.15183313036025275,1,0,58683.097170856847,1.570779286112856,68.470916116026771,1.5561910664904832,1.0521241778274895,0.31608988371774704,1.0000002393143459,6.9182988962345599E-4,1.0000002393143459,6.9182988962345599E-4,17.673260014381313,2.2401375583666665,-46.765502024841837,-228.32668016290566,-48.32668016290566,null,691830,478628748900,null,-3.2346119396387456,-18.946459720429242,null,null,null,-41.592689825041973,-209.38022044247646,null,0,0]
[758580,758.58,231.98556289797131,1.5664857003730135,1.0139763405757816,0.16622561120128485,1,0,64345.032523569607,1.5707807855796572,75.075864827131568,1.557476073016381,1.0623566923325571,0.34432526492649651,1.0000002877217669,7.5857985449337743E-4,1.0000002877217669,7.5857985449337743E-4,20.25194044059819,2.2929178551043443,-48.812697984899557,-232.09419780054935,-52.094197800549352,null,758580,575443616400,null,-3.3188349393720449,-20.49068836093663,null,null,null,-43.55566278536638,-211.60350943961274,null,0,0]
[831760,831.76,254.36474758380643,1.5668649542857267,1.0167796414277688,0.18192483255444614,1,0,70552.379776314949,1.5707821529285693,82.317184020775414,1.5586478961881656,1.0745282266367511,0.37463574096545776,1.000000345912289,8.3175980818937605E-4,1.000000345912289,8.3175980818937605E-4,23.306871183896448,2.3450413926460802,-50.908062570217616,-235.87248721599218,-55.87248721599218,null,831760,691824697600,null,-3.4179139668128053,-22.160288536152212,null,null,null,-45.55194834324368,-213.71219867983993,null,0,0]
[912010,912.01,278.9060448114007,1.5672108823014002,1.0201401528581118,0.19903688427042318,1,0,77359.425650078832,1.5707834001218814,90.258203083584633,1.559716774737127,1.0889832604314471,0.4070625458451067,1.0000004158810336,9.1200974714163261E-4,1.0000004158810336,9.1200974714163261E-4,26.93754872848011,2.3961869918891119,-53.053079954009078,-239.63903436271119,-59.639034362711186,null,912010,831762240100,null,-3.5340893085806573,-23.957036830148873,null,null,null,-47.580790385267299,-215.68199753256232,null,0,0]
[1000000,1000,305.81434765880738,1.5675263632049992,1.0241656791929297,0.21766422696524096,1,0,84823.001555894632,1.5707845375398399,98.965220883906426,1.5606915949621176,1.1061115606251346,0.44160248558178306,1.0000004999998751,9.9999966666686679E-4,1.0000004999998751,9.9999966666686679E-4,31.262580220668507,2.4460263918653258,-55.247850187915702,-243.36863409953105,-63.36863409953105,null,1000000,1000000000000,null,-3.6697335468573411,-25.880241688466835,null,null,null,-49.639916380897233,-217.48839241106421,null,0,0]
[null,null,null,null,null,null,null,null,null,null,null,null,null,null,null,null,null,null,null,null,null,null,null,null,null,null,null,null,null,null,null,null,{"$error":"#DIV/0!"}]
[null,null,null,null,null,null,null,null,null,null,null,null,null,null,null,null,null,null,null,null,null,null,null,null,null,null,null,null,null,null,null,null,{"$error":"#DIV/0!"}]
["Pole/Zero Locations for Chart",null,null,null,null,null,null,null,null,null,null,null,null,null,null,null,null,null,null,null,null,null,null,null,null,null,null,null,null,null,null,null,{"$error":"#DIV/0!"}]
[{"$f":"Q4*1000","v":45188.5},null,{"$f":"SQRT(1+(A617/pole1)^2)","v":13.855352023119597},{"$f":"ATAN(A617/pole1)","v":1.4985592427084353},{"$f":"SQRT(1+(A617/Zero1)^2)","v":1.0000499413264934},{"$f":"ATAN(A617/Zero1)","v":9.9939229670098929E-3},{"$f":"IF(VIN_nom>Vout, 1, SQRT(1+(A617/z_RHP)^2))","v":1},{"$f":"IF(VIN_nom>Vout, 0, -ATAN(A617/z_RHP))","v":0},{"$f":"SQRT(1+(A617/Pole2)^2)","v":3833.0243359874748},{"$f":"ATAN(A617/Pole2)","v":1.5705354361968498},{"$f":"SQRT(1+(A617/Zero2)^2)","v":4.5823079260629598},{"$f":"ATAN(A617/Zero2)","v":1.3507952828327392},{"$f":"SQRT(1+(A617/pole4)^2)","v":1.0002281499562973},{"$f":"ATAN(A617/pole4)","v":2.135914734900898E-2},{"$f":"SQRT(1+(A617/Zero3)^2)","v":1.0000000010210002},{"$f":"ATAN(A617/Zero3)","v":4.5188499969241689E-5},{"$f":"SQRT(1+(A617/pole5)^2)","v":1.0000000010210002},{"$f":"ATAN(A617/pole5)","v":4.5188499969241689E-5},{"$f":"SQRT((1-(A617^2/(pole3^2)))^2+(A617/(Q*pole3))^2)","v":1.3115108805106257},{"$f":"ATAN((A617/(Q*pole3))/(1-A617^2/pole3^2))","v":0.76185792611127945},{"$f":"20*LOG10(((E617*K617*G617*O617)/(C617*I617*S617*M617*Q617))*Adc)","v":5.2515298500338613E-2},{"$f":"((F617+L617+H617+R617)-(D617+J617+T617+N617+T617))*radconv","v":-186.40238133733988},{"$f":"IF(V617>0,V617,V617+180)","v":-6.4023813373398752},"crossover",null,null,null,{"$f":"20*LOG10((K617/(I617*M617))*AEA)","v":14.916963518140014},{"$f":"(L617-(J617+N617))*radconv","v":-13.813972390201988},null,null,null,4.574977308355451,{"$f":"(F617+H617-(D617+T617))*radconv","v":-128.93975425282679}]
[{"$f":"A617","v":45188.5},null,null,null,null,null,null,null,null,null,null,null,null,null,null,null,null,null,null,null,null,-180,null,null,null,null,null,null,null,null,null,null,{"$error":"#DIV/0!"}]
[{"$f":"A618","v":45188.5},null,null,null,null,null,null,null,null,null,null,null,null,null,null,null,null,null,null,null,null,null,null,null,null,null,null,null,null,null,null,null,{"$error":"#DIV/0!"}]
[1000000,null,null,null,null,null,null,null,null,null,null,null,null,null,null,null,null,null,null,null,null,null,null,null,null,null,null,null,null,null,null,null,{"$error":"#DIV/0!"}]
[null,null,null,null,null,null,null,null,null,null,null,null,null,null,null,null,null,null,null,null,null,null,null,null,null,null,null,null,null,null,null,null,{"$error":"#DIV/0!"}]
[{"$f":"pole1","v":3269.9752448189597},null,1.4142135623730951,0.78539816339744828,1.0000002615194172,7.2321415962458982E-4,{"$f":"IF(VIN_nom>Vout, 1, SQRT(1+(A622/z_RHP)^2))","v":1},{"$f":"IF(VIN_nom>Vout, 0, -ATAN(A622/z_RHP))","v":0},{"$f":"SQRT(1+(A622/Pole2)^2)","v":277.37091790591728},{"$f":"ATAN(A622/Pole2)","v":1.5671910383461152},{"$f":"SQRT(1+(A622/Zero2)^2)","v":1.051054334134415},{"$f":"ATAN(A622/Zero2)","v":0.31296268328613736},{"$f":"SQRT(1+(A622/pole4)^2)","v":1.0000011948207288},{"$f":"ATAN(A622/pole4)","v":1.5458457486118014E-3},{"$f":"SQRT(1+(A622/Zero3)^2)","v":1.0000000000053464},{"$f":"ATAN(A622/Zero3)","v":3.2699752448073046E-6},{"$f":"SQRT(1+(A622/pole5)^2)","v":1.0000000000053464},{"$f":"ATAN(A622/pole5)","v":3.2699752448073046E-6},{"$f":"SQRT((1-(A622^2/(pole3^2)))^2+(A622/(Q*pole3))^2)","v":1.001876715701588},{"$f":"ATAN((A622/(Q*pole3))/(1-A622^2/pole3^2))","v":6.5433655930212567E-2},{"$f":"20*LOG10(((E622*K622*G622*O622)/(C622*I622*S622*M622*Q622))*Adc)","v":32.235689505116561},{"$f":"((F622+L622+H622+R622)-(D622+J622+T622+N622+T622))*radconv","v":-124.40708204091536},55.592917959084645,"p1",null,null,null,{"$f":"20*LOG10((K622/(I622*M622))*AEA)","v":24.939365606257105},{"$f":"(L622-(J622+N622))*radconv","v":-71.950561809961613},null,null,null,26.735749426854586,{"$f":"(F622+H622-(D622+T622))*radconv","v":-48.707635259538343}]
[{"$f":"Zero1","v":4521447.252095351},null,1382.7164109898115,1.5700731126352721,1.4142135623730951,0.78539816339744828,1,0,383522.72727403097,1.5707937193874892,447.44429927710388,1.568561409881011,2.3598235125376403,1.1332033184905299,1.0000102216903852,4.5214164410932066E-3,1.0000102216903852,4.5214164410932066E-3,518.06742063666877,-0.17574794016005346,-96.519722661437612,-89.615943838311992,90.384056161688008,"z1",null,null,null,{"$f":"20*LOG10((K623/(I623*M623))*AEA)","v":7.249458115972538},{"$f":"(L623-(J623+N623))*radconv","v":-65.055669467351677},null,null,null,-84.329755249415044,-34.888947691547038]
[{"$f":"Pole2","v":11.789255057315287},null,1.0000064990875976,3.6052884487813553E-3,1.0000000000033993,2.6074074074014988E-6,1,0,1.4142135623730951,0.78539816339744828,1.0000006805553241,1.1666661373461115E-3,1.0000000000155307,5.5732484075856083E-6,1,1.1789255057315288E-8,1,1.1789255057315288E-8,1.0000000244163842,2.3618233261140856E-4,80.680647655419989,-45.166956574288271,134.83304342571174,"p2",null,null,{"$f":"Pole2","v":11.789255057315287},{"$f":"20*LOG10((K624/(I624*M624))*AEA)","v":70.357797065215266},{"$f":"(L624-(J624+N624))*radconv","v":-44.933474329185145},null,null,null,29.762276118199836,-0.21995066970804286]
[{"$f":"Zero2","v":10105.075763413102},null,3.2480318298189435,1.2578336435087594,1.0000024974320036,2.2349169138855944E-3,1,0,857.14344047599184,1.5696296606575506,1.4142135623730951,0.78539816339744828,1.0000114101341011,4.7770337259778082E-3,1.0000000000510563,1.010507576306915E-5,1.0000000000510563,1.010507576306915E-5,1.017783696765842,0.2002402038692514,17.65463545779771,-140.09262494418707,39.907375055812935,"z2",null,null,{"$f":"Zero2","v":10105.075763413102},{"$f":"20*LOG10((K625/(I625*M625))*AEA)","v":17.717221842189065},{"$f":"(L625-(J625+N625))*radconv","v":-45.206858876975794},null,null,null,19.376839143603775,-83.413426461747832]
[{"$f":"pole3","v":200000},null,61.170716926968218,1.5544479072117139,1.0009778286942568,4.4204808963467984E-2,1,0,16964.600339473138,1.5707373805196783,19.817280282218736,1.5203138762075137,1.0044597111790712,9.4267702037480264E-2,1.0000000199999999,1.999999973333334E-4,1.0000000199999999,1.999999973333334E-4,4.0067389336153854,{"$error":"#DIV/0!"},-22.775846864483317,{"$error":"#DIV/0!"},{"$error":"#DIV/0!"},"p3",null,null,null,{"$f":"20*LOG10((K626/(I626*M626))*AEA)","v":14.679449052923868},{"$f":"(L626-(J626+N626))*radconv","v":-8.2901954659640751},null,null,null,-18.015870389412058,{"$error":"#DIV/0!"}]
[{"$f":"Fp2_u","v":235259.03312535453},null,{"$f":"SQRT(1+(A627/pole1)^2)","v":71.952152499526278},{"$f":"ATAN(A627/pole1)","v":1.556897754465399},{"$f":"SQRT(1+(A627/Zero1)^2)","v":1.0013527390849857},{"$f":"ATAN(A627/Zero1)","v":5.1984919428486612E-2},1,0,19955.377356499353,1.5707462149888127,23.302740145011843,1.5278697363951232,1.0061655230680122,0.1107611013141023,1.000000027673406,2.3525902878507548E-4,1.000000027673406,2.3525902878507548E-4,4.7286981839550863,-1.4895704770896094,-25.639415242781325,75.677743798959384,{"$f":"IF(V627>0,V627,V627+180)","v":75.677743798959384},"p4",null,null,null,null,null,null,null,null,-20.861633139505201,-0.8790523591639211]
[{"$f":"z_RHP","v":82103.740577731471},null,{"$f":"SQRT(1+(A628/pole1)^2)","v":25.128273416350439},{"$f":"ATAN(A628/pole1)","v":1.5309900049358984},{"$f":"SQRT(1+(A628/Zero1)^2)","v":1.0001648561517134},{"$f":"ATAN(A628/Zero1)","v":1.8156734670090869E-2},1,0,6964.2857860805861,1.5706527370522938,8.1863071650164727,1.4483352693775553,1.0007529679509786,3.879422088600213E-2,1.0000000033705121,8.2103740393243713E-5,1.0000000033705121,8.2103740393243713E-5,1.8430552004248042,1.1027549509267685,-8.2238983683480598,-222.27168638465733,{"$f":"IF(V628>0,V628,V628+180)","v":-42.271686384657329},"z_RHP",null,null,null,null,null,null,null,null,-3.5502552482401546,-149.86216618970752]
[{"$f":"Fp2_u","v":235259.03312535453},null,null,null,null,null,null,null,null,null,null,null,null,null,null,null,null,null,null,null,-25]
[]
[null,null,null,"System","Plant"]
["p1","p-dom",{"$f":"pole1","v":3269.9752448189597},{"$f":"U622","v":32.235689505116561},{"$f":"AG622","v":26.735749426854586}]
["z1","ESR zero",{"$f":"Zero1","v":4521447.252095351},{"$f":"U623","v":-96.519722661437612},{"$f":"AG623","v":-84.329755249415044}]
["p2","EA pole",{"$f":"Pole2","v":11.789255057315287},{"$f":"U624","v":80.680647655419989},{"$f":"AG624","v":29.762276118199836}]
["z2","EA zero",{"$f":"Zero2","v":10105.075763413102},{"$f":"U625","v":17.65463545779771},{"$f":"AG625","v":19.376839143603775}]
["p3","p_sampling",{"$f":"pole3","v":200000},{"$f":"U626","v":-22.775846864483317},{"$f":"AG626","v":-18.015870389412058}]
[]
[]
[{"$f":"Q4*1000","v":45188.5}]
[{"$f":"Q4*1000","v":45188.5}]
[]
[]
[]
[]
[]
[]
[]
[]
[]
[]
[]
[]
[]
[]
[]
[]
[]
[]
[]
[]
[]
[]
[]
[]
[]
[]
[]
[]
[]
[]
[]
[]
[]
[]
[]
[]
[]
[]
[]
[]
[]
[]
[]
[]
[]
[]
[null,null,null,null,null,null,null,null,null,null,null,null,null,null,null,null,null,null,null,null,null,null,null,null,null,null,null,null,null,null,null,null,null,null,null,"phase margin",{"$f":"SUM(AK689:AK1306)","v":0}]

{"sheet":"Bode Plot Management","index":7,"n_rows":6,"n_cols":14,"rows_kept":6,"cut":false,"hidden":true,"merged":[]}
[null,null,null,null,null,null,null,null,null,"Single or dual output (MODE)",null,null,null,"3.3V or 5V fixed (FB1/2)"]
[{"$f":"CHOOSE(BODE_PLOT_TYPE, \"BODE_PLOT_Ch1\", \"BODE_PLOT_Ch2\")","v":"BODE_PLOT_Ch1"},null,null,null,null,null,null,null,null,"With/without dither (DITH)",null,null,null,"With/without VOUT connected to VCCX"]
[null,null,null,null,null,null,null,null,null,"FPWM or DEM (DEMB)"]
[null,null,null,null,null,null,null,null,null,"Shunt or inductor DCR current sensing"]
[]
[null,null,null,null,null,{"$f":"INDIRECT(A2)","v":0}]

{"sheet":"Efficiency Calculations","index":8,"n_rows":109,"n_cols":57,"rows_kept":109,"cut":false,"hidden":true,"merged":[[6,51,6,56],[6,27,6,32],[6,33,6,36],[6,38,6,42],[6,45,6,49],[6,24,6,26],[0,0,3,3],[5,0,6,3],[6,6,6,13],[6,17,6,20],[6,21,6,23]]}
["BUCK CONTROLLER POWER DESIGN TOOL",null,null,null,null,null,"*Assuming CCM conditions",null,null,null,null,null,null,null,null,null,null,null,null,null,null,null,null,null,null,null,null,null,null,null,null,null,null,null,null,null,null,null,null,null,{"$f":"Ext_VCC","v":2}]
[null,null,null,null,null,null,null,{"$f":"AV19","v":0.89650175625005302},"10% load"]
[null,null,null,null,null,null,null,{"$f":"AV59","v":0.91652488590756853},"50% load",null,null,null,null,null,null,{"$f":"Ext_VCC","v":2},null,null,null,null,null,null,null,null,null,null,null,null,null,null,null,null,null,null,null,null,null,null,null,{"$f":"IF(MODE=1, (Qg_Q1+Qg_Q2)*Fsw*Vin, (Qg_Q1+Qg_Q2+Qg_Q3+Qg_Q4)*Fsw*Vin)","v":3.9499199999999998E-2}]
[null,null,null,null,null,null,null,{"$f":"AV109","v":0.86006546803838879},"100% load",null,null,null,null,null,null,null,null,null,null,null,3,null,null,null,null,null,null,null,null,null,null,null,1,null,null,null,2,null,"I_VCC",{"$f":"(Qg_Q1+Qg_Q2)*Fsw*1000","v":3.2915999999999999},"mA",{"$f":"AN4*5/1000","v":1.6457999999999997E-2}]
[null,null,null,null,null,null,null,null,null,null,null,null,null,null,null,null,null,null,null,null,null,null,null,null,null,null,null,null,null,null,null,null,null,null,null,null,null,null,null,null,null,{"$f":"VCC","v":3.15}]
["Enter the values of your design and MOSFET datasheet specifications below. Note that thermal resistance (θJA) will change when components are placed on the PCB"]
[null,null,null,null,null,null,"Operating Point Condtions",null,null,null,null,null,null,null,null,null,null,"Filter Inductor",null,null,null,"Cout",null,null,"Cin",null,null,"High-side BUCK \"Control\" MOSFET Losses ",null,null,null,null,null,"Low-side BUCK \"Sync\" MOSFET Losses ",null,null,null,"Diode/FET","\"Controller\" Losses",null,null,null,null,null,null,"RESULTS",null,null,null,null,null,"Consolidated Buck Efficiency & Losses"]
["Input Parameters",null,null,null,null,null,"Step","Vin","Mode","Iout","Iout/ phase","Iin","Duty Cycle BUCK Leg","Ripple Current pk-pk","Peak Inductor Current","Valley Inductor Current","SW node voltage at Q1 turn-on","Irms Lf","DCR    Loss","Core Loss","Total Inductor Loss","Irms Cout","Cout ESR Loss","Total Cout Loss","Irms Cin","Cin ESR Loss","Total Cin Loss","Irms","RDS(on) Loss","Transition Loss (not including capacitive loss)","MOSFET Output Capacitance Loss","Dead Time Loss ","Total Control MOSFET Loss","Irms","RDS(on) Loss","Deadtime Loss","Total Sync MOSFET Loss","Reverse Recovery Loss","IQ Loss","Switching Current Loss","Switching Current Diss from VCC","LDO Loss Saved from Gate Drive Current (ext VCC = Vout)","Total \"Control\" Loss","Total Loss (not considering total loss)","Total Loss (considering total loss)","Total Loss","Pout","EFF, h",{"$f":"IF(Vin>Vout, \"Buck ''CONTROL'' MOSFET Temp Rise\", \"Boost ''CONTROL'' MOSFET Temp Rise\")","v":"Buck ''CONTROL'' MOSFET Temp Rise"},{"$f":"IF(Vin>Vout, \"Buck ''SYNC'' MOSFET Temp Rise\", \"Boost ''SYNC'' MOSFET Temp Rise\")","v":"Buck ''SYNC'' MOSFET Temp Rise"},null,"h","Inductor Cu & Core Loss","Total MOSFET Loss","Control MOSFET Loss","SYNC MOSFET Loss","IC Power Loss"]
["Design","Input Value","Units","Description",null,null,0,{"$f":"Vin","v":12},{"$f":"MODE","v":1},0,{"$f":"Iout*G9/100/Number_of_Phases","v":0},{"$f":"Vout*K9/(Vin*Efficiency)","v":0},{"$f":"(Vout+(Rdson2+Rs+Rdcr)*K9)/(Vin+(Rs+Rdson2-Rdson1)*K9)","v":0.5},{"$f":"(Vin-(Rdson1+Rdcr)*K9-Vout)*M9/(Fsw*Lf)","v":1.3392857142857144},{"$f":"K9+N9/2","v":0.66964285714285721},{"$f":"K9-N9/2","v":-0.66964285714285721},{"$f":"IF(MIN(Vin, -P9/(Coss_Q1+Coss_Q2)*0.00000002)<0, 0, MIN(Vin, -P9/(Coss_Q1+Coss_Q2)*0.00000002))","v":12},{"$f":"SQRT(K9^2+(N9^2)/12)","v":0.38661848383233871},{"$f":"R9^2*Rdcr","v":2.9894770408163268E-2},{"$f":"Core_Loss","v":0.1},{"$f":"(T9+S9*(1+Ltc*(Ta-25)))/(1-S9*Ltc*ThetaCa)","v":0.13023137969612544},{"$f":"N9/SQRT(12)","v":0.38661848383233877},{"$f":"RCoutEsr*V9^2","v":1.4947385204081641E-4},{"$f":"W9","v":1.4947385204081641E-4},{"$f":"SQRT(M9*(1-M9))*SQRT(K9^2+(N9^2)/12)","v":0.19330924191616936},{"$f":"RCinEsr*Y9^2","v":7.4736926020408178E-5},{"$f":"Z9","v":7.4736926020408178E-5},{"$f":"SQRT(M9)*SQRT(K9^2+(N9^2)/12)","v":0.27338055164990832},{"$f":"Rdson1*AB9^2","v":4.8579001913265328E-3},{"$f":"(Vin*K9/2)*Fsw*(Tr_buck+Tf_buck)","v":0},{"$f":"(0.5*Coss_Q1*(Vin-Q9)^2-0.5*Coss_Q2*(Vin-Q9)^2+(Qoss_Q2*(Vin-Q9)/Vin)*Vin)*Fsw","v":0},{"$f":"IF(K9>N9/2,0,ABS(K9-N9/2)*Vsd_Q1*Deadtime*Fsw)","v":1.0406250000000001E-3},{"$f":"(AF9+AE9+AD9+AC9*(1+RdsonTC*(Ta-25))/(1-AC9*RdsonTC*ThetaJA_Q1))","v":5.90069728796751E-3},{"$f":"SQRT((1-M9))*SQRT(K9^2+(N9^2)/12)","v":0.27338055164990832},{"$f":"Rdson2*AH9^2","v":2.9894770408163281E-3},{"$f":"IF(K9<N9/2,Deadtime*Fsw*Vsd_Q2*(K9+N9/2),2*Deadtime*Fsw*Vsd_Q2*K9)","v":1.0406250000000001E-3},{"$f":"(AJ9+AI9*(1+RdsonTC*(Ta-25)))/(1-AI9*RdsonTC*ThetaJA_Q2)","v":4.0312107523194779E-3},{"$f":"Qrr_Q2*K9/Iout*Fsw*Vin","v":0},{"$f":"Iq*Vin","v":4.1999999999999996E-4},{"$f":"IF(Ext_VCC=1,  (Qg_Q1+Qg_Q2)*Fsw*Vout, (Qg_Q1+Qg_Q2)*Fsw*Vin)","v":3.9499199999999998E-2},{"$f":"(Vin-VCC)*Fsw*(Qg_Q1+Qg_Q2)","v":2.9130660000000003E-2},{"$f":"(Qg_Q1+Qg_Q2)*Fsw*(Vin-Vout)","v":1.9749599999999999E-2},{"$f":"SUM(AM9:AN9)","v":3.9919199999999995E-2},{"$f":"SUM(S9,T9,AC9,AD9,AE9,AF9,AI9,AJ9,AQ9, AL9)","v":0.17974259764030612},{"$f":"U9 + ((AF9+AE9+AD9+AC9*(1+RdsonTC*(Ta-25))) + (AJ9+AI9*(1+RdsonTC*(Ta-25))) + AQ9 + AL9) / (1-AC9*RdsonTC*ThetaJA_Q1 -AI9*RdsonTC*ThetaJA_Q2)","v":0.18011522100175556},{"$f":"AS9","v":0.18011522100175556},{"$f":"Vout*K9","v":0},{"$f":"AU9/(AU9+AT9)","v":0},{"$f":"ThetaJA_Q1*BC9","v":0.13571603762325274},{"$f":"ThetaJA_Q2*BD9","v":9.2717847303347992E-2},null,{"$f":"AV9*100","v":0},{"$f":"U9","v":0.13023137969612544},{"$f":"AG9+AK9+AL9","v":9.9319080402869887E-3},{"$f":"AG9+AL9*0.66","v":5.90069728796751E-3},{"$f":"AK9+AL9*0.33","v":4.0312107523194779E-3},{"$f":"AS9-BA9","v":4.9883841305630117E-2}]
[null,null,null,null,null,null,1,12,1,{"$f":"Iout*G10/100","v":0.03},0.03,1.6666666666666666E-2,0.50071242875712429,1.3394169235420212,{"$f":"K10+N10/2","v":0.69970846177101065},{"$f":"K10-N10/2","v":-0.63970846177101059},12,{"$f":"SQRT(K10^2+(N10^2)/12)","v":0.38781843851975079},3.0080628251179544E-2,0.1,0.1304198203532469,{"$f":"N10/SQRT(12)","v":0.38665636068206322},1.4950314125589776E-4,{"$f":"W10","v":1.4950314125589776E-4},{"$f":"SQRT(M10*(1-M10))*SQRT(K10^2+(N10^2)/12)","v":0.19390902242069108},7.5201417952296159E-5,{"$f":"Z10","v":7.5201417952296159E-5},{"$f":"SQRT(M10)*SQRT(K10^2+(N10^2)/12)","v":0.27442434686255773},4.8950669398111915E-3,1.187483660130719E-4,0,9.941069495921506E-4,{"$f":"(AF10+AE10+AD10+AC10*(1+RdsonTopTc*Ta-RdsonTopTc*25))/(1-AC10*RdsonTopTc*ThetaJA_Q1)","v":6.0106291191501671E-3},0.2740336094440905,3.0037767641982534E-3,1.0873469495921507E-3,{"$f":"(AJ10+AI10*(1+RdsonBotTc*Ta-RdsonBotTc*25))/(1-AI10*RdsonBotTc*ThetaJA_Q2)","v":4.0922545979636621E-3},3.3600000000000004E-4,4.1999999999999996E-4,3.9499199999999998E-2,2.9130660000000003E-2,1.9749599999999999E-2,3.9919199999999995E-2,{"$f":"SUM(S10,T10,AC10,AD10,AE10,AF10,AI10,AJ10,AQ10, AL10)","v":0.18043487422038637},0.18081068504236833,{"$f":"AS10","v":0.18081068504236833},0.18,{"$f":"AU10/(AU10+AT10)","v":0.49887657838864558},0.14334494974045384,9.6672095753164225E-2,null,{"$f":"AV10*100","v":49.887657838864556},0.1304198203532469,1.043888371711383E-2,6.2323891191501668E-3,4.203134597963662E-3,{"$f":"AS10-BA10","v":5.0390864689121434E-2}]
["Vin",{"$f":"Vin","v":12},"V","Vin",null,null,2,12,1,0.06,0.06,3.3333333333333333E-2,0.5014247150569886,1.3395426952555918,0.72977134762779583,-0.60977134762779595,12,0.39131984279834048,3.0626243873543582E-2,0.1,0.13097305332115403,0.38669266784840639,1.4953121936771798E-4,1.4953121936771798E-4,0.19565912709145636,7.656498802838134E-5,7.656498802838134E-5,0.27709885968330356,4.9909455724561659E-3,2.3749673202614379E-4,0,9.4758467421359491E-4,6.1788641091469936E-3,0.27631040756716119,3.0538976531972288E-3,1.1340646742135948E-3,4.1891393020577032E-3,6.7200000000000007E-4,4.1999999999999996E-4,3.9499199999999998E-2,2.9130660000000003E-2,1.9749599999999999E-2,3.9919199999999995E-2,0.18158143317965031,0.18196598379934159,0.18196598379934159,0.36,0.66424833063561239,0.15231483451038086,0.10145068394732716,null,66.424833063561238,0.13097305332115403,1.1040003411204697E-2,6.6223841091469938E-3,4.4108993020577029E-3,5.0992930478187565E-2]
["Vout",{"$f":"Vout","v":6},"V","Vout",null,null,3,12,1,0.09,0.09,0.05,0.5021368589423173,1.3396630310572009,0.7598315155286004,-0.57983151552860046,12,0.39706181684776393,3.1531617279689443E-2,0.1,0.13189118213702031,0.3867274058021325,1.4955808639844726E-4,1.4955808639844726E-4,0.19852909536537988,7.8827603413192198E-5,7.8827603413192198E-5,0.28136441902090742,5.1457858589132295E-3,3.5624509803921568E-4,0,9.010581751314452E-4,6.4061218689656797E-3,0.2801645054382772,3.1396860042989783E-3,1.1807781751314451E-3,4.3217125108966489E-3,1.008E-3,4.1999999999999996E-4,3.9499199999999998E-2,2.9130660000000003E-2,1.9749599999999999E-2,3.9919199999999995E-2,0.18318237059120379,0.18358133696228832,0.18358133696228832,0.54,0.74628790491889618,0.16264224298621063,0.10705010775062293,null,74.628790491889617,0.13189118213702031,1.1735834379862328E-2,7.0714018689656795E-3,4.6543525108966493E-3,5.1690154825268009E-2]
["Fsw",{"$f":"Fsw/1000","v":400},"kHz","Switching Frequency",null,null,4,12,1,0.12,0.12,6.6666666666666666E-2,0.50284886045581767,1.3397779325769692,0.7898889662884846,-0.5498889662884846,12,0.40494906146948673,3.2796748477003632E-2,0.1,0.13317437866048365,0.38676057501381672,1.4958374238501816E-4,1.4958374238501816E-4,0.20247124413909834,8.1989209406468732E-5,8.1989209406468732E-5,0.28715681776964086,5.3598374694531379E-3,4.7499346405228759E-4,0,8.5452745361230516E-4,6.6926585708381283E-3,0.28552531305198037,3.2609881757372557E-3,1.227487453612305E-3,4.4898226251307979E-3,1.3440000000000001E-3,4.1999999999999996E-4,3.9499199999999998E-2,2.9130660000000003E-2,1.9749599999999999E-2,3.9919199999999995E-2,0.18523778249347092,0.18565703751127502,0.18565703751127502,0.72,0.79500293177044545,0.17433306712927696,0.11346688037800835,null,79.50029317704454,0.13317437866048365,1.2526481195968926E-2,7.5796985708381287E-3,4.9333426251307981E-3,5.2482658850791369E-2]
["Iout",{"$f":"Iout","v":3},"A","Max Output Current",null,null,5,12,1,0.15,0.15,8.3333333333333315E-2,0.5035607196401799,1.3398874014443674,0.8199437007221837,-0.51994370072218365,12,0.41485923803033675,3.4421637475822324E-2,0.1,0.13482288315408397,0.38679217595384685,1.4960818737911162E-4,1.4960818737911162E-4,0.20742435906255252,8.604972946502143E-5,8.604972946502143E-5,0.29439246371568745,5.6333499750185027E-3,5.9374183006535939E-4,0,8.0799251092227345E-4,7.0387322670923064E-3,0.29230337782263011,3.4176505874607701E-3,1.2741925109222734E-3,4.6933187897651892E-3,1.6799999999999999E-3,4.1999999999999996E-4,3.9499199999999998E-2,2.9130660000000003E-2,1.9749599999999999E-2,3.9919199999999995E-2,0.1877477648902115,0.18819345181679586,0.18819345181679586,0.89999999999999991,0.82705882717581414,0.18739324214312303,0.12069753216459936,null,82.705882717581417,0.13482288315408397,1.3412051056857494E-2,8.1475322670923056E-3,5.2477187897651892E-3,5.3370568662711892E-2]
["Ta",{"$f":"Ta","v":25},"°C","Ambient Temperature",null,null,6,12,1,0.18,0.18,0.1,0.50427243653807718,1.3399914392882128,0.84999571964410636,-0.48999571964410643,12,0.42665140506875321,3.6406284289428263E-2,0.1,0.13683700439576235,0.38682220909242188,1.4963142144714135E-4,1.4963142144714135E-4,0.21331791441949816,9.1009065224568689E-5,9.1009065224568689E-5,0.3029743032331943,5.9665728472765725E-3,7.1249019607843135E-4,0,7.6145334832694144E-4,7.4446029181199063E-3,0.30039639316659877,3.6095197211000719E-3,1.3208933483269414E-3,4.9320508842407703E-3,2.016E-3,4.1999999999999996E-4,3.9499199999999998E-2,2.9130660000000003E-2,1.9749599999999999E-2,3.9919199999999995E-2,0.19071241375053724,0.19119101977248065,0.19119101977248065,1.08,0.84959693956404736,0.20182874711675783,0.12873861033753772,null,84.959693956404735,0.13683700439576235,1.4392653802360676E-2,8.775162918119906E-3,5.5973308842407702E-3,5.4354015376718301E-2]
["Vcc",{"$f":"VCC","v":3.15},"V","Subregulated VCC Voltage",null,null,7,12,1,0.21,0.21,0.11666666666666665,0.50498401119216552,1.3400900477366737,0.88004502386833683,-0.4600450238683369,12,0.44017433440653947,3.8750688934048011E-2,0.1,0.13921711982352161,0.38685067489955355,1.4965344467024008E-4,1.4965344467024008E-4,0.22007623283939062,9.6867096521555362E-5,9.6867096521555362E-5,0.31279768488893439,6.3597554586720118E-3,8.3123856209150321E-4,0,7.1490996709139547E-4,7.9105324206152679E-3,0.30969509682648017,3.8364421199345174E-3,1.3675899670913955E-3,5.2058695125962624E-3,2.3519999999999999E-3,4.1999999999999996E-4,3.9499199999999998E-2,2.9130660000000003E-2,1.9749599999999999E-2,3.9919199999999995E-2,0.19413182500892881,0.19465025496064231,0.19465025496064231,1.26,0.86618759093682696,0.21764560567415114,0.13758667878971403,null,86.618759093682698,0.13921711982352161,1.546840193321153E-2,9.4628524206152673E-3,5.9820295125962621E-3,5.5433135137120698E-2]
["Components","Input Value","Units","Description",null,null,8,12,1,0.24,0.24,0.13333333333333333,0.5056954436450839,1.3401832284172663,0.91009161420863316,-0.43009161420863318,12,0.455273826553036,4.1454851428848784E-2,0.1,0.14196367571237353,0.38687757384506521,1.4967425714424389E-4,1.4967425714424389E-4,0.22762214458939445,1.0362368141495039E-4,1.0362368141495039E-4,0.32375553651291222,6.8131470824796371E-3,9.4998692810457518E-4,0,6.6836236848021589E-4,8.4367846360902856E-3,0.32008844046838097,4.0982643888592112E-3,1.414282368480216E-3,5.5146259937095942E-3,2.6880000000000003E-3,4.1999999999999996E-4,3.9499199999999998E-2,2.9130660000000003E-2,1.9749599999999999E-2,3.9919199999999995E-2,0.19800609456525262,0.19857174485079437,0.19857174485079437,1.44,0.8788141285391956,0.23484988663007658,0.14723831785532068,null,87.881412853919556,0.14196367571237353,1.6639410629799879E-2,1.0210864636090286E-2,6.4016659937095946E-3,5.6608069138420841E-2]
["L",{"$f":"Lf*1000000","v":5.6},"uH","Filter Inductance",null,null,9,12,1,0.27,0.27,0.15,0.50640673393945446,1.3402709829568566,0.94013549147842834,-0.40013549147842831,12,0.47179853643231895,4.4518771795935635E-2,0.1,0.14507718738372888,0.38690290639859276,1.4969385897967824E-4,1.4969385897967824E-4,0.23587990186536095,1.1127865620802463E-4,1.1127865620802463E-4,0.33574250419164731,7.32699689285709E-3,1.068735294117647E-3,0,6.2181055375747757E-4,9.023625419670141E-3,0.33146769052020719,4.3948331943519945E-3,1.4609705537574776E-3,5.858172351617911E-3,3.0239999999999998E-3,4.1999999999999996E-4,3.9499199999999998E-2,2.9130660000000003E-2,1.9749599999999999E-2,3.9919199999999995E-2,0.20233531828477733,0.2029561510313006,0.2029561510313006,1.62,0.88866646577511899,0.25344770465241323,0.15769012408721195,null,88.866646577511901,0.14507718738372888,1.7905797771288052E-2,1.1019465419670142E-2,6.8560923516179113E-3,5.7878963647571724E-2]
["Rdcr",{"$f":"Rdcr*1000","v":200},"mW","Inductor DCR at 25°C",null,null,10,12,1,0.3,0.3,0.16666666666666663,0.50711788211788211,1.3403533129816614,0.97017665649083074,-0.3701766564908307,12,0.48960417716941812,4.7942450060348599E-2,0.1,0.14855823944741289,0.3869266730295845,1.4971225030174299E-4,1.4971225030174299E-4,0.24477728190143508,1.1983183547010923E-4,1.1983183547010923E-4,0.34865795371786878,7.9015539648975494E-3,1.1874836601307188E-3,0,5.7525452418675084E-4,9.6713226491748627E-3,0.34372937263348824,4.7259952644404567E-3,1.5076545241867511E-3,6.236361305915125E-3,3.3599999999999997E-3,4.1999999999999996E-4,3.9499199999999998E-2,2.9130660000000003E-2,1.9749599999999999E-2,3.9919199999999995E-2,0.20711959199819083,0.20780420947434539,0.20780420947434539,1.7999999999999998,0.89650175625005302,0.27344522093102186,0.16893871003604788,null,89.650175625005303,0.14855823944741289,1.9267683955089987E-2,1.1888922649174863E-2,7.3451613059151251E-3,5.9245970026932493E-2]
["LTc",3930,"ppm","Inductor Series Resistance Temp Co",null,null,11,12,1,0.33,0.33,0.18333333333333332,0.5078288882229548,1.3404302201172462,1.0002151100586232,-0.34021511005862309,12,0.50855622231007802,5.17258862500595E-2,0.1,0.15240748607651902,0.38694887420730073,1.4972943125029744E-4,1.4972943125029744E-4,0.25424693907531382,1.2928301205833269E-4,1.2928301205833269E-4,0.36240791455702748,8.5370672746822931E-3,1.3062320261437907E-3,0,5.2869428103110032E-4,1.0380146254491582E-2,0.35677714993637666,5.0915973886689518E-3,1.5543342810311004E-3,6.6490462622259541E-3,3.6960000000000001E-3,4.1999999999999996E-4,3.9499199999999998E-2,2.9130660000000003E-2,1.9749599999999999E-2,3.9919199999999995E-2,0.21235901150161676,0.21311673083444319,0.21311673083444319,1.98,0.90282472070998432,0.29484864385330639,0.18098070403119695,null,90.282472070998438,0.15240748607651902,2.0725192516717537E-2,1.2819506254491582E-2,7.868726262225954E-3,6.0709244757924163E-2]
["ThetaCa",{"$f":"ThetaCa","v":22},"°C/W","Core to Ambient Thermal Resistance",null,null,12,12,1,0.36,0.36,0.2,0.50853975229724324,1.340501705988528,1.030250852994264,-0.31025085299426403,12,0.52853136328873251,5.5869080395969231E-2,0.1,0.15662565131534284,0.38696951040081462,1.4974540197984618E-4,1.4974540197984618E-4,0.26422713443109808,1.3963195713933915E-4,1.3963195713933915E-4,0.37690614419004209,9.2337856993333113E-3,1.4249803921568627E-3,0,4.8212982555308626E-4,1.115036824724272E-2,0.37052282041952739,5.4914864180656544E-3,1.6010098255530862E-3,7.0960813027555331E-3,4.032E-3,4.1999999999999996E-4,3.9499199999999998E-2,2.9130660000000003E-2,1.9749599999999999E-2,3.9919199999999995E-2,0.21805367255663125,0.21889460078073636,0.21889460078073636,2.16,0.90798474185914047,0.31766422968658253,0.19381274996337725,null,90.798474185914046,0.15662565131534284,2.2278449549998254E-2,1.381148824724272E-2,8.4266413027555328E-3,6.2268949465393519E-2]
["Cin",{"$f":"Cin*1000000","v":20},"μF","Input Capacitance",null,null,13,12,1,0.39,0.39,0.21666666666666665,0.50925047438330173,1.3405677722197751,1.0602838861098876,-0.28028388610988753,12,0.54941802178261701,6.0372032531904846E-2,0.1,0.16121352942066655,0.38698858207901204,1.4976016265952425E-4,1.4976016265952425E-4,0.2746619924661825,1.5087842021098657E-4,1.5087842021098657E-4,0.3920745222936366,9.9919580170659186E-3,1.5437287581699347E-3,0,4.3556115901476517E-4,1.1982262750755278E-2,0.38488664776495024,5.9255092651096354E-3,1.6476811590147653E-3,7.5773211769135434E-3,4.3679999999999995E-3,4.1999999999999996E-4,3.9499199999999998E-2,2.9130660000000003E-2,1.9749599999999999E-2,3.9919199999999995E-2,0.22420367089027987,0.22513878036335699,0.22513878036335699,2.34,0.91223134510817172,0.34189828326737143,0.20743150706901148,null,91.223134510817175,0.16121352942066655,2.3927583927668822E-2,1.4865142750755279E-2,9.018761176913543E-3,6.3925250942690443E-2]
["RCinEsr",{"$f":"RCinEsr*1000","v":2},"mW","Input Capacitor ESR",null,null,14,12,1,0.42,0.42,0.23333333333333331,0.50996105452366691,1.3406284204346062,1.0903142102173031,-0.2503142102173031,12,0.57111619962410642,6.5234742694616432E-2,0.1,0.1661719852366958,0.38700608971059136,1.4977371347308231E-4,1.4977371347308231E-4,0.28550142654987204,1.6302212912402394E-4,1.6302212912402394E-4,0.40784297331280989,1.0811832907241168E-2,1.6624771241830064E-3,0,3.8898828267768903E-4,1.2876106030336287E-2,0.39979722684437025,6.3935129036979538E-3,1.694348282677689E-3,8.0926212920119228E-3,4.7039999999999998E-3,4.1999999999999996E-4,3.9499199999999998E-2,2.9130660000000003E-2,1.9749599999999999E-2,3.9919199999999995E-2,0.23080910219509393,0.23185030641416221,0.23185030641416221,2.52,0.91574748601922396,0.36755715869773459,0.2218336497162742,null,91.574748601922394,0.1661719852366958,2.567272732234821E-2,1.5980746030336286E-2,9.6449412920119222E-3,6.5678321177466414E-2]
["Cout",{"$f":"Cout*1000000","v":35.200000000000003},"μF","Output Capcitance",null,null,15,12,1,0.45,0.45,0.25,0.51067149276085866,1.3406836522559913,1.1203418261279956,-0.22034182612799563,12,0.59353690249121993,7.0457210923774383E-2,0.1,0.17150195460397949,0.38702203376406363,1.4978605461887201E-4,1.4978605461887201E-4,0.29670085111417349,1.7606279010374989E-4,1.7606279010374989E-4,0.42414908392103445,1.1693658950418429E-2,1.7812254901960784E-3,0,3.4241119780290522E-4,1.3832176523860117E-2,0.41519105147849611,6.8953443691127684E-3,1.7410111978029051E-3,8.6418377040351942E-3,5.0400000000000002E-3,4.1999999999999996E-4,3.9499199999999998E-2,2.9130660000000003E-2,1.9749599999999999E-2,3.9919199999999995E-2,0.23787006212910744,0.23903029198217968,0.23903029198217968,2.7,0.91867035442463241,0.3946472600487827,0.23701586719280948,null,91.867035442463248,0.17150195460397949,2.751401422789531E-2,1.7158576523860117E-2,1.0305037704035194E-2,6.7528337378200187E-2]
["RCoutEsr",{"$f":"Cout_ESR*1000","v":1},"mW","Output Capacitor ESR",null,null,16,12,1,0.48,0.48,0.26666666666666666,0.51138178913738019,1.3407334693062529,1.1503667346531263,-0.19036673465312648,12,0.61660131877075308,7.6039437261966381E-2,0.1,0.17720444480267528,0.38703641470775302,1.4979718630983178E-4,1.4979718630983178E-4,0.30822077134065001,1.9000008777165053E-4,1.9000008777165053E-4,0.4409375436046693,1.2637684628407777E-2,1.8999738562091504E-3,0,2.9582990565095853E-4,1.4850754872672751E-2,0.43101191277006734,7.4308507579884855E-3,1.7876699056509583E-3,9.22482710848249E-3,5.3760000000000006E-3,4.1999999999999996E-4,3.9499199999999998E-2,2.9130660000000003E-2,1.9749599999999999E-2,3.9919199999999995E-2,0.24538664631587373,0.24667992680413364,0.24667992680413364,2.88,0.92110483561511458,0.42317504207147333,0.25297486349509729,null,92.110483561511458,0.17720444480267528,2.9451581981155238E-2,1.8398914872672752E-2,1.0998907108482491E-2,6.9475482001458366E-2]
["Top Driver","Input Value","Units","Description",null,null,17,12,1,0.51,0.51,0.28333333333333333,0.5120919436957172,1.3407778732070659,1.1803889366035329,-0.16038893660353293,12,0.64023988377284957,8.1981421754694389E-2,0.1,0.18328053503055347,0.38704923300979671,1.4980710877347193E-4,1.4980710877347193E-4,0.32002631545469601,2.0483368516701719E-4,2.0483368516701719E-4,0.45815950068343997,1.3644158324322437E-2,2.0187222222222221E-3,0,2.4924440748189016E-4,1.5932123952818806E-2,0.44721021981499143,7.999879228278918E-3,1.8343244074818903E-3,9.8414468312803313E-3,5.7120000000000001E-3,4.1999999999999996E-4,3.9499199999999998E-2,2.9130660000000003E-2,1.9749599999999999E-2,3.9919199999999995E-2,0.25335895034448175,0.25480047781045134,0.25480047781045134,3.06,0.92313248428793615,0.4531470109148325,0.2697073571194476,null,92.313248428793614,0.18328053503055347,3.1485570784099137E-2,1.9702043952818805E-2,1.1726406831280331E-2,7.1519942779897872E-2]
["RdsonDRT",1,"W","Drain to Source Resistance of pullup Top FET Driver",null,null,18,12,1,0.54,0.54,0.3,0.51280195647833904,1.340816865579457,1.2104084327897286,-0.13040843278972847,11.419802337206397,0.66439131711052635,8.8283164450372001E-2,0.1,0.18973137691616582,0.38706048913814489,1.4981582225186E-4,1.4981582225186E-4,0.33208675355134681,2.2056322376854594E-4,2.2056322376854594E-4,0.47577189626043337,1.4713328322631159E-2,2.1374705882352941E-3,7.4195027312639716E-4,2.0265470455523802E-4,1.7819524864377309E-2,0.46374230449745629,8.6022769992244591E-3,1.8809747045552385E-3,1.0491554819765216E-2,6.0479999999999996E-3,4.1999999999999996E-4,3.9499199999999998E-2,2.9130660000000003E-2,1.9749599999999999E-2,3.9919199999999995E-2,0.26252902004269979,0.26413683487130918,0.26413683487130918,3.24,0.92462142681108805,0.50165771188067809,0.28721008085459998,null,92.462142681108801,0.18973137691616582,3.4359079684142521E-2,2.181120486437731E-2,1.2487394819765216E-2,7.4405457955143361E-2]
["RdsonDRT2",1,"W","Drain to Source Resistance of pulldown Top FET Driver",null,null,19,12,1,0.56999999999999995,0.56999999999999995,0.31666666666666665,0.51351182752769731,1.3408504480438062,1.2404252240219029,-0.10042522402190313,8.794187488235309,0.68900168867834155,9.494466540032126E-2,0.1,0.19655819506763531,0.38707018356056094,1.4982332700160634E-4,1.4982332700160634E-4,0.34437503068305808,2.3718832351591441E-4,2.3718832351591441E-4,0.49373681574156847,1.584544280921053E-2,2.256218954248366E-3,4.1864397728830788E-3,1.5606079813003745E-4,2.247692876828988E-2,0.48056974913427791,9.237891351319312E-3,1.9276207981300372E-3,1.1175009633735217E-2,6.3840000000000008E-3,4.1999999999999996E-4,3.9499199999999998E-2,2.9130660000000003E-2,1.9749599999999999E-2,3.9919199999999995E-2,0.27485753988424261,0.27665590838074117,0.27665590838074117,3.42,0.92516049228343633,0.61387848167066728,0.30547978157590999,null,92.516049228343633,0.19655819506763531,4.0035938402025101E-2,2.6690368768289882E-2,1.3281729633735216E-2,8.0097713313105862E-2]
["Bottom Driver","Input Value","Units","Description",null,null,20,12,1,0.6,0.6,0.33333333333333326,0.51422155688622762,1.3408786222198461,1.270439311109923,-7.0439311109923075E-2,6.1683358386902283,0.71402354533576085,0.10196592465876986,0.1,0.20376228765755947,0.38707831674462134,1.4982962329384943E-4,1.4982962329384943E-4,0.35686733027228901,2.5470858283134203E-4,2.5470858283134203E-4,0.5120208810555309,1.7040749871397337E-2,2.3749673202614376E-3,7.773575888236804E-3,1.0946268946482046E-4,2.7341620567339735E-2,0.49765875924871167,9.9065696262786856E-3,1.9742626894648204E-3,1.1891670436569548E-2,6.7199999999999994E-3,4.1999999999999996E-4,3.9499199999999998E-2,2.9130660000000003E-2,1.9749599999999999E-2,3.9919199999999995E-2,0.28778471274387374,0.28979436245286661,0.28979436245286661,3.5999999999999996,0.92549879622167863,0.73086687304881393,0.32451322004109961,null,92.549879622167865,0.20376228765755947,4.5953291003909276E-2,3.1776820567339735E-2,1.4109270436569548E-2,8.603207479530714E-2]
["RdsonDRB",1,"W","Drain to Source Resistance of pullup Bottom FET Driver",null,null,21,12,1,0.63,0.63,0.35,0.5149311445963477,1.3409013897266635,1.3004506948633319,-4.0450694863331749E-2,3.5422474594624758,0.73941511440748997,0.1093469422828483,0.1,0.21134502704455099,0.38708488915771627,1.4983471141424148E-4,1.4983471141424148E-4,0.36954267591249029,2.731235786411277E-4,2.731235786411277E-4,0.53059469535521098,1.8299497498040794E-2,2.4937156862745095E-3,1.1503397026093752E-2,6.2860379817617534E-5,3.2414041371773214E-2,0.5149795924841607,1.0608159227006088E-2,2.0209003798176178E-3,1.2641396986415405E-2,7.0560000000000015E-3,4.1999999999999996E-4,3.9499199999999998E-2,2.9130660000000003E-2,1.9749599999999999E-2,3.9919199999999995E-2,0.30131067247989873,0.30355398737905515,0.30355398737905515,3.7800000000000002,0.92566426492284859,0.85263303155078396,0.34430717068755434,null,92.566426492284862,0.21134502704455099,5.2111438358188621E-2,3.7071001371773216E-2,1.4969876986415406E-2,9.2208960334504153E-2]
["RdsonDRB2",1,"W","Drain to Source Resistance of pulldown Bottom FET Driver",null,null,22,12,1,0.66,0.66,0.36666666666666664,0.51564059070045898,1.3409187521826982,1.330459376091349,-1.045937609134906E-2,0.91592242141504077,0.76513958965860196,0.11708771833258676,0.1,0.21930786043197517,0.38708990126704895,1.4983859166293369E-4,1.4983859166293369E-4,0.38238257439190987,2.9243286639716898E-4,2.9243286639716898E-4,0.54943234453745071,1.9621933579554798E-2,2.6124640522875815E-3,1.537594158150116E-2,1.6253870445956438E-5,3.7694640122470022E-2,0.53250604732623819,1.1342507617560553E-2,2.0675338704459565E-3,1.3424049627441023E-2,7.3920000000000001E-3,4.1999999999999996E-4,3.9499199999999998E-2,2.9130660000000003E-2,1.9749599999999999E-2,3.9919199999999995E-2,0.3154355529043828,0.31793666168972484,0.31793666168972484,3.96,0.92567990439481063,0.97918728281681056,0.36485842143114355,null,92.567990439481065,0.21930786043197517,5.8510689749911048E-2,4.2573360122470025E-2,1.5863409627441025E-2,9.8628801257749671E-2]
["Deadtime","Input Value","Units","Description",null,null,23,12,1,0.69,0.69,0.3833333333333333,0.51634989524094588,1.3409307112057449,1.3604653556028725,1.9534644397127487E-2,0,0.79116449892203955,0.12518825287091237,0.1,0.22765231056447935,0.38709335353963659,1.4984126435456209E-4,1.4984126435456209E-4,0.39537069953302151,3.1263598009846155E-4,3.1263598009846155E-4,0.56851095528271323,2.1008305907970103E-2,2.731212418300653E-3,1.6759968E-2,0,4.0577913863204945E-2,0.5502150107713335,1.2109462323123946E-2,2.14452E-3,1.4269879975924949E-2,7.7279999999999988E-3,4.1999999999999996E-4,3.9499199999999998E-2,2.9130660000000003E-2,1.9749599999999999E-2,3.9919199999999995E-2,0.32758892152030705,0.33036593063332675,0.33036593063332675,4.1399999999999997,0.92609868280144958,1.0506030588537136,0.38686275944627385,null,92.609868280144951,0.22765231056447935,6.2575793839129895E-2,4.5678393863204943E-2,1.682011997592495E-2,0.10271362006884741]
["Deadtime",15,"ns","Total Deadtime",null,null,24,12,1,0.72,0.72,0.4,0.51705905826017551,1.3409372684129519,1.390468634206476,4.9531365793524018E-2,0,0.81746114881273246,0.13364854596364648,0.1,0.23637997646294576,0.38709524644230964,1.4984272981823242E-4,1.4984272981823242E-4,0.40849261456761921,3.3373243231257901E-4,3.3373243231257901E-4,0.587810306620277,2.2458862176986564E-2,2.8499607843137254E-3,1.6759968E-2,0,4.2155894115562073E-2,0.56808606148118812,1.2908870929968331E-2,2.2377600000000001E-3,1.5164640701804073E-2,8.064E-3,4.1999999999999996E-4,3.9499199999999998E-2,2.9130660000000003E-2,1.9749599999999999E-2,3.9919199999999995E-2,0.33884716785491509,0.3419220143559687,0.3419220143559687,4.32,0.92665642769161494,1.0919970846579277,0.40999249614149369,null,92.665642769161494,0.23637997646294576,6.5384534817366141E-2,4.7478134115562072E-2,1.7825760701804073E-2,0.10554203789302294]
["IQ","Input Value","Units","Description",null,null,25,12,1,0.75,0.75,0.41666666666666663,0.51776807980049877,1.340938425420823,1.4204692127104115,7.9530787289588512E-2,0,0.84400414003576207,0.14246859767950126,0.1,0.24549253419853426,0.38709558044171255,1.4984298839750636E-4,1.4984298839750636E-4,0.42173552980341344,3.557217141971317E-4,3.557217141971317E-4,0.60731249061906001,2.3973849982025182E-2,2.9687091503267974E-3,1.6759968E-2,0,4.3799130239901722E-2,0.58610112364299427,1.3740581085423219E-2,2.3310000000000002E-3,1.6091923424257311E-2,8.3999999999999995E-3,4.1999999999999996E-4,3.9499199999999998E-2,2.9130660000000003E-2,1.9749599999999999E-2,3.9919199999999995E-2,0.35056190589727654,0.35396220262492484,0.35396220262492484,4.5,0.92707767637055161,1.1348919955177397,0.43387023875791814,null,92.707767637055156,0.24549253419853426,6.8291053664159038E-2,4.9343130239901722E-2,1.8863923424257311E-2,0.10846966842639058]
["IQ ",{"$f":"Iq*1000","v":3.4999999999999996E-2},"mA","Quiescent Current Of Controller (Not Switching!)",null,null,26,12,1,0.78,0.78,0.43333333333333329,0.51847695990424891,1.3409341838452167,1.4504670919226084,0.10953290807739169,0,0.87077094603023275,0.15164840809007732,0.1,0.25499173770652428,0.38709435600430353,1.498420404503865E-4,1.498420404503865E-4,0.43508809195449566,3.7860329552120737E-4,3.7860329552120737E-4,0.62700161722623249,2.555351682028021E-2,3.0874575163398693E-3,1.6759968E-2,0,4.5507927996142589E-2,0.6042441662491046,1.4604440497843024E-2,2.4242400000000002E-3,1.7051591161105568E-2,8.735999999999999E-3,4.1999999999999996E-4,3.9499199999999998E-2,2.9130660000000003E-2,1.9749599999999999E-2,3.9919199999999995E-2,0.36273323092454052,0.36648848886420449,0.36648848886420449,4.68,0.92737752405996499,1.1792948239112795,0.45849283670542806,null,92.737752405996503,0.25499173770652428,7.1295519157248147E-2,5.127368799614259E-2,1.9934471161105569E-2,0.11149675115768021]
["High-side FET","Input Value","Units","Description",null,null,27,12,1,0.81,0.81,0.45,0.51918569861374286,1.340924545301347,1.4804622726506735,0.13953772734932657,0,0.89774154763456404,0.16118797726986045,0.1,0.26487941964069939,0.3870915735963546,1.49839886349302E-4,1.49839886349302E-4,0.44854020147963941,4.0237662468679104E-4,4.0237662468679104E-4,0.64686355820601227,2.7198110090771298E-2,3.2062058823529413E-3,1.6759968E-2,0,4.7282595719549944E-2,0.62250094250077992,1.5500296936574372E-2,2.5174800000000003E-3,1.8043507471143735E-2,9.0720000000000019E-3,4.1999999999999996E-4,3.9499199999999998E-2,2.9130660000000003E-2,1.9749599999999999E-2,3.9919199999999995E-2,0.37536123817955908,0.37950295083185143,0.37950295083185143,4.8600000000000003,0.92756890216626386,1.2252126615496488,0.48385715183630595,null,92.756890216626388,0.26487941964069939,7.4398103190693676E-2,5.3270115719549947E-2,2.1037267471143737E-2,0.11462353119115204]
["RdsonTop",{"$f":"Rdson1*1000","v":65},"mW","Drain-Source Resistance of Top FET ",null,null,28,12,1,0.84,0.84,0.46666666666666662,0.51989429597128045,1.3409095114037839,1.5104547557018919,0.16954524429810802,0,0.92489811681130285,0.17108730529621888,0.1,0.27515749226906228,0.38708723368395209,1.4983652648109451E-4,1.4983652648109451E-4,0.46208285444829383,4.270411287501662E-4,4.270411287501662E-4,0.66688572535555612,2.8907877094395407E-2,3.3249542483660128E-3,1.6759968E-2,0,4.9123444356015948E-2,0.64085876431401656,1.6427998231923528E-2,2.61072E-3,1.9067536445785231E-2,9.4079999999999997E-3,4.1999999999999996E-4,3.9499199999999998E-2,2.9130660000000003E-2,1.9749599999999999E-2,3.9919199999999995E-2,0.3884460228709038,0.39300775155265633,0.39300775155265633,5.04,0.92766295033531987,1.2726526601883668,0.50996005825306034,null,92.766295033531989,0.27515749226906228,7.7598980801801179E-2,5.5332724356015946E-2,2.217217644578523E-2,0.11785025928359405]
["RdsonTopTc",{"$f":"RdsonTopTc*1000000","v":4000},"ppm","Drain to Source Resistance Temp Co",null,null,29,12,1,0.87,0.87,0.48333333333333328,0.52060275201914441,1.3408890837664524,1.5404445418832262,0.19955545811677378,0,0.95222474303443883,0.18134639224940063,0.1,0.28582794841170689,0.387081336732996,1.4983196124700304E-4,1.4983196124700304E-4,0.47570800573634209,4.5259621344329536E-4,4.5259621344329536E-4,0.68705687855439312,3.0683065033978899E-2,3.4437026143790848E-3,1.6759968E-2,0,5.1030787497738581E-2,0.65930630732467377,1.7387392275123887E-2,2.70396E-3,2.0123542700767005E-2,9.7439999999999992E-3,4.1999999999999996E-4,3.9499199999999998E-2,2.9130660000000003E-2,1.9749599999999999E-2,3.9919199999999995E-2,0.40198768017288244,0.40700514029387597,0.40700514029387597,5.22,0.92766931428951571,1.3216220324479873,0.53679844211764105,null,92.766931428951565,0.28582794841170689,8.0898330198505591E-2,5.746182749773858E-2,2.3339062700767004E-2,0.12117719188216908]
["QgTop",{"$f":"Qg_Q1*1000000000","v":3.1819999999999999},"nC","Gate Charge Of Top FET",null,null,30,12,1,0.9,0.9,0.5,0.52131106679960115,1.3408632640026348,1.5704316320013174,0.22956836799868263,0,0.97970719659633509,0.19196523821253,0.1,0.29689286242171797,0.38707388320920072,1.4982619106264998E-4,1.4982619106264998E-4,0.48940845068060529,4.7904126319518091E-4,4.7904126319518091E-4,0.70736695965041219,3.252392101432941E-2,3.5624509803921568E-3,1.6759968E-2,0,5.3004941419305909E-2,0.67783344226851339,1.8378327018303282E-2,2.7972000000000001E-3,2.1211391367913977E-2,1.008E-2,4.1999999999999996E-4,3.9499199999999998E-2,2.9130660000000003E-2,1.9749599999999999E-2,3.9919199999999995E-2,0.4159863052255548,0.4214974535848387,0.4214974535848387,5.4,0.92759638616258722,1.3721280526440358,0.56436920146202152,null,92.759638616258727,0.29689286242171797,8.4296332787219888E-2,5.965774141930591E-2,2.4537791367913977E-2,0.12460459116312073]
["QgdTop",{"$f":"Qgd_Q1*1000000000","v":2.008},"nC","Gate to Drain Charge",null,null,31,12,1,0.93,0.93,0.51666666666666661,0.52201924035489977,1.3408320537249705,1.6004160268624852,0.2595839731375148,0,1.0073327237601422,0.20294384327160542,0.1,0.30835439121001457,0.38706487357809527,1.4981921635802685E-4,1.4981921635802685E-4,0.50317772265532978,5.0637564115320799E-4,5.0637564115320799E-4,0.72780694864554329,3.4430692042287873E-2,3.6811993464052287E-3,1.6759968E-2,0,5.5046225114192847E-2,0.69643108909732809,1.9400650474451622E-2,2.8904400000000002E-3,2.2330948086962666E-2,1.0416000000000002E-2,4.1999999999999996E-4,3.9499199999999998E-2,2.9130660000000003E-2,1.9749599999999999E-2,3.9919199999999995E-2,0.43044199313475007,0.43648711628136383,0.43648711628136383,5.58,0.9274514998793606,1.4241780576264356,0.59266924600014137,null,92.74514998793606,0.30835439121001457,8.7793173201155511E-2,6.1920785114192849E-2,2.5768228086962667E-2,0.12813272507134926]
["QgsTop",{"$f":"Qgs_Q1*1000000000","v":1.175},"nC",null,null,null,32,{"$f":"Vin","v":12},{"$f":"MODE","v":1},0.96,{"$f":"Iout*G41/100/Number_of_Phases","v":0.96},{"$f":"Vout*K41/(Vin*Efficiency)","v":0.53333333333333333},{"$f":"(Vout+(Rdson2+Rs+Rdcr)*K41)/(Vin+(Rs+Rdson2-Rdson1)*K41)","v":0.52272727272727271},{"$f":"(Vin-(Rdson1+Rdcr)*K41-Vout)*M41/(Fsw*Lf)","v":1.3407954545454546},1.6303977272727272,0.28960227272727268,{"$f":"IF(MIN(Vin, -P41/(Coss_Q1+Coss_Q2)*0.00000002)<0, 0, MIN(Vin, -P41/(Coss_Q1+Coss_Q2)*0.00000002))","v":0},1.0350898693241468,{"$f":"R41^2*Rdcr","v":0.21428220751549587},{"$f":"Core_Loss","v":0.1},{"$f":"(T41+S41*(1+Ltc*(Ta-25)))/(1-S41*Ltc*ThetaCa)","v":0.32021477531509468},0.38705430830502247,1.4981103757747937E-4,1.4981103757747937E-4,0.51701000435410593,5.3459868920446526E-4,5.3459868920446526E-4,0.74836873908707147,{"$f":"Rdson1*AB41^2","v":3.6403625026780261E-2},{"$f":"(Vin*K41/2)*Fsw*(Tr_buck+Tf_buck)","v":3.7999477124183007E-3},{"$f":"(0.5*Coss_Q1*(Vin-Q41)^2-0.5*Coss_Q2*(Vin-Q41)^2+(Qoss_Q2*(Vin-Q41)/Vin)*Vin)*Fsw","v":1.6759968E-2},{"$f":"IF(K41>N41/2,0,ABS(K41-N41/2)*Vsd_Q1*Deadtime*Fsw)","v":0},{"$f":"(AF41+AE41+AD41+AC41*(1+RdsonTopTc*Ta-RdsonTopTc*25))/(1-AC41*RdsonTopTc*ThetaJA_Q1)","v":5.7154960331677364E-2},{"$f":"SQRT((1-M41))*SQRT(K41^2+(N41^2)/12)","v":0.71509109065538357},{"$f":"Rdson2*AH41^2","v":2.045421071738824E-2},{"$f":"IF(K41<N41/2,Deadtime*Fsw*Vsd_Q2*(K41+N41/2),2*Deadtime*Fsw*Vsd_Q2*K41)","v":2.9836799999999998E-3},{"$f":"(AJ41+AI41*(1+RdsonBotTc*Ta-RdsonBotTc*25))/(1-AI41*RdsonBotTc*ThetaJA_Q2)","v":2.3482078997442677E-2},{"$f":"Qrr_Q2*K41/Iout*Fsw*Vin","v":1.0752000000000001E-2},{"$f":"Iq*Vin","v":4.1999999999999996E-4},{"$f":"IF(Ext_VCC=1,  (Qg_Q1+Qg_Q2)*Fsw*Vout, (Qg_Q1+Qg_Q2)*Fsw*Vin)","v":3.9499199999999998E-2},{"$f":"(Vin-VCC)*Fsw*(Qg_Q1+Qg_Q2)","v":2.9130660000000003E-2},{"$f":"(Qg_Q1+Qg_Q2)*Fsw*(Vin-Vout)","v":1.9749599999999999E-2},{"$f":"SUM(AM41:AN41)","v":3.9919199999999995E-2},0.44535483897208261,{"$f":"U41 + ((AF41+AE41+AD41+AC41*(1+RdsonTC*(Ta-25))) + (AJ41+AI41*(1+RdsonTC*(Ta-25))) + AQ41 + AL41) / (1-AC41*RdsonTC*ThetaJA_Q1 -AI41*RdsonTC*ThetaJA_Q2)","v":0.45197664267596238},0.45197664267596238,{"$f":"Vout*K41","v":5.76},0.92724109109314645,{"$f":"ThetaJA_Q1*BC41","v":1.4777794476285793},{"$f":"ThetaJA_Q2*BD41","v":0.62169549694118165},null,92.724109109314639,{"$f":"U41","v":0.32021477531509468},{"$f":"AG41+AK41+AL41","v":9.1389039329120042E-2},{"$f":"AG41+AL41*0.66","v":6.425128033167736E-2},{"$f":"AK41+AL41*0.33","v":2.7030238997442679E-2},0.1317618673608677]
["RGateTop",{"$f":"Rgate1","v":0},"W","Gate Resistance",null,null,33,12,1,{"$f":"Iout*G42/100","v":0.99},0.99,0.54999999999999993,0.52343516395893552,1.3407534680754405,1.6603767340377202,0.31962326596227975,0,1.0629683227545841,0.22598033103593873,0.1,0.33247634001869059,0.38704218785513994,1.4980165517969343E-4,1.4980165517969343E-4,0.53090005085564307,5.6370972799704873E-4,5.6370972799704873E-4,0.7690450299796856,3.844296677886961E-2,3.9186960784313727E-3,1.6759968E-2,0,5.9331471614183888E-2,0.73380610316570549,2.1538855881729518E-2,3.0769199999999999E-3,2.4664650730615831E-2,1.1088000000000001E-2,4.1999999999999996E-4,3.9499199999999998E-2,2.9130660000000003E-2,1.9749599999999999E-2,3.9919199999999995E-2,0.46072493777496915,0.46796863765484042,0.46796863765484042,5.9399999999999995,0.92697082896053229,1.5329396871262293,0.65144488680416412,null,92.697082896053232,0.33247634001869059,9.5084122344799724E-2,6.6649551614183886E-2,2.832369073061583E-2,0.13549229763614984]
["GfsTop",{"$f":"Gfs_Q1","v":100},"S","Transconductance of Top FET",null,null,34,12,1,1.02,1.02,0.56666666666666665,0.5241429140920868,1.3407060959256383,1.690353047962819,0.34964695203718088,0,1.0909587845733131,0.2380382139275361,0.1,0.34514149650838893,0.38702851269341976,1.4979106963768058E-4,1.4979106963768058E-4,0.54484312281671632,5.9370805696134284E-4,5.9370805696134284E-4,0.78982923190160015,4.0548964011807666E-2,4.0374444444444442E-3,1.6759968E-2,0,6.1576086335060641E-2,0.75256950115680932,2.2654434162856351E-2,3.17016E-3,2.5878530401471821E-2,1.1424E-2,4.1999999999999996E-4,3.9499199999999998E-2,2.9130660000000003E-2,1.9749599999999999E-2,3.9919199999999995E-2,0.4765523845466445,0.4844657979027695,0.4844657979027695,6.12,0.92664572537318457,1.5896663057063947,0.68191435923385191,null,92.664572537318463,0.34514149650838893,9.8878616736532463E-2,6.911592633506064E-2,2.9648450401471821E-2,0.13932430139438057]
["VthTop",{"$f":"Vth_Q1","v":1.5},"V","Threshold Voltage of Top FET",null,null,35,12,1,1.05,1.05,0.58333333333333337,0.52485052316890879,1.340653339706118,1.720326669853059,0.37967333014694105,0,1.1190528501544348,0.25045585628775274,0.1,0.35821274308832218,0.38701328328464901,1.4977928143876398E-4,1.4977928143876398E-4,0.55883492836940929,6.2459295433128564E-4,6.2459295433128564E-4,0.8107153853336696,4.2721863341086831E-2,4.1561928104575166E-3,1.6759968E-2,0,6.3889134736799288E-2,0.77137529479627709,2.3800793816881733E-2,3.2634000000000001E-3,2.7123585600779935E-2,1.176E-2,4.1999999999999996E-4,3.9499199999999998E-2,2.9130660000000003E-2,1.9749599999999999E-2,3.9919199999999995E-2,0.4928372742561789,0.50147091315694314,0.50147091315694314,6.3000000000000007,0.92627022602024445,1.6479668989463834,0.71310086881793855,null,92.627022602024439,0.35821274308832218,0.10277272033757923,7.1650734736799282E-2,3.1004385600779935E-2,0.14325817006862096]
["VspTop",{"$f":"Vsp_Q1","v":1.53},"V",null,null,null,36,12,1,1.08,1.08,0.6,0.52555799123156632,1.3405952010263051,1.7502976005131528,0.4097023994868475,0,1.1472429084917297,0.26323325821691268,0.1,0.37169266643908805,0.3869965000934289,1.4976629108456332E-4,1.4976629108456332E-4,0.57287157250365095,6.5636367716561165E-4,6.5636367716561165E-4,0.83169808949468205,4.4961911284491771E-2,4.2749411764705881E-3,1.6759968E-2,0,6.6270949969703827E-2,0.79021805789001009,2.4977783160618376E-2,3.3566400000000001E-3,2.8399684387196089E-2,1.2095999999999999E-2,4.1999999999999996E-4,3.9499199999999998E-2,2.9130660000000003E-2,1.9749599999999999E-2,3.9919199999999995E-2,0.50957970183849344,0.51898686751098722,0.51898686751098722,6.48,0.92584828671130914,1.7078491293031879,0.74500138090551005,null,92.584828671130907,0.37169266643908805,0.10676663435689991,7.4254309969703822E-2,3.2391364387196087E-2,0.14729420107189917]
["VsdTop",{"$f":"Vsd_Q1","v":0.7},"V",null,null,null,37,12,1,1.1100000000000001,1.1100000000000001,0.61666666666666659,0.5262653183222078,1.3405316814949864,1.7802658407474934,0.43973415925250692,0,1.1755220538513862,0.27637041981819627,0.1,0.38558394292810905,0.38697816358417603,1.4975209909098131E-4,1.4975209909098131E-4,0.58694951289232566,6.8901946136907676E-4,6.8901946136907676E-4,0.85277244022208309,4.726935426215121E-2,4.3936895424836597E-3,1.6759968E-2,0,6.8721868131017119E-2,0.80909286505855116,2.6185250571546196E-2,3.4498800000000002E-3,2.970669527942427E-2,1.2432000000000002E-2,4.1999999999999996E-4,3.9499199999999998E-2,2.9130660000000003E-2,1.9749599999999999E-2,3.9919199999999995E-2,0.52677976219437739,0.53701664077034916,0.53701664077034916,6.66,0.92538343766940789,1.7693207270133937,0.77761287142675828,null,92.538343766940784,0.38558394292810905,0.11086056341044138,7.6926988131017116E-2,3.3809255279424272E-2,0.15143269784224012]
["θJATop",{"$f":"ThetaJA_Q1","v":23},"°C/W","Junction to Ambient Resistance",null,null,38,12,1,1.1399999999999999,1.1399999999999999,0.6333333333333333,0.52697250448296473,1.3404627827203059,1.8102313913601529,0.46976860863984693,0,1.203884008527478,0.28986734119763774,0.1,0.3998893399716984,0.38695827422112178,1.4973670598818889E-4,1.4973670598818889E-4,0.60106552126771595,7.2255952171366219E-4,7.2255952171366219E-4,0.87393397564901087,4.9644438596589582E-2,4.5124379084967321E-3,1.6759968E-2,0,7.1242228304512698E-2,0.82799523681872877,2.7423044487780112E-2,3.5431199999999999E-3,3.1044487248432208E-2,1.2768000000000002E-2,4.1999999999999996E-4,3.9499199999999998E-2,2.9130660000000003E-2,1.9749599999999999E-2,3.9919199999999995E-2,0.54443755019050422,0.55556330986034319,0.55556330986034319,6.84,0.92487883794874381,1.8323894910037919,0.81093232671394078,null,92.487883794874378,0.3998893399716984,0.11505471555294491,7.9669108304512695E-2,3.5257927248432207E-2,0.15567396988864479]
["Low-side FET","Input Value","Units","Description",null,null,39,12,1,1.17,1.17,0.64999999999999991,0.52767954975595177,1.3403885063097669,1.8401942531548834,0.49980574684511647,0,1.2323230551769331,0.30372402246412211,0.1,0.41461171745015696,0.38693683246831218,1.4972011232061071E-4,1.4972011232061071E-4,0.61521664958767186,7.5698305185976044E-4,7.5698305185976044E-4,0.89517862860977238,5.208741051277873E-2,4.6311862745098036E-3,1.6759968E-2,0,7.3832372600560095E-2,0.84692109148428807,2.8691013408037515E-2,3.6363599999999999E-3,3.2412929709719887E-2,1.3103999999999998E-2,4.1999999999999996E-4,3.9499199999999998E-2,2.9130660000000003E-2,1.9749599999999999E-2,3.9919199999999995E-2,0.56255316065944816,0.57463005028819159,0.57463005028819159,7.02,0.92433732170187988,1.8970632898128821,0.84495674332355741,null,92.433732170187994,0.41461171745015696,0.11934930231027999,8.2481012600560094E-2,3.6737249709719887E-2,0.16001833283803463]
["RdsonBot",{"$f":"Rdson2*1000","v":40},"mW","Drain-Source Resistance of Low-side FET",null,null,40,12,1,1.2,1.2,0.66666666666666652,0.52838645418326691,1.3403088538702335,1.8701544269351167,0.52984557306488322,0,1.2608339774319661,0.31794046372938234,0.1,0.42975402917728528,0.38691383878960905,1.4970231864691158E-4,1.4970231864691158E-4,0.62940020034050748,7.9228922437734196E-4,7.9228922437734196E-4,0.91650268486063891,5.4598516138189376E-2,4.7499346405228751E-3,1.6759968E-2,0,7.6492646196671843E-2,0.86586670295730406,2.998900589160609E-2,3.7296E-3,3.3811892515641019E-2,1.3439999999999999E-2,4.1999999999999996E-4,3.9499199999999998E-2,2.9130660000000003E-2,1.9749599999999999E-2,3.9919199999999995E-2,0.58112668839970072,0.59422013766045534,0.59422013766045534,7.1999999999999993,0.92376143768517949,1.9633500625234523,0.87968312785974345,null,92.376143768517949,0.42975402917728528,0.12374453871231285,8.5363046196671843E-2,3.8247092515641019E-2,0.16446610848317006]
["RdsonBotTc",{"$f":"RdsonBotTc*1000000","v":4000},"ppm","Drain To Source Resitance Temp Co",null,null,41,12,1,1.23,1.23,0.68333333333333324,0.52909321780699126,1.3402238270079281,1.9001119135039639,0.55988808649603594,0,1.28941200767636,0.33251666510799627,0.1,0.44531932442575572,0.3868892936486889,1.4968332553998143E-4,1.4968332553998143E-4,0.64361370043182708,8.2847719076709937E-4,8.2847719076709937E-4,0.93790274633471316,5.7178001502842829E-2,4.8686830065359475E-3,1.6759968E-2,0,7.9223397378540866E-2,0.88482866361673895,3.1316870558311366E-2,3.8228400000000001E-3,3.5241245947776098E-2,1.3776E-2,4.1999999999999996E-4,3.9499199999999998E-2,2.9130660000000003E-2,1.9749599999999999E-2,3.9919199999999995E-2,0.60015822817568631,0.61433694925731641,0.61433694925731641,7.38,0.92315348312727941,2.0312578197064401,0.91510849679885031,null,92.315348312727934,0.44531932442575572,0.12824064332631696,8.8315557378540868E-2,3.9787325947776099E-2,0.16901762483156069]
["QgBot",{"$f":"Qg_Q2*1000000000","v":5.0469999999999997},"nC","Gate Charge Of Top FET",null,null,42,12,1,1.26,1.26,0.7,0.52979984066918939,1.3401334273284349,1.9300667136642176,0.58993328633578257,0,1.3180527810322777,0.34745262671738431,0.1,0.46131074950985756,0.38686319750904385,1.4966313358692149E-4,1.4966313358692149E-4,0.65785487817662991,8.6554608148157726E-4,8.6554608148157726E-4,0.95937569876186035,5.9826112539362514E-2,4.987431372549019E-3,1.6759968E-2,0,8.2024977581576272E-2,0.90380385162496057,3.2674456088484551E-2,3.9160799999999997E-3,3.670086070935704E-2,1.4112000000000003E-2,4.1999999999999996E-4,3.9499199999999998E-2,2.9130660000000003E-2,1.9749599999999999E-2,3.9919199999999995E-2,0.61964787471778038,0.63498396566523518,0.63498396566523518,7.5600000000000005,0.92251553287649546,2.1007946443762542,0.95122987631521194,null,92.251553287649543,0.46131074950985756,0.13283783829093332,9.1338897581576275E-2,4.1357820709357042E-2,0.17367321615537762]
["RGateBot",{"$f":"Rgate2","v":0},"W","Gate Resistance",null,null,43,12,1,1.29,1.29,0.71666666666666667,0.53050632281190879,1.3400376564366971,1.9600188282183486,0.61998117178165146,0,1.3467522947405843,0.36274834867780598,0.1,0.47773154942718854,0.38683555083398119,1.4964174338902964E-4,1.4964174338902964E-4,0.672121642988186,9.0349500594627714E-4,9.0349500594627714E-4,0.98091868308019026,6.2543095083025357E-2,5.1061797385620914E-3,1.6759968E-2,0,8.4897741432946733E-2,0.92278940207029625,3.4061611222930201E-2,4.0093200000000002E-3,3.8190607917742266E-2,1.4447999999999999E-2,4.1999999999999996E-4,3.9499199999999998E-2,2.9130660000000003E-2,1.9749599999999999E-2,3.9919199999999995E-2,0.63959572272232368,0.65616477246957172,0.65616477246957172,7.74,0.92184946457684003,2.1719686929577748,0.98804430210807215,null,92.184946457684006,0.47773154942718854,0.13753634935068898,9.4433421432946738E-2,4.2958447917742268E-2,0.17843322304238318]
["VsdBot",{"$f":"Vsd_Q2","v":0.7},"V","Diode Forward Voltage of Bottom FET Body Diode",null,null,44,12,1,1.32,1.32,0.73333333333333328,0.53121266427718039,1.3399365159370202,1.9899682579685103,0.65003174203148995,0,1.375506872233573,0.37840383111235742,0.1,0.49458506956094211,0.38680635408662395,1.4961915556178671E-4,1.4961915556178671E-4,0.68641206741313499,9.4232305258074836E-4,9.4232305258074836E-4,1.0025290701468152,6.5329194871813462E-2,5.224928104575163E-3,1.6759968E-2,0,8.784204679414033E-2,0.94178268144638821,3.5478184762893966E-2,4.1025599999999999E-3,3.9710359096941844E-2,1.4784E-2,4.1999999999999996E-4,3.9499199999999998E-2,2.9130660000000003E-2,1.9749599999999999E-2,3.9919199999999995E-2,0.66000186685164008,0.6778830620088343,0.6778830620088343,7.92,0.92115698048928196,2.2447881962652279,1.0255488192296625,null,92.115698048928195,0.49458506956094211,0.14233640589108218,9.7599486794140336E-2,4.4589079096941847E-2,0.18329799244789219]
["QrrBot",{"$f":"Qrr_Q2*1000000000","v":7},"nC","Reverse Recovery Charge of Body Diode",null,null,45,12,1,1.35,1.35,0.75000000000000011,0.53191886510701847,1.3398300074330696,2.0199150037165348,0.6800849962834653,0,1.4043131312975898,0.39441907414696842,0.1,0.51187475744450728,0.38677560772991054,1.4959537073484165E-4,1.4959537073484165E-4,0.70072437121155384,9.8202928881965497E-4,9.8202928881965497E-4,1.0242044383247331,6.8184657546465327E-2,5.3436764705882362E-3,1.6759968E-2,0,9.0858254804049257E-2,0.96078126503942618,3.6924025570030404E-2,4.1958000000000004E-3,4.1259986170192192E-2,1.5120000000000001E-2,4.1999999999999996E-4,3.9499199999999998E-2,2.9130660000000003E-2,1.9749599999999999E-2,3.9919199999999995E-2,0.68086640173405233,0.70014263519228626,0.70014263519228626,8.1000000000000014,0.92043962646782851,2.319261460493133,1.0637404819144205,null,92.043962646782845,0.51187475744450728,0.14723824097424146,0.10083745480404926,4.6249586170192196E-2,0.18826787774777898]
["TrrBot",{"$f":"Trr_Q2*1000000000","v":40},"ns","Reverse Recovery Time of Body Diode",null,null,46,12,1,1.38,1.38,0.76666666666666661,0.53262492534342032,1.339718132527872,2.0498590662639358,0.71014093373606391,0,1.4331679558069936,0.4107940779103994,0.1,0.52960416459017479,0.3867433122265948,1.495703895519974E-4,1.495703895519974E-4,0.71505690722271387,1.0226127611338257E-3,1.0226127611338257E-3,1.0459425535815667,7.1109728650527365E-2,5.462424836601306E-3,1.6759968E-2,0,9.3946729922589456E-2,0.97978291685417163,3.8398982566370747E-2,4.28904E-3,4.2839361452579376E-2,1.5455999999999998E-2,4.1999999999999996E-4,3.9499199999999998E-2,2.9130660000000003E-2,1.9749599999999999E-2,3.9919199999999995E-2,0.70218942196389889,0.72294740338272012,0.72294740338272012,8.2799999999999994,0.91969880851341146,2.3953968682195574,1.1026163534093256,null,91.969880851341145,0.52960416459017479,0.15224209137516884,0.10414768992258945,4.7939841452579374E-2,0.19334323879254534]
["θJABot",{"$f":"ThetaJA_Q2","v":23},"°C/W","Junction to Ambient Resistance",null,null,47,12,1,1.41,1.41,0.78333333333333321,0.5333308450283667,1.3396008928238177,2.0798004464119089,0.74019955358809109,0,1.4620684705824134,0.42752884253423951,0.1,0.54777694838382052,0.38670946803924711,1.4954421267119748E-4,1.4954421267119748E-4,0.72940814879300819,1.0640724950512863E-3,1.0640724950512863E-3,1.0677413517860621,7.4104653630405276E-2,5.5811732026143784E-3,1.6759968E-2,0,9.7107839974863996E-2,0.99878557176066074,3.9902904734290798E-2,4.3822799999999997E-3,4.4448357643710849E-2,1.5792E-2,4.1999999999999996E-4,3.9499199999999998E-2,2.9130660000000003E-2,1.9749599999999999E-2,3.9919199999999995E-2,0.72397102210155007,0.74630139034628562,0.74630139034628562,8.4599999999999991,0.91893580725818336,2.4732028794218719,1.1421735058053495,null,91.893580725818339,0.54777694838382052,0.15734819761857485,0.10753055997486399,4.9659717643710848E-2,0.1985244419624651]
[null,null,null,null,null,null,48,12,1,1.44,1.44,0.8,0.53403662420382159,1.3394782899226567,2.1097391449613285,0.77026085503867159,0,1.4910120189872751,0.44462336815290215,0.1,0.56639687404751748,0.38667407563025274,1.495168407645104E-4,1.495168407645104E-4,0.74377667857303331,1.1064074951782665E-3,1.1064074951782665E-3,1.0895989229310683,7.7169677835415368E-2,5.6999215686274508E-3,1.6759968E-2,0,0.10034195619587986,1.0177873195869391,4.1435641116478648E-2,4.4755200000000002E-3,4.6086847820434568E-2,1.6128E-2,4.1999999999999996E-4,3.9499199999999998E-2,2.9130660000000003E-2,1.9749599999999999E-2,3.9919199999999995E-2,0.74621129667342367,0.77020873427133729,0.77020873427133729,8.64,0.91815179067534503,2.552688032505237,1.182409019869995,null,91.815179067534501,0.56639687404751748,0.16255680401631442,0.11098643619587986,5.1409087820434567E-2,0.20381186022381981]
[null,null,null,null,null,null,49,12,1,1.47,1.47,0.81666666666666665,0.53474226291173255,1.3393503254255046,2.1396751627127522,0.80032483728724768,0,1.5199961429286972,0.46207765490362329,0.1,0.585467816672116,0.386637135461814,1.4948827451811712E-4,1.4948827451811712E-4,0.75816117851687548,1.149616745220195E-3,1.149616745220195E-3,1.1115134970483043,8.0305046517835793E-2,5.8186699346405224E-3,1.6759968E-2,0,0.10364945327582777,1.0367863909203119,4.299704081590263E-2,4.5687599999999998E-3,4.7754705429605381E-2,1.6463999999999999E-2,4.1999999999999996E-4,3.9499199999999998E-2,2.9130660000000003E-2,1.9749599999999999E-2,3.9919199999999995E-2,0.76891034017200222,0.79467368985835829,0.79467368985835829,8.82,0.91734782526248526,2.6338609453440385,1.2233199848809237,null,91.734782526248523,0.585467816672116,0.16786815870543315,0.11451569327582777,5.318782542960538E-2,0.20920587318624229]
[null,null,null,null,null,null,50,12,1,1.5,1.5,0.83333333333333326,0.53544776119402981,1.3392170009328357,2.1696085004664178,0.83039149953358216,0,1.5490185649734141,0.47989170292645905,0.1,0.60499376332191357,0.38659864799594801,1.4945851463229494E-4,1.4945851463229494E-4,0.77256042093892929,1.1936992080026712E-3,1.1936992080026712E-3,1.1334834316115143,8.3511004832957952E-2,5.9374183006535948E-3,1.6759968E-2,0,0.10703070940593515,1.0557811444113219,4.4586952995779222E-2,4.6620000000000003E-3,4.9451804280897876E-2,1.6799999999999999E-2,4.1999999999999996E-4,3.9499199999999998E-2,2.9130660000000003E-2,1.9749599999999999E-2,3.9919199999999995E-2,0.79206824705584999,0.81970063048309849,0.81970063048309849,9,0.91652488590756853,2.7167303163365086,1.2649034984606511,null,91.65248859075686,0.60499376332191357,0.17328251368683303,0.11811870940593515,5.4995804280897877E-2,0.21470686716118492]
[null,null,null,null,null,null,51,12,1,1.53,1.53,0.84999999999999987,0.53615311909262764,1.3390783180444912,2.1995391590222457,0.86046084097775444,0,1.5780771723275782,0.49806551236428098,0.1,0.62497881521362941,0.38655861369448918,1.4942756182140533E-4,1.4942756182140533E-4,0.78697326050267302,1.2386538254924163E-3,1.2386538254924163E-3,1.1555072002514239,8.6787797839137482E-2,6.0561666666666663E-3,1.6759968E-2,0,0.11048610632490198,1.0747700554018613,4.620522687954081E-2,4.75524E-3,5.1178018539664909E-2,1.7135999999999998E-2,4.1999999999999996E-4,3.9499199999999998E-2,2.9130660000000003E-2,1.9749599999999999E-2,3.9919199999999995E-2,0.81568511174962599,0.84529405043515637,0.84529405043515637,9.18,0.91568386461457807,2.8013049254727456,1.3071566664122929,null,91.568386461457806,0.62497881521362941,0.17880012486456687,0.12179586632490198,5.683289853966491E-2,0.22031523522152696]
["Controller","Input Value","Units","Std Units",null,null,52,12,1,1.56,1.56,0.86666666666666659,0.53685833664942306,1.3389342783596732,2.2294671391798366,0.89053286082016347,0,1.6071700024620539,0.51659908336277571,0.1,0.6454271899720031,0.38651703301908735,1.4939541681387828E-4,1.4939541681387828E-4,0.80139862703220621,1.2844795188182104E-3,1.2844795188182104E-3,1.1775833826289253,9.0135670497845821E-2,6.1749150326797387E-3,1.6759968E-2,0,0.11401602936593037,1.0937517057221426,4.7851711750803862E-2,4.8484800000000005E-3,5.2933222719841917E-2,1.7471999999999998E-2,4.1999999999999996E-4,3.9499199999999998E-2,2.9130660000000003E-2,1.9749599999999999E-2,3.9919199999999995E-2,0.83976102864410518,0.87145856723434534,0.87145856723434534,9.36,0.91482557823914368,2.8875936354163985,1.3500766025563642,null,91.482557823914362,0.6454271899720031,0.18442125208577229,0.12554754936593038,5.8698982719841919E-2,0.22603137726234224]
["θJA",23,"°C/W","Junction to Ambient Resistance",null,null,53,12,1,1.59,1.59,0.88333333333333341,0.53756341390629669,1.3387848834769476,2.2593924417384739,0.92060755826152629,0,1.6362952301929499,0.53549241607043985,0.1,0.66634322396441592,0.38647390643120877,1.4936208035219871E-4,1.4936208035219871E-4,0.8158355190514216,1.3311751882918051E-3,1.3311751882918051E-3,1.1997106553326862,9.3554867673720926E-2,6.2936633986928111E-3,1.6759968E-2,0,0.11762086750435728,1.1127247745212721,4.952625695333663E-2,4.9417200000000001E-3,5.4717291676895652E-2,1.7808000000000001E-2,4.1999999999999996E-4,3.9499199999999998E-2,2.9130660000000003E-2,1.9749599999999999E-2,3.9919199999999995E-2,0.8642960920961904,0.89819892402725532,0.89819892402725532,9.5400000000000009,0.91395077536223912,2.9756053926002171,1.3936604285686001,null,91.395077536223909,0.66634322396441592,0.19014615918125294,0.12937414750435727,6.0593931676895654E-2,0.2318557000628394]
["Theta JC",2,"°C/W","Junction to Ambient Resistance",null,null,54,12,1,1.62,1.62,0.9,0.53826835090511238,1.3386301349942458,2.2893150674971228,0.95068493250287722,0,1.6654511560513845,0.55474551063857858,0.1,0.68773137471706192,0.38642923439213644,1.4932755319289274E-4,1.4932755319289274E-4,0.83028299796780702,1.378739713428819E-3,1.378739713428819E-3,1.2218877836844146,9.7045634134618711E-2,6.4124117647058826E-3,1.6759968E-2,0,0.12130101340590219,1.1316880300134318,5.1228711891027283E-2,5.0349600000000007E-3,5.6530100600817493E-2,1.8144000000000004E-2,4.1999999999999996E-4,3.9499199999999998E-2,2.9130660000000003E-2,1.9749599999999999E-2,3.9919199999999995E-2,0.8892903964289306,0.92551999206655899,0.92551999206655899,9.7200000000000006,0.91306014241142841,3.0653492283357502,1.4379052738188023,null,91.306014241142847,0.68773137471706192,0.19597511400671969,0.13327605340590218,6.2517620600817489E-2,0.23778861734949708]
[null,null,null,null,null,null,55,12,1,1.65,1.65,0.91666666666666652,0.53897314768771754,1.3384700345088618,2.3192350172544307,0.980764982745569,0,1.6946361957973495,0.57435836722130251,0.1,0.70959622341528517,0.38638301736296954,1.4929183610651282E-4,1.4929183610651282E-4,0.84474018282831032,1.4271719529696143E-3,1.4271719529696143E-3,1.2441136143496769,0.10060821455166409,6.5311601307189533E-3,1.6759968E-2,0,0.12505686347553993,1.1506403220365153,5.2958926027851828E-2,5.1282000000000003E-3,5.8371525009160381E-2,1.848E-2,4.1999999999999996E-4,3.9499199999999998E-2,2.9130660000000003E-2,1.9749599999999999E-2,3.9919199999999995E-2,0.91474403593153752,0.95342677327569547,0.95342677327569547,9.8999999999999986,0.91215430912351925,3.1568342599374186,1.4828082752106888,null,91.21543091235192,0.70959622341528517,0.2019083884847003,0.13725366347553994,6.4469925009160378E-2,0.24383054986041031]
[null,null,null,null,null,null,56,12,1,1.68,1.68,0.93333333333333324,0.53967780429594281,1.338304583617457,2.3491522918087284,1.0108477081912715,0,1.7238488709505901,0.59433098597552492,0.1,0.73194247749082009,0.38633525580462441,1.4925492987762458E-4,1.4925492987762458E-4,0.85920624558372383,1.4764707449001567E-3,1.4764707449001567E-3,1.2663870686648573,0.10424285349930205,6.6499084967320257E-3,1.6759968E-2,0,0.12888881790700971,1.1695805753329072,5.4716748887842163E-2,5.2214399999999999E-3,6.0241440740119105E-2,1.8815999999999999E-2,4.1999999999999996E-4,3.9499199999999998E-2,2.9130660000000003E-2,1.9749599999999999E-2,3.9919199999999995E-2,0.94065710485940124,0.98192440290168648,0.98192440290168648,10.08,0.91123385342932606,3.2500696918612233,1.5283665770227395,null,91.123385342932608,0.73194247749082009,0.20794625864712882,0.1413073779070097,6.645072074011911E-2,0.24998192541086639]
["Outputs",null,null,null,null,null,57,12,1,1.71,1.71,0.95,0.54038232077160187,1.3381337839160534,2.3790668919580265,1.0409331080419733,0,1.753087800227014,0.61466336706095825,0.1,0.75477497329879184,0.38628595017783302,1.4921683530479129E-4,1.4921683530479129E-4,0.87368040680584325,1.5266349064728475E-3,1.5266349064728475E-3,1.2887071366018108,0.10794979545534848,6.7686568627450981E-3,1.6759968E-2,0,0.13279728073297145,1.1885077834731892,5.6502030055054123E-2,5.3146800000000004E-3,6.2139723945653209E-2,1.9151999999999995E-2,4.1999999999999996E-4,3.9499199999999998E-2,2.9130660000000003E-2,1.9749599999999999E-2,3.9919199999999995E-2,0.96702969743410594,1.0110181522589619,1.0110181522589619,10.26,0.91029930583011875,3.3450648168583434,1.5745773307500237,null,91.029930583011875,0.75477497329879184,0.21408900467862466,0.14543760073297146,6.8459883945653208E-2,0.25624317896017001]
["Design","Value","Units",null,null,null,58,12,1,1.74,1.74,0.96666666666666656,0.54108669715649238,1.3379576370000428,2.4089788185000214,1.0710211814999786,0,1.7823516917826745,0.63535551064011242,0.1,0.7780986788874531,0.38623510094314517,1.4917755320056154E-4,1.4917755320056154E-4,0.8881619318084254,1.5776632342273482E-3,1.5776632342273482E-3,1.3110728713012771,0.1117292848010414,6.8874052287581696E-3,1.6759968E-2,0,0.13678265987582164,1.2074210033531745,5.8314619173535462E-2,5.4079200000000001E-3,6.4066251084652193E-2,1.9487999999999998E-2,4.1999999999999996E-4,3.9499199999999998E-2,2.9130660000000003E-2,1.9749599999999999E-2,3.9919199999999995E-2,0.99386190784344741,1.0407134315671902,1.0407134315671902,10.44,0.90935115332591965,3.4418290171438977,1.6214376949470004,null,90.935115332591963,0.7780986788874531,0.22033691096047384,0.14964473987582164,7.0497291084652192E-2,0.26261475267973711]
["Dmax",{"$f":"D1_Vinmin","v":0.66666666666666663},"index",null,null,null,59,12,1,1.77,1.77,0.98333333333333339,0.54179093349239493,1.3377761444641796,2.43888807223209,1.1011119277679102,0,1.8116393361791012,0.65640741687829096,0.1,0.80191869686376249,0.3861827085609269,1.4913708439145382E-4,1.4913708439145382E-4,0.90265012712882775,1.6295545040113776E-3,1.6295545040113776E-3,1.333483384114367,0.11558156582109179,7.006153594771242E-3,1.6759968E-2,0,0.14084536719917959,1.2263193502030172,6.0154365947294015E-2,5.5011600000000006E-3,6.6020898916142531E-2,1.9824000000000001E-2,4.1999999999999996E-4,3.9499199999999998E-2,2.9130660000000003E-2,1.9749599999999999E-2,3.9919199999999995E-2,1.021153830241448,1.0710157928862418,1.0710157928862418,10.620000000000001,0.90838984294778446,3.5403717655811309,1.6689448350712783,null,90.838984294778442,0.80191869686376249,0.22669026611532211,0.1539292071991796,7.2562818916142538E-2,0.26909709602247933]
["Dprime",{"$f":"1-B68","v":0.33333333333333337},"index",null,null,null,60,12,{"$f":"MODE","v":1},1.8,1.8,1,0.54249502982107367,1.3375893079025849,2.4687946539512926,1.1312053460487075,0,1.840949599993966,0.67781908594358875,0.1,0.82624026735804834,0.38612877349136132,1.4909542971794303E-4,1.4909542971794303E-4,0.91714433733232315,1.6823074710014922E-3,1.6823074710014922E-3,1.355937840098616,0.1195068827037345,7.1249019607843135E-3,1.6759968E-2,0,0.14498581856005607,1.2452019930543972,6.2021120140265715E-2,5.5944000000000002E-3,6.8003544492535775E-2,2.0160000000000001E-2,4.1999999999999996E-4,3.9499199999999998E-2,2.9130660000000003E-2,1.9749599999999999E-2,3.9919199999999995E-2,1.0489055587483731,1.1019309331515417,1.1019309331515417,10.8,0.90741578493938058,3.6407026268812896,1.7170959233283227,null,90.741578493938064,0.82624026735804834,0.23314936305259187,0.15829141856005607,7.4656344492535776E-2,0.27569066579349333]
["Ipp",{"$f":"Iripple_Vinnom","v":1.3094339622641511},"A",null,null,null,61,12,1,1.83,1.83,1.0166666666666666,0.54319898618427598,1.3373971289087465,2.4986985644543731,1.1613014355456268,0,1.8702814200099531,0.69959051800688943,0.1,0.85106877109113976,0.38607329619444875,1.4905259003444654E-4,1.4905259003444654E-4,0.93164394210552626,1.7359208697238504E-3,1.7359208697238504E-3,1.3784354539213557,0.12350547954077931,7.2436503267973851E-3,1.6759968E-2,0,0.14920443386171728,1.2640681506181035,6.3914731576282899E-2,5.6876400000000008E-3,7.001406515291772E-2,2.0496E-2,4.1999999999999996E-4,3.9499199999999998E-2,2.9130660000000003E-2,1.9749599999999999E-2,3.9919199999999995E-2,1.077117187450749,1.1334646973132245,1.1334646973132245,10.98,0.90642935562732707,3.7428312588194972,1.7658881385171075,null,90.642935562732703,0.85106877109113976,0.23971449901463499,0.16273179386171727,7.6777745152917715E-2,0.28239592622208476]
["Top FET","Value","Units",null,null,null,62,12,1,1.86,1.86,1.0333333333333332,0.54390280262373281,1.3371996090755174,2.5285998045377589,1.1914001954622413,0,1.8996337979224602,0.72172171324186207,0.1,0.87640973254749044,0.38601627713000619,1.4900856620930975E-4,1.4900856620930975E-4,0.94614835360924054,1.7903934140749529E-3,1.7903934140749529E-3,1.4009754861285955,0.12757760032766152,7.3623986928104575E-3,1.6759968E-2,0,0.15350163710725501,1.2829170875298437,6.5835050139042256E-2,5.7808800000000004E-3,7.2052338516377462E-2,2.0832000000000003E-2,4.1999999999999996E-4,3.9499199999999998E-2,2.9130660000000003E-2,1.9749599999999999E-2,3.9919199999999995E-2,1.1057888104013762,1.1656230815826305,1.1656230815826305,11.16,0.90543090001475512,3.846767413466865,1.8153186658766818,null,90.54309000147552,0.87640973254749044,0.24638597562363246,0.16725075710725501,7.8926898516377464E-2,0.28921334903514007]
["Tr",{"$f":"(Qgd_Q1+Qgs_Q1/2)*(RdsonDRT+Rgate1)/(VCC-Vsp_Q1)*1000000000","v":0.80108024691358037},"ns","Turn on of MOSFET -> Rise time of current",null,null,63,12,1,1.89,1.89,1.0499999999999998,0.54460647918115879,1.3369967499951205,2.5584983749975603,1.2215016250024395,0,1.9290057955135316,0.74421267182495854,0.1,0.90226882325798463,0.38595771675766882,1.4896335912479292E-4,1.4896335912479292E-4,0.96065701406442794,1.8457237973423652E-3,1.8457237973423652E-3,1.423557239742389,0.13172348896349301,7.481147058823529E-3,1.6759968E-2,0,0.15787785645387731,1.3017481109269271,6.778192577207294E-2,5.87412E-3,7.41182424753766E-2,2.1167999999999996E-2,4.1999999999999996E-4,3.9499199999999998E-2,2.9130660000000003E-2,1.9749599999999999E-2,3.9919199999999995E-2,1.1349205216193481,1.1984122367898593,1.1984122367898593,11.34,0.90442073412824053,3.9525209384391777,1.8653846969336616,null,90.442073412824058,0.90226882325798463,0.2531640989292539,0.1718487364538773,8.1103682475376596E-2,0.29614341353187468]
["Tf",{"$f":"(Qgd_Q1+Qgs_Q1/2)*(RdsonDRT2+Rgate1)/(Vsp_Q1)*1000000000","v":0.84820261437908495},"ns","Turn off of MOSFET -> Fall time of current",null,null,64,{"$f":"Vin","v":12},{"$f":"MODE","v":1},1.92,{"$f":"Iout*G73/100/Number_of_Phases","v":1.92},{"$f":"Vout*K73/(Vin*Efficiency)","v":1.0666666666666667},{"$f":"(Vout+(Rdson2+Rs+Rdcr)*K73)/(Vin+(Rs+Rdson2-Rdson1)*K73)","v":0.54531001589825123},{"$f":"(Vin-(Rdson1+Rdcr)*K73-Vout)*M73/(Fsw*Lf)","v":1.3367885532591415},2.5883942766295709,1.2516057233704292,{"$f":"IF(MIN(Vin, -P73/(Coss_Q1+Coss_Q2)*0.00000002)<0, 0, MIN(Vin, -P73/(Coss_Q1+Coss_Q2)*0.00000002))","v":0},1.9583965302453576,{"$f":"R73^2*Rdcr","v":0.76706339393541123},{"$f":"Core_Loss","v":0.1},{"$f":"(T73+S73*(1+Ltc*(Ta-25)))/(1-S73*Ltc*ThetaCa)","v":0.9286518651962653},0.38589761553688789,1.4891696967705577E-4,1.4891696967705577E-4,0.97516939354796861,1.901910692225426E-3,1.901910692225426E-3,1.4461800571538208,{"$f":"Rdson1*AB73^2","v":0.13594338925111285},{"$f":"(Vin*K73/2)*Fsw*(Tr_buck+Tf_buck)","v":7.5998954248366014E-3},{"$f":"(0.5*Coss_Q1*(Vin-Q73)^2-0.5*Coss_Q2*(Vin-Q73)^2+(Qoss_Q2*(Vin-Q73)/Vin)*Vin)*Fsw","v":1.6759968E-2},{"$f":"IF(K73>N73/2,0,ABS(K73-N73/2)*Vsd_Q1*Deadtime*Fsw)","v":0},{"$f":"(AF73+AE73+AD73+AC73*(1+RdsonTopTc*Ta-RdsonTopTc*25))/(1-AC73*RdsonTopTc*ThetaJA_Q1)","v":0.16233352426793099},{"$f":"SQRT((1-M73))*SQRT(K73^2+(N73^2)/12)","v":1.3205605673226912},{"$f":"Rdson2*AH73^2","v":6.975520847870513E-2},{"$f":"IF(K73<N73/2,Deadtime*Fsw*Vsd_Q2*(K73+N73/2),2*Deadtime*Fsw*Vsd_Q2*K73)","v":5.9673599999999997E-3},{"$f":"(AJ73+AI73*(1+RdsonBotTc*Ta-RdsonBotTc*25))/(1-AI73*RdsonBotTc*ThetaJA_Q2)","v":7.6211655189158012E-2},{"$f":"Qrr_Q2*K73/Iout*Fsw*Vin","v":2.1504000000000002E-2},{"$f":"Iq*Vin","v":4.1999999999999996E-4},{"$f":"IF(Ext_VCC=1,  (Qg_Q1+Qg_Q2)*Fsw*Vout, (Qg_Q1+Qg_Q2)*Fsw*Vin)","v":3.9499199999999998E-2},{"$f":"(Vin-VCC)*Fsw*(Qg_Q1+Qg_Q2)","v":2.9130660000000003E-2},{"$f":"(Qg_Q1+Qg_Q2)*Fsw*(Vin-Vout)","v":1.9749599999999999E-2},3.9919199999999995E-2,1.1645124150900659,{"$f":"U73 + ((AF73+AE73+AD73+AC73*(1+RdsonTC*(Ta-25))) + (AJ73+AI73*(1+RdsonTC*(Ta-25))) + AQ73 + AL73) / (1-AC73*RdsonTC*ThetaJA_Q1 -AI73*RdsonTC*ThetaJA_Q2)","v":1.2318384718562383},1.2318384718562383,{"$f":"Vout*K73","v":11.52},0.90339914714455094,{"$f":"ThetaJA_Q1*BC73","v":4.0601017781624131},{"$f":"ThetaJA_Q2*BD73","v":1.9160834293506344},null,90.339914714455091,{"$f":"U73","v":0.9286518651962653},{"$f":"AG73+AK73+AL73","v":0.260049179457089},{"$f":"AG73+AL73*0.66","v":0.176526164267931},{"$f":"AK73+AL73*0.33","v":8.3307975189158015E-2},0.30318660665997299]
["Part Power","Value","Units",null,null,null,65,12,1,{"$f":"Iout*G74/100","v":1.95},1.95,1.0833333333333333,0.54601341281669158,1.3365750204585378,{"$f":"K74+N74/2","v":2.6182875102292691},{"$f":"K74-N74/2","v":1.281712489770731},0,{"$f":"SQRT(K74^2+(N74^2)/12)","v":1.9878051712318652},0.790273879755229,0.1,0.9555648342925982,{"$f":"N74/SQRT(12)","v":0.3858359739269332},{"$f":"RCoutEsr*V74^2","v":1.4886939877614509E-4},{"$f":"W74","v":1.4886939877614509E-4},{"$f":"SQRT(M74*(1-M74))*SQRT(K74^2+(N74^2)/12)","v":0.98968498797746995},{"$f":"RCinEsr*Y74^2","v":1.9589527508559299E-3},{"$f":"Z74","v":1.9589527508559299E-3},{"$f":"SQRT(M74)*SQRT(K74^2+(N74^2)/12)","v":1.4688433172824125},0.14023754489713811,7.7186437908496729E-3,1.6759968E-2,0,0.16686907718067004,1.3393538397492066,7.1754748322037737E-2,6.0606000000000002E-3,7.8332455077192775E-2,2.1839999999999998E-2,4.1999999999999996E-4,3.9499199999999998E-2,2.9130660000000003E-2,1.9749599999999999E-2,3.9919199999999995E-2,{"$f":"SUM(S74,T74,AC74,AD74,AE74,AF74,AI74,AJ74,AQ74, AL74)","v":1.1945645847652544},1.2659082573857483,{"$f":"AS74","v":1.2659082573857483},11.7,{"$f":"AU74/(AU74+AT74)","v":0.90236640332044227},4.1695199751554108,1.9674120667754338,null,{"$f":"AV74*100","v":90.236640332044232},0.9555648342925982,0.26704153225786281,0.18128347718067003,8.5539655077192772E-2,{"$f":"AS74-BA74","v":0.31034342309315011}]
["Power Dis",{"$f":"AQ9","v":3.9919199999999995E-2},"W",null,null,null,66,12,1,1.98,1.98,1.0999999999999999,0.54671666997814428,1.3363561531836312,2.6481780765918157,1.3118219234081843,0,2.0172309355514999,0.81384412946919604,0.1,0.98301386406946745,0.38577279238689116,1.4882064734597945E-4,1.4882064734597945E-4,1.0042033172666767,2.0168486048187956E-3,2.0168486048187956E-3,1.4915464329759576,0.14460619951201467,7.8373921568627453E-3,1.6759968E-2,0,0.1714849561447829,1.358127345142081,7.3780395424907094E-2,6.1538399999999998E-3,8.0480520812666698E-2,2.2176000000000001E-2,4.1999999999999996E-4,3.9499199999999998E-2,2.9130660000000003E-2,1.9749599999999999E-2,{"$f":"SUM(AM75:AN75)","v":3.9919199999999995E-2},1.2250771245629803,1.3006282293796203,1.3006282293796203,11.879999999999999,0.90132274374596799,4.2807856713300065,2.0193678186913342,null,90.132274374596804,0.98301386406946745,0.27414147695744961,0.18612111614478291,8.7798600812666702E-2,0.31761436531015286]
["Temp rise",{"$f":"B75*B62","v":0.91814159999999989},"°C",null,null,null,67,12,1,2.0099999999999998,2.0099999999999998,1.1166666666666665,0.54741978742425756,1.3361319530241136,2.6780659765120567,1.3419340234879429,0,2.0466730848683028,0.83777414326486699,0.1,1.0110052494032673,0.38570807137566621,1.4877071632433603E-4,1.4877071632433603E-4,1.0187239236350325,2.0755968651727111E-3,2.0755968651727111E-3,1.5142888486276205,0.1490495966100677,7.956140522875816E-3,1.6759968E-2,0,0.17618160649169196,1.3768805319439921,7.5831999969854819E-2,6.2470799999999995E-3,8.2655731316003872E-2,2.2511999999999997E-2,4.1999999999999996E-4,3.9499199999999998E-2,2.9130660000000003E-2,1.9749599999999999E-2,3.9919199999999995E-2,1.2560501283676655,1.3360051930784962,1.3360051930784962,12.059999999999999,0.9002683879393546,4.3939091093089147,2.0719479002680892,null,90.026838793935454,1.0110052494032673,0.28134933780769578,0.19103952649169195,9.008469131600387E-2,0.32499994367522889]
["Current (switching)",{"$f":"(Qg_Q1+Qg_Q2)*Fsw+Iq","v":3.3265999999999999E-3},"A",null,null,null,68,12,1,2.04,2.04,1.1333333333333333,0.5481227651966627,1.3359024215690449,2.7079512107845227,1.3720487892154776,0,2.0761309223319313,0.86206392133256726,0.1,1.0395454504166746,0.3856418113519805,1.4871960666283651E-4,1.4871960666283651E-4,1.0332463700567176,2.1351961224707668E-3,2.1351961224707668E-3,1.5370700379896243,0.15356797960955262,8.0748888888888884E-3,1.6759968E-2,0,0.18095947798963979,1.3956128779061228,7.7909412199096403E-2,6.34032E-3,8.4857965748428549E-2,2.2848E-2,4.1999999999999996E-4,3.9499199999999998E-2,2.9130660000000003E-2,1.9749599999999999E-2,3.9919199999999995E-2,1.287483690030105,1.3720461269367568,1.3720461269367568,12.24,0.89920353529939723,4.5089006337617157,2.1251495322138569,null,89.920353529939717,1.0395454504166746,0.28866544373806835,0.19603915798963981,9.2397805748428555E-2,0.33250067652008219]
["Qrr Current",{"$f":"Qrr_Q2*Fsw","v":2.8E-3},"A",null,null,null,69,12,1,2.0699999999999998,2.0699999999999998,1.1499999999999997,0.54882560333697483,1.3356675604068533,2.7378337802034265,1.4021662197965732,0,2.1056037897303783,0.8867134638653863,0.1,1.0686410965064541,0.38557401277437375,1.4866731932693296E-4,1.4866731932693296E-4,1.047770238836039,2.1956449467810603E-3,2.1956449467810603E-3,1.5598895021650403,0.15816159183270531,8.1936372549019591E-3,1.6759968E-2,0,0.18581902490257537,1.414323888068866,8.0012482414489383E-2,6.4335599999999996E-3,8.708710350556402E-2,2.3183999999999996E-2,4.1999999999999996E-4,3.9499199999999998E-2,2.9130660000000003E-2,1.9749599999999999E-2,3.9919199999999995E-2,1.3193779033674828,1.408758186733801,1.408758186733801,12.419999999999998,0.89812836642951421,4.6257706927592332,2.1789699406279723,null,89.812836642951424,1.0686410965064541,0.29609012840813936,0.20112046490257537,9.473782350556402E-2,0.34011709022734693]
["Diode Current",{"$f":"Deadtime*Fsw*(Iripple_Vinnom/2)*(Vsd_Q2)/Vin","v":8.4785849056603801E-5},null,null,null,null,70,12,1,2.1,2.1,1.1666666666666667,0.54952830188679247,1.335427371125337,2.7677136855626685,1.4322863144373317,0,2.1350910648719164,0.91172277105917887,0.1,1.0982989905117078,0.38550467610120381,1.4861385529589408E-4,1.4861385529589408E-4,1.0622951302974359,2.2569418877072928E-3,2.2569418877072928E-3,1.5827467677611466,0.16283067650579322,8.3123856209150332E-3,1.6759968E-2,0,0.19076070604985576,1.4330130929051337,8.2141060977501484E-2,6.5268000000000001E-3,8.9343024211067976E-2,2.3519999999999999E-2,4.1999999999999996E-4,3.9499199999999998E-2,2.9130660000000003E-2,1.9749599999999999E-2,3.9919199999999995E-2,1.3517328621633886,1.4461487098273089,1.4461487098273089,12.600000000000001,0.8970430443459908,4.7445298391466819,2.2334063568545632,null,89.704304434599081,1.0982989905117078,0.30362373026092371,0.20628390604985575,9.7104624211067969E-2,0.34784971931560116]
["Total",{"$f":"SUM(B77:B79)","v":6.2113858490566035E-3},"A",null,null,null,71,12,1,2.13,2.13,1.1833333333333331,0.55023086088769735,1.3351818553116621,2.7975909276558308,1.4624090723441689,0,2.1645921591752084,0.93709184311255811,0.1,1.1285261130277497,0.38543380179064607,1.4855921556279104E-4,1.4855921556279104E-4,1.0768206615795721,2.319085474409335E-3,2.319085474409335E-3,1.6056413851895166,0.16757547675916512,8.4311339869281039E-3,1.6759968E-2,0,0.19578498486677612,1.4516800466113327,8.4294998309179248E-2,6.6200399999999998E-3,9.1625607710304868E-2,2.3856000000000002E-2,4.1999999999999996E-4,3.9499199999999998E-2,2.9130660000000003E-2,1.9749599999999999E-2,3.9919199999999995E-2,1.3845486601678305,1.4842252195536931,1.4842252195536931,12.78,0.8959477155815595,4.8651887319358504,2.2884560173370119,null,89.594771558155955,1.1285261130277497,0.311266592577081,0.21152994486677612,9.9498087710304869E-2,0.35569910652594339]
[null,null,null,null,null,null,72,12,1,2.16,2.16,1.2,0.550933280381255,1.3349310145523661,2.827465507276183,1.4925344927238171,0,2.1941065154487109,0.96282068022689682,0.1,1.1593296268710782,0.38536139030069438,1.4850340113448413E-4,1.4850340113448413E-4,1.0913464655240754,2.3820742156237841E-3,2.3820742156237841E-3,1.6285729270995444,0.17239623562730255,8.5498823529411763E-3,1.6759968E-2,0,0.20089232946594598,1.4703243255326039,8.6474144890116275E-2,6.7132800000000003E-3,9.3934734064053879E-2,2.4191999999999998E-2,4.1999999999999996E-4,3.9499199999999998E-2,2.9130660000000003E-2,1.9749599999999999E-2,3.9919199999999995E-2,1.4178253910972567,1.5229954297812467,1.5229954297812467,12.96,0.89484251119422953,4.9877581377167575,2.344116163473239,null,89.48425111942295,1.1593296268710782,0.31901906352999987,0.21685904946594597,0.10191809406405387,0.36366580291016848]
[null,null,null,null,null,null,73,12,1,2.19,2.19,1.2166666666666666,0.55163556040901418,1.3346748504333545,2.8573374252166772,1.5226625747833227,0,2.2236336058423851,0.9889092826063216,0.1,1.19071688170111,0.38528744208916038,1.484464130316081E-4,1.484464130316081E-4,1.105872189650436,2.4459065996844998E-3,2.4459065996844998E-3,1.6515409869334372,0.17729319604886967,8.6686307189542487E-3,1.6759968E-2,0,0.20608321269952354,1.4889455267102742,8.8678351260421437E-2,6.8065199999999999E-3,9.6270283542252255E-2,2.4527999999999998E-2,4.1999999999999996E-4,3.9499199999999998E-2,2.9130660000000003E-2,1.9749599999999999E-2,3.9919199999999995E-2,1.451563148634567,1.5624672496216694,1.5624672496216694,13.14,0.8937275476902099,5.1122489320890416,2.4003840414718018,null,89.372754769020986,1.19071688170111,0.32688149624177576,0.22227169269952354,0.10436452354225226,0.37175036792055938]
[null,null,null,null,null,null,74,12,1,2.2200000000000002,2.2200000000000002,1.2333333333333332,0.55233770101250745,1.3344133645399048,2.8872066822699525,1.5527933177300479,0,2.2531729299564556,1.0153576504577118,0.1,1.2226954188046455,0.38521195761367416,1.4838825228855911E-4,1.4838825228855911E-4,1.1203974952094269,2.5105810945431155E-3,2.5105810945431155E-3,1.674545177591924,0.18226660086676394,8.7873790849673193E-3,1.6759968E-2,0,0.21135811222232617,1.5075432665406956,9.0907468019687632E-2,6.8997600000000004E-3,9.8632136617774674E-2,2.4864000000000004E-2,4.1999999999999996E-4,3.9499199999999998E-2,2.9130660000000003E-2,1.9749599999999999E-2,3.9919199999999995E-2,1.4857620264291307,1.6026487883059737,1.6026487883059737,13.32,0.89260292786881923,5.2386721011135018,2.4572569022088175,null,89.260292786881919,1.2226954188046455,0.33485424884010084,0.22776835222232616,0.10683725661777467,0.37995336950132819]
[null,null,null,null,null,null,75,12,1,2.25,2.25,1.25,0.55303970223325061,1.3341465584566645,2.9170732792283323,1.5829267207716677,0,2.2827240130934534,1.0421657839906961,0.1,1.2552729760492694,0.38513493733168402,1.4832891995348018E-4,1.4832891995348018E-4,1.1349220563081719,2.5760961477895388E-3,2.5760961477895388E-3,1.6975851302009817,0.18731669282816646,8.9061274509803917E-3,1.6759968E-2,0,0.21671751055583185,1.5261171795356989,9.3161345826959882E-2,6.9930000000000001E-3,0.10102017396024641,2.52E-2,4.1999999999999996E-4,3.9499199999999998E-2,2.9130660000000003E-2,1.9749599999999999E-2,3.9919199999999995E-2,1.5204221180968025,1.643548360231005,1.643548360231005,13.5,0.89146874159644218,5.3670387427841328,2.5147320010856675,null,89.146874159644213,1.2552729760492694,0.34293768451607826,0.23334951055583186,0.10933617396024642,0.38827538418173568]
[null,null,null,null,null,null,76,12,1,2.2799999999999998,2.2799999999999998,1.2666666666666666,0.55374156411274311,1.3338744337676516,2.9469372168838257,1.6130627831161739,0,2.3122864046411395,1.0693336834176497,0.1,1.288457493012201,0.38505638170045664,1.4826841708824777E-4,1.4826841708824777E-4,1.1494455591006532,2.6424501866724264E-3,2.6424501866724264E-3,1.7206604929708391,0.19244371458459233,9.0248758169934641E-3,1.6759968E-2,0,0.22216189515308779,1.5446669171758671,9.5439835400703887E-2,7.0862399999999997E-3,0.10343427642989178,2.5536000000000003E-2,4.1999999999999996E-4,3.9499199999999998E-2,2.9130660000000003E-2,1.9749599999999999E-2,3.9919199999999995E-2,1.5555435172199392,1.6851744901831172,1.6851744901831172,13.68,0.89032506651585486,5.4973600685210187,2.572806597887511,null,89.032506651585493,1.288457493012201,0.3511321715829796,0.23901565515308779,0.11186115642989178,0.39671699717091613]
[null,null,null,null,null,null,77,12,1,2.31,2.31,1.2833333333333332,0.55444328669246801,1.3335969920562563,2.9767984960281284,1.6432015039718719,0,2.3418596765751056,1.0968613489536918,0.1,1.3222571162913959,0.38497629117707738,1.4820674476845785E-4,1.4820674476845785E-4,1.1639677010380582,2.7096416181196454E-3,2.7096416181196454E-3,1.7437709301393616,0.19764790869194113,9.1436241830065365E-3,1.6759968E-2,0,0.22769175846454315,1.5631921468486731,9.7742787518774549E-2,7.1794800000000002E-3,0.10587432507141627,2.5871999999999999E-2,4.1999999999999996E-4,3.9499199999999998E-2,2.9130660000000003E-2,1.9749599999999999E-2,3.9919199999999995E-2,1.5911263173474139,1.7275359187458323,1.7275359187458323,13.86,0.88917196869658732,5.6296474046844924,2.6314779566425743,null,88.917196869658738,1.3222571162913959,0.35943808353595941,0.24476727846454316,0.11441208507141627,0.40527880245443648]
[null,null,null,null,null,null,78,12,1,2.34,2.34,1.2999999999999998,0.55514487001389168,1.3333142349052391,3.0066571174526193,1.6733428825473804,0,2.3714434220709149,1.1247487808166823,0.1,1.3566802050060132,0.38489466621844992,1.4814390408341197E-4,1.4814390408341197E-4,1.1784881901739011,2.7776688287587136E-3,2.7776688287587136E-3,1.7669161209926749,0.20292951761054706,9.2623725490196072E-3,1.6759968E-2,0,0.23330759800482212,1.5816925508642981,0.1000700530183844,7.2727199999999999E-3,0.10834020110792249,2.6207999999999995E-2,4.1999999999999996E-4,3.9499199999999998E-2,2.9130660000000003E-2,1.9749599999999999E-2,3.9919199999999995E-2,1.6271706119946332,1.7706416078986384,1.7706416078986384,14.04,0.88800950323141425,5.763912194110909,2.6907433454822174,null,88.800950323141421,1.3566802050060132,0.36785579911274463,0.25060487800482212,0.11698884110792249,0.41396140289262529]
[null,null,null,null,null,null,79,12,1,2.37,2.37,1.3166666666666667,0.55584631411846419,1.3330261638967338,3.036513081948367,1.7034869180516332,0,2.4010372542166238,1.1529959792272209,0.1,1.391735336493708,0.38481150728129676,1.4807989613610352E-4,1.4807989613610352E-4,1.1930067445193302,2.8465301849372208E-3,2.8465301849372208E-3,1.7900957589565705,0.20828878370522949,9.3811209150326796E-3,1.6759968E-2,0,0.23900991642045502,1.6001678255426224,0.10242148279607217,7.3659600000000004E-3,0.11083178593485962,2.6544000000000005E-2,4.1999999999999996E-4,3.9499199999999998E-2,2.9130660000000003E-2,1.9749599999999999E-2,3.9919199999999995E-2,1.6636764946435549,1.8145007468144037,1.8145007468144037,14.22,0.88683771478354922,5.9001659976704657,2.7506000365017713,null,88.683771478354927,1.391735336493708,0.37638570235531466,0.25652895642045503,0.11959130593485963,0.4227654103206957]
[null,null,null,null,null,null,80,12,1,2.4,2.4,1.333333333333333,0.55654761904761907,1.3327327806122451,3.0663663903061225,1.7336336096938774,0,2.4306408048173642,1.1816029444086409,0.1,1.4274313122125304,0.38472681482215909,1.480147220432039E-4,1.480147220432039E-4,1.2075230914444719,2.9162240327432289E-3,2.9162240327432289E-3,1.8133095507528287,0.21372594924534269,9.4998692810457502E-3,1.6759968E-2,0,0.24479922155858433,1.6186176803654955,0.10479692780767109,7.4592E-3,0.11334896111400548,2.6879999999999998E-2,4.1999999999999996E-4,3.9499199999999998E-2,2.9130660000000003E-2,1.9749599999999999E-2,3.9919199999999995E-2,1.7006440587427003,1.8591227578632308,1.8591227578632308,14.399999999999999,0.88565663808866191,6.0384204958474399,2.8110453056221263,null,88.565663808866191,1.4274313122125304,0.38502818267258981,0.26254002155858436,0.12221936111400548,0.43169144565070039]
[null,null,null,null,null,null,81,12,1,2.4300000000000002,2.4300000000000002,1.35,0.55724878484277351,1.3324340866326505,3.0962170433163254,1.7637829566836749,0,2.4602537232844601,1.21056967658701,0.1,1.4637771638556147,0.38464058929739697,1.4794838293504881E-4,1.4794838293504881E-4,1.2220369671220392,2.9867486980256638E-3,2.9867486980256638E-3,1.8365572156151584,0.21924125640482672,9.6186176470588244E-3,1.6759968E-2,0,0.2506760265366646,1.6370418371889419,0.10719623906827785,7.5524400000000005E-3,0.11589160836748208,2.7216000000000001E-2,4.1999999999999996E-4,3.9499199999999998E-2,2.9130660000000003E-2,1.9749599999999999E-2,3.9919199999999995E-2,1.7380733977071732,1.9045173028309637,1.9045173028309637,14.580000000000002,0.88446629841542934,6.178687490343286,2.8720764324520882,null,88.446629841542929,1.4637771638556147,0.3937836349041467,0.26863858653666461,0.12487288836748209,0.44074013897534892]
[null,null,null,null,null,null,82,12,1,2.46,2.46,1.3666666666666665,0.5579498115453283,1.3321300835382013,3.1260650417691007,1.7939349582308992,0,2.4898756756022227,1.2398961759911251,0.1,1.5007821596871882,0.38455283116318961,1.4788087995562464E-4,1.4788087995562464E-4,1.23654811600978,3.0581024864146725E-3,3.0581024864146725E-3,1.859838484559911,0.22483494726225692,9.737366013071895E-3,1.6759968E-2,0,0.25664084981317264,1.6554400295104374,0.10961926765222073,7.6456800000000002E-3,0.1184596095718026,2.7552E-2,4.1999999999999996E-4,3.9499199999999998E-2,2.9130660000000003E-2,1.9749599999999999E-2,3.9919199999999995E-2,1.7759646049186746,1.9506942893609058,1.9506942893609058,14.76,0.8832667119879728,6.3209789057029706,2.9336907001514594,null,88.326671198797285,1.5007821596871882,0.40265245938497529,0.27482516981317262,0.12755176957180259,0.44991212967371763]
[null,null,null,null,null,null,83,12,1,2.4900000000000002,2.4900000000000002,1.3833333333333333,0.55865069919666765,1.3318207729085201,3.1559103864542601,1.8240896135457403,0,2.5195063433662068,1.2695824428525109,0.1,1.538455811108868,0.3844635408755348,1.4781221426255403E-4,1.4781221426255403E-4,1.251056290368658,3.1302836833419761E-3,3.1302836833419761E-3,1.8831530997072019,0.23050726380089478,9.8561143790849692E-3,1.6759968E-2,0,0.26269421525934933,1.6738120017868527,0.11206586469302846,7.7389200000000007E-3,0.12105284675195097,2.7888000000000003E-2,4.1999999999999996E-4,3.9499199999999998E-2,2.9130660000000003E-2,1.9749599999999999E-2,3.9919199999999995E-2,1.8143177737255187,1.9976638776277624,1.9976638776277624,14.940000000000001,0.88205788637319749,6.4653067909650339,2.9958853952948723,null,88.205788637319742,1.538455811108868,0.41163506201130029,0.28110029525934932,0.13025588675195096,0.45920806651889445]
[null,null,null,null,null,null,84,12,1,2.52,2.52,1.4,0.55935144783815949,1.3315061563226047,3.1857530781613024,1.8542469218386977,0,2.5491454228872632,1.2996284774054168,0.1,1.5768078794656157,0.38437271889024988,1.4774238702708307E-4,1.4774238702708307E-4,1.2655612498139297,3.2032905540611916E-3,3.2032905540611916E-3,1.9065008136484267,0.23625844790873735,9.9748627450980381E-3,1.6759968E-2,0,0.26883665223198794,1.6921575087990395,0.11453588138339886,7.8321599999999995E-3,0.12367120207549329,2.8224000000000006E-2,4.1999999999999996E-4,3.9499199999999998E-2,2.9130660000000003E-2,1.9749599999999999E-2,3.9919199999999995E-2,1.8531329974426507,2.0454364872531974,2.0454364872531974,15.120000000000001,0.88083982083577606,6.6116833213357227,3.0586578077363455,null,88.08398208357761,1.5768078794656157,0.42073185430748128,0.28746449223198794,0.13298512207549329,0.46862860778758164]
[null,null,null,null,null,null,85,12,1,2.5499999999999998,2.5499999999999998,1.4166666666666665,0.56005205751115517,1.3311862353588249,3.2155931176794121,1.8844068823205875,0,2.5787926243562249,1.3300342798868132,0.1,1.6158483831011867,0.38428036566297102,1.476713994340667E-4,1.476713994340667E-4,1.2800627608965411,3.2771213436681513E-3,3.2771213436681513E-3,1.9298813888565503,0.24208874137856767,1.009361111111111E-2,1.6759968E-2,0,0.27506869564729336,1.7104763150593985,0.11702916897516713,7.9253999999999991E-3,0.12631455784671972,2.8559999999999995E-2,4.1999999999999996E-4,3.9499199999999998E-2,2.9130660000000003E-2,1.9749599999999999E-2,3.9919199999999995E-2,1.8924103693516592,2.094022804472893,2.094022804472893,15.299999999999999,0.8796125066632422,6.7601207998877477,3.1220052304745538,null,87.961250666324219,1.6158483831011867,0.42994325349401302,0.29391829564729338,0.13573935784671973,0.47817442137170629]
[null,null,null,null,null,null,86,12,1,2.58,2.58,1.4333333333333333,0.56075252825698996,1.3308610115949269,3.2454305057974633,1.9145694942025366,0,2.6084476710645275,1.3607998505363916,0.1,1.6555876046733784,0.38418648164915437,1.4759925268195603E-4,1.4759925268195603E-4,1.294560596712488,3.3517742771211863E-3,3.3517742771211863E-3,1.9532945971358435,0.24799838590800502,1.0212359477124183E-2,1.6759968E-2,0,0.28139088605582752,1.7287681942591029,0.11954557877927517,8.0186400000000005E-3,0.12898279650081909,2.8895999999999998E-2,4.1999999999999996E-4,3.9499199999999998E-2,2.9130660000000003E-2,1.9749599999999999E-2,3.9919199999999995E-2,1.932149982700796,2.1434337895654396,2.1434337895654396,15.48,0.87837592746343607,6.9106316592840322,3.185924959518839,null,87.837592746343603,1.6555876046733784,0.43926968255664661,0.3004622460558275,0.13851847650081908,0.48784618489206122]
[null,null,null,null,null,null,87,12,1,2.61,2.61,1.45,0.56145286011698226,1.3305304866080285,3.2752652433040144,1.9447347566959856,0,2.6381102986764562,1.3919251895965563,0.1,1.696036098739869,0.38409106730407455,1.4752594798278311E-4,1.4752594798278311E-4,1.3090545365379926,3.4272475592613976E-3,3.4272475592613976E-3,1.9767402191080385,0.25398762309955425,1.0331107843137255E-2,1.6759968E-2,0,0.28780376971856314,1.7470329287519124,0.1220849621657394,8.1118800000000001E-3,0.13167580059808215,2.9231999999999998E-2,4.1999999999999996E-4,3.9499199999999998E-2,2.9130660000000003E-2,1.9749599999999999E-2,3.9919199999999995E-2,1.9723519307049868,2.1936806845538928,2.1936806845538928,15.66,0.87713005943632927,7.0632284635269524,3.2504142937558895,null,87.713005943632922,1.696036098739869,0.44871157031664527,0.30709688971856314,0.14132236059808215,0.49764458581402371]
[null,null,null,null,null,null,88,12,1,2.64,2.64,1.4666666666666666,0.56215305313243458,1.3301946619746234,3.3050973309873117,1.9749026690126885,0,2.6677802545491165,1.4234102973124299,0.1,1.7372046996260033,0.38399412308282604,1.4745148656214859E-4,1.4745148656214859E-4,1.3235443654885393,3.5035393748329203E-3,3.5035393748329203E-3,2.0002180437321435,0.26005669446065682,1.0449856209150326E-2,1.6759968E-2,0,0.29430789868406765,1.765270309071816,0.12464717056362019,8.2051199999999998E-3,0.13439345281813736,2.9568000000000001E-2,4.1999999999999996E-4,3.9499199999999998E-2,2.9130660000000003E-2,1.9749599999999999E-2,3.9919199999999995E-2,2.0130163065458571,2.2447750211913902,2.2447750211913902,15.84,0.87587487162206845,7.2179239097335559,3.3154705348171594,null,87.587487162206841,1.7372046996260033,0.45826935150220499,0.31382277868406766,0.14415089281813737,0.50757032156538684]
[null,null,null,null,null,null,89,12,1,2.67,2.67,1.4833333333333332,0.56285310734463279,1.3298535392705815,3.3349267696352909,2.005073230364709,0,2.6974572970965096,1.4552551739318416,0.1,1.7791045295863663,0.38389564944032339,1.4737586965920768E-4,1.4737586965920768E-4,1.3380298741999646,3.5806478885031462E-3,3.5806478885031462E-3,2.0237278678553734,0.2662058414037396,1.0568604575163398E-2,1.6759968E-2,0,0.30090383086683431,1.7834801334819383,0.12723205546099009,8.2983599999999994E-3,0.13713563595421535,2.9904000000000003E-2,4.1999999999999996E-4,3.9499199999999998E-2,2.9130660000000003E-2,1.9749599999999999E-2,3.9919199999999995E-2,2.0541432033717348,2.2967286292427058,2.2967286292427058,16.02,0.87461032612690615,7.3747308299371896,3.3810909869469534,null,87.461032612690616,1.7791045295863663,0.46794346682104965,0.32064047086683434,0.14700395595421537,0.51762409965633949]
[null,null,null,null,null,null,90,12,1,2.7,2.7,1.5000000000000002,0.56355302279484631,1.3295071200711452,3.3647535600355729,2.0352464399644274,0,2.727141195194458,1.4874598197053315,0.1,1.8217470072726667,0.38379564683129991,1.4729909852665587E-4,1.4729909852665587E-4,1.3525108585299694,3.6585712448829501E-3,3.6585712448829501E-3,2.0472694957928921,0.27243530524626536,1.0687352941176472E-2,1.6759968E-2,0,0.30759213012678632,1.801662207552396,0.12983946840490293,8.3916000000000008E-3,0.13990223290744419,3.0240000000000003E-2,4.1999999999999996E-4,3.9499199999999998E-2,2.9130660000000003E-2,1.9749599999999999E-2,3.9919199999999995E-2,2.095732714297676,2.3495536450743093,2.3495536450743093,16.200000000000003,0.87333637832853117,7.5336621929160854,3.4472729568712164,null,87.333637832853114,1.8217470072726667,0.4777343630342305,0.32755053012678631,0.14988143290744418,0.52780663780164261]
[null,null,null,null,null,null,91,12,1,2.73,2.73,1.5166666666666664,0.56425279952432861,1.3291554059509361,3.394577702975468,2.065422297024532,0,2.7568317276233447,1.5200242348861432,0.1,1.865143856520971,0.38369411571030965,1.4722117443071651E-4,1.4722117443071651E-4,1.3669871192785397,3.7373075685468811E-3,3.7373075685468811E-3,2.070842738934239,0.27874532721078293,1.0806101307189541E-2,1.6759968E-2,0,0.3143733663499737,1.819816343764957,0.13246926100136225,8.4848400000000004E-3,0.1426931266811737,3.0575999999999999E-2,4.1999999999999996E-4,3.9499199999999998E-2,2.9130660000000003E-2,1.9749599999999999E-2,3.9919199999999995E-2,2.1377849324054776,2.4032625205660043,2.4032625205660043,16.38,0.87205297706217721,7.694731106049395,3.5140137536669953,null,87.205297706217721,1.865143856520971,0.48764249303114743,0.33455352634997371,0.15278320668117371,0.53811866404503328]
[null,null,null,null,null,null,92,12,1,2.76,2.76,1.5333333333333332,0.56495243757431624,1.3287983984839475,3.4243991992419733,2.0956008007580262,0,2.7865286825459243,1.552948419730225,0.1,1.9093071154720644,0.38359105653172537,1.4714209865112531E-4,1.4714209865112531E-4,1.3814584619259005,3.8168549640533495E-3,3.8168549640533495E-3,2.0944474153744861,0.28513614842497625,1.0924849673202612E-2,1.6759968E-2,0,0.32124811553048416,1.8379423611425521,0.13512128491529038,8.5780800000000001E-3,0.14550820037532958,3.0911999999999995E-2,4.1999999999999996E-4,3.9499199999999998E-2,2.9130660000000003E-2,1.9749599999999999E-2,3.9919199999999995E-2,2.1802999507436942,2.4578680323579691,2.4578680323579691,16.559999999999999,0.87076006478875412,7.8579508172011359,3.5813106886325805,null,87.076006478875414,1.9093071154720644,0.49766831590581373,0.34165003553048418,0.15570916037532959,0.54856091688590469]
[null,null,null,null,null,null,93,12,1,2.79,2.79,1.55,0.56565193698603,1.3284360992435531,3.4542180496217765,2.1257819503782236,0,2.816231857017657,1.5862323744962241,0.1,1.9542491460393445,0.38348646974974093,1.4706187248111896E-4,1.4706187248111896E-4,1.3959246963867329,3.8972115159647846E-3,3.8972115159647846E-3,2.1180833495683533,0.29160800992171521,1.1043598039215688E-2,1.6759968E-2,0,0.32821695985359339,1.856040084901839,0.13779539187049702,8.6713199999999997E-3,0.14834733718079612,3.1247999999999998E-2,4.1999999999999996E-4,3.9499199999999998E-2,2.9130660000000003E-2,1.9749599999999999E-2,3.9919199999999995E-2,2.2232778623276519,2.513383291447651,2.513383291447651,16.740000000000002,0.86945757774613586,8.0233347166326467,3.6491610751583106,null,86.945757774613583,1.9542491460393445,0.50781229703438946,0.34884063985359337,0.15865917718079611,0.55913414540830653]
[null,null,null,null,null,null,94,12,1,2.82,2.82,1.5666666666666664,0.56635129780067373,1.3280685098024998,3.4840342549012497,2.1559657450987499,0,2.8459410565272463,1.6198760994454837,0.1,1.9999826437394146,0.38338035581836921,1.4698049722741937E-4,1.4698049722741937E-4,1.4103856367794898,3.9783752888677736E-3,3.9783752888677736E-3,2.1417503720056206,0.29816115263910392,1.1162346405228757E-2,1.6759968E-2,0,0.33528048778017494,1.8741093461271687,0.14049143364964817,8.7645599999999994E-3,0.15121042037382801,3.1584000000000001E-2,4.1999999999999996E-4,3.9499199999999998E-2,2.9130660000000003E-2,1.9749599999999999E-2,3.9919199999999995E-2,2.2667187601394643,2.5698217531517167,2.5698217531517167,16.919999999999998,0.86814544608463906,8.1908963389440235,3.7175622285980441,null,86.814544608463905,1.9999826437394146,0.51807490815400303,0.35612592778017493,0.161633140373828,0.56983910941230209]
[null,null,null,null,null,null,95,12,1,2.85,2.85,1.5833333333333333,0.56705052005943535,1.3276956317329123,3.5138478158664563,2.1861521841335438,0,2.8756560945652421,1.6538795948420439,0.1,2.0465206479013114,0.38327271519144357,1.4689797421022142E-4,1.4689797421022142E-4,1.4248411012097446,4.0603443273931946E-3,4.0603443273931946E-3,2.165448318906352,0.30479581742053252,1.1281094771241831E-2,1.6759968E-2,0,0.34243929413239788,1.8921499814644382,0.14320926209423496,8.8578000000000007E-3,0.15409733331049075,3.1920000000000004E-2,4.1999999999999996E-4,3.9499199999999998E-2,2.9130660000000003E-2,1.9749599999999999E-2,3.9919199999999995E-2,2.3106227371280532,2.6271972274490443,2.6271972274490443,17.100000000000001,0.86682359398762032,8.3606493650451519,3.7865114661412873,null,86.682359398762031,2.0465206479013114,0.52845662744288857,0.36350649413239788,0.16463093331049075,0.58067657954773289]
[null,null,null,null,null,null,96,12,1,2.88,2.88,{"$f":"Vout*K105/(Vin*Efficiency)","v":1.6},0.5677496038034866,{"$f":"(Vin-(Rdson1+Rdcr)*K105-Vout)*M105/(Fsw*Lf)","v":1.3273174666062943},3.5436587333031468,2.2163412666968529,{"$f":"IF(MIN(Vin, -P105/(Coss_Q1+Coss_Q2)*0.00000002)<0, 0, MIN(Vin, -P105/(Coss_Q1+Coss_Q2)*0.00000002))","v":0},2.9053767922187266,{"$f":"R105^2*Rdcr","v":1.6882428609526354},0.1,{"$f":"(T105+S105*(1+Ltc*(Ta-25)))/(1-S105*Ltc*ThetaCa)","v":2.0938765522710847},0.38316354832261812,1.4681430476317931E-4,1.4681430476317931E-4,1.4392909115665806,4.1431166562363167E-3,4.1431166562363167E-3,2.1891770319345158,{"$f":"Rdson1*AB105^2","v":0.31151224501472508},1.1399843137254902E-2,1.6759968E-2,0,{"$f":"(AF105+AE105+AD105+AC105*(1+RdsonTopTc*Ta-RdsonTopTc*25))/(1-AC105*RdsonTopTc*ThetaJA_Q1)","v":0.3496939801807295},1.9101618328334278,{"$f":"Rdson2*AH105^2","v":0.1459487291045424},8.9510400000000004E-3,{"$f":"(AJ105+AI105*(1+RdsonBotTc*Ta-RdsonBotTc*25))/(1-AI105*RdsonBotTc*ThetaJA_Q2)","v":0.15700795942112902},3.2256E-2,4.1999999999999996E-4,3.9499199999999998E-2,2.9130660000000003E-2,1.9749599999999999E-2,3.9919199999999995E-2,2.3549898862091578,2.6855238897215203,2.6855238897215203,17.28,0.86549193977804617,8.5326076241567783,3.8560061066859679,null,86.54919397780462,2.0938765522710847,0.53895793960185845,0.37098294018072953,0.16765243942112903,0.59164733745043563]
[null,null,null,null,null,null,97,12,1,2.91,2.91,1.6166666666666667,0.56844854907398235,1.3269340159935235,3.5734670079967619,2.2465329920032384,0,2.9351029777902844,1.7229658980466791,0.1,2.1420641160293541,0.38305285566536601,1.4672949023339171E-4,1.4672949023339171E-4,1.4537348933311207,4.2266902801768903E-3,4.2266902801768903E-3,2.2129363579287427,0.31831067607579039,1.1518591503267974E-2,1.6759968E-2,0,0.35704515373227602,1.9281447471573461,0.14870968663961864,9.04428E-3,0.1599421822048637,3.2592000000000003E-2,4.1999999999999996E-4,3.9499199999999998E-2,2.9130660000000003E-2,1.9749599999999999E-2,3.9919199999999995E-2,2.3998203002653562,2.7448162919103147,2.7448162919103147,17.46,0.86415039601180166,8.7067850958423474,3.926043470711865,null,86.415039601180169,2.1420641160293541,0.5495793359371397,0.378555873732276,0.17069754220486369,0.60275217588096064]
[null,null,null,null,null,null,98,12,1,2.94,2.94,1.6333333333333333,0.56914735591206178,1.3265452814648588,3.6032726407324294,2.2767273592675705,0,2.9648344864395701,1.758048706396278,0.1,2.1910974752403267,0.38294063767298209,1.4664353198139016E-4,1.4664353198139016E-4,1.4681728753963557,4.3110631840992059E-3,4.3110631840992059E-3,2.2367261486490273,0.32519135116327019,1.1637339869281045E-2,1.6759968E-2,0,0.36449342922047862,1.9460985761083835,0.15149198671724312,9.1375199999999997E-3,0.16289988522411544,3.2927999999999999E-2,4.1999999999999996E-4,3.9499199999999998E-2,2.9130660000000003E-2,1.9749599999999999E-2,3.9919199999999995E-2,2.4451140721460725,2.8050893741061529,2.8050893741061529,17.64,0.86279886955843699,8.8831959120710078,3.996620880154655,null,86.279886955843693,2.1910974752403267,0.56032131444459399,0.38622590922047861,0.17376612522411544,0.61399189886582617]
[null,null,null,null,null,null,99,12,1,2.97,2.97,1.65,0.56984602435884746,1.3261512645899347,3.6330756322949673,2.3069243677050331,0,2.9945711598459512,1.7934912862762251,0.1,2.2409911547517831,0.38282689479858073,1.4655643138112358E-4,1.4655643138112358E-4,1.4826046898975076,4.3962333330121693E-3,4.3962333330121693E-3,2.2605462605383044,0.33215451074219127,1.1756088235294117E-2,1.6759968E-2,0,0.37203942779619892,1.9640231758682007,0.15429548141389654,9.230760000000001E-3,0.16588095209915776,3.3263999999999995E-2,4.1999999999999996E-4,3.9499199999999998E-2,2.9130660000000003E-2,1.9749599999999999E-2,3.9919199999999995E-2,2.4908712946676075,2.8663584765931716,2.8663584765931716,17.82,0.86143726166998003,9.0618543593125747,4.067735658280629,null,86.143726166998007,2.2409911547517831,0.57118437989535664,0.39399366779619893,0.17685807209915777,0.62536732184138843]
[null,null,null,null,null,null,100,12,1,3,3,1.6666666666666665,0.57054455445544561,1.3257519669377655,3.6628759834688829,2.3371240165311171,0,3.0243128458907731,1.8292936379639895,0.1,2.2917600805664726,0.38271162749509741,1.4646818981994619E-4,1.4646818981994619E-4,1.4970301720522043,4.4821986720693053E-3,4.4821986720693053E-3,2.2843965544978673,0.33920039518311229,1.187483660130719E-2,1.6759968E-2,0,0.37968377742021026,1.9819184069023175,0.15712002286472879,9.3240000000000007E-3,0.16888526650269536,3.3599999999999998E-2,4.1999999999999996E-4,3.9499199999999998E-2,2.9130660000000003E-2,1.9749599999999999E-2,3.9919199999999995E-2,2.5370920606131375,2.9286393523668082,2.9286393523668082,18,0.86006546803838879,9.242774880664836,4.139385129561993,null,86.006546803838873,2.2917600805664726,0.58216904392290558,0.40185977742021028,0.17997326650269535,0.63687927180033554]

{"sheet":"Efficiency Plot Management","index":9,"n_rows":3,"n_cols":1,"rows_kept":3,"cut":false,"hidden":true,"merged":[]}
[]
[{"$f":"\"EFF_Ch1\"","v":"EFF_Ch1"}]
[{"$f":"\"EFF_Ch2\"","v":"EFF_Ch2"}]

{"sheet":"Standard Value Calculator","index":10,"n_rows":159,"n_cols":16,"rows_kept":159,"cut":false,"hidden":true,"merged":[]}
[]
["Capacitors","Css","Cc1ea","Cc2ea","Cout","Cin","Cres","Cdither","Cc3ea","Cc4ea"]
["Inputs",{"$f":"Css","v":{"$error":"#NAME?"}},{"$f":"Cc1ea","v":{"$error":"#REF!"}},{"$f":"Cc2ea","v":{"$error":"#REF!"}},{"$f":"Cout","v":3.5200000000000002E-5},{"$f":"Cin","v":2.0000000000000002E-5},{"$f":"Cres","v":{"$error":"#NAME?"}},{"$f":"Cdither_init","v":{"$error":"#NAME?"}},{"$f":"Cc3ea","v":{"$error":"#NAME?"}},{"$f":"Cc4ea","v":{"$error":"#NAME?"}},null,null,"Resistors","inputs","Standard Result"]
["Standard Result",{"$f":"SUM(B6:B158)/1000000000000","v":{"$error":"#NAME?"}},{"$f":"IF(C3=\"OPEN\",\"OPEN\",SUM(C6:C158)/1000000000000)","v":{"$error":"#REF!"}},{"$f":"SUM(D6:D158)/1000000000000","v":{"$error":"#REF!"}},{"$f":"SUM(E6:E158)/1000000000000","v":3.3000000000000003E-5},{"$f":"SUM(F6:F158)/1000000000000","v":2.1999999999999999E-5},{"$f":"SUM(G6:G158)/1000000000000","v":{"$error":"#NAME?"}},{"$f":"IF(H3=\"OPEN\",\"OPEN\",SUM(H6:H158)/1000000000000)","v":{"$error":"#NAME?"}},{"$error":"#NAME?"},{"$error":"#NAME?"},null,null,"Rt",{"$f":"Rfadj","v":86.6},{"$f":"IF(N4>(INT(0.5+100*POWER(10,IF(96*(LOG(N4)-INT(LOG(N4)))-ROUND(96*(LOG(N4)-INT(LOG(N4))),0)<0,ROUND(96*(LOG(N4)-INT(LOG(N4))),0)-1,ROUND(96*(LOG(N4)-INT(LOG(N4))),0))/96))*POWER(10,INT(LOG(N4))-2)+INT(0.5+100*POWER(10,(IF(96*(LOG(N4)-INT(LOG(N4)))-ROUND(96*(LOG(N4)-INT(LOG(N4))),0)<0,ROUND(96*(LOG(N4)-INT(LOG(N4))),0)-1,ROUND(96*(LOG(N4)-INT(LOG(N4))),0))+1)/96))*POWER(10,INT(LOG(N4))-2))/2,INT(0.5+100*POWER(10,(IF(96*(LOG(N4)-INT(LOG(N4)))-ROUND(96*(LOG(N4)-INT(LOG(N4))),0)<0,ROUND(96*(LOG(N4)-INT(LOG(N4))),0)-1,ROUND(96*(LOG(N4)-INT(LOG(N4))),0))+1)/96))*POWER(10,INT(LOG(N4))-2),INT(0.5+100*POWER(10,IF(96*(LOG(N4)-INT(LOG(N4)))-ROUND(96*(LOG(N4)-INT(LOG(N4))),0)<0,ROUND(96*(LOG(N4)-INT(LOG(N4))),0)-1,ROUND(96*(LOG(N4)-INT(LOG(N4))),0))/96))*POWER(10,INT(LOG(N4))-2))","v":86.600000000000009},"Ω"]
["(pF)"]
[0.47,{"$f":"IF(IF((B$3*10^12-$A7)*(B$3*10^12-$A6)*-1<0,0,1)*IF(ABS(B$3*10^12-$A7)>(B$3*10^12-$A6),$A6,$A7)=B7,0,IF((B$3*10^12-$A7)*(B$3*10^12-$A6)*-1<0,0,1)*IF(ABS(B$3*10^12-$A7)>(B$3*10^12-$A6),$A6,$A7))","v":{"$error":"#NAME?"}},{"$error":"#REF!"},{"$error":"#REF!"},0,0,{"$error":"#NAME?"},{"$error":"#NAME?"},{"$error":"#NAME?"},{"$error":"#NAME?"}]
[0.56000000000000005,{"$f":"IF(IF((B$3*10^12-$A8)*(B$3*10^12-$A7)*-1<0,0,1)*IF(ABS(B$3*10^12-$A8)>(B$3*10^12-$A7),$A7,$A8)=B8,0,IF((B$3*10^12-$A8)*(B$3*10^12-$A7)*-1<0,0,1)*IF(ABS(B$3*10^12-$A8)>(B$3*10^12-$A7),$A7,$A8))","v":{"$error":"#NAME?"}},{"$f":"IF(IF((C$3*10^12-$A8)*(C$3*10^12-$A7)*-1<0,0,1)*IF(ABS(C$3*10^12-$A8)>(C$3*10^12-$A7),$A7,$A8)=C8,0,IF((C$3*10^12-$A8)*(C$3*10^12-$A7)*-1<0,0,1)*IF(ABS(C$3*10^12-$A8)>(C$3*10^12-$A7),$A7,$A8))","v":{"$error":"#REF!"}},{"$f":"IF(IF((D$3*10^12-$A8)*(D$3*10^12-$A7)*-1<0,0,1)*IF(ABS(D$3*10^12-$A8)>(D$3*10^12-$A7),$A7,$A8)=D8,0,IF((D$3*10^12-$A8)*(D$3*10^12-$A7)*-1<0,0,1)*IF(ABS(D$3*10^12-$A8)>(D$3*10^12-$A7),$A7,$A8))","v":{"$error":"#REF!"}},{"$f":"IF(IF((E$3*10^12-$A8)*(E$3*10^12-$A7)*-1<0,0,1)*IF(ABS(E$3*10^12-$A8)>(E$3*10^12-$A7),$A7,$A8)=E8,0,IF((E$3*10^12-$A8)*(E$3*10^12-$A7)*-1<0,0,1)*IF(ABS(E$3*10^12-$A8)>(E$3*10^12-$A7),$A7,$A8))","v":0},{"$f":"IF(IF((F$3*10^12-$A8)*(F$3*10^12-$A7)*-1<0,0,1)*IF(ABS(F$3*10^12-$A8)>(F$3*10^12-$A7),$A7,$A8)=F8,0,IF((F$3*10^12-$A8)*(F$3*10^12-$A7)*-1<0,0,1)*IF(ABS(F$3*10^12-$A8)>(F$3*10^12-$A7),$A7,$A8))","v":0},{"$f":"IF(IF((G$3*10^12-$A8)*(G$3*10^12-$A7)*-1<0,0,1)*IF(ABS(G$3*10^12-$A8)>(G$3*10^12-$A7),$A7,$A8)=G8,0,IF((G$3*10^12-$A8)*(G$3*10^12-$A7)*-1<0,0,1)*IF(ABS(G$3*10^12-$A8)>(G$3*10^12-$A7),$A7,$A8))","v":{"$error":"#NAME?"}},{"$error":"#NAME?"},{"$error":"#NAME?"},{"$error":"#NAME?"},null,null,"Renb",{"$f":"Renb","v":98804.202056325434},100000,"Ω"]
[0.68,{"$error":"#NAME?"},{"$error":"#REF!"},{"$error":"#REF!"},0,0,{"$error":"#NAME?"},{"$error":"#NAME?"},{"$error":"#NAME?"},{"$error":"#NAME?"},null,null,"Rc1ea",{"$f":"Rcea2","v":{"$error":"#REF!"}},{"$f":"IF(N8>(INT(0.5+100*POWER(10,IF(96*(LOG(N8)-INT(LOG(N8)))-ROUND(96*(LOG(N8)-INT(LOG(N8))),0)<0,ROUND(96*(LOG(N8)-INT(LOG(N8))),0)-1,ROUND(96*(LOG(N8)-INT(LOG(N8))),0))/96))*POWER(10,INT(LOG(N8))-2)+INT(0.5+100*POWER(10,(IF(96*(LOG(N8)-INT(LOG(N8)))-ROUND(96*(LOG(N8)-INT(LOG(N8))),0)<0,ROUND(96*(LOG(N8)-INT(LOG(N8))),0)-1,ROUND(96*(LOG(N8)-INT(LOG(N8))),0))+1)/96))*POWER(10,INT(LOG(N8))-2))/2,INT(0.5+100*POWER(10,(IF(96*(LOG(N8)-INT(LOG(N8)))-ROUND(96*(LOG(N8)-INT(LOG(N8))),0)<0,ROUND(96*(LOG(N8)-INT(LOG(N8))),0)-1,ROUND(96*(LOG(N8)-INT(LOG(N8))),0))+1)/96))*POWER(10,INT(LOG(N8))-2),INT(0.5+100*POWER(10,IF(96*(LOG(N8)-INT(LOG(N8)))-ROUND(96*(LOG(N8)-INT(LOG(N8))),0)<0,ROUND(96*(LOG(N8)-INT(LOG(N8))),0)-1,ROUND(96*(LOG(N8)-INT(LOG(N8))),0))/96))*POWER(10,INT(LOG(N8))-2))","v":{"$error":"#REF!"}},"Ω"]
[0.82,{"$error":"#NAME?"},{"$error":"#REF!"},{"$error":"#REF!"},0,0,{"$error":"#NAME?"},{"$error":"#NAME?"},{"$error":"#NAME?"},{"$error":"#NAME?"}]
[1,{"$error":"#NAME?"},{"$error":"#REF!"},{"$error":"#REF!"},0,0,{"$error":"#NAME?"},{"$error":"#NAME?"},{"$error":"#NAME?"},{"$error":"#NAME?"},null,null,"Rfb1",{"$f":"Rfb1_","v":100000},{"$f":"IF(N10>(INT(0.5+100*POWER(10,IF(96*(LOG(N10)-INT(LOG(N10)))-ROUND(96*(LOG(N10)-INT(LOG(N10))),0)<0,ROUND(96*(LOG(N10)-INT(LOG(N10))),0)-1,ROUND(96*(LOG(N10)-INT(LOG(N10))),0))/96))*POWER(10,INT(LOG(N10))-2)+INT(0.5+100*POWER(10,(IF(96*(LOG(N10)-INT(LOG(N10)))-ROUND(96*(LOG(N10)-INT(LOG(N10))),0)<0,ROUND(96*(LOG(N10)-INT(LOG(N10))),0)-1,ROUND(96*(LOG(N10)-INT(LOG(N10))),0))+1)/96))*POWER(10,INT(LOG(N10))-2))/2,INT(0.5+100*POWER(10,(IF(96*(LOG(N10)-INT(LOG(N10)))-ROUND(96*(LOG(N10)-INT(LOG(N10))),0)<0,ROUND(96*(LOG(N10)-INT(LOG(N10))),0)-1,ROUND(96*(LOG(N10)-INT(LOG(N10))),0))+1)/96))*POWER(10,INT(LOG(N10))-2),INT(0.5+100*POWER(10,IF(96*(LOG(N10)-INT(LOG(N10)))-ROUND(96*(LOG(N10)-INT(LOG(N10))),0)<0,ROUND(96*(LOG(N10)-INT(LOG(N10))),0)-1,ROUND(96*(LOG(N10)-INT(LOG(N10))),0))/96))*POWER(10,INT(LOG(N10))-2))","v":100000},"Ω"]
[1.2,{"$error":"#NAME?"},{"$error":"#REF!"},{"$error":"#REF!"},0,0,{"$error":"#NAME?"},{"$error":"#NAME?"},{"$error":"#NAME?"},{"$error":"#NAME?"},null,null,"Rfb2",{"$f":"Rfb2_","v":20000},{"$f":"IF(N11=\"OPEN\",\"OPEN\",IF(N11>(INT(0.5+100*POWER(10,IF(96*(LOG(N11)-INT(LOG(N11)))-ROUND(96*(LOG(N11)-INT(LOG(N11))),0)<0,ROUND(96*(LOG(N11)-INT(LOG(N11))),0)-1,ROUND(96*(LOG(N11)-INT(LOG(N11))),0))/96))*POWER(10,INT(LOG(N11))-2)+INT(0.5+100*POWER(10,(IF(96*(LOG(N11)-INT(LOG(N11)))-ROUND(96*(LOG(N11)-INT(LOG(N11))),0)<0,ROUND(96*(LOG(N11)-INT(LOG(N11))),0)-1,ROUND(96*(LOG(N11)-INT(LOG(N11))),0))+1)/96))*POWER(10,INT(LOG(N11))-2))/2,INT(0.5+100*POWER(10,(IF(96*(LOG(N11)-INT(LOG(N11)))-ROUND(96*(LOG(N11)-INT(LOG(N11))),0)<0,ROUND(96*(LOG(N11)-INT(LOG(N11))),0)-1,ROUND(96*(LOG(N11)-INT(LOG(N11))),0))+1)/96))*POWER(10,INT(LOG(N11))-2),INT(0.5+100*POWER(10,IF(96*(LOG(N11)-INT(LOG(N11)))-ROUND(96*(LOG(N11)-INT(LOG(N11))),0)<0,ROUND(96*(LOG(N11)-INT(LOG(N11))),0)-1,ROUND(96*(LOG(N11)-INT(LOG(N11))),0))/96))*POWER(10,INT(LOG(N11))-2)))","v":20000},"Ω"]
[1.5,{"$error":"#NAME?"},{"$error":"#REF!"},{"$error":"#REF!"},0,0,{"$error":"#NAME?"},{"$error":"#NAME?"},{"$error":"#NAME?"},{"$error":"#NAME?"},null,null,"Rt1",{"$f":"'Variable Management'!B38*1000","v":87433.628318584073},{"$f":"IF(N12>(INT(0.5+100*POWER(10,IF(96*(LOG(N12)-INT(LOG(N12)))-ROUND(96*(LOG(N12)-INT(LOG(N12))),0)<0,ROUND(96*(LOG(N12)-INT(LOG(N12))),0)-1,ROUND(96*(LOG(N12)-INT(LOG(N12))),0))/96))*POWER(10,INT(LOG(N12))-2)+INT(0.5+100*POWER(10,(IF(96*(LOG(N12)-INT(LOG(N12)))-ROUND(96*(LOG(N12)-INT(LOG(N12))),0)<0,ROUND(96*(LOG(N12)-INT(LOG(N12))),0)-1,ROUND(96*(LOG(N12)-INT(LOG(N12))),0))+1)/96))*POWER(10,INT(LOG(N12))-2))/2,INT(0.5+100*POWER(10,(IF(96*(LOG(N12)-INT(LOG(N12)))-ROUND(96*(LOG(N12)-INT(LOG(N12))),0)<0,ROUND(96*(LOG(N12)-INT(LOG(N12))),0)-1,ROUND(96*(LOG(N12)-INT(LOG(N12))),0))+1)/96))*POWER(10,INT(LOG(N12))-2),INT(0.5+100*POWER(10,IF(96*(LOG(N12)-INT(LOG(N12)))-ROUND(96*(LOG(N12)-INT(LOG(N12))),0)<0,ROUND(96*(LOG(N12)-INT(LOG(N12))),0)-1,ROUND(96*(LOG(N12)-INT(LOG(N12))),0))/96))*POWER(10,INT(LOG(N12))-2))","v":86600},"Ω"]
[1.8,{"$error":"#NAME?"},{"$error":"#REF!"},{"$error":"#REF!"},0,0,{"$error":"#NAME?"},{"$error":"#NAME?"},{"$error":"#NAME?"},{"$error":"#NAME?"},null,null,"Rt2",{"$f":"'Variable Management'!#REF!*1000","v":{"$error":"#REF!"}},{"$f":"IF(N13=\"OPEN\",\"OPEN\",IF(N13>(INT(0.5+100*POWER(10,IF(96*(LOG(N13)-INT(LOG(N13)))-ROUND(96*(LOG(N13)-INT(LOG(N13))),0)<0,ROUND(96*(LOG(N13)-INT(LOG(N13))),0)-1,ROUND(96*(LOG(N13)-INT(LOG(N13))),0))/96))*POWER(10,INT(LOG(N13))-2)+INT(0.5+100*POWER(10,(IF(96*(LOG(N13)-INT(LOG(N13)))-ROUND(96*(LOG(N13)-INT(LOG(N13))),0)<0,ROUND(96*(LOG(N13)-INT(LOG(N13))),0)-1,ROUND(96*(LOG(N13)-INT(LOG(N13))),0))+1)/96))*POWER(10,INT(LOG(N13))-2))/2,INT(0.5+100*POWER(10,(IF(96*(LOG(N13)-INT(LOG(N13)))-ROUND(96*(LOG(N13)-INT(LOG(N13))),0)<0,ROUND(96*(LOG(N13)-INT(LOG(N13))),0)-1,ROUND(96*(LOG(N13)-INT(LOG(N13))),0))+1)/96))*POWER(10,INT(LOG(N13))-2),INT(0.5+100*POWER(10,IF(96*(LOG(N13)-INT(LOG(N13)))-ROUND(96*(LOG(N13)-INT(LOG(N13))),0)<0,ROUND(96*(LOG(N13)-INT(LOG(N13))),0)-1,ROUND(96*(LOG(N13)-INT(LOG(N13))),0))/96))*POWER(10,INT(LOG(N13))-2)))","v":{"$error":"#REF!"}},"Ω"]
[2.2000000000000002,{"$f":"IF(IF((B$3*10^12-$A15)*(B$3*10^12-$A14)*-1<0,0,1)*IF(ABS(B$3*10^12-$A15)>(B$3*10^12-$A14),$A14,$A15)=B15,0,IF((B$3*10^12-$A15)*(B$3*10^12-$A14)*-1<0,0,1)*IF(ABS(B$3*10^12-$A15)>(B$3*10^12-$A14),$A14,$A15))","v":{"$error":"#NAME?"}},{"$error":"#REF!"},{"$error":"#REF!"},0,0,{"$error":"#NAME?"},{"$error":"#NAME?"},{"$error":"#NAME?"},{"$error":"#NAME?"}]
[2.7,{"$error":"#NAME?"},{"$error":"#REF!"},{"$error":"#REF!"},0,0,{"$error":"#NAME?"},{"$error":"#NAME?"},{"$error":"#NAME?"},{"$error":"#NAME?"}]
[3.3,{"$error":"#NAME?"},{"$error":"#REF!"},{"$error":"#REF!"},0,0,{"$error":"#NAME?"},{"$error":"#NAME?"},{"$error":"#NAME?"},{"$error":"#NAME?"},null,null,"Rs",{"$f":"Rs_ideal*1000","v":{"$error":"#NAME?"}},{"$f":"IF(N16=0,0,IF(N16>(INT(0.5+100*POWER(10,IF(96*(LOG(N16)-INT(LOG(N16)))-ROUND(96*(LOG(N16)-INT(LOG(N16))),0)<0,ROUND(96*(LOG(N16)-INT(LOG(N16))),0)-1,ROUND(96*(LOG(N16)-INT(LOG(N16))),0))/96))*POWER(10,INT(LOG(N16))-2)+INT(0.5+100*POWER(10,(IF(96*(LOG(N16)-INT(LOG(N16)))-ROUND(96*(LOG(N16)-INT(LOG(N16))),0)<0,ROUND(96*(LOG(N16)-INT(LOG(N16))),0)-1,ROUND(96*(LOG(N16)-INT(LOG(N16))),0))+1)/96))*POWER(10,INT(LOG(N16))-2))/2,INT(0.5+100*POWER(10,(IF(96*(LOG(N16)-INT(LOG(N16)))-ROUND(96*(LOG(N16)-INT(LOG(N16))),0)<0,ROUND(96*(LOG(N16)-INT(LOG(N16))),0)-1,ROUND(96*(LOG(N16)-INT(LOG(N16))),0))+1)/96))*POWER(10,INT(LOG(N16))-2),INT(0.5+100*POWER(10,IF(96*(LOG(N16)-INT(LOG(N16)))-ROUND(96*(LOG(N16)-INT(LOG(N16))),0)<0,ROUND(96*(LOG(N16)-INT(LOG(N16))),0)-1,ROUND(96*(LOG(N16)-INT(LOG(N16))),0))/96))*POWER(10,INT(LOG(N16))-2)))","v":{"$error":"#NAME?"}},"mΩ"]
[3.9,{"$error":"#NAME?"},{"$error":"#REF!"},{"$error":"#REF!"},0,0,{"$error":"#NAME?"},{"$error":"#NAME?"},{"$error":"#NAME?"},{"$error":"#NAME?"},null,null,"Cres",{"$f":"Cres","v":{"$error":"#NAME?"}},{"$f":"G4*1000000000000","v":{"$error":"#NAME?"}},"pF"]
[4.7,{"$error":"#NAME?"},{"$error":"#REF!"},{"$error":"#REF!"},0,0,{"$error":"#NAME?"},{"$error":"#NAME?"},{"$error":"#NAME?"},{"$error":"#NAME?"}]
[5.6,{"$error":"#NAME?"},{"$error":"#REF!"},{"$error":"#REF!"},0,0,{"$error":"#NAME?"},{"$error":"#NAME?"},{"$error":"#NAME?"},{"$error":"#NAME?"}]
[6.8,{"$error":"#NAME?"},{"$error":"#REF!"},{"$error":"#REF!"},0,0,{"$error":"#NAME?"},{"$error":"#NAME?"},{"$error":"#NAME?"},{"$error":"#NAME?"}]
[8.1999999999999993,{"$error":"#NAME?"},{"$error":"#REF!"},{"$error":"#REF!"},0,0,{"$error":"#NAME?"},{"$error":"#NAME?"},{"$error":"#NAME?"},{"$error":"#NAME?"}]
[10,{"$error":"#NAME?"},{"$error":"#REF!"},{"$error":"#REF!"},0,0,{"$error":"#NAME?"},{"$error":"#NAME?"},{"$error":"#NAME?"},{"$error":"#NAME?"},null,null,"Cdither",{"$f":"Cdither_init","v":{"$error":"#NAME?"}},{"$f":"H4","v":{"$error":"#NAME?"}}]
[12,{"$error":"#NAME?"},{"$error":"#REF!"},{"$error":"#REF!"},0,0,{"$error":"#NAME?"},{"$error":"#NAME?"},{"$error":"#NAME?"},{"$error":"#NAME?"}]
[15,{"$error":"#NAME?"},{"$error":"#REF!"},{"$error":"#REF!"},0,0,{"$error":"#NAME?"},{"$error":"#NAME?"},{"$error":"#NAME?"},{"$error":"#NAME?"}]
[18,{"$error":"#NAME?"},{"$error":"#REF!"},{"$error":"#REF!"},0,0,{"$error":"#NAME?"},{"$error":"#NAME?"},{"$error":"#NAME?"},{"$error":"#NAME?"}]
[22,{"$error":"#NAME?"},{"$error":"#REF!"},{"$error":"#REF!"},0,0,{"$error":"#NAME?"},{"$error":"#NAME?"},{"$error":"#NAME?"},{"$error":"#NAME?"}]
[27,{"$error":"#NAME?"},{"$error":"#REF!"},{"$error":"#REF!"},0,0,{"$error":"#NAME?"},{"$error":"#NAME?"},{"$error":"#NAME?"},{"$error":"#NAME?"}]
[33,{"$error":"#NAME?"},{"$error":"#REF!"},{"$error":"#REF!"},0,0,{"$error":"#NAME?"},{"$error":"#NAME?"},{"$error":"#NAME?"},{"$error":"#NAME?"}]
[39,{"$error":"#NAME?"},{"$error":"#REF!"},{"$error":"#REF!"},0,0,{"$error":"#NAME?"},{"$error":"#NAME?"},{"$error":"#NAME?"},{"$error":"#NAME?"}]
[47,{"$error":"#NAME?"},{"$error":"#REF!"},{"$error":"#REF!"},0,0,{"$error":"#NAME?"},{"$error":"#NAME?"},{"$error":"#NAME?"},{"$error":"#NAME?"},null,null,"Rc1",{"$f":"O7/1000&\" kΩ\"","v":"100 kΩ"},{"$f":"O7/1000","v":100},"kΩ"]
[56,{"$error":"#NAME?"},{"$error":"#REF!"},{"$error":"#REF!"},0,0,{"$error":"#NAME?"},{"$error":"#NAME?"},{"$error":"#NAME?"},{"$error":"#NAME?"},null,null,"Cc1",{"$f":"C4*1000000000&\" nF\"","v":{"$error":"#REF!"}},{"$f":"C4*1000000000","v":{"$error":"#REF!"}},"nF"]
[68,{"$error":"#NAME?"},{"$error":"#REF!"},{"$error":"#REF!"},0,0,{"$error":"#NAME?"},{"$error":"#NAME?"},{"$error":"#NAME?"},{"$error":"#NAME?"},null,null,"Cc2",{"$f":"D4*1000000000000&\" pF\"","v":{"$error":"#REF!"}},{"$f":"D4*1000000000000","v":{"$error":"#REF!"}},"pF"]
[82,{"$error":"#NAME?"},{"$error":"#REF!"},{"$error":"#REF!"},0,0,{"$error":"#NAME?"},{"$error":"#NAME?"},{"$error":"#NAME?"},{"$error":"#NAME?"}]
[{"$f":"A22*10","v":100},{"$error":"#NAME?"},{"$error":"#REF!"},{"$error":"#REF!"},0,0,{"$error":"#NAME?"},{"$error":"#NAME?"},{"$error":"#NAME?"},{"$error":"#NAME?"},null,null,"Rc2",{"$f":"O8/1000&\" kΩ\"","v":{"$error":"#REF!"}},{"$f":"O8/1000","v":{"$error":"#REF!"}},"kΩ"]
[{"$f":"A23*10","v":120},{"$error":"#NAME?"},{"$error":"#REF!"},{"$error":"#REF!"},0,0,{"$error":"#NAME?"},{"$error":"#NAME?"},{"$error":"#NAME?"},{"$error":"#NAME?"},null,null,"Cc3",{"$f":"I4*1000000000&\" nF\"","v":{"$error":"#NAME?"}},{"$f":"I4*1000000000","v":{"$error":"#NAME?"}},"nF"]
[150,{"$error":"#NAME?"},{"$error":"#REF!"},{"$error":"#REF!"},0,0,{"$error":"#NAME?"},{"$error":"#NAME?"},{"$error":"#NAME?"},{"$error":"#NAME?"},null,null,"Cc4",{"$f":"J4*1000000000000&\" pF\"","v":{"$error":"#NAME?"}},{"$f":"J4*1000000000000","v":{"$error":"#NAME?"}},"pF"]
[180,{"$error":"#NAME?"},{"$error":"#REF!"},{"$error":"#REF!"},0,0,{"$error":"#NAME?"},{"$error":"#NAME?"},{"$error":"#NAME?"},{"$error":"#NAME?"}]
[220,{"$error":"#NAME?"},{"$error":"#REF!"},{"$error":"#REF!"},0,0,{"$error":"#NAME?"},{"$error":"#NAME?"},{"$error":"#NAME?"},{"$error":"#NAME?"}]
[270,{"$error":"#NAME?"},{"$f":"IF(IF((C$3*10^12-$A40)*(C$3*10^12-$A39)*-1<0,0,1)*IF(ABS(C$3*10^12-$A40)>(C$3*10^12-$A39),$A39,$A40)=C40,0,IF((C$3*10^12-$A40)*(C$3*10^12-$A39)*-1<0,0,1)*IF(ABS(C$3*10^12-$A40)>(C$3*10^12-$A39),$A39,$A40))","v":{"$error":"#REF!"}},{"$error":"#REF!"},0,0,{"$error":"#NAME?"},{"$error":"#NAME?"},{"$error":"#NAME?"},{"$error":"#NAME?"}]
[330,{"$error":"#NAME?"},{"$error":"#REF!"},{"$error":"#REF!"},0,0,{"$error":"#NAME?"},{"$error":"#NAME?"},{"$error":"#NAME?"},{"$error":"#NAME?"}]
[390,{"$error":"#NAME?"},{"$error":"#REF!"},{"$error":"#REF!"},0,0,{"$error":"#NAME?"},{"$error":"#NAME?"},{"$error":"#NAME?"},{"$error":"#NAME?"}]
[470,{"$error":"#NAME?"},{"$error":"#REF!"},{"$error":"#REF!"},0,0,{"$error":"#NAME?"},{"$error":"#NAME?"},{"$error":"#NAME?"},{"$error":"#NAME?"}]
[560,{"$error":"#NAME?"},{"$error":"#REF!"},{"$error":"#REF!"},0,0,{"$error":"#NAME?"},{"$error":"#NAME?"},{"$error":"#NAME?"},{"$error":"#NAME?"}]
[680,{"$error":"#NAME?"},{"$error":"#REF!"},{"$error":"#REF!"},0,0,{"$error":"#NAME?"},{"$error":"#NAME?"},{"$error":"#NAME?"},{"$error":"#NAME?"}]
[{"$f":"A33*10","v":820},{"$error":"#NAME?"},{"$error":"#REF!"},{"$error":"#REF!"},0,0,{"$error":"#NAME?"},{"$error":"#NAME?"},{"$error":"#NAME?"},{"$error":"#NAME?"}]
[1000,{"$error":"#NAME?"},{"$error":"#REF!"},{"$error":"#REF!"},0,0,{"$error":"#NAME?"},{"$error":"#NAME?"},{"$error":"#NAME?"},{"$error":"#NAME?"}]
[1200,{"$error":"#NAME?"},{"$error":"#REF!"},{"$error":"#REF!"},0,0,{"$error":"#NAME?"},{"$error":"#NAME?"},{"$error":"#NAME?"},{"$error":"#NAME?"}]
[1500,{"$error":"#NAME?"},{"$error":"#REF!"},{"$error":"#REF!"},0,0,{"$error":"#NAME?"},{"$error":"#NAME?"},{"$error":"#NAME?"},{"$error":"#NAME?"}]
[1800,{"$error":"#NAME?"},{"$error":"#REF!"},{"$error":"#REF!"},0,0,{"$error":"#NAME?"},{"$error":"#NAME?"},{"$error":"#NAME?"},{"$error":"#NAME?"}]
[2200,{"$error":"#NAME?"},{"$error":"#REF!"},{"$error":"#REF!"},0,0,{"$error":"#NAME?"},{"$error":"#NAME?"},{"$error":"#NAME?"},{"$error":"#NAME?"}]
[2700,{"$error":"#NAME?"},{"$error":"#REF!"},{"$error":"#REF!"},0,0,{"$error":"#NAME?"},{"$error":"#NAME?"},{"$error":"#NAME?"},{"$error":"#NAME?"}]
[3300,{"$error":"#NAME?"},{"$error":"#REF!"},{"$error":"#REF!"},0,0,{"$error":"#NAME?"},{"$error":"#NAME?"},{"$error":"#NAME?"},{"$error":"#NAME?"}]
[3900,{"$error":"#NAME?"},{"$error":"#REF!"},{"$error":"#REF!"},0,0,{"$error":"#NAME?"},{"$error":"#NAME?"},{"$error":"#NAME?"},{"$error":"#NAME?"}]
[4700,{"$error":"#NAME?"},{"$error":"#REF!"},{"$error":"#REF!"},0,0,{"$error":"#NAME?"},{"$error":"#NAME?"},{"$error":"#NAME?"},{"$error":"#NAME?"}]
[5600,{"$error":"#NAME?"},{"$error":"#REF!"},{"$error":"#REF!"},0,0,{"$error":"#NAME?"},{"$error":"#NAME?"},{"$error":"#NAME?"},{"$error":"#NAME?"}]
[6800,{"$error":"#NAME?"},{"$error":"#REF!"},{"$error":"#REF!"},0,0,{"$error":"#NAME?"},{"$error":"#NAME?"},{"$error":"#NAME?"},{"$error":"#NAME?"}]
[8200,{"$error":"#NAME?"},{"$error":"#REF!"},{"$error":"#REF!"},0,0,{"$error":"#NAME?"},{"$error":"#NAME?"},{"$error":"#NAME?"},{"$error":"#NAME?"}]
[10000,{"$error":"#NAME?"},{"$error":"#REF!"},{"$error":"#REF!"},0,0,{"$error":"#NAME?"},{"$error":"#NAME?"},{"$error":"#NAME?"},{"$error":"#NAME?"}]
[12000,{"$error":"#NAME?"},{"$error":"#REF!"},{"$error":"#REF!"},0,0,{"$error":"#NAME?"},{"$error":"#NAME?"},{"$error":"#NAME?"},{"$error":"#NAME?"}]
[15000,{"$error":"#NAME?"},{"$error":"#REF!"},{"$error":"#REF!"},0,0,{"$error":"#NAME?"},{"$error":"#NAME?"},{"$error":"#NAME?"},{"$error":"#NAME?"}]
[18000,{"$error":"#NAME?"},{"$error":"#REF!"},{"$error":"#REF!"},0,0,{"$error":"#NAME?"},{"$error":"#NAME?"},{"$error":"#NAME?"},{"$error":"#NAME?"}]
[22000,{"$error":"#NAME?"},{"$error":"#REF!"},{"$error":"#REF!"},0,0,{"$error":"#NAME?"},{"$error":"#NAME?"},{"$error":"#NAME?"},{"$error":"#NAME?"}]
[27000,{"$error":"#NAME?"},{"$error":"#REF!"},{"$error":"#REF!"},0,0,{"$error":"#NAME?"},{"$error":"#NAME?"},{"$error":"#NAME?"},{"$error":"#NAME?"}]
[33000,{"$error":"#NAME?"},{"$error":"#REF!"},{"$error":"#REF!"},0,0,{"$error":"#NAME?"},{"$error":"#NAME?"},{"$error":"#NAME?"},{"$error":"#NAME?"}]
[39000,{"$error":"#NAME?"},{"$error":"#REF!"},{"$error":"#REF!"},0,0,{"$error":"#NAME?"},{"$error":"#NAME?"},{"$error":"#NAME?"},{"$error":"#NAME?"}]
[47000,{"$error":"#NAME?"},{"$error":"#REF!"},{"$error":"#REF!"},0,0,{"$error":"#NAME?"},{"$error":"#NAME?"},{"$error":"#NAME?"},{"$error":"#NAME?"}]
[56000,{"$error":"#NAME?"},{"$error":"#REF!"},{"$error":"#REF!"},0,0,{"$error":"#NAME?"},{"$error":"#NAME?"},{"$error":"#NAME?"},{"$error":"#NAME?"}]
[68000,{"$error":"#NAME?"},{"$error":"#REF!"},{"$error":"#REF!"},0,0,{"$error":"#NAME?"},{"$error":"#NAME?"},{"$error":"#NAME?"},{"$error":"#NAME?"}]
[82000,{"$error":"#NAME?"},{"$error":"#REF!"},{"$error":"#REF!"},0,0,{"$error":"#NAME?"},{"$error":"#NAME?"},{"$error":"#NAME?"},{"$f":"IF(IF((J$3*10^12-$A70)*(J$3*10^12-$A69)*-1<0,0,1)*IF(ABS(J$3*10^12-$A70)>(J$3*10^12-$A69),$A69,$A70)=J70,0,IF((J$3*10^12-$A70)*(J$3*10^12-$A69)*-1<0,0,1)*IF(ABS(J$3*10^12-$A70)>(J$3*10^12-$A69),$A69,$A70))","v":{"$error":"#NAME?"}}]
[100000,{"$error":"#NAME?"},{"$error":"#REF!"},{"$f":"IF(IF((D$3*10^12-$A71)*(D$3*10^12-$A70)*-1<0,0,1)*IF(ABS(D$3*10^12-$A71)>(D$3*10^12-$A70),$A70,$A71)=D71,0,IF((D$3*10^12-$A71)*(D$3*10^12-$A70)*-1<0,0,1)*IF(ABS(D$3*10^12-$A71)>(D$3*10^12-$A70),$A70,$A71))","v":{"$error":"#REF!"}},0,0,{"$error":"#NAME?"},{"$error":"#NAME?"},{"$error":"#NAME?"},{"$error":"#NAME?"}]
[120000,{"$f":"IF(IF((B$3*10^12-$A72)*(B$3*10^12-$A71)*-1<0,0,1)*IF(ABS(B$3*10^12-$A72)>(B$3*10^12-$A71),$A71,$A72)=B72,0,IF((B$3*10^12-$A72)*(B$3*10^12-$A71)*-1<0,0,1)*IF(ABS(B$3*10^12-$A72)>(B$3*10^12-$A71),$A71,$A72))","v":{"$error":"#NAME?"}},{"$f":"IF(IF((C$3*10^12-$A72)*(C$3*10^12-$A71)*-1<0,0,1)*IF(ABS(C$3*10^12-$A72)>(C$3*10^12-$A71),$A71,$A72)=C72,0,IF((C$3*10^12-$A72)*(C$3*10^12-$A71)*-1<0,0,1)*IF(ABS(C$3*10^12-$A72)>(C$3*10^12-$A71),$A71,$A72))","v":{"$error":"#REF!"}},{"$error":"#REF!"},0,{"$f":"IF(IF((F$3*10^12-$A72)*(F$3*10^12-$A71)*-1<0,0,1)*IF(ABS(F$3*10^12-$A72)>(F$3*10^12-$A71),$A71,$A72)=F72,0,IF((F$3*10^12-$A72)*(F$3*10^12-$A71)*-1<0,0,1)*IF(ABS(F$3*10^12-$A72)>(F$3*10^12-$A71),$A71,$A72))","v":0},{"$f":"IF(IF((G$3*10^12-$A72)*(G$3*10^12-$A71)*-1<0,0,1)*IF(ABS(G$3*10^12-$A72)>(G$3*10^12-$A71),$A71,$A72)=G72,0,IF((G$3*10^12-$A72)*(G$3*10^12-$A71)*-1<0,0,1)*IF(ABS(G$3*10^12-$A72)>(G$3*10^12-$A71),$A71,$A72))","v":{"$error":"#NAME?"}},{"$f":"IF(IF((H$3*10^12-$A72)*(H$3*10^12-$A71)*-1<0,0,1)*IF(ABS(H$3*10^12-$A72)>(H$3*10^12-$A71),$A71,$A72)=H72,0,IF((H$3*10^12-$A72)*(H$3*10^12-$A71)*-1<0,0,1)*IF(ABS(H$3*10^12-$A72)>(H$3*10^12-$A71),$A71,$A72))","v":{"$error":"#NAME?"}},{"$f":"IF(IF((I$3*10^12-$A72)*(I$3*10^12-$A71)*-1<0,0,1)*IF(ABS(I$3*10^12-$A72)>(I$3*10^12-$A71),$A71,$A72)=I72,0,IF((I$3*10^12-$A72)*(I$3*10^12-$A71)*-1<0,0,1)*IF(ABS(I$3*10^12-$A72)>(I$3*10^12-$A71),$A71,$A72))","v":{"$error":"#NAME?"}},{"$error":"#NAME?"}]
[150000,{"$error":"#NAME?"},{"$error":"#REF!"},{"$error":"#REF!"},0,0,{"$error":"#NAME?"},{"$error":"#NAME?"},{"$error":"#NAME?"},{"$error":"#NAME?"}]
[180000,{"$error":"#NAME?"},{"$error":"#REF!"},{"$error":"#REF!"},0,0,{"$error":"#NAME?"},{"$error":"#NAME?"},{"$error":"#NAME?"},{"$error":"#NAME?"}]
[220000,{"$error":"#NAME?"},{"$error":"#REF!"},{"$error":"#REF!"},0,0,{"$error":"#NAME?"},{"$error":"#NAME?"},{"$error":"#NAME?"},{"$error":"#NAME?"}]
[270000,{"$error":"#NAME?"},{"$error":"#REF!"},{"$error":"#REF!"},0,0,{"$error":"#NAME?"},{"$error":"#NAME?"},{"$error":"#NAME?"},{"$error":"#NAME?"}]
[330000,{"$error":"#NAME?"},{"$error":"#REF!"},{"$error":"#REF!"},0,0,{"$error":"#NAME?"},{"$error":"#NAME?"},{"$error":"#NAME?"},{"$error":"#NAME?"}]
[390000,{"$error":"#NAME?"},{"$error":"#REF!"},{"$error":"#REF!"},0,0,{"$error":"#NAME?"},{"$error":"#NAME?"},{"$error":"#NAME?"},{"$error":"#NAME?"}]
[470000,{"$error":"#NAME?"},{"$error":"#REF!"},{"$error":"#REF!"},0,0,{"$error":"#NAME?"},{"$error":"#NAME?"},{"$error":"#NAME?"},{"$error":"#NAME?"}]
[560000,{"$error":"#NAME?"},{"$error":"#REF!"},{"$error":"#REF!"},0,0,{"$error":"#NAME?"},{"$error":"#NAME?"},{"$error":"#NAME?"},{"$error":"#NAME?"}]
[680000,{"$error":"#NAME?"},{"$error":"#REF!"},{"$error":"#REF!"},0,0,{"$error":"#NAME?"},{"$error":"#NAME?"},{"$error":"#NAME?"},{"$error":"#NAME?"}]
[820000,{"$error":"#NAME?"},{"$error":"#REF!"},{"$error":"#REF!"},0,0,{"$error":"#NAME?"},{"$error":"#NAME?"},{"$error":"#NAME?"},{"$error":"#NAME?"}]
[1000000,{"$error":"#NAME?"},{"$error":"#REF!"},{"$error":"#REF!"},0,0,{"$error":"#NAME?"},{"$error":"#NAME?"},{"$error":"#NAME?"},{"$error":"#NAME?"}]
[1200000,{"$error":"#NAME?"},{"$error":"#REF!"},{"$error":"#REF!"},0,0,{"$error":"#NAME?"},{"$error":"#NAME?"},{"$error":"#NAME?"},{"$error":"#NAME?"}]
[1500000,{"$error":"#NAME?"},{"$error":"#REF!"},{"$error":"#REF!"},0,0,{"$error":"#NAME?"},{"$error":"#NAME?"},{"$error":"#NAME?"},{"$error":"#NAME?"}]
[1800000,{"$error":"#NAME?"},{"$error":"#REF!"},{"$error":"#REF!"},0,0,{"$error":"#NAME?"},{"$error":"#NAME?"},{"$error":"#NAME?"},{"$error":"#NAME?"}]
[2200000,{"$error":"#NAME?"},{"$error":"#REF!"},{"$error":"#REF!"},0,0,{"$error":"#NAME?"},{"$error":"#NAME?"},{"$error":"#NAME?"},{"$error":"#NAME?"}]
[2700000,{"$error":"#NAME?"},{"$error":"#REF!"},{"$error":"#REF!"},0,0,{"$error":"#NAME?"},{"$error":"#NAME?"},{"$error":"#NAME?"},{"$error":"#NAME?"}]
[3300000,{"$error":"#NAME?"},{"$error":"#REF!"},{"$error":"#REF!"},0,0,{"$error":"#NAME?"},{"$error":"#NAME?"},{"$error":"#NAME?"},{"$error":"#NAME?"}]
[3900000,{"$error":"#NAME?"},{"$error":"#REF!"},{"$error":"#REF!"},0,0,{"$error":"#NAME?"},{"$error":"#NAME?"},{"$error":"#NAME?"},{"$error":"#NAME?"}]
[4700000,{"$error":"#NAME?"},{"$error":"#REF!"},{"$error":"#REF!"},0,0,{"$error":"#NAME?"},{"$error":"#NAME?"},{"$error":"#NAME?"},{"$error":"#NAME?"}]
[5600000,{"$error":"#NAME?"},{"$error":"#REF!"},{"$error":"#REF!"},0,0,{"$error":"#NAME?"},{"$error":"#NAME?"},{"$error":"#NAME?"},{"$error":"#NAME?"}]
[6800000,{"$error":"#NAME?"},{"$error":"#REF!"},{"$error":"#REF!"},0,0,{"$error":"#NAME?"},{"$error":"#NAME?"},{"$error":"#NAME?"},{"$error":"#NAME?"}]
[8200000,{"$error":"#NAME?"},{"$error":"#REF!"},{"$error":"#REF!"},0,0,{"$error":"#NAME?"},{"$error":"#NAME?"},{"$error":"#NAME?"},{"$error":"#NAME?"}]
[10000000,{"$error":"#NAME?"},{"$error":"#REF!"},{"$error":"#REF!"},0,0,{"$error":"#NAME?"},{"$error":"#NAME?"},{"$error":"#NAME?"},{"$error":"#NAME?"}]
[12000000,{"$error":"#NAME?"},{"$error":"#REF!"},{"$error":"#REF!"},0,0,{"$error":"#NAME?"},{"$error":"#NAME?"},{"$error":"#NAME?"},{"$error":"#NAME?"}]
[15000000,{"$error":"#NAME?"},{"$error":"#REF!"},{"$error":"#REF!"},0,0,{"$error":"#NAME?"},{"$error":"#NAME?"},{"$error":"#NAME?"},{"$error":"#NAME?"}]
[18000000,{"$error":"#NAME?"},{"$error":"#REF!"},{"$error":"#REF!"},0,22000000,{"$error":"#NAME?"},{"$error":"#NAME?"},{"$error":"#NAME?"},{"$error":"#NAME?"}]
[22000000,{"$error":"#NAME?"},{"$error":"#REF!"},{"$error":"#REF!"},0,0,{"$error":"#NAME?"},{"$error":"#NAME?"},{"$error":"#NAME?"},{"$error":"#NAME?"}]
[{"$f":"A87*10","v":27000000},{"$error":"#NAME?"},{"$error":"#REF!"},{"$error":"#REF!"},0,0,{"$error":"#NAME?"},{"$error":"#NAME?"},{"$error":"#NAME?"},{"$error":"#NAME?"}]
[33000000,{"$error":"#NAME?"},{"$error":"#REF!"},{"$error":"#REF!"},33000000,0,{"$error":"#NAME?"},{"$error":"#NAME?"},{"$error":"#NAME?"},{"$error":"#NAME?"}]
[39000000,{"$error":"#NAME?"},{"$error":"#REF!"},{"$error":"#REF!"},0,0,{"$error":"#NAME?"},{"$error":"#NAME?"},{"$error":"#NAME?"},{"$error":"#NAME?"}]
[47000000,{"$error":"#NAME?"},{"$error":"#REF!"},{"$error":"#REF!"},0,0,{"$error":"#NAME?"},{"$error":"#NAME?"},{"$error":"#NAME?"},{"$error":"#NAME?"}]
[56000000,{"$error":"#NAME?"},{"$error":"#REF!"},{"$error":"#REF!"},0,{"$f":"IF(IF((F$3*10^12-$A104)*(F$3*10^12-$A103)*-1<0,0,1)*IF(ABS(F$3*10^12-$A104)>(F$3*10^12-$A103),$A103,$A104)=F104,0,IF((F$3*10^12-$A104)*(F$3*10^12-$A103)*-1<0,0,1)*IF(ABS(F$3*10^12-$A104)>(F$3*10^12-$A103),$A103,$A104))","v":0},{"$f":"IF(IF((G$3*10^12-$A104)*(G$3*10^12-$A103)*-1<0,0,1)*IF(ABS(G$3*10^12-$A104)>(G$3*10^12-$A103),$A103,$A104)=G104,0,IF((G$3*10^12-$A104)*(G$3*10^12-$A103)*-1<0,0,1)*IF(ABS(G$3*10^12-$A104)>(G$3*10^12-$A103),$A103,$A104))","v":{"$error":"#NAME?"}},{"$f":"IF(IF((H$3*10^12-$A104)*(H$3*10^12-$A103)*-1<0,0,1)*IF(ABS(H$3*10^12-$A104)>(H$3*10^12-$A103),$A103,$A104)=H104,0,IF((H$3*10^12-$A104)*(H$3*10^12-$A103)*-1<0,0,1)*IF(ABS(H$3*10^12-$A104)>(H$3*10^12-$A103),$A103,$A104))","v":{"$error":"#NAME?"}},{"$f":"IF(IF((I$3*10^12-$A104)*(I$3*10^12-$A103)*-1<0,0,1)*IF(ABS(I$3*10^12-$A104)>(I$3*10^12-$A103),$A103,$A104)=I104,0,IF((I$3*10^12-$A104)*(I$3*10^12-$A103)*-1<0,0,1)*IF(ABS(I$3*10^12-$A104)>(I$3*10^12-$A103),$A103,$A104))","v":{"$error":"#NAME?"}},{"$error":"#NAME?"}]
[68000000,{"$error":"#NAME?"},{"$error":"#REF!"},{"$error":"#REF!"},0,0,{"$error":"#NAME?"},{"$error":"#NAME?"},{"$error":"#NAME?"},{"$error":"#NAME?"}]
[82000000,{"$error":"#NAME?"},{"$error":"#REF!"},{"$error":"#REF!"},0,0,{"$error":"#NAME?"},{"$error":"#NAME?"},{"$error":"#NAME?"},{"$error":"#NAME?"}]
[100000000,{"$error":"#NAME?"},{"$error":"#REF!"},{"$error":"#REF!"},0,0,{"$error":"#NAME?"},{"$error":"#NAME?"},{"$error":"#NAME?"},{"$error":"#NAME?"}]
[120000000,{"$error":"#NAME?"},{"$error":"#REF!"},{"$error":"#REF!"},0,0,{"$error":"#NAME?"},{"$error":"#NAME?"},{"$error":"#NAME?"},{"$error":"#NAME?"}]
[150000000,{"$error":"#NAME?"},{"$error":"#REF!"},{"$error":"#REF!"},0,0,{"$error":"#NAME?"},{"$error":"#NAME?"},{"$error":"#NAME?"},{"$error":"#NAME?"}]
[180000000,{"$error":"#NAME?"},{"$error":"#REF!"},{"$error":"#REF!"},0,0,{"$error":"#NAME?"},{"$error":"#NAME?"},{"$error":"#NAME?"},{"$error":"#NAME?"}]
[220000000,{"$error":"#NAME?"},{"$error":"#REF!"},{"$error":"#REF!"},0,0,{"$error":"#NAME?"},{"$error":"#NAME?"},{"$error":"#NAME?"},{"$error":"#NAME?"}]
[270000000,{"$error":"#NAME?"},{"$error":"#REF!"},{"$error":"#REF!"},0,0,{"$error":"#NAME?"},{"$error":"#NAME?"},{"$error":"#NAME?"},{"$error":"#NAME?"}]
[330000000,{"$error":"#NAME?"},{"$error":"#REF!"},{"$error":"#REF!"},0,0,{"$error":"#NAME?"},{"$error":"#NAME?"},{"$error":"#NAME?"},{"$error":"#NAME?"}]
[390000000,{"$error":"#NAME?"},{"$error":"#REF!"},{"$error":"#REF!"},0,0,{"$error":"#NAME?"},{"$error":"#NAME?"},{"$error":"#NAME?"},{"$error":"#NAME?"}]
[470000000,{"$error":"#NAME?"},{"$error":"#REF!"},{"$error":"#REF!"},0,0,{"$error":"#NAME?"},{"$error":"#NAME?"},{"$error":"#NAME?"},{"$error":"#NAME?"}]
[560000000,{"$error":"#NAME?"},{"$error":"#REF!"},{"$error":"#REF!"},0,0,{"$error":"#NAME?"},{"$error":"#NAME?"},{"$error":"#NAME?"},{"$error":"#NAME?"}]
[680000000,{"$error":"#NAME?"},{"$error":"#REF!"},{"$error":"#REF!"},0,0,{"$error":"#NAME?"},{"$error":"#NAME?"},{"$error":"#NAME?"},{"$error":"#NAME?"}]
[820000000,{"$error":"#NAME?"},{"$error":"#REF!"},{"$error":"#REF!"},0,0,{"$error":"#NAME?"},{"$error":"#NAME?"},{"$error":"#NAME?"},{"$error":"#NAME?"}]
[1000000000,{"$error":"#NAME?"},{"$error":"#REF!"},{"$error":"#REF!"},0,0,{"$error":"#NAME?"},{"$error":"#NAME?"},{"$error":"#NAME?"},{"$error":"#NAME?"}]
[1200000000,{"$error":"#NAME?"},{"$error":"#REF!"},{"$error":"#REF!"},0,0,{"$error":"#NAME?"},{"$error":"#NAME?"},{"$error":"#NAME?"},{"$error":"#NAME?"}]
[1500000000,{"$error":"#NAME?"},{"$error":"#REF!"},{"$error":"#REF!"},0,0,{"$error":"#NAME?"},{"$error":"#NAME?"},{"$error":"#NAME?"},{"$error":"#NAME?"}]
[1800000000,{"$error":"#NAME?"},{"$error":"#REF!"},{"$error":"#REF!"},0,0,{"$error":"#NAME?"},{"$error":"#NAME?"},{"$error":"#NAME?"},{"$error":"#NAME?"}]
[2200000000,{"$error":"#NAME?"},{"$error":"#REF!"},{"$error":"#REF!"},0,0,{"$error":"#NAME?"},{"$error":"#NAME?"},{"$error":"#NAME?"},{"$error":"#NAME?"}]
[2700000000,{"$error":"#NAME?"},{"$error":"#REF!"},{"$error":"#REF!"},0,0,{"$error":"#NAME?"},{"$error":"#NAME?"},{"$error":"#NAME?"},{"$error":"#NAME?"}]
[3300000000,{"$error":"#NAME?"},{"$error":"#REF!"},{"$error":"#REF!"},0,0,{"$error":"#NAME?"},{"$error":"#NAME?"},{"$error":"#NAME?"},{"$error":"#NAME?"}]
[3900000000,{"$error":"#NAME?"},{"$error":"#REF!"},{"$error":"#REF!"},0,0,{"$error":"#NAME?"},{"$error":"#NAME?"},{"$error":"#NAME?"},{"$error":"#NAME?"}]
[4700000000,{"$error":"#NAME?"},{"$error":"#REF!"},{"$error":"#REF!"},0,0,{"$error":"#NAME?"},{"$error":"#NAME?"},{"$error":"#NAME?"},{"$error":"#NAME?"}]
[5600000000,{"$error":"#NAME?"},{"$error":"#REF!"},{"$error":"#REF!"},0,0,{"$error":"#NAME?"},{"$error":"#NAME?"},{"$error":"#NAME?"},{"$error":"#NAME?"}]
[6800000000,{"$error":"#NAME?"},{"$error":"#REF!"},{"$error":"#REF!"},0,0,{"$error":"#NAME?"},{"$error":"#NAME?"},{"$error":"#NAME?"},{"$error":"#NAME?"}]
[8200000000,{"$error":"#NAME?"},{"$error":"#REF!"},{"$error":"#REF!"},0,0,{"$error":"#NAME?"},{"$error":"#NAME?"},{"$error":"#NAME?"},{"$error":"#NAME?"}]
[10000000000,{"$error":"#NAME?"},{"$error":"#REF!"},{"$error":"#REF!"},0,0,{"$error":"#NAME?"},{"$error":"#NAME?"},{"$error":"#NAME?"},{"$error":"#NAME?"}]
[12000000000,{"$error":"#NAME?"},{"$error":"#REF!"},{"$error":"#REF!"},0,0,{"$error":"#NAME?"},{"$error":"#NAME?"},{"$error":"#NAME?"},{"$error":"#NAME?"}]
[15000000000,{"$error":"#NAME?"},{"$error":"#REF!"},{"$error":"#REF!"},0,0,{"$error":"#NAME?"},{"$error":"#NAME?"},{"$error":"#NAME?"},{"$error":"#NAME?"}]
[18000000000,{"$error":"#NAME?"},{"$error":"#REF!"},{"$error":"#REF!"},0,0,{"$error":"#NAME?"},{"$error":"#NAME?"},{"$error":"#NAME?"},{"$f":"IF(IF((J$3*10^12-$A134)*(J$3*10^12-$A133)*-1<0,0,1)*IF(ABS(J$3*10^12-$A134)>(J$3*10^12-$A133),$A133,$A134)=J134,0,IF((J$3*10^12-$A134)*(J$3*10^12-$A133)*-1<0,0,1)*IF(ABS(J$3*10^12-$A134)>(J$3*10^12-$A133),$A133,$A134))","v":{"$error":"#NAME?"}}]
[22000000000,{"$error":"#NAME?"},{"$error":"#REF!"},{"$error":"#REF!"},{"$f":"IF(IF((E$3*10^12-$A135)*(E$3*10^12-$A134)*-1<0,0,1)*IF(ABS(E$3*10^12-$A135)>(E$3*10^12-$A134),$A134,$A135)=E135,0,IF((E$3*10^12-$A135)*(E$3*10^12-$A134)*-1<0,0,1)*IF(ABS(E$3*10^12-$A135)>(E$3*10^12-$A134),$A134,$A135))","v":0},0,{"$error":"#NAME?"},{"$error":"#NAME?"},{"$error":"#NAME?"},{"$f":"IF(IF((J$3*10^12-$A135)*(J$3*10^12-$A134)*-1<0,0,1)*IF(ABS(J$3*10^12-$A135)>(J$3*10^12-$A134),$A134,$A135)=J135,0,IF((J$3*10^12-$A135)*(J$3*10^12-$A134)*-1<0,0,1)*IF(ABS(J$3*10^12-$A135)>(J$3*10^12-$A134),$A134,$A135))","v":{"$error":"#NAME?"}}]
[27000000000,{"$f":"IF(IF((B$3*10^12-$A136)*(B$3*10^12-$A135)*-1<0,0,1)*IF(ABS(B$3*10^12-$A136)>(B$3*10^12-$A135),$A135,$A136)=B136,0,IF((B$3*10^12-$A136)*(B$3*10^12-$A135)*-1<0,0,1)*IF(ABS(B$3*10^12-$A136)>(B$3*10^12-$A135),$A135,$A136))","v":{"$error":"#NAME?"}},{"$f":"IF(IF((C$3*10^12-$A136)*(C$3*10^12-$A135)*-1<0,0,1)*IF(ABS(C$3*10^12-$A136)>(C$3*10^12-$A135),$A135,$A136)=C136,0,IF((C$3*10^12-$A136)*(C$3*10^12-$A135)*-1<0,0,1)*IF(ABS(C$3*10^12-$A136)>(C$3*10^12-$A135),$A135,$A136))","v":{"$error":"#REF!"}},{"$error":"#REF!"},0,0,{"$error":"#NAME?"},{"$error":"#NAME?"},{"$error":"#NAME?"},{"$error":"#NAME?"}]
[33000000000,{"$error":"#NAME?"},{"$error":"#REF!"},{"$error":"#REF!"},0,0,{"$error":"#NAME?"},{"$error":"#NAME?"},{"$error":"#NAME?"},{"$error":"#NAME?"}]
[39000000000,{"$error":"#NAME?"},{"$error":"#REF!"},{"$error":"#REF!"},0,0,{"$error":"#NAME?"},{"$error":"#NAME?"},{"$error":"#NAME?"},{"$error":"#NAME?"}]
[47000000000,{"$error":"#NAME?"},{"$error":"#REF!"},{"$error":"#REF!"},0,0,{"$error":"#NAME?"},{"$error":"#NAME?"},{"$error":"#NAME?"},{"$error":"#NAME?"}]
[56000000000,{"$error":"#NAME?"},{"$error":"#REF!"},{"$error":"#REF!"},0,0,{"$error":"#NAME?"},{"$error":"#NAME?"},{"$error":"#NAME?"},{"$error":"#NAME?"}]
[68000000000,{"$error":"#NAME?"},{"$error":"#REF!"},{"$error":"#REF!"},0,0,{"$error":"#NAME?"},{"$error":"#NAME?"},{"$error":"#NAME?"},{"$error":"#NAME?"}]
[82000000000,{"$error":"#NAME?"},{"$error":"#REF!"},{"$error":"#REF!"},0,0,{"$error":"#NAME?"},{"$error":"#NAME?"},{"$error":"#NAME?"},{"$error":"#NAME?"}]
[100000000000,{"$error":"#NAME?"},{"$error":"#REF!"},{"$error":"#REF!"},0,0,{"$error":"#NAME?"},{"$error":"#NAME?"},{"$error":"#NAME?"},{"$error":"#NAME?"}]
[120000000000,{"$error":"#NAME?"},{"$error":"#REF!"},{"$error":"#REF!"},0,0,{"$error":"#NAME?"},{"$error":"#NAME?"},{"$error":"#NAME?"},{"$error":"#NAME?"}]
[150000000000,{"$error":"#NAME?"},{"$error":"#REF!"},{"$error":"#REF!"},0,0,{"$error":"#NAME?"},{"$error":"#NAME?"},{"$error":"#NAME?"},{"$error":"#NAME?"}]
[180000000000,{"$error":"#NAME?"},{"$error":"#REF!"},{"$error":"#REF!"},0,0,{"$error":"#NAME?"},{"$error":"#NAME?"},{"$error":"#NAME?"},{"$error":"#NAME?"}]
[220000000000,{"$error":"#NAME?"},{"$error":"#REF!"},{"$error":"#REF!"},0,0,{"$error":"#NAME?"},{"$error":"#NAME?"},{"$error":"#NAME?"},{"$error":"#NAME?"}]
[270000000000,{"$error":"#NAME?"},{"$error":"#REF!"},{"$error":"#REF!"},0,0,{"$error":"#NAME?"},{"$error":"#NAME?"},{"$error":"#NAME?"},{"$error":"#NAME?"}]
[330000000000,{"$error":"#NAME?"},{"$error":"#REF!"},{"$error":"#REF!"},0,0,{"$error":"#NAME?"},{"$error":"#NAME?"},{"$error":"#NAME?"},{"$error":"#NAME?"}]
[390000000000,{"$error":"#NAME?"},{"$error":"#REF!"},{"$error":"#REF!"},0,0,{"$error":"#NAME?"},{"$error":"#NAME?"},{"$error":"#NAME?"},{"$error":"#NAME?"}]
[470000000000,{"$error":"#NAME?"},{"$error":"#REF!"},{"$error":"#REF!"},0,0,{"$error":"#NAME?"},{"$error":"#NAME?"},{"$error":"#NAME?"},{"$error":"#NAME?"}]
[560000000000,{"$error":"#NAME?"},{"$error":"#REF!"},{"$error":"#REF!"},0,0,{"$error":"#NAME?"},{"$error":"#NAME?"},{"$error":"#NAME?"},{"$error":"#NAME?"}]
[680000000000,{"$error":"#NAME?"},{"$error":"#REF!"},{"$error":"#REF!"},0,0,{"$error":"#NAME?"},{"$error":"#NAME?"},{"$error":"#NAME?"},{"$error":"#NAME?"}]
[820000000000,{"$error":"#NAME?"},{"$error":"#REF!"},{"$error":"#REF!"},0,0,{"$error":"#NAME?"},{"$error":"#NAME?"},{"$error":"#NAME?"},{"$error":"#NAME?"}]
[1000000000000,{"$error":"#NAME?"},{"$error":"#REF!"},{"$error":"#REF!"},0,0,{"$error":"#NAME?"},{"$error":"#NAME?"},{"$error":"#NAME?"},{"$error":"#NAME?"}]
[1200000000000,{"$error":"#NAME?"},{"$error":"#REF!"},{"$error":"#REF!"},0,0,{"$error":"#NAME?"},{"$error":"#NAME?"},{"$error":"#NAME?"},{"$error":"#NAME?"}]
[1500000000000,{"$error":"#NAME?"},{"$error":"#REF!"},{"$error":"#REF!"},0,0,{"$error":"#NAME?"},{"$error":"#NAME?"},{"$error":"#NAME?"},{"$error":"#NAME?"}]
[1800000000000,{"$error":"#NAME?"},{"$error":"#REF!"},{"$error":"#REF!"},0,0,{"$error":"#NAME?"},{"$error":"#NAME?"},{"$error":"#NAME?"},{"$error":"#NAME?"}]
[2200000000000,{"$error":"#NAME?"},{"$error":"#REF!"},{"$error":"#REF!"},0,0,{"$error":"#NAME?"},{"$error":"#NAME?"},{"$error":"#NAME?"},{"$error":"#NAME?"}]
[2700000000000,{"$error":"#NAME?"},{"$error":"#REF!"},{"$error":"#REF!"},2700000000000,2700000000000,{"$error":"#NAME?"},{"$error":"#NAME?"},{"$error":"#NAME?"},{"$error":"#NAME?"}]

{"sheet":"Snubber","index":11,"n_rows":6,"n_cols":5,"rows_kept":6,"cut":false,"hidden":true,"merged":[]}
[null,null,"UNITS","STD UNITS"]
["Frequency of Ringing",85,"MHz",{"$f":"B2*1000000","v":85000000},"Hz"]
["SW capacitance",3000,"pF",{"$f":"B3*0.000000000001","v":3E-9},"F"]
["Lpar",{"$f":"1000000000*1/((D2*2*3.14159)^2*D3)","v":1.1686430773614742},"nH",{"$f":"B4/1000000000","v":1.1686430773614743E-9},"H"]
["Csnub",{"$f":"4*B3","v":12000},"pF",{"$f":"B5*0.000000000001","v":1.2E-8},"F"]
["Rsnub",{"$f":"SQRT(D4/D3)","v":0.62413755891936573},"Ω",{"$f":"B6","v":0.62413755891936573},"Ω"]

{"sheet":"Parallel Output Caps","index":12,"n_rows":17,"n_cols":5,"rows_kept":17,"cut":false,"hidden":true,"merged":[]}
[]
[]
[]
["Fsw",{"$f":"Fsw","v":400000}]
[]
["C1",20,"uF",{"$f":"B6/1000000","v":2.0000000000000002E-5},"F"]
["R1",0.5,"mOhms",{"$f":"B7/1000","v":5.0000000000000001E-4},"Ohms"]
[]
["C2",68,"uF",{"$f":"B9/1000000","v":6.7999999999999999E-5},"F"]
["R2",20,"mOhms",{"$f":"B10/1000","v":0.02},"Ohms"]
[]
[]
["I1 ",{"$f":"(D6/(D6+D9))*SQRT((D10*D9*B4)^2+1)/SQRT((((D7+D10)*D6*D9/(D9+D6))*B4)^2+1)","v":0.25667257397349275},"%"]
["I2 ",{"$f":"1-B13","v":0.74332742602650725},"%"]
[]
["I1 ",{"$f":"B13*(Iripple1/(2*SQRT(3)))","v":{"$error":"#NAME?"}},"A"]
["I2 ",{"$f":"B14*(Iripple1/(2*SQRT(3)))","v":{"$error":"#NAME?"}},"A"]