{"text_format":"1","workbook":"xlsx","n_sheets":14,"sheets":["Design the Converter","Image Test","Variable Management","Schematic Management","Schematic & BOM","EVMs","MOSFET Parameters","Stability Calculations","Efficiency Calculations","Efficiency Plot Management","Bode Plot Management","Standard Value Calculator","Snubber","Parallel Output Caps"],"not_rendered":{"charts":9,"images":31,"macros":1,"external_links":0,"defined_names":273,"comments":2,"pivot_tables":0},"unopened":[],"bounds":{"document_bytes":16777216,"sheet_cells":100000,"rows_first":2000,"rows_last":500,"rows_between":2000,"halvings":0,"cell_chars":16384,"cell_head_chars":4096},"cells_cut":0,"cells_raw":0,"read":"whole","date_system":"1900"}

{"sheet":"Design the Converter","index":0,"n_rows":73,"n_cols":17,"rows_kept":73,"cut":false,"hidden":false,"merged":[[2,14,2,15],[0,0,0,16],[43,11,44,16],[45,11,46,16]]}
["                    LMR604xx 36VIN, 4A/5A/6A Converter Design Tool"]
[null,null,null,null,null,null,null,null,null,null,null,null,null,null,"http://www.ti.com/product/lm5175"]
["About",null,"xx",null,null,"= Input Box",null,null,null,null,null,null,null,null,"TERMS OF USE",null,"                "]
[]
["Step 1: Operating Specifications"]
[null,null,null,"Device","LMR60460"]
[null,null,null,"Input Voltage – Min, VIN(min) ",9,"V"]
[null,null,null,"Input Voltage – Nom, VIN(nom)",12,"V"]
[null,null,null,"Input Voltage – Max, VIN(max)",16,"V"]
[null,null,null,"Output Voltage, VOUT ",3.3,"V",{"$f":"IF(OR(E10=5, E10=3.3), \"Fixed\", \"ADJ\")","v":"Fixed"}]
[null,null,null,"Full Load Output Current, IOUT ",6,"A"]
[null,null,null,"Switching Frequency, FSW",400,"kHz"]
[null,null,null,"Frequency Set Resistor, RT ",{"$f":"'Variable Management'!C352","v":86.6},{"$f":"'Variable Management'!E352","v":"kΩ"}]
[null,null,null,"Ambient Temperature, TA",25,"°C"]
[]
[]
[]
["Step 2: Buck Inductor"]
[null,null,null,"Inductance for 35% Ripple Current at VIN(nom)",{"$f":"Lopt*1000000","v":2.8482142857142851},"µH"]
[null,null,null,"Buck Inductance, LO ",3.3,"µH"]
[null,null,null,"Inductor DCR at 25°C",5.9,"mΩ"]
[null,null,null,"Inductor Pk-Pk Ripple Current at VIN(nom)",{"$f":"'Variable Management'!B73","v":1.867400452488688},"Apk-pk"]
[null,null,null,"DIL as a % of Full Load at VIN(nom)",{"$f":"'Variable Management'!D73*100","v":31.123340874811468},"%"]
[null,null,null,"Peak Inductor Current at VIN(max) and Full Load",{"$f":"'Variable Management'!B110","v":7.0301617096660092},"Apk"]
[null,null,null,"Peak Inductor Current Limit at VIN(nom)",{"$f":"Ipk_OCP_Vinnom","v":9.826805731523379},"Apk"]
[null,null,null,"Estimate Inductor Core Loss at VIN(nom)",0.2,"W"]
[]
["Step 3: Output Capacitors"]
[null,null,null,"Desired Output Voltage Ripple",15,"mVpk-pk"]
[null,null,null,"Effective COUT Value to Meet Ripple Spec",{"$f":"'Variable Management'!B124","v":38.904176093514337},"µF"]
[null,null,null,"Desired Crossover Frequency",40,{"$f":"\"     kHz \"","v":"     kHz "}]
[null,null,null,"Effective COUT Value to Meet Crossover Spec",{"$f":"'Variable Management'!B220","v":120.11665009665029},"µF"]
[null,null,null,"Output Capacitance (derated), COUT ",120,"µF"]
[null,null,null,"Output Cap ESR (Max) to Meet Ripple Spec",10,"mΩ"]
[null,null,null,"Output Capacitor ESR",1,"mΩ"]
[null,null,null,"Resulting Output Voltage Ripple (max) ",{"$f":"'Variable Management'!B130*1000","v":5.2092386714499384},"mVpk-pk"]
[null,null,null,"Output Capacitor RMS Current (max) ",{"$f":"'Variable Management'!B117","v":0.59476414038451542},"A (rms)"]
[null,null,null,"Effective Crossover Frequency",{"$f":"'Stability Calculations'!AK7","v":38.905000000000001},"kHz"]
[]
["Step 4: Input Capacitors"]
[null,null,null,"Input Voltage Ripple Spec",200,"mVpk-pk"]
[null,null,null,"Minimum Input Capacitance",{"$f":"'Variable Management'!B147","v":18.75},"µF"]
[null,null,null,"Input Capacitance (derated), CIN ",{"$f":"2*4.7*0.7","v":6.58},"µF"]
[null,null,null,"Maximum Permitted ESR",{"$f":"'Variable Management'!B152","v":"N/A"},"mΩ",null,null,null,null,null,{"$f":"CHOOSE(SCH_MODE, \"\", \"** For Single-Output Operation in 2-Phase Mode, tie MODE to VDDA and use FB1 to set VOUT **\", \"** For Single-Output Operation in 3-Phase Mode, tie both MODE pins to VDDA. Use FB1 of master IC to set VOUT. Connect FB2 of master IC to AGND. Connect FB2 of slave IC to VDDA to configure it as a slave **\", \"** For Single-Output Operation in 4-Phase Mode, tie both MODE pins to VDDA. Use FB1 of master IC to set VOUT. Connect FB2 of master IC to AGND. Connect FB2 of slave IC to VDDA to configure it as a slave **\")","v":""}]
[null,null,null,"Input Capacitor ESR",0.3,"mΩ"]
[null,null,null,"Resulting Input Voltage Ripple (max)",{"$f":"'Variable Management'!B157*1000","v":572.01786310256557},"mVpk-pk",null,null,null,null,null,{"$f":"CHOOSE(SCH_MODE, \"\", \"** For Single-Output Operation in 2-Phase Mode, tie MODE to VDDA and use FB1 to set VOUT **\", \"** For Single-Output Operation in 3-Phase Mode, tie both MODE pins to VDDA. Use FB1 of master IC to set VOUT. Connect FB2 of master IC to AGND. Connect FB2 of slave IC to VDDA to configure it as a slave **\", \"** For Single-Output Operation in 4-Phase Mode, tie both MODE pins to VDDA. Use FB1 of master IC to set VOUT. Connect FB2 of master IC to AGND. Connect FB2 of slave IC to VDDA to configure it as a slave **\")","v":""}]
[null,null,null,"Input Capacitor RMS Current (max)",{"$f":"'Variable Management'!B140","v":2.9400914229586133},"A (rms)"]
[]
["Step 5: Feedback Network"]
[null,null,null,{"$f":"CHOOSE(LMR604x0_FB_sel, \"Upper Feedback Resistance (E96), RFBT\", \"* Tie FB to VOUT for a Fixed 5V Output*\", \"*Tie FB to VOUT for a Fixed 3.3V Output*\")","v":"*Tie FB to VOUT for a Fixed 3.3V Output*"},100,"kΩ"]
[null,null,null,{"$f":" CHOOSE(LMR604x0_FB_sel, \"Lower Feedback Resistance (E96), RFBB\", \"\",\"\")","v":""},{"$f":"IF(Vout=Vref,\"OPEN\",Rfb2_u/1000)","v":43.2},{"$f":"IF(Vout=Vref,\"\",\"kΩ\")","v":"kΩ"}]
[null,null,null,{"$f":"CHOOSE(LMR604x0_FB_sel, \"Feedforward Capacitance, CFF\", \"*Select drop table as No CFF*\", \"*Select drop table as No CFF*\")","v":"*Select drop table as No CFF*"},10,"pF"]
[]
["Step 6: VIN UVLO",null,null,null,null,null,null,null,null,null,null,null,null,null,null,null," "]
[null,null,null,"Desired VIN UVLO Turn-On Threshold",5,"V"]
[null,null,null,"UVLO Divider Upper Resistance, RENT",100,"kΩ"]
[null,null,null,"UVLO Divider Lower Resistance (E96), RENB",{"$f":"Renb_u/1000","v":33.200000000000003},{"$f":"IF(Vout=Vref,\"\",\"kΩ\")","v":"kΩ"}]
[null,null,null,"Actual VIN UVLO Turn-On Threshold",{"$f":"1.25/E57*(E56+E57)","v":5.0150602409638543},"V"]
[null,null,null,"Actual VIN UVLO Turn-Off Threshold",{"$f":"E58*0.8","v":4.0120481927710836},"V"]
[]
[]
["Step 7: Power Loss & Thermals"]
[null,null,null,"IC Power Dissipation",{"$f":"'Efficiency Calculations'!BE109","v":1.2352226049207284},"W"]
[null,null,null,"Junction Temperature (estimate)",{"$f":"'Variable Management'!B296","v":129.25278785530949},"°C"]
[null,null,null,null,{"$f":"CHOOSE(Ext_VCC, \"* Tie FB pin to VOUT\", \"* Tie FB pin to VOUT Resistor Divider\")","v":"* Tie FB pin to VOUT"}]
[]
[]
["Pole/Zero Frequencies"]
[null,null,null,"Load Pole Frequency, FP-LOAD",{"$f":"Fp_dominant/1000","v":3.450186377403901},"kHz"]
[null,null,null,"Output Cap ESR Zero Frequency, FZ-ESR",{"$f":"Fesr/1000000","v":1.326291192432461},"MHz"]
[null,null,null,"Error Amp Dominant Pole Frequency, FP-EA",{"$f":"Fp1_u","v":11.109362084285808},"Hz"]
[null,null,null,"Compensator Zero Frequency, FZ-COMP",{"$f":"Fz1_u/1000","v":9.529873749824203},"kHz"]
[null,null,null,"Compensator Pole Frequency, FP-COMP",{"$f":"Fp2_u_simplified/1000","v":611.5002322803864},"kHz"]

{"sheet":"Image Test","index":1,"n_rows":4,"n_cols":3,"rows_kept":4,"cut":false,"hidden":true,"merged":[]}
[]
[null,"Images","Configuration"]
[null,null,"Fixed"]
[null,null,"ADJ"]

{"sheet":"Variable Management","index":2,"n_rows":357,"n_cols":26,"rows_kept":357,"cut":false,"hidden":true,"merged":[[32,17,32,19],[4,4,4,7],[0,0,0,8],[28,17,28,19],[29,17,29,19],[30,17,30,19],[31,17,31,19],[27,17,27,19]]}
["EXCEL Variables Names/Calculations"]
[null,"Input from user =",null,null,"Good"]
[null,"Output ="]
[null,"Constant"]
["Variable Name","Value","STD Units",null,"Notes",null,null,null,"Iteration"]
[]
[null,null,null,null,null,null,null,null,null,null,"Device GPN",null,null,null,"Use feedforward cap","Use CFF",1,null,"BOM Variant","LMR60440 5V",1,null,null,null,"selector used in power loss and thermal calculations"]
[null,null,null,null,null,null,null,null,null,null,null,"LMR60441",{"$f":"IF(AND((Vout=5),(Device=\"LMR60460\")),1,0)","v":0},null,null,"No CFF",2,null,null,"LMR60440 3.3V",2,null,null,null,"Fixed Output",1]
[null,null,null,null,null,null,null,null,null,null,null,"LMR60450",null,null,null,"Result",2,null,null,"LMR60440 ADJ",3,null,null,null,"Adjustable Output",2]
[null,null,null,null,null,null,null,null,null,null,null,"LMR60460",null,null,null,"No FF ",{"$f":"IF(Q9=2, TRUE, FALSE)","v":true},null,null,"LMR60430 5V",4,null,null,null,"Ext_VCC",{"$f":"IF(VOUT_FIXED = TRUE, 1, 2)","v":1}]
[null,null,null,null,null,null,null,null,null,null,"Device Selected",{"$f":"Device","v":"LMR60460"},null,null,null,null,null,null,null,"LMR60430 3.3V",5]
[null,null,null,null,null,null,null,null,null,null,null,null,null,null,null,null,null,null,null,"LMR60430 ADJ",6]
[]
[null,null,null,null,null,null,null,null,null,null,null,null,null,null,null,null,null,null,"4A fixed BOM Variant Selected",null,{"$f":"IF(AND(Device=\"LMR60440\",Vout=5),1,IF(AND(Device=\"LMR60440\",Vout=3.3),2,0))","v":0},"1 =5V, 4A; 2 = 3.3V, 4A"]
[null,null,null,null,null,null,null,null,null,null,null,null,null,null,null,null,null,null,"3A fixed BOM Variant Selected",null,{"$f":"IF(AND(Device=\"LMR60430\",Vout=5),4,IF(AND(Device=\"LMR60430\",Vout=3.3),5,0))","v":0},"4 = 5V, 3A; 5 = 3.3V, 3A"]
[null,null,null,null,null,null,null,null,null,null,null,null,null,null,null,null,null,null,"4A BOM Variant Adj",null,{"$f":"IF(AND(AND(SelectFixed4A = 0, SelectFixed3A = 0), Device = \"LMR60440\"),3,)","v":0},"Shows 3 if adj 4A"]
[null,null,null,null,null,null,null,null,null,null,null,null,null,null,null,null,null,null,"3A adj BOM Variant Selected",null,{"$f":"IF(AND(AND(SelectFixed4A = 0, SelectFixed3A = 0), Device = \"LMR60430\"),6,)","v":0},"Shows 6 if adj 3A"]
[null,null,null,null,null,null,null,null,null,null,null,null,null,null,null,null,null,null,"BOM Selector ",null,{"$f":"SUM(U14:U17)","v":0}]
["Step 1: Operational Specs"]
["VIN_min",{"$f":"'Design the Converter'!E7","v":9},"V","Minimum input voltage",null,null,null,null,1,null,"Used in Step 5: Feedback Network",null,null,null,"Used in efficiency calculations for single/dual phase",null,null,"Single/Dual Yes/No",1,null,"Selector used in schematic design. Mode = RT for FPWM, Mode = GND for DEM",null,null,"Selector used in Bode plot manager Set to single channel. "]
["VIN_nom",{"$f":"'Design the Converter'!E8","v":12},"V","Nominal input voltage",null,null,null,null,null,null,"LMR604x0 3.3Vout",{"$f":"IF(Vout = 3.3, 1, 0)","v":1},null,null,null,null,null,"MODE (Single/Dual), DUAL = 1, SINGLE = 2",{"$f":"IF(S20=1, 1, 2)","v":1},null,"FPWM",1,null,null,{"$f":"CHOOSE(SCH_MODE, \"Bode Plot (Ch1)\", \"Bode Plot - 2 Ph\", \"Bode Plot - 3 Ph\", \"Bode Plot - 4 Ph\")","v":"Bode Plot (Ch1)"},1]
["VIN_max",{"$f":"'Design the Converter'!E9","v":16},"V","Maximum input voltage",null,null,null,null,null,null,"LMR604x0 5Vout",{"$f":"IF(Vout=5,1,0)","v":0},null,null,null,null,null,"SINGLE OUTPUT (1 = YES)",{"$f":"IF(S20=1, 2, 1)","v":2},null,"DEM",2,null,null,{"$f":"IF(MODE=1, \"Bode Plot (Ch2)\", \"N/A - Do Not Use\")","v":"Bode Plot (Ch2)"},2]
[null,null,null,null,null,null,null,null,null,null,"Connection Point",{"$f":"IF(Vout=3.3,3,IF(Vout=5,2,1))","v":3},"1 = No, 2 = 5V, 3 = 3.3V",null,null,null,null,"Number of Phases",{"$f":"SCH_MODE","v":1},null,"FPWM/DEM",2,null,null,"BODE_PLOT_TYPE",1]
["Vout",{"$f":"'Design the Converter'!E10","v":3.3},"V","Output voltage",null,null,null,null,null,null,"Fixed VOUT",{"$f":"OR(L21,L22)","v":true},"If VOUT = 5 or 3.3"]
["Iout",{"$f":"'Design the Converter'!E11","v":6},"A","Output current",null,"Iout-max",{"$f":"CHOOSE(GPN, 6, 6)","v":{"$error":"#VALUE!"}},"A",1]
[null,null,null,null,null,null,null,null,1]
["Rout",{"$f":"Vout/Iout","v":0.54999999999999993},"Ω","Load resistance",null,null,null,null,null,null,null,null,null,"This defines the schematic variant"]
["Pout",{"$f":"Vout*Iout","v":19.799999999999997},"W","Output power",null,null,null,null,null,null,null,null,null,null,null,null,null,"Schematic Look-up Table",null,null,"Value"]
[null,null,null,null,null,null,null,null,null,null,null,null,null,"Schematic variant definition","LMR60440_Fix_FPWM",1,null,"If (Bom selector = 1 or 2 or 4 or 5) & DEMB = 1, do variant 1",null,null,{"$f":"IF(AND(OR(BOM_sel = 1, BOM_sel = 2, BOM_sel = 4, BOM_sel =5), DEMB = 1),1,)","v":0}]
["Efficiency",0.9,null,"Estimate of efficiency",null,null,null,null,null,null,null,null,null,null,"LMR60440_Adj_FPWM",2,null,"if (BOM selector = 3 or 6) & DEMB = 1, do variant 2",null,null,{"$f":"IF(AND(OR(BOM_sel = 3, BOM_sel = 6), DEMB = 1),2,)","v":0}]
["Pin",{"$f":"Pout/Efficiency","v":21.999999999999996},"W","Calculate input power assuming finite efficiency",null,null,null,null,null,null,null,null,null,null,"LMR60440_Fix_DEM",3,null,"If (Bom selector = 1 or 2 or 4 or 5) & DEMB = 2, do variant 3",null,null,{"$f":"IF(AND(OR(BOM_sel = 1, BOM_sel = 2, BOM_sel = 4, BOM_sel =5), DEMB = 2),3,)","v":0}]
[null,null,null,null,null,null,null,null,null,null,null,null,null,null,"LMR60440_Adj_DEM",4,null,"If (Bom selector = 3 or 6) & DEMB = 2, do variant 4",null,null,{"$f":"IF(AND(OR(BOM_sel = 3, BOM_sel = 6), DEMB = 2),4,)","v":0}]
["Iin_Vinmin",{"$f":"Pin/VIN_min","v":2.4444444444444442},"A",null,null,null,null,null,null,null,null,null,null,null,null,null,null,"Result",null,null,{"$f":"SUM(U29:U32)","v":0}]
["Iin_Vinnom",{"$f":"Pin/VIN_nom","v":1.833333333333333},"A","Input currents at min, nom, max Vin",null,null,null,{"$f":"AND(OSC=1, OR(Fsw/1000>2530, Fsw/1000<1800))","v":false},null,null,null,null,null,null,null,null,null,null,null,"VARIANT",{"$f":"U33","v":0}]
["Iin_Vinmax",{"$f":"Pin/VIN_max","v":1.3749999999999998},"A",null,null,null,null,{"$f":"AND(OSC=2, OR(Fsw/1000>500, Fsw/1000<300))","v":false}]
[null,null,null,null,null,null,null,{"$f":"OR(H34,H35)","v":false}]
["Fsw",{"$f":"'Design the Converter'!E12*1000","v":400000},"Hz","Nominal switching frequency - determines RT resistor"]
["RT resistor to AGND",{"$f":"((1/Fsw-(69.6*10^-9))/(2.825*10^-11))/1000","v":86.031858407079653},"kΩ",null,null,null,null,null,1,null,"basically if has fixed RT option"]
["Tsw",{"$f":"1/Fsw","v":2.5000000000000002E-6},"sec","Switching period"]
["Max crossover frequency = 20% Fsw",{"$f":"Fsw*0.2/1000","v":80},"kHz",null,null,"Min Crossover",10,null,null,null,"Adjustable"]
["Vref",1,"V","Reference voltage",null,null,null,null,null,null,"5V"]
["Rt",{"$f":"'Standard Value Calculator'!O12/1000","v":86.6},"kΩ","Frequency set resistor",null,{"$f":"IF(OR((Fsw=440000),(Fsw=2200000)),\"N/A\",Rfadj/1000)","v":8.6599999999999996E-2},null,null,null,null,"3.3V",1]
[null,null,null,null,null,null,null,null,null,null,"Adjustable_NoRT",2]
[null,null,null,null,null,null,null,null,null,null,"5V_NoRT",3]
[null,null,null,null,null,null,null,null,null,null,"3.3V_NoRT",4]
["Step 2: Buck Inductor","Channel 1",null,null,null,null,null,null,null,null,"Schematic setting",5]
["Don1",{"$f":"Vout/VIN_nom","v":0.27499999999999997},null,null,null,"Ideal Duty Cycle at VIN(nom)",null,null,null,null,null,6]
["Doff1",{"$f":"1-B47","v":0.72500000000000009},null,null,null,"Ideal 1- Duty Cycle at VIN(nom)",null,null,null,null,null,{"$f":"IF(No_RT, IF(Vout=3.3, 6, IF(Vout=5, 5, 4)),IF(Vout=3.3, 3, IF(Vout=5, 2, 1)))","v":3}]
[]
["D_Vinmin",{"$f":"Vout/VIN_min","v":0.36666666666666664}]
["D_Vinnom",{"$f":"Vout/VIN_nom","v":0.27499999999999997}]
["D_Vinmax",{"$f":"Vout/VIN_max","v":0.20624999999999999}]
[]
["L_Vinnom",{"$f":"(VIN_nom-Vout)*D1_Vinnom/(Fsw*Iout*0.35)","v":2.8482142857142852E-6},"H",null,null,"Calculated inductance for 35% ripple at VIN(nom)"]
["L_slopecomp",{"$f":"0.27*Vout/Fsw","v":2.2274999999999998E-6},"H","Matches DS",null,"Calculated inductance based on one times inductor downslope"]
[]
["Lopt",{"$f":"B54","v":2.8482142857142852E-6},"H",null,null,"min of calculated inductances at VIN(min) and VIN(nom)"]
["L_actual_TPSM63602-03",{"$f":"-0.0238*Iout^2-0.0868*Iout+2.0073","v":0.6296999999999997},"uH",null,null,"Calculate TOKO chip inductance based on entered load current value"]
["L_actual_TPSM63604-06",{"$f":"-0.1304*Iout+2.32","v":1.5375999999999999},"uH",null,null,"Calculate MagLayers inductance based on entered load current value"]
[]
["Lo",{"$f":"'Design the Converter'!E20*0.000001","v":3.2999999999999997E-6},"H",null,null,"Chosen inductance"]
["Rdcr",{"$f":"'Design the Converter'!E21/1000","v":5.9000000000000007E-3},"Ω",null,null,"Chosen inductor DCR"]
[]
["Don2",{"$f":"(Vout+Iout*(Rdcr+Rdson2))/(Vin+Iout*(Rdson2-Rdson1))","v":0.29155354449472098}]
["Doff2",{"$f":"1-_Don2","v":0.70844645550527896}]
[]
["D_Vinmin_2",{"$f":"(Vout+Iout*(Rdcr+Rdson2))/(VIN_min+Iout*(Rdson2-Rdson1))","v":0.38945601074546682},null,{"$f":"Vout/VIN_min","v":0.36666666666666664},null,"Duty cycles adjusted for DCR/Rdson voltage drops"]
["D_Vinnom_2",{"$f":"(Vout+Iout*(Rdcr+Rdson2))/(VIN_nom+Iout*(Rdson2-Rdson1))","v":0.29155354449472098},null,{"$f":"Vout/VIN_nom","v":0.27499999999999997}]
["D_Vinmax_2",{"$f":"(Vout+Iout*(Rdcr+Rdson2))/(VIN_max+Iout*(Rdson2-Rdson1))","v":0.21836324839964857},null,{"$f":"Vout/VIN_max","v":0.20624999999999999},null,{"$f":"(Ts-0.000000085)/Ts","v":0.96599999999999997},"Dmax = [Ts-toff(min)]/Ts"]
[]
[]
["Iripple_Vinmin",{"$f":"(VIN_min-Vout-Iout*(Rdcr+Rdson1))*D1_Vinmin_2/(Fsw*Lf)","v":1.609338451675927},"A",{"$f":"B72/Iout","v":0.26822307527932115},null,"Ripple calculations include DCR and Rdson"]
["Iripple_Vinnom",{"$f":"(VIN_nom-Vout-Iout*(Rdcr+Rdson1))*D1_Vinnom_2/(Fsw*Lf)","v":1.867400452488688},"A",{"$f":"B73/Iout","v":0.31123340874811467},null,"% ripple current at Vin-nom"]
["Iripple_Vinmax",{"$f":"(VIN_max-Vout-Iout*(Rdcr+Rdson1))*D1_Vinmax_2/(Fsw*Lf)","v":2.0603234193320179},"A",{"$f":"B74/Iout","v":0.34338723655533632},null,"Max inductor ripple current - it's at Vin-max"]
[]
["Iinductor_rms_Vinmin",{"$f":"SQRT(Iout^2+(Iripple_Vinmin^2)/12)","v":6.017959027306258},"A"]
["Iinductor_rms_Vinnom",{"$f":"SQRT(Iout^2+(Iripple_Vinnom^2)/12)","v":6.0241678847922984},"A"]
["Iinudctor_rms_Vinmax",{"$f":"SQRT(Iout^2+(Iripple_Vinmax^2)/12)","v":6.0294066360370264},"A"]
[]
[]
["Core loss estimate - Vin(nom)",{"$f":"'Design the Converter'!E26","v":0.2},"W"]
[]
[]
["Inductor copper temperature",125,"°C"]
["Inductor DCR at hot",{"$f":"Rdcr*(1+Ltc*(B84-25))*1000","v":8.2187000000000001},"mΩ"]
[]
[]
["Step 2b: Sense Resistors, Slope Comp, Current Limit"]
[]
["Ilimit_inductor_Vinmin",{"$f":"Ipk_OCP_Vinmin","v":9.6343294828744135},"A","refers to B87",null,"Peak inductor current at current limit inception"]
["Ilimit_inductor_Vinnom",{"$f":"Ipk_OCP_Vinnom","v":9.826805731523379},"A","refers to B88"]
["Ilimit_inductor_Vinmax",{"$f":"Ipk_OCP_Vinmax","v":9.9706978536462909},"A","refers to B89"]
[]
["CS threshold_min",6.8000000000000005E-2,"V","not applicable here"]
["CS threshold",7.4999999999999997E-2,"V","not applicable here"]
["CS threshold_max",8.2000000000000003E-2,"V","not applicable here"]
[]
["Rs",6.5000000000000002E-2,"Ω",null,null,"Current sense resistance Rs = 0.12Ohm: high-side MOSFET Rdson"]
[]
["Current limit setpoint - peak - Vin(min)",{"$f":"_xlfn.SWITCH(Device,\"LMR60441\",6.7,\"LMR60450\",8.7,\"LMR60460\",10.4,10.4)-(1.966)*MAX(0, (D1_Vinmin_2))","v":9.6343294828744135},"A",null,"6.9-1.966*MAX(0, (D1_Vinmin_2)) (original)","Golf Peak Current limit can be defined that at 100% duty cycle, the current limit will drop by 28.5% from the 0% duty cycle current limit (6.9A nominal)"]
["Current limit setpoint - peak - Vin(nom)",{"$f":"_xlfn.SWITCH(Device,\"LMR60441\",6.7,\"LMR60450\",8.7,\"LMR60460\",10.4,10.4)-(1.966)*MAX(0, (D1_Vinnom_2))","v":9.826805731523379},"A",null,null,"Peak current limit (6.9A trimmed at ATE minus slope comp contribution) = min inductor sat current at hot"]
["Current limit setpoint - peak - Vin(max)",{"$f":"_xlfn.SWITCH(Device,\"LMR60441\",6.7,\"LMR60450\",8.7,\"LMR60460\",10.4,10.4)-(1.966)*MAX(0, (D1_Vinmax_2))","v":9.9706978536462909},"A"]
[]
["Iout_OCP_Vinmin",{"$f":"Ipk_OCP_Vinmin-Iripple_Vinmin/2","v":8.8296602570364495},"A",null,null,"Current limit setpoints (i.e. IOUT) assuming no CS delay"]
["Iout_OCP_Vinnom",{"$f":"Ipk_OCP_Vinnom-Iripple_Vinnom/2","v":8.8931055052790349},"A"]
["Iout_OCP_Vinmax",{"$f":"Ipk_OCP_Vinmax-Iripple_Vinmax/2","v":8.9405361439802817},"A"]
[]
["Ipk_full-load_Vinmin",{"$f":"Iout+Iripple_Vinmin/2","v":6.804669225837964},"A"]
["Ipk_full-load_Vinnom",{"$f":"Iout+Iripple_Vinnom/2","v":6.9337002262443441},"A"]
["Ipk_full-load_Vinmax",{"$f":"Iout+Iripple_Vinmax/2","v":7.0301617096660092},"A"]
[]
[]
["Step 3: Output Capacitor"]
["Icoutrms_VINmin",{"$f":"Iripple_Vinmin/SQRT(12)","v":0.46457599414615602},"A",null,null,"Output cap RMS current"]
["Icoutrms_VINnom",{"$f":"Iripple_Vinnom/SQRT(12)","v":0.53907207696458648},"A"]
["Icoutrms_VINmax",{"$f":"Iripple_Vinmax/SQRT(12)","v":0.59476414038451542},"A"]
["Max Cout rms current",{"$f":"MAX(B114:B116)","v":0.59476414038451542},"A"]
[]
["Vripple1",{"$f":"'Design the Converter'!E29/1000","v":1.4999999999999999E-2},"V",null,null,"Output voltage ripple spec(pk-pk)"]
[]
["Output Ripple Spec (pk-pk)",{"$f":"Vo1_ripple*1000","v":15},"mV",null,null,"Vout ripple spec at Vin(nom)"]
[]
["Coutmin",{"$f":"Iripple_Vinnom/(Fsw*8*Vo1_ripple)","v":3.8904176093514335E-5},"F",null,null,"Minimum output capacitnace",null,{"$f":"Vo2_ripple","v":0},1]
["Reported Coutmin",{"$f":"IF(Cout_min*1000000<10, 10,Cout_min*1000000)","v":38.904176093514337},"uF"]
["Cout",{"$f":"'Design the Converter'!E33/1000000","v":1.2E-4},"F",null,null,"Chosen output capacitance",null,null,1]
["Resrmax",{"$f":"SQRT((Vo1_ripple/Iripple_Vinnom)^2-(1/(Fsw*Cout*8))^2)","v":7.598702716344983E-3},"Ω",null,null,"Max ESR before ripple exceeds Vripple1. Terms are squared because the voltage ripple from ESR and output capacitor are out of phase, so you need to treat the ripples like you're summing two orthogonal vectors.",null,null,1]
[]
["Reported Cout ESR max",{"$f":"IF(OR(CoutEsrMax>0.3, CoutEsrMax<0, (ISERROR(CoutEsrMax))), \"N/A\", CoutEsrMax*1000)","v":7.5987027163449827},"mΩ"]
["CoutEsr",{"$f":"'Design the Converter'!E35/1000","v":1E-3},"Ω",null,null,"Chosen ESR",null,null,1,null,{"$f":"ISERROR(CoutEsrMax)","v":false}]
["Vripple",{"$f":"Iripple_Vinnom*SQRT(Cout_ESR^2+(1/(8*Fsw*Cout))^2)","v":5.2092386714499388E-3},"Vp-p"]
[null,null,null,null,null,null,null,null,null,null,{"$f":"OR(TRUE, FALSE, TRUE)","v":true},{"$f":"ISERROR(B128)","v":false}]
["Step 4: Input Capacitor",null,null,null,null,null,null,null,null,null,null,{"$f":"OR(CoutEsrMax>0.3,CoutEsrMax<0)","v":false}]
[]
["Icinrms_VINmin",{"$f":"SQRT(D1_Vinmin_2*(Iout^2*(1-D1_Vinmin_2)+Iripple_Vinmin^2/12))","v":2.9400914229586133},"A",null,null,"Calculate input cap rms current"]
["Icinrms_VINnom",{"$f":"SQRT(D1_Vinnom_2*(Iout^2*(1-D1_Vinnom_2)+Iripple_Vinnom^2/12))","v":2.7423580708883653},"A"]
["Icinrms_VINmax",{"$f":"SQRT(D1_Vinmax_2*(Iout^2*(1-D1_Vinmax_2)+Iripple_Vinmax^2/12))","v":2.4943438852401254},"A",null,null,null,null,null,null,null,null,null,null,null,"A"]
["Max Cin rms current",{"$f":"MAX(B134:B136)","v":2.9400914229586133},"A"]
[]
["Icinrms - max at D = 0.5",{"$f":"Iout/2","v":3},"A"]
["Final result",{"$f":"IF(VIN_min<2*Vout, Iout/2, B134)","v":2.9400914229586133},"A","…report this"]
[]
["Vinripple1",{"$f":"'Design the Converter'!E41/1000","v":0.2},"Vp-p",null,null,"Input voltage ripple spec (pk-pk)"]
[null,null,null,null,null,{"$f":"Number_of_Phases","v":1}]
["Cinmin_Vinmax",{"$f":"Iout*D1_Vinmax*(1-D1_Vinmax)/(Vinripple1*Fsw)","v":1.2278320312499997E-5},"F",null,null,"Calculate cap at Vinmax and 50% duty cycle (Vin = 2*Vout)"]
["Cinmin_50%D",{"$f":"Iout*0.5*(1-0.5)/(Vinripple1*Fsw)","v":1.8749999999999998E-5},"F",null,null,"Buck 50% typically worst case"]
["Cinmin",{"$f":"IF(VIN_max<2*Vout, B144,B145)","v":1.8749999999999998E-5},"F"]
["Reported Cinmin",{"$f":"IF(Cinmin*1000000<4.7, 4.7,Cinmin*1000000)","v":18.75},"uF",null,null,"…report this"]
["Cin",{"$f":"'Design the Converter'!E43/1000000","v":6.5799999999999997E-6},"F",null,null,"Input capacitance"]
["CinEsrMax_Vinmax",{"$f":"-(Iout*D1_Vinmax*(1-D1_Vinmax)/(Cin*Fsw)-Vinripple1)/(Iout+Iripple_Vinmax/2)","v":-2.4636876427154022E-2},"Ω"]
["CinEsrMax_50%D",{"$f":"-(Iout*0.5*(1-0.5)/(Cin*Fsw)-Vinripple1)/(Iout+Iripple_Vinmax/2)","v":-5.2617397702397858E-2},"Ω",null,null,"Calculate ESR at Vinmax and 50% duty cycle (Vin = 2*Vout)"]
["CinEsrMax",{"$f":"IF(VIN_max<2*Vout, B149,B150)","v":-5.2617397702397858E-2},"Ω"]
["Reported Cin ESR max",{"$f":"IF(OR(CinEsrMax>0.3, CinEsrMax<0), \"N/A\",CinEsrMax*1000)","v":"N/A"},"mΩ",null,null,"…report this"]
["RCinEsr",{"$f":"'Design the Converter'!E45/1000","v":2.9999999999999997E-4},"Ω",null,null,"Input capacitance series resistance (ESR)"]
[]
["Vinripple2_Vinmax",{"$f":"Iout*D1_Vinmax_2*(1-D1_Vinmax_2)/(Cin*Fsw)+(Iout +Iripple_Vinmax/2)*RCinEsr","v":0.39119888167703798},"Vp-p"]
["Vinripple2_50%D",{"$f":"Iout*0.5*(1-0.5)/(Cin*Fsw)+(Iout +Iripple_Vinmax/2)*RCinEsr","v":0.57201786310256553},"Vp-p",null,null,"Calculate ripple at Vinmax and 50% duty cycle (Vin = 2*Vout)"]
["Vinripple2",{"$f":"IF(VIN_max<2*Vout, B155,B156)","v":0.57201786310256553},"Vp-p",null,null,"…report highest of these"]
[]
[null,{"$f":"Iout*D1_Vinmax_2*(1-D1_Vinmax_2)/(Cin*Fsw)","v":0.3890898331641382},"Vp-p"]
[]
["Step ?: Other Components - MODE"]
[]
["RPG1/2",100,"kΩ"]
["RFB1/2",null,"Ω",null,"Tie to VDDA 3.3V/5V output, respectively. "]
["R_MODE",null,"Ω",null,"Tie to VDDA or AGND for Single/Dual operation, respectively. "]
[null,null,"Ω"]
[]
[]
["Step 5: Feedback Network and Internal Compensation"]
["Pi",{"$f":"PI()","v":3.1415926535897931},null,"p"]
["CS Amp Gain (effective value)",{"$f":"_xlfn.SWITCH(Device,\"LMR60441\",2.342,\"LMR60450\",1.8735,\"LMR60460\",1.5613,1.5613)","v":1.5612999999999999},1.3,"CS Amp = gm2*Rs; and shunt resistor Rs is high-side MOSFET resistance RDSONHS",null,"Effective CS gain - depending on control architecture"]
["Ri",{"$f":"Rdson1*CSAmp_gain","v":5.46455E-2},"Ω","Grabbed value from SIMPLIS model.Use slightly higher value to match bench",null,"Current Sense effective resistance = shunt resistor Rs * CS amp gain"]
[]
["Se_ext",{"$f":"(B178/Ri)*1000000","v":1122984000},"A/s",null,null,"Slope Comp Slope - referred to inductor current"]
["Sn",{"$f":"(Vin-Vout)/Lf","v":2636363.6363636362},"A/s","(VIN-VOUT)/L",null,"On-time Slope"]
["Sf",{"$f":"Vout/Lf","v":1000000},"A/s","VOUT/L",null,"Off-time Slope"]
[]
["Se_int",{"$f":"0.27*1.733*_xlfn.SWITCH(Device,\"LMR60441\",4,\"LMR60450\",5,\"LMR60460\",6,6)*Fsw*Ri/1000","v":61.366022171999994},"mV/μs","From SIMPLIS (1V amplitude, period of 1/fsw, multiply by gain of 0.27)",null,"Slope Comp Slope - referred to IC",null,"Slope = 0.27"]
["Sn_int",{"$f":"Sn*Ri/1000","v":144.0654090909091},"mV/μs",null,null,"Upslope"]
["Sf_int",{"$f":"Sf*Ri/1000","v":54.645499999999998},"mV/μs",null,null,"Downslope"]
[]
["Gain Terms Control-to-Output"]
["Km",{"$f":"VIN_nom/0.27","v":44.444444444444443},{"$f":"1/((0.5-D1_Vinnom)*Ri*(1/(Fsw*Lf))+(Vout*Ri*(1/(Lf*Fsw))/VIN_nom))","v":48.311388860930904},"From Sheehan's paper",null,{"$f":"1/((0.5-D1_Vinnom)*Ri*(1/(Fsw*Lf))+(Vout*Ri*(1/(Lf*Fsw))/VIN_nom))","v":48.311388860930904},{"$f":"1/((0.5-D1_Vinnom)*Ri*(1/(Fsw*Lf))+(Vout*Ri*(1/(Lf*Fsw))/VIN_nom))","v":48.311388860930904},{"$f":"1/((0.5-D1_Vinnom)*Ri*(1/(Fsw*Lf))+((Se_int*1000/Fsw)*CSAmp_gain)/VIN_nom)","v":34.15866237010659}]
["Kd",{"$f":"1+(Ro/(Km*Ri))","v":1.2083333333333333},null,"From Sheehan's paper"]
["mc",{"$f":"1+Se_int/Sn_int","v":1.425959448275862},null,"Mc is ratio of 1+ (Se_int/Sn_int)"]
["Q",{"$f":"1/(Pi*((1-(Vout/Vin))*(mc)-0.5))","v":0.59628625456528028},null,"Q equation in PCM2 Bob Sheehan",null,"1/(Pi*(k-0.5))",null,"Q = 2/Pi = 0.636 gives ideal one-cycle damping"]
[]
["Error Amp (EA)"]
["gm",8.6479999999999992E-6,"S",null,null,"Error Amp Transconductance"]
["Imod",3.7530000000000002E-4]
["GBW",1.44,"MHz","Check Simplis (plotting TF across error amp_",null,"EA gain-bandwidth product"]
["Cbw",{"$f":"gm/(2*Pi*GBW*1000000)","v":9.5581385267966022E-13},"F","Need to check",null,"EA effective bandwidth limiting capacitance = gm/(2*Pi*GBW)"]
[]
["RoEA",540000000,"Ω","Simplis model (DCGain/GM)",null,"EA output resistance"]
[]
["AEA",{"$f":"gm*RoEA","v":4669.9199999999992},"V/V",null,null,"EA DC gain = gm*RoEA"]
["Afb",{"$f":"Vref/Vout","v":0.30303030303030304},"V/V",null,null,"Feedback gain from Vout to FB"]
["Acs",{"$f":"1/Ri","v":18.299768507928373},{"$f":"1/Ri","v":18.299768507928373},null,null,"Acs = 1/Ri"]
["Am",{"$f":"Rout/Ri","v":10.064872679360604},null,"Buck modulator gain"]
[null,null,{"$f":"Acs*Ro/Kd","v":8.3295498036087761}]
["DC Gain is Adc = AEA*Afb*Am"]
["Power-Stage"]
["Rout",{"$f":"Rout","v":0.54999999999999993},"Ω",null,null,"Output Resistance (Load)"]
["Fp_load_buck_simplified",{"$f":"Kd/(2*Pi*Ro*Cout)","v":2913.8215591319222},"Hz",null,null,"Buck dominant pole frequency - without slope comp influence"]
["Fp_load_buck",{"$f":"Kd/(2*Pi*Ro*Cout)+((mc*(1-D1_Vinnom)-0.5)/(2*Pi*Fsw*Lf*Cout))","v":3450.1863774039011},"Hz",null,null,"Buck dominant pole frequency -- note slope comp influence"]
["Fp_dominant",{"$f":"Fload_u","v":3450.1863774039011},"Hz"]
["Inductor pole",{"$f":"(B183*Ri)/(2*Pi*Lf)","v":117132.67936334232},"Hz","inductor pole"]
["Fesr",{"$f":"1/(2*Pi*Cout*Cout_ESR)","v":1326291.1924324611},"Hz",null,null,"Cout ESR zero frequency"]
["Cbw",{"$f":"Cbw","v":9.5581385267966022E-13},"F",null,null,"Cbw"]
[]
["Error Amplifier"]
["Fp_EA",{"$f":"1/(2*Pi*(RoEA)*Cc1ea_u)","v":11.109362084285808},"Hz",null,null,"Error Amp LF pole -- related to amplifier ouptut resistance and comp cap"]
["Fp_HF_simplified",{"$f":"1*(Cc1ea_u+Cc2ea_u)/(2*Pi*Rcea1_u*Cc2ea_u*Cc1ea_u)","v":611500.23228038638},"Hz",null,null,"Error Amp HF pole without Cbw effect (like the SIMPLIS model)"]
["Fp_HF",{"$f":"1/(2*Pi*Rcea1_u*(Cc2ea_u+Cbw))","v":183765.81257006983},"Hz",null,null,"Error Amp HF pole cancels zero related to Output Cap ESR"]
["F_mod",{"$f":"Fsw/2","v":200000},"Hz",null,null,"Zero-order sample-and-hold effects of current-mode control modeled as pole at Fsw/2"]
["Fz_ff",{"$f":"IF(NO_FF_CAP=TRUE, 1000000000, 1/(2*Pi*Rfb1_*Cff_u*0.000000000001))","v":1000000000},"Hz",{"$f":"Fz_ff/1000","v":1000000},"kHz"]
["Fp_ff",{"$f":"IF(NO_FF_CAP=TRUE, 1000000000, 1/(2*Pi*Rfb4_u*Cff_u*0.000000000001))","v":1000000000},"Hz",{"$f":"Fp_ff/1000","v":1000000},"kHz"]
[]
["Desired Crossover Frequency",{"$f":"'Design the Converter'!E31*1000","v":40000},"Hz"]
["Cout - for the Fc spec",{"$f":"(Rcea1_u*gm*Vref)/(Fcross*2*Pi*Vout*Ri)*1000000","v":120.11665009665029},"uF",null,null,"Output cap to meet the crossover frequeny spec"]
[]
["Chosen Compensation Components from the standard value sheet"]
["Rcea1_u",629500,"Ω","Rcomp",null,{"$f":"1/(Rcea1*2*Pi*(Fsw/2))-Cbw","v":{"$error":"#REF!"}}]
["Cc1ea_u",2.6530000000000001E-11,"F","Ccomp"]
["Cc2ea_u",4.1999999999999998E-13,"F","Chf"]
[]
["Resulting Pole/Zero Locations",null,null,null,null,{"$f":"Cout","v":1.2E-4},{"$f":"Cout_ESR","v":1E-3}]
["Fz1",{"$f":"1/(2*Pi*Rcea1_u*Cc1ea_u)","v":9529.8737498242026},"Hz","Zero from Rcomp, Ccomp",null,"This zero is set at or close to the dominant load pole"]
["Fp2",{"$f":"1/(2*Pi*Rcea1_u*(Cc2ea_u+Cbw))","v":183765.81257006983},"Hz","high frequency pole Rcomp, Chf",null,"This pole cancels the zero from the Output Cap ESR"]
[]
["Rfb1",{"$f":"'Design the Converter'!E50*1000","v":100000},"Ω",null,null,"Upper Feedback Resistance - chosen by user"]
["Rfb2",{"$f":"IF(Vout=Vref, \"N/A\", Vref*B231/(Vout-Vref))","v":43478.260869565223},"Ω",{"$f":"Rfb2_u","v":43200},null,"Upper Feedback Resistance"]
["Rfb2_u",{"$f":"IF(Vout=Vref,\"N/A\",'Standard Value Calculator'!O11)","v":43200},"Ω",null,null,"Std Value Upper Feedback Resistance"]
["Cff",{"$f":"1/(2*Pi*200000)/Rfb1_","v":7.9577471545947678E-12},"F",{"$f":"1/(1/Rfb1_+1/Rfb2_u)","v":30167.597765363127},"Ω","Based on a 200kHz zero frequency"]
["Cff_u",{"$f":"IF('Design the Converter'!E52<0.1, 0.1, 'Design the Converter'!E52)","v":10},"pF"]
[]
[]
["Step 6: UVLO Divider"]
["VIN UVLO turn-on voltage",{"$f":"'Design the Converter'!E55","v":5},"V"]
["VIN UVLO turn-off voltage",{"$f":"'Design the Converter'!E59","v":4.0120481927710836},"V"]
["Rent",{"$f":"'Design the Converter'!E56*1000","v":100000},"Ω"]
["Renb",{"$f":"B241*(1.25/(B239-1.25))","v":33333.333333333328},"Ω"]
["Renb_u",{"$f":"'Standard Value Calculator'!O7","v":33200},"Ω"]
[]
["Step 7: Efficiency"]
["VAR",0]
["Design"]
["Ta",{"$f":"'Design the Converter'!E14","v":25},"°C","Ambient Temperature"]
["Components"]
["LTc",{"$f":"3930/1000000","v":3.9300000000000003E-3},"%/°C","Inductor DCR Temp Co"]
["θCA",22,"°C/W","Inductor Core-to-Ambient Thermal Resistance"]
["RCinEsr",{"$f":"RCinEsr","v":2.9999999999999997E-4},"Ω","Input Capacitor ESR"]
[]
["Controller Characteristics"]
["VCC",3.15,"V"]
["Top Driver"]
["RdsonDRT",0.5,"Ω","Drain-Source Resistance of Pullup High-side FET Driver"]
["RdsonDRT2",0.5,"Ω","Drain-Source Resistance of Pulldown High-side FET Driver"]
["Bottom Driver"]
["RdsonDRB",0.5,"Ω","Drain-Source Resistance of Pullup Low-side FET Driver"]
["RdsonDRB2",0.5,"Ω","Drain-Source Resistance of Pulldown Low-side FET Driver"]
["Deadtime"]
["Deadtime",5.5500000000000001E-9,"s","Total Deadtime",null,null,"5.55ns"]
["IQ"]
["IQ ",3.4999999999999997E-5,"A","Quiescent Current of MC-Q0 converter (current into VOUT/BIAS pin + VIN pin, non switching)"]
[]
["High- & low-side MOSFETs - Ch1","Q1: high-side",null,"Q2: low-side"]
["Rdson",{"$f":"'MOSFET Parameters'!E6*0.001","v":3.5000000000000003E-2},"Ω",{"$f":"'MOSFET Parameters'!F6*0.001","v":2.4E-2},"W","Drain-Source Resistances of internal FETs"]
["RdsonTopTc",{"$f":"4000/1000000","v":4.0000000000000001E-3},"%/°C",4.0000000000000001E-3,"%/°C","Drain-Source Resistance Temp Co"]
["Qg",{"$f":"'MOSFET Parameters'!E7/1000000000","v":3.182E-9},"C",{"$f":"'MOSFET Parameters'!F7/1000000000","v":5.0469999999999996E-9},"C","Gate Charge at VCC = 3.15V"]
["Qgd",{"$f":"'MOSFET Parameters'!E8/1000000000","v":1.446E-9},"C",{"$f":"'MOSFET Parameters'!F8/1000000000","v":2.0110000000000002E-9},"C","Gate to Drain Charge"]
["Qgs",{"$f":"'MOSFET Parameters'!E9/1000000000","v":1.9770000000000001E-9},"C",{"$f":"'MOSFET Parameters'!F9/1000000000","v":3.8730000000000002E-9},"C","Gate to Source Charge"]
["Qoss",{"$f":"'MOSFET Parameters'!E10/1000000000","v":4.0860000000000002E-9},"C",{"$f":"'MOSFET Parameters'!F10/1000000000","v":8.5716000000000005E-9},"C","Output Charge"]
["Coss",{"$f":"'MOSFET Parameters'!E11/1000000000000","v":1.135E-10},"F",{"$f":"'MOSFET Parameters'!F11/1000000000000","v":2.3809999999999998E-10},"F","Output Capacitance"]
["Rgate",{"$f":"'MOSFET Parameters'!E12","v":0},"W",{"$f":"'MOSFET Parameters'!F12","v":0},"W","Gate Resistance"]
["Gfs",{"$f":"'MOSFET Parameters'!E13","v":100},"S",{"$f":"'MOSFET Parameters'!F13","v":100},"S","Transconductance"]
["Vth",{"$f":"'MOSFET Parameters'!E14","v":1.2},"V",{"$f":"'MOSFET Parameters'!F14","v":1.1000000000000001},"V","Threshold Voltage"]
["Vsp",{"$f":"Vth_Q1+Iout/Gfs_Q1","v":1.26},"V",{"$f":"Vth_Q2+Iout/Gfs_Q2","v":1.1600000000000001},"V","Switch Point Voltage of FETs"]
[]
["Vsd - Buck",{"$f":"'MOSFET Parameters'!E15","v":0.7},"V",{"$f":"'MOSFET Parameters'!F15","v":0.7},"V","Diode Forward Voltage of MOSFET Body diode"]
["QrrTop",null,"C",{"$f":"'MOSFET Parameters'!F16/1000000000","v":6.9999999999999998E-9},"C","Reverse Recovery Charge of Body Diode"]
["TrrTop",4.0000000000000001E-8,"s",4.0000000000000001E-8,"s","Reverse Recovery Time of Body Diode"]
["θJA-MOSFET",23,"°C/W",23,"°C/W","Junction-to-Ambient Resistance"]
[]
[]
["Controller"]
["θJACtrl",84.4,"°C/W",null,null,"Junction-to-ambient thermal resistance of converter"]
["Outputs"]
["Top FET"]
["Tr",{"$f":"(Qgd_Q1+Qgs_Q1/2)*(RdsonDRT+Rgate1)/(VCC-Vsp_Q1)","v":6.440476190476191E-10},"s"]
["Tf",{"$f":"(Qgd_Q1+Qgs_Q1/2)*(RdsonDRT2+Rgate1)/(Vsp_Q1)","v":9.660714285714286E-10},"s"]
[]
["IC Power Disipation","Value","Units"]
["Power Dis",{"$f":"'Efficiency Calculations'!BE109","v":1.2352226049207284},"W"]
["Temp rise",{"$f":"B294*ThetaJaCtrl","v":104.25278785530949},"°C"]
["Junction temperature",{"$f":"B295 + Ta","v":129.25278785530949},"°C"]
[]
["Current (switching)",{"$f":"(Qg_Q1+Qg_Q2)*Fsw+Iq","v":3.3265999999999999E-3},"A"]
["Qrr Current",{"$f":"Qrr_Q2*Fsw","v":2.8E-3},"A"]
["Diode Current",{"$f":"C300/Vin","v":{"$error":"#NAME?"}},{"$f":"Deadtime*Fsw*(Ipp/2)*(Vsd_Q1+Vsd_Q2)","v":{"$error":"#NAME?"}}]
["Total Application Switching IQ",{"$f":"SUM(B298:B300)","v":{"$error":"#NAME?"}},"A"]
[]
["Low-side MOSFET/Diode"]
["Part Power"]
["Power Dis"]
[]
["SCHEMATIC LABELS"]
[{"$f":"\"RFBT = \"&'Design the Converter'!E50&\"kΩ\"","v":"RFBT = 100kΩ"},{"$f":"IF(VARIANT<5, 'Design the Converter'!E50&\" kΩ\", \"\")","v":"100 kΩ"},null,{"$f":"'Design the Converter'!E50&\"kΩ\"","v":"100kΩ"},{"$f":"'Design the Converter'!G10","v":"Fixed"}]
[{"$f":"\"RFBB = \"&'Design the Converter'!E51&\"kΩ\"","v":"RFBB = 43.2kΩ"},{"$f":"IF(VARIANT<5, 'Design the Converter'!E51&\" kΩ\", \"\")","v":"43.2 kΩ"},null,{"$f":"'Design the Converter'!E51&\"kΩ\"","v":"43.2kΩ"},{"$f":"E308=\"ADJ\"","v":false}]
[{"$f":"\"CFF = \"&'Design the Converter'!E52&\"pF\"","v":"CFF = 10pF"},{"$f":"IF(VARIANT< 5, IF(NO_FF_CAP=TRUE,\"N/A\",IF(Cff_u>0.1,ROUND(Cff_u,1)&\" pF\",\"N/A\")), \"\")","v":"N/A"},null,{"$f":"IF(Cff_u>0, ROUND(Cff_u,1), \"N/A\")","v":10},{"$f":"D308","v":"100kΩ"},{"$f":"D310&\"pF\"","v":"10pF"}]
[null,null,null,null,{"$f":"D309","v":"43.2kΩ"}]
[{"$f":"\"RRT = \"&'Design the Converter'!E13&\"kΩ\"","v":"RRT = 86.6kΩ"},{"$f":"'Design the Converter'!E13&\" kΩ\"","v":"86.6 kΩ"},null,{"$f":"'Design the Converter'!E13&\"kΩ\"","v":"86.6kΩ"},{"$f":"GPN","v":0}]
[{"$f":"\"RENT = \"&'Design the Converter'!E56&\"kΩ\"","v":"RENT = 100kΩ"},{"$f":"'Design the Converter'!E56&\" kΩ\"","v":"100 kΩ"},null,{"$f":"'Design the Converter'!E56","v":100}]
[{"$f":"\"RENB = \"&Renb_u/1000&\"kΩ\"","v":"RENB = 33.2kΩ"},{"$f":"Renb_u/1000&\" kΩ\"","v":"33.2 kΩ"},null,{"$f":"Renb_u/1000","v":33.200000000000003}]
["RPG",{"$f":"100&\" kΩ\"","v":"100 kΩ"}]
[{"$f":"\"Lo = \"&'Design the Converter'!E20&\"µH\"","v":"Lo = 3.3µH"},{"$f":"'Design the Converter'!E20&\" µH\"","v":"3.3 µH"},null,{"$f":"IF(MODE = 1, 'Design the Converter'!J34&\"µH\", 'Design the Converter'!E20&\"µH\")","v":"µH"}]
[{"$f":"\"Rdcr = \"&Rdcr*1000&\"mΩ\"","v":"Rdcr = 5.9mΩ"},{"$f":"Rdcr*1000&\"mΩ\"","v":"5.9mΩ"},null,{"$f":"Rdcr*1000&\"mΩ\"","v":"5.9mΩ"}]
[]
[{"$f":"\"VOUT = \"&'Design the Converter'!E10&\" V\"","v":"VOUT = 3.3 V"},{"$f":"'Design the Converter'!E10&\" V\"","v":"3.3 V"},null,{"$f":"IF(MODE=1, 'Design the Converter'!J11&\"V\", \"\")","v":"V"}]
[]
[{"$f":"\"COUT = \"&'Design the Converter'!$E$33&\" µF\"","v":"COUT = 120 µF"},{"$f":"ROUND('Design the Converter'!$E$33, 0)&\" µF\"","v":"120 µF"},null,{"$f":"IF(MODE=1, 'Design the Converter'!$J$44&\"µF\", ROUND('Design the Converter'!$E$33/Number_of_Phases, 0)&\"µF\")","v":"µF"}]
["Capacitance per component (Cout)",{"$f":"\"22µF\"","v":"22µF"}]
["# of output caps",{"$f":"ROUNDUP(Cout*1000000/22,0)&\" x\"","v":"6 x"}]
[]
["CIN",{"$f":"Cin/2*1000000&\" µF\"","v":"3.29 µF"},{"$f":"Cin*1000000&\" µF\"","v":"6.58 µF"}]
["Capacitance per component (Cin)",{"$f":"\"10 µF\"","v":"10 µF"}]
["# of input caps",{"$f":"ROUNDUP(Cin*1000000/10,0)&\" x\"","v":"1 x"}]
[]
[{"$f":"\"CVCC = 1µF\"","v":"CVCC = 1µF"},{"$f":"CHOOSE(GPN, \"\", \"\", \"1 µF\", \"1 µF\")","v":{"$error":"#VALUE!"}},null,{"$f":"IF(MODE=1, 'Design the Converter'!$J$44&\"µF\", ROUND('Design the Converter'!$E$33/Number_of_Phases, 0)&\"µF\")","v":"µF"}]
[]
[{"$f":"\"RC1 = \"&Rcea1_u/1000&\"kΩ\"","v":"RC1 = 629.5kΩ"},{"$f":"ROUND(Rcea1_u/1000,2)&\" kΩ\"","v":"629.5 kΩ"}]
[{"$f":"\"CC1 = \"&Cc1ea_u*10^9&\"nF\"","v":"CC1 = 0.02653nF"},{"$f":"Cc1ea_u*10^9&\" nF\"","v":"0.02653 nF"}]
[{"$f":"\"CC2 = \"&IF(Cc2ea_u>0, Cc2ea_u*10^12&\"pF\", \"OPEN\")","v":"CC2 = 0.42pF"},{"$f":"IF(Cc2ea_u>0, ROUND(Cc2ea_u*10^12,1)&\" pF\", \"N/A\")","v":"0.4 pF"}]
[]
[{"$f":"\"gm = \"&$B$189*1000&\"mS\"","v":"gm = 0.008648mS"},{"$f":"$B$189*1000&\"mS\"","v":"0.008648mS"}]
[{"$f":"\"RoEA = \"&RoEA/1000000&\"MΩ\"","v":"RoEA = 540MΩ"},{"$f":"RoEA/1000000&\"MΩ\"","v":"540MΩ"}]
[{"$f":"\"GBW = \"&GBW&\"MHz\"","v":"GBW = 1.44MHz"},{"$f":"GBW&\"MHz\"","v":"1.44MHz"}]
[]
[{"$f":"\"RPGOOD = 100 kΩ\"","v":"RPGOOD = 100 kΩ"},{"$f":"CHOOSE(GPN, \"100 kΩ\", \"100 kΩ\", \"\", \"\")","v":{"$error":"#VALUE!"}}]
[{"$f":"\"RFB1 = \"&'Design the Converter'!E50&\"kΩ\"","v":"RFB1 = 100kΩ"},{"$f":"IF(VOUT_setting=1, 'Design the Converter'!E50&\"kΩ\", \"\")","v":{"$error":"#NAME?"}},null,{"$f":"'Design the Converter'!#REF!&\"kΩ\"","v":{"$error":"#REF!"}}]
[{"$f":"\"RFB2 = \"&IF(Vout=Vref,\"OPEN\",'Design the Converter'!E51&\"kΩ\")","v":"RFB2 = 43.2kΩ"},{"$f":"IF(VOUT_setting=1, IF(Vout=Vref,\"OPEN\",Rfb2_u/1000&\"kΩ\"), \"\")","v":{"$error":"#NAME?"}},null,{"$f":"IF(Vout2=Vref,\"OPEN\",Rfb4_u/1000&\"kΩ\")","v":"30.1675977653631kΩ"}]
[{"$f":"\"Crossover Frequency = \"&ROUND('Stability Calculations'!Q4,1)&\" kHz\"","v":"Crossover Frequency = 38.9 kHz"},{"$f":"ROUND('Stability Calculations'!Q4,1)&\" kHz\"","v":"38.9 kHz"},null,{"$f":"'Stability Calculations'!Q4","v":38.905000000000001}]
[{"$f":"\"Phase Margin = \"&ROUND('Stability Calculations'!Q5,0)&\"°\"","v":"Phase Margin = 60°"},{"$f":"ROUND('Stability Calculations'!Q5,0)&\"°\"","v":"60°"}]
[]
["Full-load/high line efficiency",{"$f":"ROUND('Efficiency Calculations'!AZ109,1)&\"%\"","v":"92.3%"}]
["Half-load/mid-line efficiency",{"$f":"ROUND('Efficiency Calculations'!AZ59,1)&\"%\"","v":"94.2%"}]
[]
[]
["Rpgood","100 kΩ"]
[]
[]
["Rt",{"$f":"IF(No_RT,\"\", Rfadj&\"kΩ\")","v":"86.6kΩ"},{"$f":"Rfadj","v":86.6},{"$f":"Fsw","v":400000},{"$f":"\"kΩ\"","v":"kΩ"},{"$f":"OR((Fsw=440000),(Fsw=2200000))","v":false},null,{"$f":"OR(OR(AND(OSC=1, OR(Fsw/1000>2530, Fsw/1000<1800)), AND(OSC=2, OR(Fsw/1000>500, Fsw/1000<300))), OR((Fsw=440000),(Fsw=2200000)))","v":false}]
[]
["Blank out",{"$f":"IF(B89=\"y\",\"\",\"|\")","v":"|"}]
["OUTPUT CURRENT",{"$f":"'Design the Converter'!$E$11&\" A\"","v":"6 A"},null,{"$f":"IF(MODE=1,'Design the Converter'!$J$12&\"A\",\"\")","v":"A"}]
["VIN",{"$f":"VIN_nom&\" V\"","v":"12 V"}]
["VIN range",{"$f":"VIN_min&\" V\"&\"...\"&VIN_max&\" V\"","v":"9 V...16 V"}]

{"sheet":"Schematic Management","index":3,"n_rows":15,"n_cols":14,"rows_kept":15,"cut":false,"hidden":true,"merged":[]}
[{"$f":"VARIANT","v":0},null,null,null,null,null,null,null,null,null,null,null,null,"3.3V or 5V fixed (FB1/2)"]
[{"$f":"CHOOSE(VARIANT, \"LMR60440_fix_FPWM\", \"LMR60440_adj_FPWM\", \"LMR60440_fix_DEM\", \"LMR60440_adj_DEM\")","v":{"$error":"#VALUE!"}},null,null,null,null,null,null,null,null,"With/without dither (DITH)",null,null,null,"With/without VOUT connected to VCCX"]
[null,null,null,null,null,null,null,null,null,"FPWM or DEM (DEMB)"]
[null,null,null,null,null,null,null,null,null,"Shunt or inductor DCR current sensing"]
[]
[]
[]
[]
[]
[]
[]
[]
[]
[]
[null," "]

{"sheet":"Schematic & BOM","index":4,"n_rows":51,"n_cols":10,"rows_kept":51,"cut":false,"hidden":true,"merged":[[46,0,47,0],[46,9,47,9],[46,3,47,6],[46,2,47,2],[46,1,47,1],[46,7,47,7],[46,8,47,8],[45,3,45,6],[41,3,41,6],[42,3,42,6],[40,3,40,6],[39,3,39,6],[36,3,36,5],[34,3,34,5],[43,3,43,6],[44,3,44,6],[33,3,33,6],[35,3,35,5],[38,3,38,5],[37,3,37,5]]}
[]
[]
[]
[]
[]
[]
[]
[]
[]
[]
[]
[]
[]
[]
[]
[]
[]
[]
[]
[]
[]
[]
[]
[]
[]
[]
[]
[]
[]
[]
[]
[{"$f":"\"VIN = \"&VIN_min&\" V to \"&VIN_max&\" V, VOUT = \"&Vout&\" V, IOUT = \"&Iout&\" A,  Fsw = \"&Fsw/1000&\" kHz\"","v":"VIN = 9 V to 16 V, VOUT = 3.3 V, IOUT = 6 A,  Fsw = 400 kHz"}]
["High-Efficiency Synchronous Buck DC/DC Converter BOM"]
["Count","Ref Des","Value","Description",null,null,null,"Size","Part Number","MFR"]
[{"$f":"ROUNDUP('Design the Converter'!E43/10,0)","v":1},"CIN1, CIN2",10,{"$f":"C35","v":10},null,null,null,1210,"Std","Std"]
[2,"COUT",47,{"$f":"C36","v":47},null,null,null,1210,"Std","Std"]
[1,"CVCC",1,{"$f":"C37","v":1},null,null,null,"0402","Std","Std"]
[1,"CSYNC",1,{"$f":"C38","v":1},null,null,null,"0402","Std","Std"]
[1,"CFF",{"$f":"'Variable Management'!D310","v":10},10,null,null,null,"0402","Std","Std"]
[1,"LO",{"$f":"'Design the Converter'!E20","v":3.3},{"$f":"\"Buck Inductor, \"&Lf*1000000&\" µH, \"&Rdcr*1000&\" mΩ, >\"&ROUNDUP(Ipk_OCP_Vinmin*1.05,0)&\" A\"","v":"Buck Inductor, 3.3 µH, 5.9 mΩ, >11 A"},null,null,null,"--","--","Various"]
[1,"RRT",{"$f":"'Design the Converter'!E13","v":86.6},{"$f":"C41","v":86.6},null,null,null,"0402","Std","Std"]
[1,"RFBT",{"$f":"'Design the Converter'!E50","v":100},{"$f":"C42","v":100},null,null,null,"0402","Std","Std"]
[1,"RFBB",{"$f":"'Design the Converter'!E51","v":43.2},43.2,null,null,null,"0402","Std","Std"]
[1,"RENT",{"$f":"'Variable Management'!D313","v":100},{"$f":"C44","v":100},null,null,null,"0402","Std","Std"]
[1,"RENB",{"$f":"'Variable Management'!D314","v":33.200000000000003},33.200000000000003,null,null,null,"0402","Std","Std"]
[1,"RPGOOD",100,100,null,null,null,"0402","Std","Std"]
[1,"U1",{"$f":"'Variable Management'!O34","v":0},{"$f":"CHOOSE(GPN, \"IC, LMR36503E-Q1 Synchronous Buck DC/DC Converter, 3V–65V Input, 0.3A Output\", \"IC, LMR36503E-Q1 Synchronous Buck DC/DC Converter, 3V–65V Input, 0.3A Output\", \"IC, LMR36503E-Q1 Synchronous Buck DC/DC Converter, 3V–65V Input, 0.3A Output\")","v":{"$error":"#VALUE!"}},null,null,null,"VQFN-22",{"$f":"CHOOSE(VARIANT, \"LM63460AASQRYFTQ1\", \"LM63460AFSQRYFTQ1\", \"LM64460APPQRYFRQ1\", \"LM64460BPPQRYFRQ1\", \"LM64460CPPQRYFRQ1\")","v":{"$error":"#VALUE!"}},"TI"]
[]
[]
["NOTES:"]
["** Effective input and output capacitances should be appropriately derated for applied voltage and temperature, particularly with ceramics **"]

{"sheet":"EVMs","index":5,"n_rows":6,"n_cols":2,"rows_kept":6,"cut":false,"hidden":true,"merged":[[0,0,0,16]]}
["LM63460-Q1 & LM64460-Q1 Converter Design Tool"]
[]
[]
[]
[]
[null,"LM64460EVM-2MHZ (BSR173) PCB Layout"]

{"sheet":"MOSFET Parameters","index":6,"n_rows":21,"n_cols":8,"rows_kept":21,"cut":false,"hidden":true,"merged":[]}
[]
[]
["MOSFET Parameters"]
[null,null,null,null,"Internal Power MOSFETs"]
[null,null,null,null,"High-side","  Low-side"]
[null,null,null,"On-State Resistance, RDS(on) ",35,24,"mΩ","LMR60460 Switcher Template "]
[null,null,null,"Total Gate Charge, QG ",3.1819999999999999,5.0469999999999997,"nC","LMR60460 FET parameter table @36V"]
[null,null,null,"Gate-Drain Charge, QGD ",1.446,2.0110000000000001,"nC","LMR60460 FET parameter table @36V"]
[null,null,null,"Gate-Source Charge, QGS ",1.9770000000000001,3.8730000000000002,"nC","LMR60460 FET parameter table @36V"]
[null,null,null,"Output Charge, QOSS ",{"$f":"E11*36/1000","v":4.0860000000000003},{"$f":"F11*36/1000","v":8.5716000000000001},"nC","LMR60460 FET parameter table @36V"]
[null,null,null,"Output Capacitance, COSS ",113.5,238.1,"pF","Qoss/36V"]
[null,null,null,"Gate Resistance, RGATE ",0,0,"Ω"]
[null,null,null,"Transconductance, gFS ",100,100,"S"]
[null,null,null,"Gate-Source Miller Plateau Voltage, VTH ",1.2,1.1000000000000001,"V"]
[null,null,null,"Body Diode Forward Voltage, VBD ",0.7,0.7,"V","LMR60440 Switcher Template"]
[null,null,null,"Body Diode Rev Recovery Charge, QRR ",4.5,7,"nC","N/A"]
[null,null,null,"Thermal Resistance, θJA ",27,27,"°C/W"]
[]
[]
["Note: "]
["2025-10-29","values from Corolla Parameter FET table (worst case)"]

{"sheet":"Stability Calculations","index":7,"n_rows":687,"n_cols":37,"rows_kept":687,"cut":false,"hidden":true,"merged":[[9,20,9,22],[10,14,10,15],[10,16,10,17],[9,27,9,28],[9,32,9,33],[10,18,10,19],[9,18,9,19],[1,15,1,17],[9,14,9,17],[9,1,10,1],[1,0,1,3],[1,9,1,11],[1,12,1,14],[9,0,11,0],[10,6,10,7],[1,4,1,6],[9,2,9,7],[9,8,9,13],[10,2,10,3],[10,4,10,5],[10,8,10,9],[10,10,10,11],[10,12,10,13]]}
[null,null,null,null,null,null,null,null,null,null,null,null,null,null,null,null,null,null,null,"2025-03-21","AM matches"]
["Divider Network & EA Poles/Zeros",null,null,null,"Modulator",null,null,null,null,"Power Stage Poles/Zeros",null,null,"Complex Pole Pair",null,null,"Total System",null,null,null,null,"Afb matches"]
[null,"Afb1",{"$f":"Afb*1","v":0.30303030303030304},"V/V","Acs",{"$f":"Acs","v":18.299768507928373},"A/V","gm",{"$f":"gm","v":8.6479999999999992E-6},"z_ESR",{"$f":"Fesr","v":1326291.1924324611},"Hz","p3",{"$f":"Fsw/2","v":200000},"Hz","Adc",{"$f":"Am_stability*C3*0.8*Aea_stability","v":11394.460660072647},"V/V",null,null,"p_dom matches SIMPLIS model if neglecting slope comp influence. Need to change back"]
[null,"EA zero, z1",{"$f":"Fz1_u","v":9529.8737498242026},"Hz","Am",{"$f":"Am_new","v":10.064872679360604},"V/V",null,null,"p_dom",{"$f":"Fp_load_buck_simplified","v":2913.8215591319222},"Hz","pterm1",{"$f":"Q*pole3","v":119257.25091305605},null,"Crossover",{"$f":"AK7","v":38.905000000000001},"kHz",null,null,"z_ESR doesn't really matter (beyond half the switching frequency)"]
[null,"EA pole, p1",{"$f":"Fp1_u","v":11.109362084285808},"Hz","Q",{"$f":"Q","v":0.59628625456528028},null,null,null,"p_L",{"$f":"FL","v":117132.67936334232},"Hz","pterm2",{"$f":"pole3^2","v":40000000000},null,"Phase Margin",{"$f":"AK9","v":59.846073374413862},"°",null,null,"FF zero, FF pole don't matter (beyond)"]
[null,"Aea",{"$f":"AEA","v":4669.9199999999992},"V/V","mc",{"$f":"mc","v":1.425959448275862},null,"FF zero, z5",{"$f":"1*Fz_ff","v":1000000000},null,null,null,null,null,null,"radconv",{"$f":"180/Pi","v":57.295779513082323},null,null,null,"EA zero, z1 looks correct",null,null,null,null,null,null,null,null,null,null,null,null,null,null,"XOVER SEARCH"]
[null,"EA pole, p2",{"$f":"1*Fp2_u_simplified","v":611500.23228038638},"Hz",null,null,null,"FF pole, p5",{"$f":"Fp_ff","v":1000000000},null,null,null,null,null,null,null,null,null,null,null,"EA HF pole seems off by 2x from SIMPLIS)",null,null,null,null,null,null,null,null,null,null,null,null,null,null,"xover",{"$f":"SUM(AJ12:AJ613)/1000","v":38.905000000000001}]
[]
[null,null,null,null,null,null,null,null,null,null,null,null,null,null,null,null,null,null,null,null,null,null,null,null,null,null,null,null,null,null,null,null,null,null,null,"phase margin",{"$f":"SUM(AK13:AK613)","v":59.846073374413862}]
["Freq (Hz)",null,"Power Stage",null,null,null,null,null,"Error Amplifier",null,null,null,null,null,"FF Network",null,null,null,"Sampling Double Pole",null,"System Response",null,null,null,null,null,null,"ERROR AMP Response",null,null,null,null,"PLANT Response"]
[null,null,"p_dom",null,"z_ESR",null,"z_RHP",null,"p1",null,"z1",null,"p2",null,"z3",null,"p3",null,"p3"]
[null,null,"Gain(V/V)","Phase(rad)","Gain(V/V)","Phase(rad)","Gain(V/V)","Phase(rad)","Gain(V/V)","Phase(rad)","Gain(V/V)","Phase(rad)","Gain(V/V)","Phase(rad)","Gain(V/V)","Phase(rad)","Gain(V/V)","Phase(rad)","Gain(V/V)","Phase(rad)","Gain (dB)","Phase (°)","Phase Margin (°)",null,null,"Fsquare",null,"Gain(dB)","Phase(Deg)",null,null,null,"Gain(dB)","Phase(Deg)"]
[1,{"$f":"A13/1000","v":1E-3},{"$f":"SQRT(1+(A13/p_dom)^2)","v":1.0000000588903435},{"$f":"ATAN(A13/p_dom)","v":3.4319190123560271E-4},{"$f":"SQRT(1+(A13/z_ESR)^2)","v":1.0000000000002842},{"$f":"ATAN(A13/z_ESR)","v":7.5398223686140756E-7},{"$f":"IF(VIN_nom>Vout, 1, SQRT(1+(A13/z_RHP)^2))","v":1},{"$f":"IF(VIN_nom>Vout, 0, -ATAN(A13/z_RHP))","v":0},{"$f":"SQRT(1+(A13/EA_p1)^2)","v":1.0040431020047693},{"$f":"ATAN(A13/EA_p1)","v":8.9772229670350423E-2},{"$f":"SQRT(1+(A13/EA_z1)^2)","v":1.0000000055054865},{"$f":"ATAN(A13/EA_z1)","v":1.0493318406743034E-4},{"$f":"SQRT(1+(A13/EA_hf_p)^2)","v":1.0000000000013372},{"$f":"ATAN(A13/EA_hf_p)","v":1.635322355103516E-6},{"$f":"SQRT(1+(A13/Zero3)^2)","v":1},{"$f":"ATAN(A13/Zero3)","v":1.0000000000000001E-9},{"$f":"SQRT(1+(A13/pole5)^2)","v":1},{"$f":"ATAN(A13/pole5)","v":1.0000000000000001E-9},{"$f":"SQRT((1-(Z13/pterm2))^2+(A13/pterm1)^2)","v":1.0000000000101561},{"$f":"IF((ATAN((A13/pterm1)/(1-A13^2/pterm2))>0),ATAN((A13/pterm1)/(1-A13^2/pterm2)),PI()+ATAN((A13/pterm1)/(1-A13^2/pterm2)))","v":8.3852343764875801E-6},{"$f":"20*LOG10(((E13*K13*G13*O13)/(C13*I13*S13*M13*Q13))*Adc)","v":81.09882786665581},{"$f":"((F13+L13+H13+P13)-(D13+J13+T13+N13+R13))*radconv","v":-5.1577520321252139},{"$f":"IF(V13>0,V13,V13+180)","v":174.84224796787478},null,{"$f":"IF(U13<0,A13,1000000000)","v":1000000000},{"$f":"A13^2","v":1},null,{"$f":"20*LOG10((K13/(I13*M13))*Aea_stability*Afb*0.8)","v":61.042662669572067},{"$f":"(L13-(J13+N13))*radconv","v":-5.1376513460813422},"57dB",null,"33dB ",{"$f":"20*LOG10((E13*G13/(C13*S13))*Am_stability)","v":20.05616519708375},{"$f":"(F13+H13-(D13+T13))*radconv","v":-2.0100686043871378E-2},null,{"$f":"SUM((U14<0)*(U13>0))*A13","v":0},{"$f":"IF(AJ13>0,W11,0)","v":0}]
[1.0965,{"$f":"A14/1000","v":1.0965E-3},1.0000000708045809,3.7630991671587478E-4,1.0000000000003417,8.2674152271850165E-7,1,0,{"$f":"SQRT(1+(A14/EA_p1)^2)","v":1.0048590925810688},9.8381890309919437E-2,1.000000006619314,1.1505923624449995E-4,{"$f":"SQRT(1+(A14/EA_hf_p)^2)","v":1.0000000000016076},1.7931309623706819E-6,1,1.0965000000000001E-9,1,1.0965000000000001E-9,1.0000000000122107,9.1944094938215407E-6,81.091771576161605,-5.6524178275586943,174.34758217244129,null,1000000000,1.2023122500000001,null,61.035606482580945,-5.6303774254828438,null,null,null,20.05616509358066,-2.2040402075850132E-2,null,0,0]
[1.2022999999999999,1.2022999999999999E-3,1.0000000851274797,4.1261961563826078E-4,1.0000000000004108,9.0651284337839368E-7,1,0,1.0058391729925329,0.1078044578745207,1.00000000795832,1.2616116699796991E-4,1.0000000000019329,1.9661480675401763E-6,1,1.2022999999999999E-9,1,1.2022999999999999E-9,1.0000000000146809,1.0081567290858037E-5,81.083303886589206,-6.1937916529016741,173.80620834709833,null,1000000000,1.4455252899999997,null,61.02713891743651,-6.1696245984846483,null,null,null,20.056164969152697,-2.4167054417025883E-2,null,0,0]
[1.3183,1.3183000000000001E-3,1.0000001023464025,4.5242987029168292E-4,1.0000000000004938,9.9397478285425447E-7,1,0,1.0070161584997481,0.11811334002788393,1.000000009568067,1.3833341618143299E-4,1.0000000000023239,2.1558454607315471E-6,1,1.3183000000000001E-9,1,1.3183000000000001E-9,1.0000000000176503,1.1054254478536326E-5,81.073145875026086,-6.7860922213853661,173.21390777861464,null,1000000000,1.7379148900000001,null,61.016981055460107,-6.7595934877247181,null,null,null,20.056164819565975,-2.6498733660648439E-2,null,0,0]
[1.4454,1.4454000000000001E-3,1.0000001230325921,4.9604955283411869E-4,1.0000000000005937,1.0898059251592536E-6,1,0,1.0084283297466505,0.12937971338570445,1.0000000115019587,1.5167042364473883E-4,1.0000000000027935,2.3636949320643272E-6,1,1.4454E-9,1,1.4454E-9,1.0000000000212179,1.2120017767795779E-5,81.060973741432605,-7.4334104165974315,172.56658958340256,null,1000000000,2.0891811599999999,null,61.004809101574686,-7.4043568862049662,null,null,null,20.056164639857919,-2.9053530392465037E-2,null,0,0]
[1.5849,1.5849E-3,1.0000001479271188,5.439248119821008E-4,1.0000000000007141,1.1949864472013025E-6,1,0,1.0101251714332049,0.14170723731856574,1.0000000138292757,1.6630860250559183E-4,1.0000000000033586,2.5918224006000697E-6,1,1.5849E-9,1,1.5849E-9,1.0000000000255111,1.3289757963326565E-5,81.046370431724029,-8.1417039197381538,171.85829608026185,null,1000000000,2.51190801,null,60.990206008133441,-8.1098463442770843,null,null,null,20.056164423590591,-3.1857575461070223E-2,null,0,0]
[1.7378,1.7378000000000001E-3,1.0000001778458136,5.9639883867062973E-4,1.0000000000008584,1.3102703312172525E-6,1,0,1.0121607029208615,0.15516915143989607,1.0000000166262877,1.8235288592044033E-4,1.0000000000040381,2.8418631886937731E-6,1,1.7377999999999999E-9,1,1.7377999999999999E-9,1.0000000000306708,1.4571860299506114E-5,81.028884628848516,-8.9151832336509056,171.08481676634909,null,1000000000,3.0199488400000001,null,60.972720465171932,-8.8802522641537589,null,null,null,20.056164163676588,-3.493096949714674E-2,null,0,0]
[1.9055,1.9055000000000001E-3,1.0000002138267128,6.5395210025713491E-4,1.0000000000010321,1.4367131523386959E-6,1,0,1.0146032704354779,0.16986903355737745,1.0000000199900376,1.9995018030969611E-4,1.000000000004855,3.1161067476424416E-6,1,1.9055000000000001E-9,1,1.9055000000000001E-9,1.0000000000368758,1.5978064104462775E-5,81.007948624877528,-9.7598027845108319,170.24019721548916,null,1000000000,3.63093025,null,60.951784773779387,-9.7215009311244067,null,null,null,20.056163851098141,-3.830185338642516E-2,null,0,0]
[2.0893000000000002,2.0893000000000001E-3,1.0000002570665993,7.170307445192374E-4,1.0000000000012408,1.5752950874735342E-6,1,0,1.0175308582774933,0.18589525463392753,1.0000000240324094,2.1923689876422549E-4,1.0000000000058369,3.4166789965075272E-6,1,2.0893000000000002E-9,1,2.0893000000000002E-9,1.000000000044333,1.7519270182887632E-5,80.982921666132597,-10.680644292231236,169.31935570776875,null,1000000000,4.3651744900000002,null,60.926758190674207,-10.638647934307532,null,null,null,20.056163475458387,-4.199635792370441E-2,null,0,0]
[2.2909000000000002,2.2909000000000002E-3,1.000000309069605,7.8621819541032419E-4,1.0000000000014917,1.7272979064244082E-6,1,0,1.0210406413633042,0.20336283996147272,1.0000000288940201,2.4039142763180758E-4,1.0000000000070175,3.7463599832924581E-6,1,2.2909E-9,1,2.2909E-9,1.0000000000533014,1.9209733433222923E-5,80.953012451652256,-11.684322330112639,168.31567766988735,null,1000000000,5.2482228100000006,null,60.896849427961833,-11.638273675967941,null,null,null,20.056163023690431,-4.6048654144698532E-2,null,0,0]
[2.5118999999999998,2.5118999999999996E-3,1.0000003715769032,8.6206355700992813E-4,1.0000000000017935,1.8939279807702639E-6,1,0,1.0252434788570264,0.22236746258923529,1.0000000347376468,2.6358165992227073E-4,1.0000000000084368,4.107766223765079E-6,1,2.5119E-9,1,2.5119E-9,1.0000000000640812,2.1062870230473913E-5,80.917332227895884,-12.776341251370999,167.22365874862899,null,1000000000,6.309641609999999,null,60.861169747227777,-12.725850348393656,null,null,null,20.05616248066811,-5.0490902977342343E-2,null,0,0]
[2.7542,2.7542000000000001E-3,1.0000004467195414,9.4521888999412153E-4,1.0000000000021561,2.076617876761097E-6,1,0,1.0302731926012074,0.2430172574788648,1.0000000417625154,2.8900696857282737E-4,1.000000000010143,4.5040048303996627E-6,1,2.7541999999999999E-9,1,2.7541999999999999E-9,1.0000000000770402,2.3094612519959757E-5,80.874823952962174,-13.962923678801177,166.03707632119881,null,1000000000,7.5856176399999997,null,60.818662125083861,-13.90756238330159,null,null,null,20.056161827878306,-5.536129549958746E-2,null,0,0]
[3.02,3.0200000000000001E-3,1.0000005371033598,1.0364392113057254E-3,1.0000000000025924,2.2770263553179469E-6,1,0,1.036290742626079,0.26542861648150001,1.0000000502122388,3.1689820643864659E-4,1.0000000000121951,4.938673512376869E-6,1,3.0199999999999999E-9,1,3.0199999999999999E-9,1.0000000000926275,2.5323407817313829E-5,80.824238865559039,-15.25076957469147,164.74923042530853,null,1000000000,9.1204000000000001,null,60.768077822875838,-15.190065521770965,null,null,null,20.056161042683218,-6.0704052920506693E-2,null,0,0]
[3.3113000000000001,3.3113000000000001E-3,1.000000645715212,1.1364108979786953E-3,1.0000000000031166,2.4966613809144642E-6,1,0,1.0434759699132725,0.28967962821913179,1.0000000603660495,3.4746523969438975E-4,1.0000000000146614,5.4150429144061721E-6,1,3.3112999999999999E-9,1,3.3112999999999999E-9,1.0000000001113585,2.7766026591295678E-5,80.76422133699559,-16.644381451442303,163.35561854855769,null,1000000000,10.964707690000001,null,60.70806123786052,-16.577822075217924,null,null,null,20.05616009913507,-6.6559376224380767E-2,null,0,0]
[3.6307999999999998,3.6308E-3,1.0000007763339607,1.2460605590208032E-3,1.0000000000037472,2.7375587055900786E-6,1,0,1.0520520732832377,0.31588025866863528,1.0000000725772231,3.8099138767619021E-4,1.0000000000176272,5.9375284068453645E-6,1,3.6307999999999999E-9,1,3.6307999999999999E-9,1.0000000001338845,3.0445108974730689E-5,80.693124620963005,-18.150098186727984,161.84990181327203,null,1000000000,13.182708639999998,null,60.636965656557337,-18.07711664998731,null,null,null,20.056158964405665,-7.298153674067237E-2,null,0,0]
[3.9811000000000001,3.9811000000000004E-3,1.0000009333619031,1.3662804814935001E-3,1.0000000000045051,3.0016786831605033E-6,1,0,1.0622704926630293,0.34409891302652812,1.0000000872573187,4.177494763229903E-4,1.0000000000211924,6.5103818278164303E-6,1,3.9810999999999998E-9,1,3.9810999999999998E-9,1.0000000001609652,3.3382456577009307E-5,80.609165755980541,-19.771875982546213,160.22812401745378,null,1000000000,15.849157210000001,null,60.553008155729728,-19.691853186973891,null,null,null,20.056157600250806,-8.002279557232142E-2,null,0,0]
[4.3651999999999997,4.3651999999999996E-3,1.0000011221531919,1.4981002253575278E-3,1.0000000000054161,3.2912832603361552E-6,1,0,1.0744272281646368,0.37439660229058613,1.0000001049068823,4.5805430473698901E-4,1.0000000000254792,7.1385091443829763E-6,1,4.3651999999999998E-9,1,4.3651999999999998E-9,1.0000000001935239,3.6603225101276278E-5,80.510326514732498,-21.51325305716081,158.4867469428392,null,1000000000,19.054971039999998,null,60.454170554575192,-21.425509603285352,null,null,null,20.056155960157312,-8.7743453875454985E-2,null,0,0]
[4.7862999999999998,4.7862999999999994E-3,1.0000013490984374,1.6426179840047415E-3,1.0000000000065117,3.6087851802747721E-6,1,0,1.0888611670210584,0.40680239267036394,1.0000001261233551,5.0224165851572985E-4,1.0000000000306319,7.8271433880790945E-6,1,4.7862999999999995E-9,1,4.7862999999999995E-9,1.0000000002326623,4.0134247297556496E-5,80.394414652065208,-23.375940163448533,156.62405983655145,null,1000000000,22.908667689999998,null,60.338260663457255,-23.279732330788686,null,null,null,20.056153988607953,-9.6207832659844658E-2,null,0,0]
[5.2481,5.2481000000000003E-3,1.0000016219891732,1.8011035400061883E-3,1.0000000000078288,3.9569741772524499E-6,1,0,1.1059678732106852,0.44132758194895949,1.0000001516351484,5.5069978965523224E-4,1.0000000000368283,8.582335251615699E-6,1,5.2480999999999997E-9,1,5.2480999999999997E-9,1.0000000002797242,4.4006548533069686E-5,80.259012461994516,-25.360637089141964,154.63936291085804,null,1000000000,27.542553609999999,null,60.202860844079183,-25.255146786251654,null,null,null,20.056151617915326,-0.10549030289031032,null,0,0]
[5.7544000000000004,5.7544000000000007E-3,1.0000019500411272,1.9748609866304819E-3,1.0000000000094122,4.3387153837688815E-6,1,0,1.1261885845179425,0.47792598449443485,1.0000001823038183,6.038274432271655E-4,1.000000000044277,9.4102989599382902E-6,1,5.7544000000000007E-9,1,5.7544000000000007E-9,1.0000000003362992,4.825199269848145E-5,80.101637691734382,-27.4647514826429,152.5352485173571,null,1000000000,33.113119360000006,null,60.045488923714679,-27.349084237529208,null,null,null,20.056148768019696,-0.11566724511368894,null,0,0]
[6.3095999999999997,6.3095999999999994E-3,1.0000023444838546,2.1654003205532715E-3,1.0000000000113161,4.7573263216657487E-6,1,0,1.150030898665015,0.51652245022704957,1.0000002191791901,6.6208632387823488E-4,1.000000000053233,1.0318229931404163E-5,1,6.3095999999999998E-9,1,6.3095999999999998E-9,1.0000000004043241,5.2907474825094709E-5,79.919666822383874,-29.684039960377774,150.31596003962221,null,1000000000,39.811052159999996,null,59.863521481017145,-29.557212860761631,null,null,null,20.056145341366737,-0.12682709961615266,null,0,0]
[6.9183000000000003,6.9183000000000005E-3,1.0000028186572503,2.3743001619755183E-3,1.0000000000136047,5.2162753092319537E-6,1,0,1.178054060579357,0.55697611866158525,1.0000002635083816,7.2595912246733476E-4,1.0000000000639995,1.1313650648840031E-5,1,6.9183E-9,1,6.9183E-9,1.0000000004860992,5.8011566991102144E-5,79.710548856690494,-32.010497045473194,147.98950295452681,null,1000000000,47.862874890000008,null,59.654407634621329,-31.871434719503235,null,null,null,20.056141222069176,-0.13906232596995824,null,0,0]
[7.5857999999999999,7.5858000000000002E-3,1.0000033888015771,2.603379345045842E-3,1.0000000000163567,5.71955845232198E-6,1,0,1.210890625419843,0.59910893689101119,1.0000003168096616,7.9600198249955509E-4,1.0000000000769449,1.2405228320718965E-5,1,7.5858E-9,1,7.5858E-9,1.000000000584425,6.3608710938779762E-5,79.471750438827996,-34.433996218629652,145.56600378137034,null,1000000000,57.544361639999998,null,59.415614169784298,-34.281516765569933,null,null,null,20.056136269043698,-0.15247945305972252,null,0,0]
[8.3176000000000005,8.3176000000000014E-3,1.0000040741712239,2.8545253165713183E-3,1.0000000000196647,6.2713226532374169E-6,1,0,1.2492215446550601,0.64266977815316406,1.0000003808830877,8.7279203338154249E-4,1.0000000000925067,1.3601957219982283E-5,1,8.3176000000000003E-9,1,8.3176000000000003E-9,1.0000000007026226,6.9745025457303939E-5,79.201054066830224,-36.940226972055164,143.05977302794483,null,1000000000,69.182469760000004,null,59.144923751807347,-36.773037943621638,null,null,null,20.056130315022877,-0.16718902843352249,null,0,0]
[9.1201000000000008,9.1201000000000008E-3,1.0000048982645446,3.1299343605118218E-3,1.0000000000236424,6.8763933982926439E-6,1,0,1.2938081661094407,0.68737839740349871,1.0000004579254818,9.5700084336916569E-4,1.0000000001112181,1.4914303409687045E-5,1,9.1201000000000004E-9,1,9.1201000000000004E-9,1.0000000008447441,7.647417604682443E-5,78.896439131179577,-39.513223205230517,140.48677679476947,null,1000000000,83.176224010000013,null,58.84031597530813,-39.329903517010983,null,null,null,20.056123155871454,-0.18331968821953537,null,0,0]
[10,0.01,1.0000058890171759,3.4319056733956277E-3,1.0000000000284244,7.5398223684726275E-6,1,0,1.3454571967684192,0.7328933799602726,1.0000005505485083,1.049331459387119E-3,1.0000000001337139,1.6353223549591969E-5,1,1E-8,1,1E-8,1.0000000010156078,8.385234377784767E-5,78.556431366512626,-42.133518307732409,137.8664816922676,null,1000000000,100,null,58.500316817605338,-41.932512211559079,null,null,null,20.056114548907292,-0.20100609617333109,null,0,0]
[10.965,1.0964999999999999E-2,1.0000070804332732,3.7630815819606842E-3,1.0000000000341751,8.2674152269985407E-6,1,0,1.4050550146826561,0.77885844887662503,1.000000661931179,1.1505918597806812E-3,1.0000000001607661,1.7931309621804207E-5,1,1.0964999999999999E-8,1,1.0964999999999999E-8,1.0000000012210777,9.1944094955316667E-5,78.179953118473748,-44.780808302793197,135.21919169720681,null,1000000000,120.23122499999999,null,58.123848919742834,-44.560405289591337,null,null,null,20.056104198730921,-0.22040301320186093,null,0,0]
[12.023,1.2022999999999999E-2,1.0000085127120935,4.126172973942654E-3,1.0000000000410882,9.0651284335381056E-6,1,0,1.4735142322455759,0.82487373803591546,1.0000007958316948,1.2616110073199061E-3,1.0000000001932869,1.9661480672893565E-5,1,1.2023E-8,1,1.2023E-8,1.0000000014680865,1.0081567293112489E-4,77.766721725990124,-47.432294570308294,132.5677054296917,null,1000000000,144.55252899999999,null,57.710629969863412,-47.190625354392694,null,null,null,20.056091756126708,-0.24166921591559645,null,0,0]
[13.183,1.3183E-2,1.0000102345883999,4.524268142276325E-3,1.0000000000493992,9.9397478282184745E-6,1,0,1.5518229112753121,0.87055345656742167,1.0000009568062562,1.3833332882502844E-3,1.0000000002323834,2.1558454604008984E-5,1,1.3183E-8,1,1.3183E-8,1.0000000017650399,1.1054254481508299E-4,77.316951673100363,-50.066000536836114,129.9339994631639,null,1000000000,173.79148899999998,null,57.260874875368145,-49.801014951223621,null,null,null,20.056076797732217,-0.26498558561248564,null,0,0]
[14.454000000000001,1.4454E-2,1.0000123031842774,4.9604552489629335E-3,1.0000000000593838,1.0898059251165404E-5,1,0,1.6409660641103898,0.91549633476960435,1.0000011501952266,1.5167030850743802E-3,1.0000000002793525,2.3636949316285262E-5,1,1.4453999999999998E-8,1,1.4453999999999998E-8,1.0000000021217885,1.2120017771712895E-4,76.831786578053496,-52.659062749969948,127.34093725003005,null,1000000000,208.91811600000003,null,56.775727750726261,-52.368529753881411,null,null,null,20.056058827327234,-0.29053299608854388,null,0,0]
[15.849,1.5848999999999999E-2,1.0000147926035616,5.4391950163519415E-3,1.0000000000713998,1.1949864471449901E-5,1,0,1.742207277075873,0.95943282888626003,1.0000013829266325,1.663084507106268E-3,1.0000000003358771,2.5918224000255168E-5,1,1.5849000000000002E-8,1,1.5849000000000002E-8,1.0000000025511133,1.3289757968490824E-4,76.311762499356661,-55.196221815105943,124.80377818489406,null,1000000000,251.19080099999999,null,56.255725298182348,-54.8776491030969,null,null,null,20.056037201174313,-0.31857271200903842,null,0,0]
[17.378,1.7378000000000001E-2,1.0000177844248128,5.9639183839563974E-3,1.0000000000858404,1.3102703311430195E-5,1,0,1.856590653247296,1.0019959549874535,1.0000016626274049,1.8235268581863738E-3,1.0000000004038092,2.8418631879363762E-5,1,1.7377999999999995E-8,1,1.7377999999999995E-8,1.0000000030670835,1.4571860306313836E-4,75.759412211608506,-57.656592868938176,122.34340713106182,null,1000000000,301.99488400000001,null,55.703401000996351,-57.307287184824887,null,null,null,20.056011210612152,-0.34930568411328689,null,0,0]
[19.055,1.9054999999999999E-2,1.0000213824449633,6.5394287155375683E-3,1.0000000001032072,1.4367131522408315E-5,1,0,1.9854419250727924,1.0429589832407076,1.0000019990017857,1.9994991650756156E-3,1.0000000004855061,3.1161067466439352E-5,1.0000000000000002,1.9054999999999998E-8,1.0000000000000002,1.9054999999999998E-8,1.0000000036876009,1.5978064113437667E-4,75.176563304342608,-60.027383725512195,119.97261627448781,null,1000000000,363.09302500000001,null,55.120583350363283,-59.644370479300285,null,null,null,20.055979953979318,-0.38301324621191046,null,0,{"$f":"IF(AJ45>0,W43,0)","v":0}]
[20.893000000000001,2.0893000000000002E-2,1.0000257063328326,7.1701857946736818E-3,1.0000000001240776,1.5752950873445311E-5,1,0,2.1300011161248769,1.0820908179822382,1.0000024032380783,2.1923655102502916E-3,1.0000000005836847,3.4166789951913132E-5,1.0000000000000002,2.0892999999999997E-8,1.0000000000000002,2.0892999999999997E-8,1.0000000044333051,1.7519270194718174E-4,74.566076398366647,-62.295537851400184,117.70446214859982,null,1000000000,436.51744900000006,null,54.510134006611764,-61.875581242217585,null,null,null,20.055942391754886,-0.4199566091825998,null,0,0]
[22.909000000000002,2.2909000000000002E-2,1.0000309064876709,7.8620215825956821E-3,1.000000000149178,1.727297906254343E-5,1,0,2.2918113211079905,1.1192736780756785,1.000002889397861,2.4039096920566716E-3,1.0000000007017606,3.7463599815572858E-5,1.0000000000000002,2.2909E-8,1.0000000000000002,2.2909E-8,1.0000000053301361,1.9209733448819193E-4,73.930054857458416,-64.454547853135608,115.54545214686439,null,1000000000,524.82228100000009,null,53.874157639967805,-63.994070500290107,null,null,null,20.05589721749061,-0.46047735284548141,null,0,0]
[25.119,2.5118999999999999E-2,1.0000371570069038,8.6204241664096012E-3,1.0000000001793481,1.89392798054608E-5,1,0,2.4723307007529951,1.1543898358184592,1.0000034737586998,2.6358105561515581E-3,1.0000000008436871,4.1077662214777371E-5,1.0000000000000004,2.5118999999999992E-8,1.0000000000000004,2.5118999999999992E-8,1.0000000064081211,2.1062870251033262E-4,73.271451604903831,-66.497895178657544,113.50210482134246,null,1000000000,630.96416099999999,null,53.2156086859871,-65.992998261411401,null,null,null,20.055842918916731,-0.50489691724613928,null,0,0]
[27.542000000000002,2.7542000000000001E-2,1.0000446709663602,9.4519102313693013E-3,1.0000000002156171,2.0766178764655792E-5,1,0,2.6732536616019922,1.1873961034899678,1.0000041762429062,2.890061719793943E-3,1.0000000010143029,4.5040048273845027E-5,1.0000000000000004,2.7541999999999996E-8,1.0000000000000004,2.7541999999999996E-8,1.0000000077040123,2.3094612547060975E-4,72.592720261234334,-68.423374594331435,111.57662540566857,null,1000000000,758.56176400000004,null,52.536942616010961,-67.869777605852917,null,null,null,20.055777645223372,-0.55359698847851813,null,0,0]
[30.2,3.0199999999999998E-2,1.0000537089080772,1.036402473125368E-2,1.0000000002592424,2.2770263549283475E-5,1,0,2.8965238347458908,1.2183003180522469,1.000005021211392,3.1689715624186239E-3,1.0000000012195247,4.9386735084017972E-5,1.0000000000000004,3.0199999999999992E-8,1.0000000000000004,3.0199999999999992E-8,1.0000000092627495,2.5323407853043012E-4,71.895910363055592,-70.231746839199232,109.76825316080077,null,1000000000,912.04,null,51.840211229695271,-69.624727359400282,null,null,null,20.055699133360314,-0.60701947979894677,null,0,0]
[33.113,3.3112999999999997E-2,1.0000645694574379,1.1363624710770253E-2,1.0000000003116658,2.4966613804009025E-5,1,0,3.1439163440913114,1.247098382895087,1.0000060365869055,3.4746385534756745E-3,1.0000000014661343,5.4150429091663122E-5,1.0000000000000004,3.3112999999999987E-8,1.0000000000000004,3.3112999999999987E-8,1.0000000111358427,2.7766026638393178E-4,71.183947338336097,-71.923060459776863,108.07693954022314,null,1000000000,1096.470769,null,51.128342548744605,-71.257494444076599,null,null,null,20.055604789591499,-0.66556601570028096,null,0,0]
[36.308,3.6308E-2,1.0000776304129562,1.2459967192671565E-2,1.0000000003747114,2.7375587049130544E-5,1,0,3.4177999487910191,1.2738663867023026,1.0000072576962393,3.8098956270648976E-3,1.0000000017627122,5.9375283999377028E-5,1.0000000000000007,3.6307999999999983E-8,1.0000000000000007,3.6307999999999983E-8,1.0000000133884619,3.0445109036818919E-4,70.458331335572893,-73.502057424944567,106.49794257505543,null,1000000000,1318.2708640000001,null,50.402840002952559,-72.772278634986378,null,null,null,20.055491332620331,-0.72977878995819434,null,0,0]
[39.811,3.9810999999999999E-2,1.0000933318784408,1.3661963254677655E-2,1.0000000004505036,3.0016786822680068E-5,1,0,3.720465019087734,1.29866638608457,1.0000087256941947,4.1774707053603777E-3,1.0000000021192534,6.5103818187103114E-5,1.0000000000000009,3.9810999999999978E-8,1.0000000000000009,3.9810999999999978E-8,1.0000000160965279,3.3382456658857953E-4,69.721195958988915,-74.972661389628257,105.02733861037174,null,1000000000,1584.9157210000001,null,49.665841018771559,-74.17248165170858,null,null,null,20.055354940217359,-0.80017973791966945,null,0,0]
[43.652000000000001,4.3652000000000003E-2,1.0001122090867183,1.4979892878352823E-2,1.0000000005416272,3.2912832591596076E-5,1,0,4.0545513761887921,1.3215884217417411,1.000010490633745,4.580511332756913E-3,1.0000000025479157,7.1385091323786852E-5,1.0000000000000009,4.3651999999999973E-8,1.0000000000000009,4.3651999999999973E-8,1.0000000193523777,3.6603225209174599E-4,68.974135662986427,-76.340455892530343,103.65954410746966,null,1000000000,1905.497104,null,48.918944698756242,-75.463084916231452,null,null,null,20.055190964230185,-0.87737097629890204,null,0,0]
[47.863,4.7863000000000003E-2,1.0001349008356264,1.6424717481635216E-2,1.0000000006511665,3.6087851787238252E-5,1,0,4.4228796167933542,1.3427272318505699,1.0000126122567639,5.0223747784842237E-3,1.0000000030632086,7.8271433722548202E-5,1.0000000000000011,4.7862999999999957E-8,1.0000000000000011,4.7862999999999957E-8,1.0000000232662225,4.0134247439790031E-4,68.218710760954849,-77.61132170690594,102.38867829309406,null,1000000000,2290.8667689999997,null,48.163716903445739,-76.649327167190265,null,null,null,20.054993857509121,-0.96199453971567472,null,0,0]
[52.481000000000002,5.2481E-2,1.0001621858967382,1.8009107670871469E-2,1.0000000007828822,3.9569741752078732E-5,1,0,4.8287155287319061,1.3621922804476425,1.0000151634010177,5.5069427839622102E-3,1.0000000036828238,8.5823352307549272E-5,1.0000000000000013,5.2480999999999952E-8,1.0000000000000013,5.2480999999999952E-8,1.0000000279724337,4.4006548720572824E-4,67.45596587384162,-78.792053869545796,101.2079461304542,null,1000000000,2754.255361,null,47.401209015896853,-77.73726129128076,null,null,null,20.054756857944767,-1.0547925782650509,null,0,0]
[57.544000000000004,5.7544000000000005E-2,1.0001949852932144,1.9746068761379701E-2,1.0000000009412224,4.3387153810736408E-5,1,0,5.275421574609247,1.3800840454184633,1.0000182302173206,6.0382017810294382E-3,1.0000000044276862,9.4102989324388282E-5,1.0000000000000018,5.7543999999999936E-8,1.0000000000000018,5.7543999999999936E-8,1.0000000336299444,4.8251992945655197E-4,66.6871966101358,-79.888946258737988,100.11105374126201,null,1000000000,3311.3119360000005,null,46.632724641025725,-78.732419402045451,null,null,null,20.054471969110082,-1.1565268566925442,null,0,0]
[63.095999999999997,6.3095999999999999E-2,1.0002344211836467,2.1650653495725931E-2,1.0000000011316077,4.7573263181126869E-5,1,0,5.7668975011201811,1.3965118854923633,1.0000219176812262,6.620767465042799E-3,1.0000000053232934,1.0318229895152365E-4,1.000000000000002,6.3095999999999919E-8,1.000000000000002,6.3095999999999919E-8,1.0000000404324183,5.2907475150937159E-4,65.913184883761829,-80.908886028050944,99.091113971949056,null,1000000000,3981.1052159999995,null,45.859055434347972,-79.640806955935219,null,null,null,20.054129449413853,-1.268079072115734,null,0,0]
[69.183000000000007,6.9183000000000008E-2,1.0002818264092044,2.3738586170230343E-2,1.0000000013604764,5.2162753045481854E-5,1,0,6.3072289450083519,1.4115762140058323,1.0000263504944586,7.2594649730997399E-3,1.0000000063999346,1.1313650601051659E-4,1.0000000000000024,6.9182999999999899E-8,1.0000000000000024,6.9182999999999899E-8,1.0000000486099139,5.8011567420638893E-4,65.134884393411255,-81.858275336737222,98.141724663262778,null,1000000000,4786.2874890000012,null,45.081166663339104,-80.467905063411266,null,null,null,20.053717730072158,-1.390370273325946,null,0,0]
[75.858000000000004,7.5858000000000009E-2,1.0003388233312798,2.6027973076046425E-2,1.0000000016356674,5.7195584461474861E-5,1,0,6.9011311154741763,1.425380599135192,1.0000316804693634,7.9598533917861758E-3,1.0000000076944844,1.2405228257720755E-4,1.0000000000000029,7.5857999999999858E-8,1.0000000000000029,7.5857999999999858E-8,1.0000000584425099,6.3608711505027239E-4,64.352802017163498,-82.743795245649764,97.256204754350236,null,1000000000,5754.4361640000006,null,44.299579285496336,-81.219334197613534,null,null,null,20.053222731667159,-1.5244610480362055,null,0,0]
[83.176000000000002,8.3176E-2,1.0004073349914278,2.8537581232787174E-2,1.0000000019664743,6.2713226450980344E-5,1,0,7.5535055942944407,1.438017658003558,1.0000380875906874,8.7277009389075712E-3,1.000000009250662,1.3601957136936393E-4,1.0000000000000036,8.3175999999999818E-8,1.0000000000000036,8.3175999999999818E-8,1.0000000702622669,6.9745026203746092E-4,63.567697160809836,-83.571526302999956,96.428473697000044,null,1000000000,6918.2469760000004,null,43.515069391722712,-81.900075587609749,null,null,null,20.052627769087124,-1.6714507153902003,null,0,0]
[91.201000000000008,9.1201000000000004E-2,1.0004897077472745,3.1289230927568065E-2,1.0000000023642392,6.8763933875627334E-5,1,0,8.2700639096168675,1.4495816605276675,1.0000457915102388,9.5697192144410734E-3,1.0000000111218224,1.4914303300210053E-4,1.000000000000004,9.1200999999999759E-8,1.000000000000004,9.1200999999999759E-8,1.0000000844744381,7.6474177030837361E-4,62.779842566778889,-84.347769421045157,95.652230578954843,null,1000000000,8317.6224010000005,null,42.727930077584524,-82.515151952023061,null,null,null,20.051912489194351,-1.8326174690220987,null,0,0]
[100,0.1,1.0005887301500147,3.4305727191110108E-2,1.0000000028424461,7.5398223543278125E-5,1,0,9.0567934079117265,1.4601563826264641,1.000055053350561,1.0492933331872191E-2,1.000000013371396,1.6353223405272789E-4,1.0000000000000049,9.9999999999999665E-8,1.0000000000000049,9.9999999999999665E-8,1.0000001015608038,8.3852345075032724E-4,61.989751300860817,-85.078264301719628,94.921735698280372,null,1000000000,10000,null,41.938698590054663,-83.0689670657829,null,null,null,20.051052710806147,-2.0092972359367236,null,0,0]
[109.65,0.10965000000000001,1.0007077953468109,3.7613245546281385E-2,1.0000000034175076,8.2674152083509308E-5,1,0,9.9205826153753645,1.4698243086273328,1.0000661909491892,1.1505415973408267E-2,1.0000000160765932,1.7931309431543129E-4,1.000000000000006,1.0964999999999957E-7,1.000000000000006,1.0964999999999957E-7,1.0000001221078048,9.1944096665441287E-4,61.197559983957788,-85.768815047280015,94.231184952719985,null,1000000000,12023.122500000001,null,41.147540963795322,-83.565791616777346,null,null,null,20.050019020162463,-2.2030234305026823,null,0,0]
[120.23,0.12023,1.0008509128063678,4.1238570949853344E-2,1.0000000041088277,9.0651284089550532E-5,1,0,10.868505843170299,1.4786570430317301,1.0000795800346449,1.2615447476676188E-2,1.0000000193286909,1.9661480422073315E-4,1.0000000000000071,1.2022999999999943E-7,1.0000000000000071,1.2022999999999943E-7,1.0000001468087272,1.0081567518557329E-3,60.40378059893726,-86.424626473961993,93.575373526038007,null,1000000000,14455.252900000001,null,40.355003921718129,-84.00926121440142,null,null,null,20.048776677219131,-2.4153652595605779,null,0,0]
[131.83000000000001,0.13183,1.0010229408733093,4.5212158256894633E-2,1.0000000049399294,9.9397477958113866E-5,1,0,11.90862858585734,1.4867245989601432,1.0000956760944253,1.3832459418733473E-2,1.0000000232383479,2.1558454273360299E-4,1.0000000000000087,1.3182999999999924E-7,1.0000000000000087,1.3182999999999924E-7,1.0000001765040667,1.1054254778705282E-3,59.608589148224937,-87.050962367408189,92.949037632591811,null,1000000000,17379.148900000004,null,39.561305539863739,-84.402855358143583,null,null,null,20.047283608361191,-2.6481070092645882,null,0,0]
[144.54,0.14454,1.001229570074877,4.9564332469068884E-2,1.0000000059383847,1.089805920845227E-4,1,0,13.049021509530681,1.4940870200796486,1.0001150129748146,1.5165879636610254E-2,1.0000000279352683,2.3636948880484287E-4,1.0000000000000104,1.4453999999999899E-7,1.0000000000000104,1.4453999999999899E-7,1.0000002121789773,1.2120018163423786E-3,58.812640075280179,-87.652508079898965,92.347491920101035,null,1000000000,20891.811599999997,null,38.767149507479452,-84.749482554174747,null,null,null,20.045490567800726,-2.9030255257242064,null,0,0]
[158.49,0.15849000000000002,1.0014781787909457,5.4338940751302557E-2,1.0000000071399631,1.1949864415137654E-4,1,0,14.3013502729502,1.5008157542682032,1.0001382831977654,1.6629327373242814E-2,1.0000000335877162,2.5918223425702773E-4,1.0000000000000124,1.5848999999999869E-7,1.0000000000000124,1.5848999999999869E-7,1.0000002551114957,1.328975848491542E-3,58.014703359550225,-88.235158227317882,91.764841772682118,null,1000000000,25119.080100000003,null,37.971369622514388,-85.052468319830837,null,null,null,20.043333737035837,-3.1826899074870489,null,0,0]
[173.78,0.17377999999999999,1.0017768796449238,5.9569330091998413E-2,1.0000000085840417,1.3102703237197257E-4,1,0,15.674593627029765,1.506955462851272,1.0001662490593286,1.8233267962933276E-2,1.000000040380931,2.8418631121967044E-4,1.0000000000000151,1.7377999999999826E-7,1.0000000000000151,1.7377999999999826E-7,1.000000306708591,1.457186098708397E-3,57.21597053611292,-88.802835830939756,91.197164169060244,null,1000000000,30199.488400000002,null,37.175227501637082,-85.313781310782502,null,null,null,20.040743034475838,-3.4890545201572478,null,0,0]
[190.55,0.19055000000000002,1.0021359861383867,6.5302236177094575E-2,1.0000000103207234,1.4367131424544051E-4,1,0,17.181326019364036,1.5125606903747955,1.0001998804022698,1.9992354261975948E-2,1.0000000485506051,3.1161066467932854E-4,1.0000000000000182,1.9054999999999772E-7,1.0000000000000182,1.9054999999999772E-7,1.0000003687604442,1.5978065010923764E-3,56.415941168408501,-89.360578604827481,90.639421395172519,null,1000000000,36309.302500000005,null,36.378311726716952,-85.535720270065639,null,null,null,20.037629441691553,-3.8248583347618355,null,0,0]
[208.93,0.20893,1.0025673706280678,7.1580581283274033E-2,1.000000012407773,1.5752950744442348E-4,1,0,18.833227962017617,1.5176737026516898,1.0002402952257019,2.1920178712936195E-2,1.0000000583684752,3.4166788635699321E-4,1.0000000000000218,2.0892999999999696E-7,1.0000000000000218,2.0892999999999696E-7,1.0000004433310135,1.7519271377767864E-3,55.615191557840042,-89.912557699102578,90.087442300897422,null,1000000000,43651.744900000005,null,35.581300912891948,-85.719940241394141,null,null,null,20.033890644948087,-4.1926174577084403,null,0,0]
[229.09,0.22909000000000002,1.0030859350301196,7.8460436432949074E-2,1.0000000149177901,1.7272978892478143E-4,1,0,20.64557853768877,1.5223408462347587,1.0002888984723621,2.4034514247839735E-2,1.0000000701760632,3.7463598080401299E-4,1.0000000000000262,2.29089999999996E-7,1.0000000000000262,2.29089999999996E-7,1.0000005330143089,1.9209735008438537E-3,54.81307536966704,-90.463713153747165,89.536286846252835,null,1000000000,52482.2281,null,34.783676979259141,-85.86809430113145,null,null,null,20.029398390407902,-4.5956188526157096,null,0,0]
[251.19,0.25119000000000002,1.0037088917834174,8.599377553056764E-2,1.0000000179348159,1.8939279581276956E-4,1,0,22.632761859494291,1.5265982011097095,1.000347316159069,2.6352065007927666E-2,1.0000000843687131,4.1077659927435639E-4,1.0000000000000315,2.5118999999999472E-7,1.0000000000000315,2.5118999999999472E-7,1.0000006408131479,2.1062872306956163E-3,54.009979041755606,-91.018217958090347,88.981782041909653,null,1000000000,63096.416100000002,null,33.985974174317477,-85.981307594902546,null,null,null,20.024004867438133,-5.0369103631877987,null,0,0]
[275.42,0.27542,1.0044572628148856,9.4241917951291068E-2,1.0000000215617089,2.076617846913796E-4,1,0,24.811862363128768,1.5304821049328949,1.000417537993685,2.8892655252955236E-2,1.0000001014302924,4.5040045258684566E-4,1.000000000000038,2.7541999999999303E-7,1.000000000000038,2.7541999999999303E-7,1.0000007704027287,2.3094615257163325E-3,53.205677479211737,-91.580632479426043,88.419367520573957,null,1000000000,75856.176400000011,null,33.188147541189352,-86.060544073056462,null,null,null,20.017529938022378,-5.5200884063695872,null,0,0]
[302,0.30199999999999999,1.0053566879869644,0.10327521509168393,1.0000000259242448,2.2770263159684238E-4,1,0,27.202665908419792,1.5340269391832102,1.0005019963996444,3.1679219979096597E-2,1.000000121952473,4.9386731108947573E-4,1.0000000000000457,3.0199999999999082E-7,1.0000000000000457,3.0199999999999082E-7,1.0000009262770877,2.5323411425931647E-3,52.399592996327286,-92.155760197108592,87.844239802891408,null,1000000000,91204,null,32.389838535007371,-86.106480184065916,null,null,null,20.009754461319915,-6.0492800130426785,null,0,0]
[331.13,0.33112999999999998,1.0064364403225177,0.11315569579372649,1.0000000311665898,2.4966613290447053E-4,1,0,29.823162103714754,1.5372590553540302,1.0006034784194655,3.4732552084984013E-2,1.0000001466134381,5.4150423851804478E-4,1.0000000000000548,3.3112999999998785E-7,1.0000000000000548,3.3112999999998785E-7,1.0000011135873779,2.776603134809587E-3,51.592304114300191,-92.747579773472737,87.252420226527263,null,1000000000,109647.0769,null,31.591874867523426,-86.119453151321366,null,null,null,20.000429246776761,-6.6281266221513739,null,0,0]
[363.08,0.36307999999999996,{"$f":"SQRT(1+(A77/p_dom)^2)","v":1.007733439575822},{"$f":"ATAN(A77/p_dom)","v":0.12396715584371329},{"$f":"SQRT(1+(A77/z_ESR)^2)","v":1.0000000374711375},{"$f":"ATAN(A77/z_ESR)","v":2.7375586372106259E-4},{"$f":"IF(VIN_nom>Vout, 1, SQRT(1+(A77/z_RHP)^2))","v":1},{"$f":"IF(VIN_nom>Vout, 0, -ATAN(A77/z_RHP))","v":0},{"$f":"SQRT(1+(A77/EA_p1)^2)","v":32.697639807722958},{"$f":"ATAN(A77/EA_p1)","v":1.5402083100236656},{"$f":"SQRT(1+(A77/EA_z1)^2)","v":1.0007255090759402},{"$f":"ATAN(A77/EA_z1)","v":3.8080722449717844E-2},{"$f":"SQRT(1+(A77/EA_hf_p)^2)","v":1.0000001762712025},{"$f":"ATAN(A77/EA_hf_p)","v":5.9375277091717115E-4},{"$f":"SQRT(1+(A77/Zero3)^2)","v":1.0000000000000659},{"$f":"ATAN(A77/Zero3)","v":3.6307999999998406E-7},{"$f":"SQRT(1+(A77/pole5)^2)","v":1.0000000000000659},{"$f":"ATAN(A77/pole5)","v":3.6307999999998406E-7},{"$f":"SQRT((1-(Z77/pterm2))^2+(A77/pterm1)^2)","v":1.0000013388506768},{"$f":"IF((ATAN((A77/pterm1)/(1-A77^2/pterm2))>0),ATAN((A77/pterm1)/(1-A77^2/pterm2)),PI()+ATAN((A77/pterm1)/(1-A77^2/pterm2)))","v":3.0445115245566283E-3},{"$f":"20*LOG10(((E77*K77*G77*O77)/(C77*I77*S77*M77*Q77))*Adc)","v":50.782920531053925},{"$f":"((F77+L77+H77+P77)-(D77+J77+T77+N77+R77))*radconv","v":-93.36113801951609},{"$f":"IF(V77>0,V77,V77+180)","v":86.63886198048391},null,{"$f":"IF(U77<0,A77,1000000000)","v":1000000000},{"$f":"A77^2","v":131827.0864},null,{"$f":"20*LOG10((K77/(I77*M77))*Aea_stability*Afb*0.8)","v":30.793679525515458},{"$f":"(L77-(J77+N77))*radconv","v":-86.099590586002918},null,null,null,{"$f":"20*LOG10((E77*G77/(C77*S77))*Am_stability)","v":19.989241005538471},{"$f":"(F77+H77-(D77+T77))*radconv","v":-7.2615474335131704},null,{"$f":"SUM((U78<0)*(U77>0))*A77","v":0},{"$f":"IF(AJ77>0,W75,0)","v":0}]
[398.11,{"$f":"A78/1000","v":0.39811000000000002},1.0092904669975544,0.13578737304462635,1.0000000450503734,3.0016785930183574E-4,1,0,35.849490872612812,1.5428983091661974,1.0008721928661606,4.1750674340856164E-2,1.0000002119253353,6.5103809080986467E-4,1.0000000000000793,3.9810999999997899E-7,1.0000000000000793,3.9810999999997899E-7,1.0000016096592872,3.3382464843603652E-3,49.97144923399027,-94.000838106113761,85.999161893886239,null,1000000000,158491.57210000002,null,29.995620540353734,-86.046725636443426,null,null,null,19.975828693636529,-7.9541124696703314,null,0,0]
[436.52,0.43651999999999996,1.0111592735229946,0.14870425501550016,1.0000000541627261,3.2912831415047949E-4,1,0,39.305708061494606,1.5453519839779157,1.0010485191809435,4.577343857574822E-2,1.0000002547915317,7.1385079319499962E-4,1.0000000000000953,4.3651999999997225E-7,1.0000000000000953,4.3651999999997225E-7,1.0000019352471528,3.6603235998817563E-3,49.157455597749305,-94.671411976194975,85.328588023805025,null,1000000000,190549.71039999998,null,29.197697612046241,-85.960422337563443,null,null,null,19.959757985703067,-8.710989638631542,null,0,0]
[478.63,0.47863,1.0134011974281618,0.1628080408626745,1.0000000651166503,3.6087850236291111E-4,1,0,43.095085688099203,1.5475897419310258,1.0012604392762532,5.0182004265064716E-2,1.0000003063208212,7.8271417898279527E-4,1.0000000000001146,4.7862999999996352E-7,1.0000000000001146,4.7862999999996352E-7,1.0000023266358011,4.0134261662842906E-3,48.340611071108654,-95.377478975350854,84.622521024649146,null,1000000000,229086.67689999999,null,28.400093267995349,-85.839989797513098,null,null,null,19.940517803113302,-9.5374891778377577,null,0,0]
[524.80999999999995,0.52481,1.0160904535395152,0.17820001555346365,1.0000000782882201,3.9569739707501369E-4,1,0,47.250919205256359,1.549631137173227,1.0015152036771162,5.5014415306503327E-2,1.0000003682823242,8.5823331446787071E-4,1.0000000000001377,5.2480999999995172E-7,1.0000000000001377,5.2480999999995172E-7,1.0000027972629593,4.4006567470410273E-3,47.520146929552695,-96.123979367651799,83.876020632348201,null,1000000000,275425.53609999997,null,27.602652258800028,-85.684403299398213,null,null,null,19.917494670752667,-10.439576068253604,null,0,0]
[575.44000000000005,0.57544000000000006,1.019313916597494,0.19497742969199938,1.0000000941222515,4.3387151115496835E-4,1,0,51.807405638434268,1.5514928682585247,1.0018213796372089,6.0309525074009031E-2,1.0000004427685347,9.4102961824940698E-4,1.0000000000001656,5.7543999999993655E-7,1.0000000000001656,5.7543999999993655E-7,1.0000033630227658,4.8252017662275808E-3,46.69565317416108,-96.915417581927571,83.084582418072429,null,1000000000,331131.19360000006,null,26.805674931424388,-85.492429070203485,null,null,null,19.889978242736696,-11.422988511724075,null,0,0]
[630.96,0.63096000000000008,1.0231762956883139,0.21324800589188508,1.0000001131607623,4.7573259628065515E-4,1,0,56.804143148564606,1.5531910676718554,1.0021893954157166,6.6112151997804222E-2,1.0000005323292029,1.0318226269974964E-3,1.000000000000199,6.3095999999991628E-7,1.000000000000199,6.3095999999991628E-7,1.0000040432827748,5.2907507733986406E-3,45.866223099331897,-97.756555699760597,82.243444300239403,null,1000000000,398110.52160000004,null,26.00910092963958,-85.262464752747022,null,null,null,19.857122169692317,-12.494090947013564,null,0,0]
[691.83,0.69183000000000006,1.0278001870272984,0.23311397489689925,1.0000001360476312,5.2162748361713764E-4,1,0,62.282531230475186,1.5547397704801691,1.0026316214475681,7.2468795838736486E-2,1.0000006399932504,1.1313645822218202E-3,1.0000000000002394,6.9182999999988975E-7,1.0000000000002394,6.9182999999988975E-7,1.000004861050573,5.8011610372417956E-3,45.031157879297162,-98.651635254880389,81.348364745119611,null,1000000000,478628.74890000006,null,25.213207058906086,-84.992693357349054,null,null,null,19.817950820391083,-13.658941897531346,null,0,0]
[758.58,0.75858000000000003,1.033332543947457,0.25468511994561166,1.000000163566731,5.7195578286981018E-4,1,0,68.290270663518271,1.55615242903609,1.0031630945354406,7.943273052317619E-2,1.0000007694481525,1.2405221957905396E-3,1.0000000000002878,7.5857999999985453E-7,1.0000000000002878,7.5857999999985453E-7,1.0000058443365243,6.3608768126770434E-3,44.18927154289544,-99.604946155441567,80.395053844558433,null,1000000000,575443.61640000006,null,24.417957323551285,-84.680882934832411,null,null,null,19.771314219344159,-14.92406322060917,null,0,0]
[831.76,0.83175999999999994,1.039944032371487,0.27805836014793495,1.0000001966474197,6.2713218311601332E-4,1,0,74.876863424583576,1.5574406694688343,1.0038016054997754,8.7058611714546E-2,1.0000009250657733,1.3601948832356512E-3,1.0000000000003459,8.3175999999980813E-7,1.0000000000003459,8.3175999999980813E-7,1.0000070263503194,6.974510084320075E-3,43.339613614580642,-100.6198680667256,79.380131933274399,null,1000000000,691824.69759999996,null,23.623706569736274,-84.324619607206671,null,null,null,19.715907044844368,-16.29524845951892,null,0,0]
[912.01,0.91200999999999999,1.0478385041706897,0.30333527213763939,1.0000002364239029,6.8763923145720278E-4,1,0,82.099912953149598,1.5586157447184943,1.00456881881431,9.5409551686736191E-2,1.0000011121816128,1.4914292352525469E-3,1.0000000000004159,9.1200999999974713E-7,1.0000000000004159,9.1200999999974713E-7,1.0000084476225153,7.6474275424586059E-3,42.480647365484209,-101.69958938621046,78.300410613789538,null,1000000000,831762.24009999994,null,22.830440040320596,-83.920992018746588,null,null,null,19.650207325163617,-17.778597367463874,null,0,0]
[1000,1,1.0572514792242671,0.33059688250777974,1.0000002842445663,7.5398209398467621E-4,1,0,90.019723857382104,1.5596874217082459,1.0054904142752217,0.10455057023509783,1.0000013371387086,1.6353208973377904E-3,1.0000000000005,9.9999999999966665E-7,1.0000000000005,9.9999999999966665E-7,1.0000101563386985,8.3852474781581313E-3,41.611017241319786,-102.84594257566886,77.154057424331143,null,1000000000,1000000,null,22.038503309118131,-83.466897188933331,null,null,null,19.572513932201655,-19.379045386735548,null,0,0]
[1096.5,1.0965,1.0684611208590971,0.35991861109751311,1.0000003417507144,8.267413343590645E-4,1,0,98.705602388358855,1.5606650162790821,1.006597550147033,0.1145554899458263,1.0000016076580318,1.7931290405471707E-3,1.0000000000006013,1.0964999999995606E-6,1.0000000000006013,1.0964999999995606E-6,1.0000122111538996,9.1944267658952486E-3,40.72886524848937,-104.05996174232189,75.940038257678111,null,1000000000,1202312.25,null,21.247977109265626,-82.958711298703832,null,null,null,19.480888139223747,-21.101250443618067,null,0,0]
[1202.3,1.2022999999999999,1.0817832345409897,0.39133781676351403,1.0000004108826832,9.0651259506509382E-4,1,0,108.22865575393003,1.5615564981908394,1.0079269022241557,0.12549813422865855,1.0000019328672438,1.9661455340106741E-3,1.0000000000007228,1.2022999999994205E-6,1.0000000000007228,1.2022999999994205E-6,1.0000146814124802,1.0081590060037405E-2,39.83266524900111,-105.34043371036397,74.659566289636032,null,1000000000,1445525.2899999998,null,20.459428421015538,-82.392735230502154,null,null,null,19.373236827985572,-22.947698479861817,null,0,{"$f":"IF(AJ90>0,W90,0)","v":0}]
[1318.3,1.3183,1.0975849923650152,0.42487279541887352,1.0000004939928124,9.9397445551042941E-4,1,0,118.66989289449053,1.5623694898696237,1.0095227259832011,0.13746102297177687,1.0000023238321252,2.1558421208583609E-3,1.0000000000008691,1.3182999999992363E-6,1.0000000000008691,1.3182999999992363E-6,1.0000176511868644,1.1054284493642671E-2,38.92045404788788,-106.68459331372969,73.315406686270308,null,1000000000,1737914.89,null,19.67320056642945,-81.764762000524897,null,null,null,19.247253481458429,-24.919831313204785,null,0,0]
[1445.4,1.4454,1.1162729053561722,0.46048229265777774,1.000000593838301,1.0898054937141985E-3,1,0,130.11032332455193,1.5631104659044968,1.0114365614122132,0.15052321321860923,1.0000027935229641,2.3636905300532889E-3,1.0000000000010445,1.4453999999989937E-6,1.0000000000010445,1.4453999999989937E-6,1.0000212190251836,1.2120057326969965E-2,37.990802233475513,-108.0863960511391,71.913603948860896,null,1000000000,2089181.1600000001,null,18.890223340762876,-81.070717264328408,null,null,null,19.100578892712637,-27.015678786810675,null,0,0]
[1584.9,1.5849000000000002,1.1383559458459873,0.49816703841099524,1.0000007139960496,1.1949858783917538E-3,1,0,142.66696170789254,1.5637869380992662,1.0137349514431078,0.16480027193936345,1.0000033587660375,2.5918165970694818E-3,1.0000000000012559,1.584899999998673E-6,1.0000000000012559,1.584899999998673E-6,1.000025512779436,1.3289810115418776E-2,37.040089447589047,-109.5403828945397,70.459617105460296,null,1000000000,2511908.0100000002,null,18.109700741362317,-80.304531718323929,null,null,null,18.930388706226733,-29.235851176215782,null,0,0]
[1737.8,1.7378,1.1643417278067569,0.53776743234599023,1.000000858403802,1.3102695813910969E-3,1,0,156.4298198466399,1.5644036402081161,1.0164903225022208,0.18037104656837016,1.0000040380850386,2.8418555382662327E-3,1.0000000000015099,1.7377999999982506E-6,1.0000000000015099,1.7377999999982506E-6,1.0000306732148985,1.4571929045148669E-2,36.067646250257248,-111.03369400205615,68.966305997943849,null,1000000000,3019948.84,null,17.333348746287459,-79.462052652430884,null,null,null,18.734297503969785,-31.571641349625306,null,0,0]
[1905.5,1.9055,1.1948445385721409,0.57914854844553443,1.0000010320718085,1.4367121638129709E-3,1,0,171.52491474525664,1.5649662369417758,1.0197941339660099,0.19734765840482993,1.0000048550488456,3.1160966617864929E-3,1.0000000000018154,1.9054999999976938E-6,1.0000000000018154,1.9054999999976938E-6,1.0000368794498569,1.5978154729498477E-2,35.070999826223087,-112.55324254522577,67.446757454774229,null,1000000000,3630930.25,null,16.561373534612404,-78.537311721123089,null,null,null,18.509626291610683,-34.015930824102682,null,0,0]
[2089.3000000000002,2.0893000000000002,1.2305012250330156,0.62206486345348511,1.0000012407765366,1.5752937844165141E-3,1,0,188.06926263196817,1.5654791117532141,1.0237503696311452,0.21582231966160173,1.0000058368306484,3.4166657015240209E-3,1.0000000000021827,2.0892999999969601E-6,1.0000000000021827,2.0892999999969601E-6,1.0000443380232971,1.7519389635139514E-2,34.049334426157017,-114.08061916238448,65.91938083761552,null,1000000000,4365174.4900000012,null,15.795184054942146,-77.52539850271944,null,null,null,18.254150371214877,-36.555220659665018,null,0,0]
[2290.9,2.2909000000000002,1.2720610463043613,0.66628082684584211,1.0000014917779161,1.7272961885980054E-3,1,0,206.21588521640984,1.5659470208442128,1.0284882307081418,0.23591506154323749,1.0000070175819391,3.7463424564706444E-3,1.0000000000026241,2.2908999999959922E-6,1.0000000000026241,2.2908999999959922E-6,1.0000533085455849,1.9209890894932261E-2,33.000749567539017,-115.59662573719227,64.403374262807731,null,1000000000,5248222.8100000005,null,15.035192993989119,-76.41986749682799,null,null,null,17.96555657354989,-39.176758240364258,null,0,0]
[2511.9,2.5119000000000002,1.3202855541547027,0.71145614554066727,1.0000017934799899,1.893925716294081E-3,1,0,226.10880332012277,1.566373662814917,1.0341543862814957,0.25771999858205175,1.0000084368360844,4.1077431195577635E-3,1.0000000000031548,2.5118999999947171E-6,1.0000000000031548,2.5118999999947171E-6,1.00006409159817,2.1063077779687925E-2,31.925261795001102,-117.07743410715052,62.922565892849477,null,1000000000,6309641.6100000003,null,14.282994612970199,-75.215688148948075,null,null,null,17.642267182030906,-41.861745958202441,null,0,0]
[2754.2,2.7542,1.376022994777772,0.75724382776589172,1.0000021561685786,2.0766148917431104E-3,1,0,247.9190420130825,1.5667627410585172,1.0409250849771126,0.28134119012431957,1.0000101429783161,4.5039743746308029E-3,1.000000000003793,2.7541999999930355E-6,1.000000000003793,2.7541999999930355E-6,1.0000770551357188,2.3094886077928506E-2,30.822814788874847,-118.49842211133837,61.501577888661629,null,1000000000,7585617.6399999987,null,13.539813448055645,-73.907288486391536,null,null,null,17.283001340819204,-44.591133624946863,null,0,0]
[3020,3.02,1.4402107512485336,0.80329002442952047,1.0000025924211511,2.2770224199881671E-3,1,0,271.84463072223889,1.567117746671125,1.0490111915358267,0.30688675257727538,1.00001219517367,4.9386333607723248E-3,1.0000000000045604,3.0199999999908185E-6,1.0000000000045604,3.0199999999908185E-6,1.0000926491940754,2.5323768414470975E-2,29.693653622580417,-119.83448942305475,60.165510576945252,null,1000000000,9120400,null,12.806791072398697,-72.488880021288523,null,null,null,16.886862550181721,-47.345609401766211,null,0,0]
[3311.3,3.3113000000000001,1.5137472843595972,0.84916231528673469,1.0000031166541687,2.4966561934442353E-3,1,0,298.06559644891058,1.5674413543059893,1.0586463538469173,0.33441491122643219,1.0000146612374068,5.4149899875157916E-3,1.0000000000054823,3.311299999987898E-6,1.0000000000054823,3.311299999987898E-6,1.000111389790483,2.7766501842439711E-2,28.540521278240032,-121.05873958099842,58.94126041900158,null,1000000000,10964707.690000001,null,12.086363504906281,-70.9574672888767,null,null,null,16.454157773333755,-50.101272292121713,null,0,0]
[3630.8,3.6308000000000002,1.5977072710392499,0.89451533564157781,1.0000037471068128,2.7375518669982704E-3,1,0,326.82497594210719,1.5677365803435721,1.0701188959783725,0.36401303546260483,1.0000176269664365,5.9374586340334287E-3,1.0000000000065914,3.6307999999840453E-6,1.0000000000065914,3.6307999999840453E-6,1.0001339299530461,3.0445735365998271E-2,27.364983351865511,-122.14798555742676,57.852014442573235,null,1000000000,13182708.640000001,null,11.379892551935246,-69.308470142969384,null,null,null,15.985090799930262,-52.839515414457402,null,0,0]
[3981.1,3.9811000000000001,1.6931404776964412,0.93897130066595957,1.000004505027311,3.0016696681016497E-3,1,0,358.35680485035431,1.568005808282904,1.0837502688681115,0.39571341629157919,1.0000211923112157,6.510289849247659E-3,1.0000000000079245,3.9810999999789672E-6,1.0000000000079245,3.9810999999789672E-6,1.0001610308065025,3.3383282122707782E-2,26.170743342086013,-123.08024932868754,56.919750671312457,null,1000000000,15849157.209999999,null,10.689796935741338,-67.54041854816758,null,null,null,15.480946406344673,-55.539830780519978,null,0,0]
[4365.2,4.3651999999999997,1.8011961700922612,0.98220900972514635,1.000005416258082,3.2912713761000583E-3,1,0,392.93112452635285,1.5682513487642258,1.0999153492137301,0.4295316922958744,1.0000254788318177,7.1383878927508294E-3,1.0000000000095275,4.3651999999722742E-6,1.0000000000095275,4.3651999999722742E-6,1.0001936184900331,3.6604313068476564E-2,24.961655954508863,-123.83795741169685,56.162042588303152,null,1000000000,19054971.039999999,null,10.018345083893415,-65.652829863005422,null,null,null,14.943310870615447,-58.185127548691447,null,0,0]
[4786.3,4.7862999999999998,1.9230701221960749,1.0239432231622518,1.000006511644038,3.6087695142788447E-3,1,0,430.8359792849958,1.568475255793456,1.1190383040662921,0.46543936104918998,1.0000306316176619,7.8269835529570387E-3,1.0000000000114544,4.7862999999634508E-6,1.0000000000114544,4.7862999999634508E-6,1.0002327991152538,4.0135680965615102E-2,23.742401488693226,-124.40821755721457,55.59178244278543,null,1000000000,22908667.690000001,null,9.368103462828536,-63.647754544185688,null,null,null,14.374298025864686,-60.760463013028875,null,0,0]
[5248.1,5.2481,2.0600924681707284,1.0639584282958396,1.0000078287916747,3.9569535251686152E-3,1,0,472.4044205700942,1.5686794948956033,1.1416086543301784,0.50338036140845988,1.0000368275610527,8.5821245462746054E-3,1.0000000000137712,5.2480999999518189E-6,1.0000000000137712,5.2480999999518189E-6,1.0002799221984258,4.4008437695629558E-2,22.517524262873103,-124.78397230844068,55.216027691559319,null,1000000000,27542553.610000003,null,8.7414558736925461,-61.528863783514176,null,null,null,13.776068389180551,-63.25510852492647,null,0,0]
[5370.3,5.3703000000000003,2.0968570501414976,1.0736670937858219,1.0000081976155617,4.0490886780420593E-3,1,0,483.40412798040524,1.5687276628027071,1.147849211089667,0.51316599381105221,1.0000385625258548,8.7819458745672114E-3,1.00000000001442,5.3702999999483734E-6,1.00000000001442,5.3702999999483734E-6,1.0002931194861477,4.5033248155883832E-2,22.211179320282227,-124.84720952450782,55.152790475492182,null,1000000000,28840122.090000004,null,8.5888645216718036,-60.982397083532078,null,null,null,13.622314798610422,-63.864812440975754,null,0,0]
[5432.85,5.4328500000000002,2.1157500473572077,1.0785058403177152,1.0000083896885756,4.0962494847013448E-3,1,0,489.03450236455717,1.5687514798729207,1.1510857195508253,0.51813362616417791,1.0000394660453518,8.8842273070276791E-3,1.000000000014758,5.432849999946548E-6,1.000000000014758,5.432849999946548E-6,1.000299992608644,4.5557815984685397E-2,22.057076359962153,-124.87440323039694,55.125596769603064,null,1000000000,29515859.122500002,null,8.5127302769566899,-60.704997627531483,null,null,null,13.544346083005461,-64.169405602865467,null,0,0]
[5495.4,5.4954000000000001,2.134691704098421,1.0832588256639042,1.0000085839857493,4.1434102731392562E-3,1,0,494.66487701980031,1.5687747547618254,1.1543504740887196,0.52307328075096915,1.0000403800267339,8.9865085535990579E-3,1.0000000000150997,5.4953999999446802E-6,1.0000000000150997,5.4953999999446802E-6,1.0003069455638218,4.6082385469434523E-2,21.904762576529123,-124.89825521080174,55.101744789198264,null,1000000000,30199421.159999996,null,8.4378912412693712,-60.429170104110632,null,null,null,13.466871335259754,-64.469085106691097,null,0,0]
[5559.4,5.5593999999999992,2.1541214817113579,1.0880353645653214,1.0000087850891086,4.19166429818571E-3,1,0,500.42577222187089,1.5687980271048267,1.1577198969726674,0.52809848214623589,1.0000413260239833,9.0911606336340194E-3,1.0000000000154534,5.559399999942725E-6,1.0000000000154534,5.559399999942725E-6,1.0003141423374258,4.6619116971492319E-2,21.750737400760528,-124.91932512673753,55.080674873262467,null,1000000000,30906928.359999996,null,8.3626273971954923,-60.148576802495235,null,null,null,13.388110003565037,-64.770748324242305,null,0,0]
[5623.4,5.6233999999999993,2.1735995270079465,1.0927264019274503,1.0000089885209384,4.2399183037118877E-3,1,0,506.18666768880382,1.5688207697241481,1.1611183852460545,0.53309439247109192,1.0000422829737223,9.1958125145300412E-3,1.0000000000158114,5.623399999940724E-6,1.0000000000158114,5.623399999940724E-6,1.0003214227057005,4.7155850246779853E-2,21.598520261344728,-124.93714416041819,55.062855839581815,null,1000000000,31622627.559999995,null,8.2886584913546795,-59.869631393250785,null,null,null,13.309861769990043,-65.067512767167443,null,0,0]
[5688.9,5.6888999999999994,2.1935827250787878,1.0974410188247703,1.0000091991316706,4.2893032420462072E-3,1,0,512.08258440816167,1.5688435155374416,1.1646263552575422,0.53817707409990756,1.0000432736924845,9.3029169652984918E-3,1.0000000000161817,5.6888999999386289E-6,1.0000000000161817,5.6888999999386289E-6,1.0003289602736762,4.770516506515067E-2,21.444574474731255,-124.95213934899387,55.047860651006133,null,1000000000,32363583.209999997,null,8.2142660525227527,-59.585855059410378,null,null,null,13.230308422208498,-65.366284289583518,null,0,0]
[5754.4,5.7543999999999995,2.2136138003121277,1.1020704115835671,1.0000094121812961,4.3386881594582836E-3,1,0,517.97850138642525,1.5688657435399631,1.1681642306713838,0.54322909899933181,1.0000442758830834,9.4100212026269267E-3,1.0000000000165565,5.7543999999364839E-6,1.0000000000165565,5.7543999999364839E-6,1.0003365854202795,4.8254481783252166E-2,21.292455910308128,-124.96397848477162,55.036021515228384,null,1000000000,33113119.359999996,null,8.1411685739424371,-59.30380554617674,null,null,null,13.151287336365694,-65.660172938594869,null,0,0]
[5821.4,5.8213999999999997,2.234151794269851,1.106719832708654,1.0000096326332311,4.3892040072799603E-3,1,0,524.00943962294787,1.5688879630682906,1.1718137842672192,0.5483651231652118,1.0000453128934921,9.5195779853602096E-3,1.0000000000169442,5.8213999999342396E-6,1.0000000000169442,5.8213999999342396E-6,1.0003444758090598,4.8816380261347964E-2,21.138710295270528,-124.97294847713052,55.027051522869485,null,1000000000,33888697.959999993,null,8.0677060209267033,-59.017083264458208,null,null,null,13.07100427434383,-65.955865212672322,null,0,0]
[5888.4,5.8883999999999999,2.2547372037077396,1.1112844539907936,1.0000098556370405,4.4397198327003149E-3,1,0,530.04037811229057,1.5689096769573825,1.1754940564267604,0.55346912123113945,1.0000463619071083,9.6291345395660075E-3,1.0000000000173366,5.8883999999319428E-6,1.0000000000173366,5.8883999999319428E-6,1.0003524578550331,4.937828077251636E-2,20.98680854713092,-124.97886589042888,55.021134109571122,null,1000000000,34673254.559999995,null,7.9955367216768094,-58.732166959013391,null,null,null,12.991271825454113,-66.246698931415494,null,0,0]
[5957,5.9569999999999999,2.275861988759146,1.1158724267837861,1.0000100866103245,4.4914419827110277E-3,1,0,536.21533926635846,1.5689314033090727,1.1792937430069856,0.55866186015884844,1.0000474484083524,9.7413071301686045E-3,1.0000000000177429,5.9569999999295369E-6,1.0000000000177429,5.9569999999295369E-6,1.0003607254950986,4.9953601933747802E-2,20.833155067937525,-124.98188720109199,55.018112798908007,null,1000000000,35485849,null,7.9229528521186339,-58.442316778617013,null,null,null,12.910202215818888,-66.539570422474981,null,0,0]
[6025.6,6.0256000000000007,2.2970337978376656,1.1203759180391051,1.0000103202588149,4.5431641086907514E-3,1,0,542.39030066777525,1.568952634963936,1.1831250239493234,0.56382110645134464,1.0000485474928562,9.8534794756202845E-3,1.0000000000181539,6.0255999999270751E-6,1.0000000000181539,6.0255999999270751E-6,1.0003690892457777,5.0528925274879365E-2,20.681364964721183,-124.98195883103163,55.018041168968367,null,1000000000,36307855.360000007,null,7.8516625991525473,-58.154357226776675,null,null,null,12.829702365568634,-66.827601604254951,null,0,0]
[6095.8,6.0958000000000006,2.3187467481286554,1.1248992133008453,1.0000105621263584,4.5960925564651417E-3,1,0,548.70928473990614,1.568973867103816,1.1870780533372278,0.56906606475740784,1.0000496852388534,9.9682678289503644E-3,1.0000000000185794,6.0957999999244956E-6,1.0000000000185794,6.0957999999244956E-6,1.0003777475811999,5.1117669518574008E-2,20.527928182565127,-124.97910396825229,55.020896031747711,null,1000000000,37158777.640000001,null,7.7800175450209244,-57.8616366523054,null,null,null,12.7479106375442,-67.117467315946868,null,0,0]
[6166,6.1660000000000004,2.3405062596396036,1.1293384925153553,1.0000108067953506,4.6490209784881883E-3,1,0,555.0282690537648,1.568994615788839,1.1910635214661933,0.57427606483853999,1.0000508361618414,1.0083055919581252E-2,1.0000000000190097,6.1659999999218569E-6,1.0000000000190097,6.1659999999218569E-6,1.0003865065885797,5.1706416097018294E-2,20.376371548331981,-124.97341071957537,55.026589280424631,null,1000000000,38019556,null,7.7096646180292296,-57.570891321607476,null,null,null,12.666706930302752,-67.402519397967865,null,0,0]
[6237.8,6.2378,2.362808538773955,1.1337942812423834,1.0000110599387946,4.7031557193648321E-3,1,0,561.49127604367573,1.5690153542823935,1.1951730443999431,0.57956872015117,1.0000520269475535,1.020045998808947E-2,1.0000000000194551,6.2377999999190955E-6,1.0000000000194551,6.2377999999190955E-6,1.0003955693851565,5.2308583843441052E-2,20.223269350145273,-124.96477676023386,55.03522323976614,null,1000000000,38910148.840000004,null,7.6390134022712539,-57.275559495553601,null,null,null,12.58425594787402,-67.689217264680195,null,0,0]
[6309.6,6.3096000000000005,2.3851568514137607,1.1381666562168478,1.0000113160128394,4.757290432675431E-3,1,0,567.95428326957972,1.5690356207906662,1.1993158167771989,0.58482495723464101,1.0000532315176651,1.0317863775388136E-2,1.0000000000199054,6.3095999999162696E-6,1.0000000000199054,6.3095999999162696E-6,1.0004047375232392,5.2910754087790363E-2,20.072061369454492,-124.95342324156849,55.046576758431513,null,1000000000,39811052.160000004,null,7.5696510490604236,-56.982287221451131,null,null,null,12.502410320394068,-67.97113602011737,null,0,0]
[6383.05,6.3830499999999999,2.4080650356042304,1.1425554490995076,1.0000115810039869,4.8126691599863101E-3,1,0,574.56581387792653,1.5690558812607127,1.2035878384980689,0.59016439297793466,1.000054478032548,1.0437965266233511E-2,1.0000000000203717,6.3830499999133111E-6,1.0000000000203717,6.3830499999133111E-6,1.0004142253653872,5.3526765120212261E-2,19.919301640701455,-124.93911943073481,55.060880569265194,null,1000000000,40743327.302500002,null,7.4999967504001201,-56.684402236342379,null,null,null,12.419304890301335,-68.25471719439237,null,0,0]
[6456.5,6.4565000000000001,2.4310187280715345,1.146861445608979,1.0000118490619718,4.8680478577779558E-3,1,0,581.17734471675897,1.5690756807605528,1.2078939307085823,0.59546590923374865,1.0000557389725484,1.05580664559466E-2,1.0000000000208433,6.4564999999102839E-6,1.0000000000208433,6.4564999999102839E-6,1.0004238234771778,5.4142778826034396E-2,19.76845011400334,-124.92221808971722,55.077781910282781,null,1000000000,41686392.25,null,7.4316280817892206,-56.388663448926614,null,null,null,12.336822032214121,-68.533554640790584,null,0,0]
[6531.7,6.5316999999999998,2.4545651234424124,1.1511865179776901,1.0000121266839439,4.9247459626328193E-3,1,0,587.94640034674944,1.5690954906616181,1.2123375373818721,0.60085456503138512,1.0000570449000559,1.068102882879682E-2,1.0000000000213316,6.5316999999071123E-6,1.0000000000213316,6.5316999999071123E-6,1.0004337645294306,5.4773472310190287E-2,19.615943660655876,-124.90234700950053,55.097652990499469,null,1000000000,42663104.890000001,null,7.3629306174860698,-56.088096463200188,null,null,null,12.253013043169805,-68.814250546300329,null,0,0]
[6606.9,6.6068999999999996,2.4781565614858128,1.1554293212197448,1.0000124075206285,4.9814440358245289E-3,1,0,594.71545620221673,1.5691148496098011,1.2168160897339491,0.60620370877405649,1.0000583659481315,1.080399087864674E-2,1.0000000000218257,6.6068999999038662E-6,1.0000000000218257,6.6068999999038662E-6,1.0004438212023532,5.5404168660206699E-2,19.465361721798526,-124.88000043934403,55.11999956065597,null,1000000000,43651127.609999992,null,7.2955171732427848,-55.789767495259682,null,null,null,12.169844548555744,-69.090232944084349,null,0,0]
[6683.85,6.6838500000000005,2.5023423005679439,1.1596879670840448,1.0000126982205366,5.0394615124026839E-3,1,0,601.64203685425775,1.5691342081276762,1.2214346376776024,0.61163656782680376,1.0000597333910943,1.0929814074129187E-2,1.0000000000223368,6.6838499999004689E-6,1.0000000000223368,6.6838499999004689E-6,1.0004542316130434,5.6049545119599177E-2,19.313229254787746,-124.8546944696096,55.145305530390402,null,1000000000,44673850.822500005,null,7.2278321105211498,-55.486805900285688,null,null,null,12.085397144266594,-69.367888569323924,null,0,0]
[6760.8,6.7608000000000006,2.5265725529618703,1.1638650052492097,1.0000129922865133,5.0974789550546377E-3,1,0,608.56861772663319,1.5691531259776184,1.2260889652093274,0.61702833792356837,1.0000611166664359,1.1055636923528615E-2,1.0000000000228542,6.760799999896992E-6,1.0000000000228542,6.760799999896992E-6,1.0004647631254975,5.6694924647771039E-2,19.163034669006993,-124.82704185643149,55.172958143568508,null,1000000000,45708416.640000001,null,7.1614275336430762,-55.186173260832277,null,null,null,12.001607135363916,-69.64086859559923,null,0,0]
[6839.55,6.83955,2.5514143589478548,1.1680575346146602,1.00001329671632,5.1568534953346573E-3,1,0,615.6572241029387,1.569172045619325,1.2308887871755674,0.62250385056642366,1.0000625486912591,1.1184402634999003E-2,1.0000000000233897,6.8395499998933505E-6,1.0000000000233897,6.8395499998933505E-6,1.0004756663931709,5.7355403986211605E-2,19.011293888076132,-124.79643484486297,55.203565155137028,null,1000000000,46779444.202500001,null,7.0947631965686071,-54.880911243159083,null,null,null,11.916530691507523,-69.915523601703882,null,0,0]
[6918.3,6.9183000000000003,2.5763001465929731,1.1721691395648222,1.0000136046715076,5.2162279992550931E-3,1,0,622.74583069460334,1.5691905345431103,1.2357252253870852,0.62793666440819595,1.0000639972976804,1.1313167975566593E-2,1.0000000000239315,6.9182999998896235E-6,1.0000000000239315,6.9182999998896235E-6,1.0004866965352439,5.8015886611397199E-2,18.8615039220475,-124.76361315776079,55.236386842239213,null,1000000000,47862874.890000001,null,7.0293755740487569,-54.578070987008012,null,null,null,11.83212834799874,-70.185542170752782,null,0,0]
[6998.9,6.9988999999999999,2.601814779275577,1.176295816661332,1.0000139235117758,5.2769972947037226E-3,1,0,630.00096349781063,1.5692090269686103,1.240712751246031,0.63345307951844187,1.0000654971052578,1.1444957891160753E-2,1.0000000000244924,6.9988999998857209E-6,1.0000000000244924,6.9988999998857209E-6,1.0004981172002407,5.8691888778144394E-2,18.710175121549209,-124.72784782576798,55.272152174232019,null,1000000000,48984601.209999993,null,6.963741515712476,-54.270614227028766,null,null,null,11.746433605836737,-70.457233598739222,null,0,0]
[7079.5,7.0795000000000003,2.6273728584861011,1.1803422760790017,1.0000142460450003,5.3377665511770934E-3,1,0,637.25609651155366,1.5692270983231922,1.2457377300390062,0.63892515649542347,1.0000670142825023,1.1576747409173384E-2,1.0000000000250595,7.0794999998817268E-6,1.0000000000250595,7.0794999998817268E-6,1.0005096708154861,5.9367894465674552E-2,18.560809530532907,-124.69000280283572,55.309997197164279,null,1000000000,50119320.25,null,6.8993800841031021,-53.96567370659082,null,null,null,11.661429446429807,-70.724329096244901,null,0,0]
[7161.95,7.16195,2.6535612134684334,1.1844008931733061,1.0000145798023536,5.3999305947022257E-3,1,0,644.67775574162408,1.5692451636097056,1.2509163281106357,0.64447717448088948,1.0000685842554793,1.1711561456552867E-2,1.0000000000256468,7.1619499998775462E-6,1.0000000000256468,7.1619499998775462E-6,1.0005216272058279,6.0059420096672242E-2,18.410006102578919,-124.64925633800776,55.35074366199224,null,1000000000,51293527.802499995,null,6.8348255827050135,-53.656325848849718,null,null,null,11.575180519873902,-70.992930489158027,null,0,0]
[7244.4,7.2443999999999997,2.679792424161473,1.1883801190141934,1.0000149174241295,5.4620945964923388E-3,1,0,652.09941517729897,1.5692628176877463,1.2561331669339557,0.64998324491889858,1.0000701724044729,1.1846375078203018E-2,1.0000000000262408,7.2443999998732674E-6,1.0000000000262408,7.2443999998732674E-6,1.0005337227686584,6.0750949495053136E-2,18.261175270282269,-124.60657032332089,55.393429676679105,null,1000000000,52481331.359999992,null,6.7715377123208071,-53.349587006754405,null,null,null,11.48963755796146,-71.25698331656649,null,0,0]
[7328.75,7.3287500000000003,2.7066711630928797,1.1923711641242614,1.0000152668251754,5.5256910785879271E-3,1,0,659.69210153685174,1.5692804675317009,1.2615093020075969,0.65556889927674977,1.0000718159602315,1.1984294935583379E-2,1.0000000000268554,7.3287499998687894E-6,1.0000000000268554,7.3287499998687894E-6,1.0005462411113262,6.1458418625452191E-2,18.110914551848644,-124.56101061604869,55.438989383951309,null,1000000000,53710576.5625,null,6.7080694526292595,-53.038466073537279,null,null,null,11.402845099219384,-71.522544542511412,null,0,0]
[7413.1,7.4131,2.733592166840396,1.1962836611944445,1.0000156202707928,5.5892875159856388E-3,1,0,667.28478809723322,1.569297715718871,1.2669244608396295,0.66110697616760816,1.0000734785391807,1.2122214337015611E-2,1.0000000000274771,7.4130999998642073E-6,1.0000000000274771,7.4130999998642073E-6,1.000558905168349,6.2165891787663165E-2,17.962635215161885,-124.51365361986502,55.486346380134975,null,1000000000,54954051.610000007,null,6.6458614903473423,-52.7300480890163,null,null,null,11.316773724814544,-71.783605530848718,null,0,0]
[7499.45,7.4994499999999995,2.7611939764421529,1.2002098381238173,1.0000159862864171,5.6543918244453192E-3,1,0,675.05750299277918,1.5693149709677225,1.2725079195296785,0.66672736375567643,1.000075200244108,1.226340343024533E-2,1.0000000000281208,7.4994499998594059E-6,1.0000000000281208,7.4994499998594059E-6,1.0005720204660469,6.2890143877510699E-2,17.812850236472812,-124.4634270775536,55.536572922446396,null,1000000000,56241750.302499995,null,6.583451105951676,-52.417101793081258,null,null,null,11.229399130521131,-72.046325284472346,null,0,0]
[7585.8,7.5857999999999999,2.7888375065773037,1.2040582392561288,1.000016356540677,5.7194960849714423E-3,1,0,682.83021808474348,1.5693318333806159,1.278131223228719,0.67229847079913363,1.0000769418848257,1.2404592034526037E-2,1.0000000000287721,7.5857999998544936E-6,1.0000000000287721,7.5857999998544936E-6,1.0005852885289381,6.3614400287635403E-2,17.665057019067181,-124.41154559196349,55.588454408036512,null,1000000000,57544361.640000001,null,6.522295715937255,-52.106956528507375,null,null,null,11.142761303129928,-72.304589063456135,null,0,0]
[7674.15,7.67415,2.8171632039842129,1.2079175474524395,1.0000167397576276,5.7861082110143899E-3,1,0,690.78296151650272,1.5693486935946244,1.2839254653012291,0.67794792457823372,1.0000787444982897,1.2549050274046011E-2,1.0000000000294462,7.6741499998493501E-6,1.0000000000294462,7.6741499998493501E-6,1.0005990220459733,6.4355436121701443E-2,17.51585921380331,-124.35686230397376,55.643137696026244,null,1000000000,58892578.222499996,null,6.4609897337984821,-51.792509536955464,null,null,null,11.054869480004829,-72.564352767018264,null,0,0]
[7762.5,7.7625000000000002,2.8455300252223492,1.2116999648923876,1.0000171274118246,5.852720285708852E-3,1,0,698.73570514015864,1.5693651700155709,1.2897603166124751,0.68354643965636086,1.0000805679815046,1.2693507989788638E-2,1.0000000000301283,7.7624999998440873E-6,1.0000000000301283,7.7624999998440873E-6,1.0006129155513119,6.5096476580022627E-2,17.368660405222641,-124.30067032089991,55.699329679100089,null,1000000000,60256406.25,null,6.4009314674152149,-51.480959098250302,null,null,null,10.967728937807429,-72.819711222649616,null,0,0]
[7852.9,7.8529,2.8745963429196975,1.2154928219724657,1.0000175286537001,5.9208779178780806E-3,1,0,706.87297781169616,1.5693816449992366,1.2957720162858211,0.68922248698667965,1.0000824553769252,1.284131703391971E-2,1.000000000030834,7.8528999998385748E-6,1.000000000030834,7.8528999998385748E-6,1.0006272970643966,6.5854716365392585E-2,17.220071583744527,-124.24172304387085,55.758276956129151,null,1000000000,61668038.409999996,null,6.3407379238701616,-51.165158323340698,null,null,null,10.879333659874369,-73.076564720530101,null,0,0]
[7943.3,7.9432999999999998,{"$f":"SQRT(1+(A141/p_dom)^2)","v":2.9037031856415938},{"$f":"ATAN(A141/p_dom)","v":1.2192096921159599},{"$f":"SQRT(1+(A141/z_ESR)^2)","v":1.0000179345411162},{"$f":"ATAN(A141/z_ESR)","v":5.9890354950362735E-3},{"$f":"IF(VIN_nom>Vout, 1, SQRT(1+(A141/z_RHP)^2))","v":1},{"$f":"IF(VIN_nom>Vout, 0, -ATAN(A141/z_RHP))","v":0},{"$f":"SQRT(1+(A141/EA_p1)^2)","v":715.01025067072987},{"$f":"ATAN(A141/EA_p1)","v":1.5693977449912551},{"$f":"SQRT(1+(A141/EA_z1)^2)","v":1.301825076168075},{"$f":"ATAN(A141/EA_z1)","v":0.69484593057417809},{"$f":"SQRT(1+(A141/EA_hf_p)^2)","v":1.000084364621578},{"$f":"ATAN(A141/EA_hf_p)","v":1.2989125516920379E-2},{"$f":"SQRT(1+(A141/Zero3)^2)","v":1.0000000000315481},{"$f":"ATAN(A141/Zero3)","v":7.943299999832937E-6},{"$f":"SQRT(1+(A141/pole5)^2)","v":1.0000000000315481},{"$f":"ATAN(A141/pole5)","v":7.943299999832937E-6},{"$f":"SQRT((1-(Z141/pterm2))^2+(A141/pterm1)^2)","v":1.0006418461471942},{"$f":"IF((ATAN((A141/pterm1)/(1-A141^2/pterm2))>0),ATAN((A141/pterm1)/(1-A141^2/pterm2)),PI()+ATAN((A141/pterm1)/(1-A141^2/pterm2)))","v":6.6612961100578544E-2},{"$f":"20*LOG10(((E141*K141*G141*O141)/(C141*I141*S141*M141*Q141))*Adc)","v":17.073488149073405},{"$f":"((F141+L141+H141+P141)-(D141+J141+T141+N141+R141))*radconv","v":-124.18141477769385},{"$f":"IF(V141>0,V141,V141+180)","v":55.818585222306154},null,{"$f":"IF(U141<0,A141,1000000000)","v":1000000000},{"$f":"A141^2","v":63096014.890000001},null,{"$f":"20*LOG10((K141/(I141*M141))*Aea_stability*Afb*0.8)","v":6.2817843015800303},{"$f":"(L141-(J141+N141))*radconv","v":-50.852350003292152},null,null,null,{"$f":"20*LOG10((E141*G141/(C141*S141))*Am_stability)","v":10.79170384749337},{"$f":"(F141+H141-(D141+T141))*radconv","v":-73.329064774401672},null,{"$f":"SUM((U142<0)*(U141>0))*A141","v":0},0]
[8035.8,{"$f":"A142/1000","v":8.0358000000000001},2.9335268726333474,1.2229365041897344,1.0000183546659953,6.0587763211402629E-3,1,0,723.33655328587065,1.5694138440294392,1.3080609627655451,0.70054594978647244,1.0000863408344896,1.3140367016493451E-2,1.0000000000322871,8.0357999998270327E-6,1.0000000000322871,8.0357999998270327E-6,1.0006569066983846,6.7388825108801828E-2,16.925531063217861,-124.11840412125828,55.88159587874172,null,1000000000,64574081.640000001,null,6.2227112938852951,-50.535350865839135,null,null,null,10.702819769332564,-73.583053255419145,null,0,0]
[8128.3,8.1282999999999994,2.9633904833285079,1.2265882521294131,1.0000187796547424,6.1285170883064368E-3,1,0,731.66285608421811,1.5694295766544204,1.3143389444740308,0.70619169833169293,1.0000883399232765,1.3291607914889033E-2,1.0000000000330345,8.1282999998209895E-6,1.0000000000330345,8.1282999998209895E-6,1.0006721427726406,6.8164694415372692E-2,16.779584840641427,-124.05418136549574,55.945818634504263,null,1000000000,66069260.890000001,null,6.16486984923257,-50.221440180185802,null,null,null,10.614714991408857,-73.832741185309942,null,0,0]
[8222.9500000000007,8.2229500000000009,2.9939883013886375,1.2302494201084995,1.0000192195563598,6.1998787953716243E-3,1,0,740.18268934701894,1.5694453085684494,1.320805794780082,0.71191292953066221,1.0000904091568461,1.3446363512760788E-2,1.0000000000338085,8.222949999814663E-6,1.0000000000338085,8.222949999814663E-6,1.0006879147143921,6.8958602986474798E-2,16.632282909115581,-123.98731553816765,56.01268446183235,null,1000000000,67616906.702500015,null,6.1069253413719196,-49.903405993757893,null,null,null,10.525357567743661,-74.083909544409764,null,0,0]
[8270.2750000000015,8.2702750000000016,3.0093020302877265,1.232052072663129,1.0000194414168888,6.2355596252697274E-3,1,0,744.44260604593626,1.5694530394915969,1.3240553134860338,0.71475254128308463,1.0000914527554008,1.3523741070622953E-2,1.0000000000341989,8.2702749998114464E-6,1.0000000000341989,8.2702749998114464E-6,1.0006958696309483,6.9355559394861474E-2,16.559390465205656,-123.95347807525802,56.046521924741981,null,1000000000,68397448.575625017,null,6.0784135996911912,-49.745584581650967,null,null,null,10.480976865514462,-74.20789349360706,null,0,0]
[8317.6,8.3176000000000005,3.024625439043128,1.2338364657094363,1.0000196645505637,6.2712404392903775E-3,1,0,748.7025227888405,1.5694606824409822,1.3273154562471874,0.71757822645879288,1.0000925023417768,1.3601118466534556E-2,1.0000000000345912,8.3175999998081892E-6,1.0000000000345912,8.3175999998081892E-6,1.0007038705185538,6.9752517228889671E-2,16.486996342412855,-123.91938738644291,56.080612613557093,null,1000000000,69182469.760000005,null,6.0502034329585026,-49.588556053808453,null,null,null,10.436792909454351,-74.33083133263446,null,0,0]
[8366.0499999999993,8.3660499999999995,3.040322987595141,1.2356446377187873,1.0000198943074277,6.3077694336148528E-3,1,0,753.06370542620596,1.5694684175002578,1.3306640227900786,0.72045671607570039,1.0000935830817062,1.3680335092977027E-2,1.0000000000349956,8.3660499998048175E-6,1.0000000000349956,8.3660499998048175E-6,1.000712109230574,7.0158912946537963E-2,16.413391847783181,-123.88423647163334,56.115763528366656,null,1000000000,69990792.602499992,null,6.0216309054707722,-49.428612712000614,null,null,null,10.391760942312409,-74.455623759632729,null,0,0]
[8414.5,8.4145000000000003,3.0560303743035475,1.2374342282420685,1.0000201253986851,6.3442984111053502E-3,1,0,757.42488810810926,1.5694760634840175,1.3340235594153131,0.72332073124190499,1.0000946700974833,1.3759551547713461E-2,1.0000000000354019,8.4144999998014068E-6,1.0000000000354019,8.4144999998014068E-6,1.00072039613692,7.0565310174964271E-2,16.340298219874715,-123.84884521506756,56.151154784932444,null,1000000000,70803810.25,null,5.9933660632657553,-49.269493581639672,null,null,null,10.346932156608959,-74.579351633427876,null,0,0]
[8462.9500000000007,8.4629500000000011,3.0717474482460547,1.2392055109529254,1.000020357824335,6.3808273716643941E-3,1,0,761.7860708337854,1.5694836219221171,1.3373939834522808,0.72617033422894117,1.0000957633890875,1.3838767829750215E-2,1.0000000000358109,8.4629499997979572E-6,1.0000000000358109,8.4629499997979572E-6,1.0007287312435467,7.0971708922531282E-2,16.267709797139172,-123.81322581727633,56.186774182723667,null,1000000000,71621522.702500015,null,5.9654047617997898,-49.111195182426876,null,null,null,10.30230503533938,-74.702030634849422,null,0,0]
[8511.4,8.5114000000000001,3.0874740614813652,1.2409587544136653,1.0000205915843763,6.4173563151945084E-3,1,0,766.1472536024869,1.5694910943095792,1.3407752127950638,0.72900558761946121,1.0000968629564979,1.391798393809365E-2,1.0000000000362219,8.511399999794467E-6,1.0000000000362219,8.511399999794467E-6,1.0007371145564419,7.137810919759506E-2,16.195620996709781,-123.77739016611044,56.222609833889564,null,1000000000,72443929.959999993,null,5.937742924473949,-48.95371401424191,null,null,null,10.257878072235833,-74.823676151868497,null,0,0]
[8560.9500000000007,8.5609500000000001,3.1035674443799843,1.2427334195976023,1.0000208320318413,6.4547145875089289E-3,1,0,770.60745191638546,1.5694986488679903,1.3442443000533482,0.73189043563531819,1.000097993979417,1.399899837388403E-2,1.0000000000366449,8.5609499997908571E-6,1.0000000000366449,8.5609499997908571E-6,1.0007457380692197,7.1793737899300755E-2,16.122406534296541,-123.74052930403568,56.259470695964325,null,1000000000,73289864.902500018,null,5.9097586189764879,-48.793499027960074,null,null,null,10.212647915320051,-74.947030276075608,null,0,0]
[8610.5,8.6105,3.1196705009024641,1.2444897693988315,1.0000210738749751,6.4920728418061836E-3,1,0,775.06765027375741,1.569506116479594,1.3477245169336483,0.73476040839945334,1.000099131566303,1.408001262590248E-2,1.0000000000370703,8.6104999997872033E-6,1.0000000000370703,8.6104999997872033E-6,1.0007544120148262,7.2209368216306982E-2,16.049703073703764,-123.70346643834228,56.296533561657725,null,1000000000,74140710.25,null,5.8820791171519007,-48.634131338606643,null,null,null,10.167623956551866,-75.069335099735625,null,0,0]
[8660.0499999999993,8.66005,3.1357830820191341,1.2462280752268102,1.0000213171137771,6.5294310779820111E-3,1,0,779.52784867385651,1.5695134986368315,1.351215777438973,0.73761557375453812,1.0001002757171338,1.4161026693086191E-2,1.0000000000374982,8.6600499997835071E-6,1.0000000000374982,8.6600499997835071E-6,1.0007631363997773,7.2625000157529984E-2,15.977504890135334,-123.66621331851431,56.333786681485691,null,1000000000,74996466.002499983,null,5.8547002700255293,-48.475607144532546,null,null,null,10.122804620109804,-75.190606173981763,null,0,0]
[8709.6,8.7096,3.1519050416604353,1.2479486033790987,1.0000215617482457,6.5667892959321485E-3,1,0,783.9880471159538,1.569520796798181,1.3547179961873375,0.74045599981068999,1.0001014264318866,1.4242040574372365E-2,1.0000000000379285,8.7095999997797719E-6,1.0000000000379285,8.7095999997797719E-6,1.0007719112306273,7.3040633731878635E-2,15.905806339334291,-123.62878138387603,56.371218616123969,null,1000000000,75857132.160000011,null,5.8276179970881001,-48.317922626819254,null,null,null,10.078188342246193,-75.310858757056792,null,0,{"$f":"IF(AJ154>0,W154,0)","v":0}]
[8760.3250000000007,8.7603249999999999,3.1684188734031333,1.2496917888876082,1.0000218136295367,6.60503338603643E-3,1,0,788.55401216326197,1.569528182504706,1.3583145271355237,0.74334858573530649,1.0001026112332463,1.4324975378243275E-2,1.0000000000383715,8.760324999775902E-6,1.0000000000383715,8.760324999775902E-6,1.0007809464040642,7.3466125101037491E-2,15.832919306230986,-123.59028820982942,56.409711790170576,null,1000000000,76743294.105625018,null,5.8001965278025676,-48.157364645508942,null,null,null,10.03272277842842,-75.432923564320504,null,0,0]
[8811.0499999999993,8.8110499999999998,3.184942233149378,1.2514168924320952,1.0000220669734694,6.6432774568192573E-3,1,0,793.11997725308936,1.5695354831727022,1.3619223630931994,0.74622587026791032,1.0001038029134772,1.4407909985041602E-2,1.0000000000388174,8.8110499997719848E-6,1.0000000000388174,8.8110499997719848E-6,1.0007900344582759,7.3891618200564113E-2,15.760544165209176,-123.55163093735163,56.448369062648368,null,1000000000,77634602.102499992,null,5.773077424856079,-47.997678485741396,null,null,null,9.9874667403530957,-75.553952451610229,null,0,0]
[8861.7749999999996,8.8617749999999997,3.201474973372207,1.2531241837958238,1.0000223217800424,6.6815215081687755E-3,1,0,797.68594238470587,1.569542700262454,1.365541414454986,0.74908792723743112,1.0001050014725548,1.4490844393627189E-2,1.0000000000392655,8.8617749997680252E-6,1.0000000000392655,8.8617749997680252E-6,1.0007991754004146,7.4317113039991528E-2,15.688675114525319,-123.51282087795434,56.48717912204566,null,1000000000,78531056.15062499,null,5.746256524511665,-47.83886000103336,null,null,null,9.9424185900136521,-75.673960876920987,null,0,0]
[8912.5,8.9124999999999996,3.2180169494934696,1.2548139276349495,1.0000225780492549,6.7197655399731278E-3,1,0,802.25190755739823,1.5695498352010011,1.369171592285817,0.75193483069131306,1.000106206910454,1.4573778602859883E-2,1.0000000000397162,8.9124999997640181E-6,1.0000000000397162,8.9124999997640181E-6,1.0008083692376741,7.474260962884445E-2,15.617306435142259,-123.4738690349625,56.526130965037495,null,1000000000,79432656.25,null,5.719729732293346,-47.680905030476836,null,null,null,9.8975767028489123,-75.79296400448564,null,0,0]
[8964.4,8.9643999999999995,3.234951517449896,1.2565249217429351,1.0000228417685699,6.758895440783081E-3,1,0,806.92363933822321,1.5695570518409652,1.372897283990596,0.75483207349344539,1.0001074473909157,1.4658633702566299E-2,1.0000000000401803,8.964399999759873E-6,1.0000000000401803,8.964399999759873E-6,1.0008178307968467,7.5177964292456337E-2,15.544796574936779,-123.43387932007759,56.566120679922406,null,1000000000,80360467.359999999,null,5.6928886770486686,-47.520180567785538,null,null,null,9.8519078978881094,-75.913698752292092,null,0,0]
[9016.2999999999993,9.0162999999999993,3.2518954570782297,1.2582180905600053,1.0000231070190682,6.7980253208949773E-3,1,0,811.59537116058902,1.5695641853996114,1.3766344373834578,0.75771361006764804,1.0001086950725215,1.4743488591162424E-2,1.0000000000406468,9.0162999997556754E-6,1.0000000000406468,9.0162999997556754E-6,1.0008273477454275,7.5613320807626117E-2,15.472798682233408,-123.39376352679497,56.60623647320503,null,1000000000,81293665.689999983,null,5.6663470572472452,-47.360351233362088,null,null,null,9.8064516249861651,-76.033412293432875,null,0,0]
[9068.2000000000007,9.0682000000000009,3.2688486226454709,1.2598937016428005,1.0000233738007487,6.8371551801890062E-3,1,0,816.2671030237824,1.5695712373034343,1.3803829593726604,0.7605795203212955,1.0001099499552437,1.482834326742708E-2,1.000000000041116,9.0681999997514338E-6,1.000000000041116,9.0681999997514338E-6,1.0008369200912541,7.6048679184528248E-2,15.401306891167634,-123.35353248887736,56.646467511122637,null,1000000000,82232251.24000001,null,5.6401007033051354,-47.201412530513316,null,null,null,9.7612061878624985,-76.152119958364054,null,0,0]
[9120.1,9.1201000000000008,3.2858108713477208,1.2615520174220562,1.0000236421136102,6.8762850185453538E-3,1,0,820.93883492710597,1.5695782089464569,1.384142757593239,0.76342988432424463,1.0001112120390558,1.49131977301391E-2,1.0000000000415881,9.120099999747143E-6,1.0000000000415881,9.120099999747143E-6,1.0008465478422108,7.6484039433327627E-2,15.330315420558495,-123.31319673522448,56.68680326477552,null,1000000000,83176224.010000005,null,5.6141455155468218,-47.04335995137604,null,null,null,9.7161699050116699,-76.269836783848476,null,0,0]
[9173.2000000000007,9.1732000000000014,3.3031745654199343,1.2632310444410362,1.0000239182149304,6.9163195712542789E-3,1,0,825.71858379387243,1.5695852601384428,1.3880010623234018,0.76633014677272837,1.0001125107567312,1.5000013923456474E-2,1.0000000000420739,9.173199999742699E-6,1.0000000000420739,9.173199999742699E-6,1.0008564555498991,7.6929467762957518E-2,15.25819439298607,-123.27183065679233,56.728169343207668,null,1000000000,84147598.24000001,null,5.5878873462776983,-46.882565358609448,null,null,null,9.6703070467083734,-76.389265298182892,null,0,0]
[9226.2999999999993,9.2262999999999984,3.3205474741722867,1.2648925069622654,1.0000241959190534,6.9563541017923858E-3,1,0,830.49833270122042,1.5695922301672864,1.3918709774703448,0.76921430576867311,1.0001138170122865,1.5086829890645723E-2,1.0000000000425624,9.2262999997382042E-6,1.0000000000425624,9.2262999997382042E-6,1.0008664212712615,7.7374898073543655E-2,15.18658511169593,-123.23037631814489,56.769623681855109,null,1000000000,85124611.689999983,null,5.5619254990554978,-46.722688762447234,null,null,null,9.6246596126404302,-76.507687555697657,null,0,0]
[9279.4,9.279399999999999,3.3379294537259492,1.266536670137461,1.0000244752259781,6.9963886100313632E-3,1,0,835.27808164845339,1.5695991204263178,1.3957524064596485,0.77208244747509636,1.0001151308056919,1.5173645630399076E-2,1.0000000000430536,9.2793999997336586E-6,1.0000000000430536,9.2793999997336586E-6,1.000876445014887,7.7820330375941563E-2,15.115481651105725,-123.18884405496559,56.811155945034415,null,1000000000,86107264.359999999,null,5.5362558012513139,-46.563725305869156,null,null,null,9.5792258498544101,-76.625118749096416,null,0,0]
[9332.5,9.3324999999999996,3.3553203631091546,1.2681637939995605,1.000024756135703,7.0364230958428987E-3,1,0,840.05783063489048,1.5696059322771556,1.3996452535024122,0.77493465815478046,1.0001164521369181,1.5260461141408771E-2,1.0000000000435478,9.3324999997290587E-6,1.0000000000435478,9.3324999997290587E-6,1.0008865267894131,7.8265764680996219E-2,15.044878172257954,-123.14724390211967,56.852756097880331,null,1000000000,87095556.25,null,5.510874150776603,-46.405670124321922,null,null,null,9.5340040214813531,-76.74157377779774,null,0,0]
[9386.85,9.3868500000000008,3.3731297664799684,1.2698118415994033,1.0000250453180193,7.0773999896935032E-3,1,0,844.95009729274,1.5696128246725225,1.4036414653129352,0.77783760341213848,1.0001178123789722,1.5349320093807125E-2,1.0000000000440563,9.386849999724299E-6,1.0000000000440563,9.386849999724299E-6,1.000896905999008,7.8721686812930083E-2,14.973124423124499,-123.10460432160401,56.895395678395985,null,1000000000,88112952.922499999,null,5.4851890932605141,-46.244829761027425,null,null,null,9.4879353298639852,-76.859774560576611,null,0,0]
[9441.2000000000007,9.4412000000000003,3.3909482352277034,1.2714425735466961,1.0000253361794824,7.118376859776317E-3,1,0,849.84236399026679,1.5696196377133227,1.4076494385189862,0.78072404187809563,1.0001191805178484,1.5438178803793296E-2,1.0000000000445681,9.4411999997194834E-6,1.0000000000445681,9.4411999997194834E-6,1.0009073460222822,7.917761106587394E-2,14.901882365856036,-123.06191395907412,56.938086040925882,null,1000000000,89136257.440000013,null,5.4597973283091239,-46.084930606642558,null,null,null,9.4420850375469119,-76.976983352431589,null,0,0]
[9495.5499999999993,9.4955499999999997,3.4087756271918157,1.2730562527744993,1.0000256287200908,7.1593537059537514E-3,1,0,854.73463072678953,1.5696263727621673,1.4116690729426467,0.7835940662568569,1.0001205565535145,1.5527037269965049E-2,1.0000000000450826,9.4955499997146084E-6,1.0000000000450826,9.4955499997146084E-6,1.0009178468686575,7.9633537451422043E-2,14.831146011679703,-123.0191826465886,56.980817353411396,null,1000000000,90165469.80249998,null,5.4346946775734617,-45.925967427599133,null,null,null,9.3964513341062421,-77.093215218989471,null,0,0]
[9549.9,9.5498999999999992,3.4266118030997408,1.2746531371007652,1.0000259229398434,7.2003305280882212E-3,1,0,859.62689750164259,1.5696330311506477,1.4157002692539289,0.78644776928294036,1.0001219404859374,1.5615895490920174E-2,1.0000000000456004,9.549899999709681E-6,1.0000000000456004,9.549899999709681E-6,1.00092840854761,8.0089465981156849E-2,14.760909460504328,-122.97641991961726,57.023580080382743,null,1000000000,91200590.00999999,null,5.4098770339839888,-45.7679349868149,null,null,null,9.3510324265203408,-77.208484932802349,null,0,0]
[9605.5249999999996,9.6055250000000001,3.4448753520301594,1.2762703561279272,1.0000262258004065,7.2422686029796528E-3,1,0,864.63393230332451,1.5696397677176068,1.4198379027926245,0.78935161412126986,1.0001233650608883,1.5706837986981484E-2,1.0000000000461331,9.6055249997045784E-6,1.0000000000461331,9.6055249997045784E-6,1.000939280993514,8.0556092398675033E-2,14.689536688001306,-122.93263113852352,57.067368861476481,null,1000000000,92266110.52562499,null,5.3847680936421769,-45.607153531275635,null,null,null,9.3047685943591265,-77.325477607247905,null,0,0]
[9661.15,9.6611499999999992,3.4631478156360735,1.2778705135716697,1.0000265304198168,7.28420665239522E-3,1,0,869.6409671437932,1.5696464267118051,1.4239874392165348,0.79223855942656374,1.0001247979073731,1.5797780223214181E-2,1.0000000000466689,9.6611499996994166E-6,1.0000000000466689,9.6611499996994166E-6,1.0009502171798808,8.1022721086671842E-2,14.61867521599766,-122.88882874469635,57.111171255303645,null,1000000000,93337819.32249999,null,5.359949206768361,-45.447335888176163,null,null,null,9.2587260092292993,-77.441492856520213,null,0,0]
[9716.7749999999996,9.7167750000000002,3.4814290535500545,1.2794538699472811,1.0000268367980725,7.3261446761874252E-3,1,0,874.648002022382,1.5696530094654679,1.42814877477291,0.79510870459216199,1.0001262390253569,1.5888722198115116E-2,1.000000000047208,9.7167749996941938E-6,1.000000000047208,9.7167749996941938E-6,1.0009612171170437,8.1489352057525069E-2,14.548318997944536,-122.84502204670581,57.154977953294193,null,1000000000,94415716.40062499,null,5.3354161929389381,-45.288476438942375,null,null,null,9.2129028050055961,-77.556545607763439,null,0,0]
[9772.4,9.7723999999999993,3.4997189282708807,1.2810206806650339,1.0000271449351723,7.3680826742087693E-3,1,0,879.65503693844005,1.5696595172804877,1.4323218066214232,0.79796214896516082,1.0001276884148036,1.5979663910181154E-2,1.0000000000477498,9.7723999996889117E-6,1.0000000000477498,9.7723999996889117E-6,1.0009722808153962,8.1955985323599226E-2,14.47846207797223,-122.80122006153695,57.198779938463048,null,1000000000,95499801.75999999,null,5.3111649437128676,-45.130569565911749,null,null,null,9.1672971342593605,-77.670650495625139,null,0,0]
[9829.2999999999993,9.8292999999999999,3.5184368271859388,1.2826065469709396,1.0000274619549667,7.410981920872921E-3,1,0,884.77683988393687,1.5696660980549195,1.4366024852287935,0.80086382224985075,1.0001291795841987,1.6072689855397993E-2,1.0000000000483076,9.8292999996834461E-6,1.0000000000483076,9.8292999996834461E-6,1.0009836640897072,8.2433316840915039E-2,14.407514423438181,-122.75642805523832,57.243571944761683,null,1000000000,96615138.48999998,null,5.286645140080001,-44.970022977820165,null,null,null,9.1208692833581786,-77.786405077418166,null,0,0]
[9886.2000000000007,9.8862000000000005,3.5371634812064618,1.2841756252193668,1.0000277808151561,7.4538811402590603E-3,1,0,889.89864286730938,1.5696726030781853,1.4408951876808092,0.80374823042033272,1.0001306794085121,1.6165715522411167E-2,1.0000000000488685,9.8861999996779177E-6,1.0000000000488685,9.8861999996779177E-6,1.0009951141038802,8.2910650786006054E-2,14.337076895238143,-122.71165916677914,57.288340833220857,null,1000000000,97736950.440000013,null,5.2624116937906464,-44.810461251743497,null,null,null,9.0746652014474964,-77.901197915035638,null,0,0]
[9943.1,9.9431000000000012,3.5558987520097589,1.2857281729805767,1.0000281015157384,7.496780332209311E-3,1,0,895.02044588790716,1.5696790336507547,1.445199806833561,0.80661547954282442,1.0001321878877052,1.625874090961189E-2,1.0000000000494325,9.9430999996723233E-6,1.0000000000494325,9.9430999996723233E-6,1.0010066308692314,8.3387987172062916E-2,14.267143402711362,-122.66692215188566,57.333077848114343,null,1000000000,98865237.610000014,null,5.2384604316354988,-44.651878384954394,null,null,null,9.0286829710758632,-78.015043766931271,null,0,0]
[10000,10,3.5746425041100389,1.2872644427450208,1.0000284240567117,7.5396794965658029E-3,1,0,900.14224894509471,1.5696853910434991,1.4495162365202019,0.80946567555391757,1.0001337050217389,1.6351766015391393E-2,1.00000000005,9.9999999996666679E-6,1.00000000005,9.9999999996666679E-6,1.0010182143971411,8.3865326012261418E-2,14.197707947642842,-122.6222254809629,57.377774519037104,null,1000000000,100000000,null,5.2147872529216865,-44.494268380456617,null,null,null,8.9829206947211535,-78.127957100506251,null,0,0]
[10058.25,10.058249999999999,3.5938396143482332,1.2888205583077881,1.0000287561566434,7.5835964506604046E-3,1,0,905.3855710927387,1.5696918247625593,1.4539472014599404,0.81236594048344735,1.0001352671162942,1.6446997926267214E-2,1.0000000000505842,1.0058249999660807E-5,1.0000000000505842,1.0058249999660807E-5,1.0010301419232164,8.4353992670837888E-2,14.127134813451995,-122.57651868773554,57.423481312264457,null,1000000000,101168393.0625,null,5.1908362598385018,-44.333920452041625,null,null,null,8.93629855361349,-78.242598235693947,null,0,0]
[10116.5,10.1165,3.6130453345639517,1.2903601340034738,1.0000290901853282,7.6275133755015177E-3,1,0,910.62889327742744,1.569698184392027,1.4583903219547216,0.81524855768871152,1.0001368382811646,1.6542229538797571E-2,1.0000000000511717,1.011649999965488E-5,1.0000000000511717,1.011649999965488E-5,1.0010421394417719,8.4842661929286814E-2,14.057071197970036,-122.53087125857215,57.469128741427852,null,1000000000,102343572.25,null,5.1671682315493648,-44.174579401630176,null,null,null,8.889902966420669,-78.356291856941979,null,0,0]
[10174.75,10.17475,3.6322595281803762,1.2918834249565352,1.0000294261427642,7.6714302709197666E-3,1,0,915.87221549852484,1.5697044712043793,1.4628454872438523,0.81811364028603373,1.0001384185163076,1.6637460851256562E-2,1.0000000000517628,1.0174749999648884E-5,1.0000000000517628,1.0174749999648884E-5,1.0010542069652282,8.5331333801695108E-2,13.987510956258655,-122.48529140356483,57.51470859643517,null,1000000000,103525537.5625,null,5.1437789950186446,-44.016238820942995,null,null,null,8.8437319612400085,-78.469052582621828,null,0,0]
[10233,10.233000000000001,3.6514820614357442,1.2933906812250771,1.0000297640289493,7.7153471367457762E-3,1,0,921.11553775540892,1.5697106864431198,1.4673125876133937,0.82096130117131383,1.00014000782168,1.6732691861918298E-2,1.0000000000523572,1.023299999964282E-5,1.0000000000523572,1.023299999964282E-5,1.001066344506077,8.5820008302132988E-2,13.918448037837226,-122.43978705349353,57.560212946506468,null,1000000000,104714289,null,5.1206644504660668,-43.85889231267015,null,null,null,8.7977835873711552,-78.580894740823396,null,0,0]
[10292.5,10.2925,3.6711255691898583,1.294913982376525,1.0000301111571863,7.7602063938575112E-3,1,0,926.47137769360586,1.569716962425691,1.4718877575167597,0.82385220129134451,1.0001416405965511,1.6829966143124032E-2,1.0000000000529679,1.0292499999636554E-5,1.0000000000529679,1.0292499999636554E-5,1.0010788148095313,8.6319172107674036E-2,13.848410334243852,-122.39339213084779,57.606607869152214,null,1000000000,105935556.25,null,5.0973332949054342,-43.6991889298804,null,null,null,8.7510770393384227,-78.69420320096738,null,0,0]
[10352,10.352,3.6907775049046121,1.2964210650374877,1.0000304602978356,7.8050656197360922E-3,1,0,931.82721766787506,1.5697231662636466,1.4764751521385164,0.82672516129775298,1.0001432828350172,1.6927240105800833E-2,1.000000000053582,1.0351999999630213E-5,1.000000000053582,1.0351999999630213E-5,1.0010913581942325,8.6818338684868143E-2,13.778879060034516,-122.34709185870287,57.652908141297132,null,1000000000,107163904,null,5.0742803273682346,-43.54050928805286,null,null,null,8.7045987326662839,-78.806582570650022,null,0,0]
[10411.5,10.4115,3.710437734666638,1.2979121801142093,1.0000308114508947,7.8499248142010081E-3,1,0,937.18305767759819,1.5697292991938685,1.481074657886271,0.82958030068374455,1.0001449345370319,1.7024513748109427E-2,1.0000000000541998,1.0411499999623801E-5,1.0000000000541998,1.0411499999623801E-5,1.0011039746737227,8.7317508048656192E-2,13.709848061112277,-122.30089383810045,57.69910616189955,null,1000000000,108399332.25,null,5.0515014054417184,-43.382846611493882,null,null,null,8.6583466556705595,-78.918047226606589,null,0,0]
[10471,10.471,3.7301061273299041,1.299387573508324,1.000031164616362,7.8947839770717454E-3,1,0,942.53889772217099,1.5697353624251245,1.4856861622762565,0.8324177386269318,1.0001465957025479,1.7121787068210558E-2,1.000000000054821,1.0470999999617314E-5,1.000000000054821,1.0470999999617314E-5,1.0011166642616218,8.7816680213960385E-2,13.641311278957946,-122.25480539980936,57.745194600190644,null,1000000000,109641841,null,5.0289924600327982,-43.226194140981164,null,null,null,8.6123188189251483,-79.028611258828192,null,0,0]
[10532,10.532,3.7502787015517631,1.3008840927769132,1.0000315287743047,7.9407740102202112E-3,1,0,948.02975897989791,1.5697415073907919,1.4904262626697178,0.83530845657992614,1.0001483085705094,1.722151232046612E-2,1.0000000000554614,1.0531999999610587E-5,1.0000000000554614,1.0531999999610587E-5,1.0011297496656821,8.8328439475446913E-2,13.571553497897035,-122.20767622706423,57.792323772935774,null,1000000000,110923024,null,5.00619214959152,-43.066634119175013,null,null,null,8.5653613483055153,-79.141042107889191,null,0,0]
[10593,10.593,3.7704595849019307,1.3023645954910714,1.0000318950473959,7.9867640097771985E-3,1,0,953.52062027301088,1.569747581584725,1.4951787384104429,0.8381808219204514,1.0001500313850376,1.7321237230148775E-2,1.0000000000561058,1.059299999960378E-5,1.0000000000561058,1.059299999960378E-5,1.0011429119399931,8.8840201713186032E-2,13.502302570646274,-122.16067699848701,57.839323001512994,null,1000000000,112211649,null,4.9836671678402276,-42.908121550056705,null,null,null,8.518635402806046,-79.252555448430314,null,0,0]
[10654,10.654,3.790648644670497,1.3038293310215803,1.0000322634356331,8.0327539755482014E-3,1,0,959.01148160090179,1.5697535862225431,1.4999434718669282,0.84103496192327798,1.0001517641460809,1.7420961795276756E-2,1.0000000000567537,1.0653999999596897E-5,1.0000000000567537,1.0653999999596897E-5,1.0011561510994833,8.9351966943195485E-2,13.433552270351765,-122.11381478012916,57.886185219870839,null,1000000000,113507716,null,4.9614133602050705,-42.750649210855379,null,null,null,8.4721389101466933,-79.363165569273789,null,0,0]
[10715,10.715,3.8108457509066258,1.305278543726504,1.0000326339390138,8.0787439073387122E-3,1,0,964.50234296297685,1.5697595224921839,1.5047203465961159,0.84387100344094634,1.0001535068535881,1.7520686013868341E-2,1.0000000000574056,1.0714999999589933E-5,1.0000000000574056,1.0714999999589933E-5,1.0011694671591667,8.9863735181472032E-2,13.365296468206189,-122.06709637343916,57.932903626560844,null,1000000000,114811225,null,4.9394266465417793,-42.59420990140611,null,null,null,8.4258698216644117,-79.472886472033053,null,0,0]
[10777.5,10.7775,3.8315477199331016,1.3067475431046331,1.0000330157469317,8.1258647036437509E-3,1,0,970.12822554093486,1.5697655350389603,1.5096271577125537,0.84675814434664032,1.0001553027308527,1.7622862105847858E-2,1.0000000000580771,1.0777499999582714E-5,1.0000000000580771,1.0777499999582714E-5,1.0011831904386554,9.0388091021466735E-2,13.295868824452475,-122.0193851553886,57.980614844611395,null,1000000000,116154506.25,null,4.9171721126331533,-42.43498766504225,null,null,null,8.3786967118193232,-79.584397490346362,null,0,0]
[10840,10.84,3.8522578684051201,1.3082007505965525,1.0000333997752906,8.1729854638631777E-3,1,0,975.7541081535594,1.5697714782529368,1.5145464708533551,0.84962655391335362,1.000157109049655,1.7725037829826873E-2,1.0000000000587528,1.0839999999575412E-5,1.0000000000587528,1.0839999999575412E-5,1.001196994478998,9.0912450053425936E-2,13.226947579151016,-121.97183854696783,58.028161453032169,null,1000000000,117505600,null,4.8951895309470022,-42.27683466178491,null,null,null,8.3317580482040157,-79.695003885182942,null,0,0]
[10902.5,10.9025,3.8729760651076717,1.3096384134472772,1.000033786024088,8.2201061877877867E-3,1,0,981.37999080025406,1.5697773533264894,1.5194781645925488,0.85247636709626906,1.0001589258099381,1.7827213183673977E-2,1.0000000000594322,1.0902499999568026E-5,1.0000000000594322,1.0902499999568026E-5,1.0012108792966212,9.1436812294486094E-2,13.158526448649372,-121.9244630511002,58.075536948899796,null,1000000000,118864506.25,null,4.873474745879923,-42.119743227467708,null,null,null,8.2850517027694472,-79.804719823632496,null,0,0]
[10965,10.965,3.8937021815680493,1.3110607738976057,1.0000341744933214,8.2672268752083666E-3,1,0,987.00587348043643,1.5697831614248083,1.5244221187718476,0.8553077183146589,1.0001607530116456,1.7929388165257822E-2,1.0000000000601155,1.0964999999560553E-5,1.0000000000601155,1.0964999999560553E-5,1.0012248449080463,9.196117776175991E-2,13.09059924952345,-121.87726491313488,58.12273508686512,null,1000000000,120231225,null,4.8520236771495817,-41.963705727071996,null,null,null,8.2385755723738683,-79.913559186062884,null,0,0]
[11028.75,11.02875,3.9148508488421947,1.3124960631566951,1.0000345730194298,8.3152899385539499E-3,1,0,992.744273848131,1.5697890178680614,1.5294774594378022,0.85817681586819305,1.0001626275140829,1.8033606260757413E-2,1.0000000000608167,1.1028749999552846E-5,1.0000000000608167,1.1028749999552846E-5,1.0012391730827055,9.2496033879746684E-2,13.021816044386975,-121.82931174326194,58.17068825673806,null,1000000000,121633326.5625,null,4.830411112922409,-41.805625352745544,null,null,null,8.1914049314645663,-80.023686390516403,null,0,0]
[11092.5,11.092499999999999,3.9360074942492989,1.3139159255137756,1.0000349738556742,8.3633529634810719E-3,1,0,998.48267424948324,1.5697948069959424,1.5345453073214599,0.86102698632047325,1.000164512879657,1.8137823964475171E-2,1.0000000000615219,1.1092499999545046E-5,1.0000000000615219,1.1092499999545046E-5,1.0012535853502542,9.3030893390174355E-2,12.953534040783161,-121.78155543727281,58.218444562727186,null,1000000000,123043556.25,null,4.8090645765646354,-41.648625542105222,null,null,null,8.1444694642185276,-80.132929895167592,null,0,0]
[11156.25,11.15625,3.9571719898263651,1.3153206027247764,1.000035377002052,8.4114159497677247E-3,1,0,1004.2210746839162,1.5698005299624278,1.5396255389161513,0.86385837049447123,1.0001664091083069,1.8242041274149433E-2,1.0000000000622311,1.1156249999537158E-5,1.0000000000622311,1.1156249999537158E-5,1.0012680817285262,9.3565756311125889E-2,12.885746987099289,-121.73400184523712,58.265998154762883,null,1000000000,124461914.0625,null,4.7879799700897454,-41.492698292577458,null,null,null,8.0977670170095433,-80.241303552659673,null,0,0]
[11220,11.22,3.9783442102864339,1.3167103316418254,1.0000357824585604,8.4594788971918983E-3,1,0,1009.959475150866,1.5698061878952676,1.5447180320401266,0.86667110856776508,1.0001683161999706,1.8346258187518588E-2,1.0000000000629443,1.1219999999529176E-5,1.0000000000629443,1.1219999999529176E-5,1.0012826622354571,9.4100622660657884E-2,12.818448732267562,-121.68665657173162,58.313343428268382,null,1000000000,125888400,null,4.7671532703377943,-41.337835637064387,null,null,null,8.0512954619297705,-80.348820934667273,null,0,0]
[11285.5,11.285500000000001,4.0001055459044048,1.3181228844258945,1.0000362014513684,8.5088611789327119E-3,1,0,1015.8554003698051,1.5698119345662973,1.549962963094786,0.86954178479182198,1.000170286957512,1.8453335542183206E-2,1.0000000000636813,1.1285499999520885E-5,1.0000000000636813,1.1285499999520885E-5,1.0012977306350344,9.4650175205863551E-2,12.749805823491196,-121.63823423824572,58.361765761754285,null,1000000000,127362510.25,null,4.7460193296649296,-41.179822345577328,null,null,null,8.0037864938262633,-80.458411892668352,null,0,0]
[11351,11.351000000000001,4.0218747765742373,1.3195201485035137,1.0000366228828723,8.5582434191729759E-3,1,0,1021.751325621905,1.5698176149160179,1.5552205808427153,0.87239307502041785,1.0001722691825203,1.8560412473645819E-2,1.0000000000644227,1.1350999999512492E-5,1.0000000000644227,1.1350999999512492E-5,1.0013128878842097,9.5199731409029625E-2,12.681666070843441,-121.59004304991223,58.409956950087775,null,1000000000,128845201,null,4.7251492748216961,-41.022915965633061,null,null,null,7.9565167960217416,-80.567127084279164,null,0,0]
[11416.5,11.416499999999999,4.0436517747855438,1.3209023653852614,1.0000370467530693,8.6076256176718952E-3,1,0,1027.6472509065948,1.5698232300859458,1.5604907570515998,0.87522512907191519,1.0001742628749277,1.8667488979453566E-2,1.0000000000651683,1.1416499999504004E-5,1.0000000000651683,1.1416499999504004E-5,1.0013281340027713,9.5749291289653246E-2,12.614023121822823,-121.5420883267027,58.457911673297303,null,1000000000,130336472.25,null,4.704538978550973,-40.867107978535252,null,null,null,7.9094841432718503,-80.674980348167409,null,0,0]
[11482,11.481999999999999,4.0654364157150198,1.3222697716379423,1.0000374730619557,8.6570077741886745E-3,1,0,1033.5431762233166,1.5698287811915497,1.5657733649113248,0.87803809598434068,1.0001762680346653,1.8774565057153657E-2,1.0000000000659182,1.1481999999495419E-5,1.0000000000659182,1.1481999999495419E-5,1.0013434690106198,9.6298854867201689E-2,12.54687072766477,-121.49437514854691,58.505624851453092,null,1000000000,131836324,null,4.6841843900727396,-40.712389908805079,null,null,null,7.86268633759203,-80.7819852397418,null,0,0]
[11548.75,11.54875,4.087644530443745,1.3236482760505572,1.0000379100154486,8.7073322948317006E-3,1,0,1039.5516192311454,1.5698343734529689,1.5711694458525862,0.88088526195007322,1.0001783232584205,1.8883684128471034E-2,1.0000000000666867,1.1548749999486568E-5,1.0000000000666867,1.1548749999486568E-5,1.0013591881420258,9.6858910122833486E-2,12.478935122220317,-121.44600493505122,58.553995064948779,null,1000000000,133373626.5625,null,4.6637003133428525,-40.555831790623444,null,null,null,7.8152348088774657,-80.890173144427763,null,0,0]
[11615.5,11.615500000000001,4.1098603288634505,1.3250118800545052,1.0000383495015925,8.7576567713700121E-3,1,0,1045.5600622711106,1.5698399014411144,1.5765781760046866,0.88371291529464147,1.0001803903912219,1.8992802750041816E-2,1.0000000000674598,1.1615499999477612E-5,1.0000000000674598,1.1615499999477612E-5,1.0013749996299004,9.7418969258565261E-2,12.411496191114622,-121.39789549835031,58.602104501649691,null,1000000000,134919840.25,null,4.6434735387504968,-40.400387954925868,null,null,null,7.7680226523641229,-80.997507543424433,null,0,0]
[11682.25,11.68225,{"$f":"SQRT(1+(A205/p_dom)^2)","v":4.1320836870419937},{"$f":"ATAN(A205/p_dom)","v":1.3263608189515934},{"$f":"SQRT(1+(A205/z_ESR)^2)","v":1.0000387915203846},{"$f":"ATAN(A205/z_ESR)","v":8.807981203548771E-3},{"$f":"IF(VIN_nom>Vout, 1, SQRT(1+(A205/z_RHP)^2))","v":1},{"$f":"IF(VIN_nom>Vout, 0, -ATAN(A205/z_RHP))","v":0},{"$f":"SQRT(1+(A205/EA_p1)^2)","v":1051.5685053426619},{"$f":"ATAN(A205/EA_p1)","v":1.5698453662577179},{"$f":"SQRT(1+(A205/EA_z1)^2)","v":1.581999425627695},{"$f":"ATAN(A205/EA_z1)","v":0.88652121116738103},{"$f":"SQRT(1+(A205/EA_hf_p)^2)","v":1.0001824694329953},{"$f":"ATAN(A205/EA_hf_p)","v":1.9101920919270283E-2},{"$f":"SQRT(1+(A205/Zero3)^2)","v":1.0000000000682374},{"$f":"ATAN(A205/Zero3)","v":1.1682249999468554E-5},{"$f":"SQRT(1+(A205/pole5)^2)","v":1.0000000000682374},{"$f":"ATAN(A205/pole5)","v":1.1682249999468554E-5},{"$f":"SQRT((1-(Z205/pterm2))^2+(A205/pterm1)^2)","v":1.0013909034956672},{"$f":"IF((ATAN((A205/pterm1)/(1-A205^2/pterm2))>0),ATAN((A205/pterm1)/(1-A205^2/pterm2)),PI()+ATAN((A205/pterm1)/(1-A205^2/pterm2)))","v":9.7979032294902998E-2},{"$f":"20*LOG10(((E205*K205*G205*O205)/(C205*I205*S205*M205*Q205))*Adc)","v":12.344547640778279},{"$f":"((F205+L205+H205+P205)-(D205+J205+T205+N205+R205))*radconv","v":-121.35005149500785},{"$f":"IF(V205>0,V205,V205+180)","v":58.649948504992153},null,{"$f":"IF(U205<0,A205,1000000000)","v":1000000000},{"$f":"A205^2","v":136474965.0625},null,{"$f":"20*LOG10((K205/(I205*M205))*Aea_stability*Afb*0.8)","v":4.6235000138447333},{"$f":"(L205-(J205+N205))*radconv","v":-40.246049575286051},null,null,null,{"$f":"20*LOG10((E205*G205/(C205*S205))*Am_stability)","v":7.7210476269335491},{"$f":"(F205+H205-(D205+T205))*radconv","v":-81.104001919721824},null,{"$f":"SUM((U206<0)*(U205>0))*A205","v":0},0]
[11749,{"$f":"A206/1000","v":11.749000000000001},4.15431448365739,1.3276953232230495,1.0000392360718209,8.8583055911131362E-3,1,0,1057.5769484452603,1.5698507689794738,1.587433066455717,0.88931030382203602,1.0001845603836663,1.921103863356077E-2,1.0000000000690195,1.1748999999459394E-5,1.0000000000690195,1.1748999999459394E-5,1.0014068997608725,9.8539099252319629E-2,12.278083281126396,-121.30247735526598,58.697522644734022,null,1000000000,138039001,null,4.6037757617696879,-40.092807875156836,null,null,null,7.6743075193567067,-81.209669480109127,null,0,0]
[11817.5,11.817500000000001,4.1771357191095477,1.3290500440145356,1.0000396949112735,8.9099492979921226E-3,1,0,1063.7429163051227,1.5698562498910107,1.5930219120653462,0.89215271457225831,1.0001867185345088,1.9323016636189034E-2,1.0000000000698268,1.1817499999449883E-5,1.0000000000698268,1.1817499999449883E-5,1.0014234114914211,9.9113853711176425E-2,12.210373423695453,-121.25394093776049,58.74605906223951,null,1000000000,139653306.25,null,4.583789463155564,-39.936679635574343,null,null,null,7.6265839605398895,-81.317261302186154,null,0,0]
[11886,11.885999999999999,4.1999645374079559,1.3303900401307025,1.000040156417902,8.9615929573429332E-3,1,0,1069.9088841965718,1.5698616676287107,1.5986235381232359,0.89497522820413233,1.0001888892267112,1.943499415417364E-2,1.0000000000706386,1.188599999944026E-5,1.0000000000706386,1.188599999944026E-5,1.0014400205762017,9.9688612342985483E-2,12.143160595233491,-121.20569747386382,58.794302526136178,null,1000000000,141276996,null,4.5640574305503403,-39.781687769535409,null,null,null,7.5791031646831524,-81.424009704328384,null,0,0]
[11954.5,11.954499999999999,4.2228008155720946,1.3317155456065075,1.0000406205917027,9.0132365688901615E-3,1,0,1076.0748521190649,1.5698670232785428,1.6042378107503146,0.89777800840876321,1.0001910724601923,1.9546971184709591E-2,1.0000000000714551,1.1954499999430528E-5,1.0000000000714551,1.1954499999430528E-5,1.001456727038899,0.10026337516976275,12.076438432712171,-121.15775105731969,58.842248942680314,null,1000000000,142910070.25,null,4.5445756036967104,-39.62782296029129,null,null,null,7.531862829015461,-81.529928097028375,null,0,0]
[12023,12.023,4.2456444332276106,1.3330267896461783,1.0000410874326719,9.0648801323584011E-3,1,0,1082.2408200720713,1.569872317901726,1.609864597634926,0.90056121783659548,1.0001932682348698,1.9658947724991962E-2,1.0000000000722764,1.2022999999420682E-5,1.0000000000722764,1.2022999999420682E-5,1.0014735309033331,0.10083814221348665,12.010200679156537,-121.11010556329673,58.889894436703273,null,1000000000,144552529,null,4.5253399991203498,-39.475075949300653,null,null,null,7.4848606800361868,-81.635029613996039,null,0,0]
[12093,12.093,4.2689957358075219,1.3343522473512528,1.0000415672518479,9.1176545268221512E-3,1,0,1088.5418092521122,1.5698776664989331,1.61562739107616,0.90338532331062915,1.0001955250482586,1.977337579690926E-2,1.0000000000731202,1.2092999999410503E-5,1.0000000000731202,1.2092999999410503E-5,1.0014908033849466,0.10142549977615667,11.943006497788208,-121.06173142812058,58.938268571879419,null,1000000000,146240649,null,4.5059334790958321,-39.320129322363684,null,null,null,7.4370730186923737,-81.741602105756868,null,0,0]
[12163,12.163,4.2923544567118599,1.3356632812251126,1.0000420498562737,9.1704288704967142E-3,1,0,1094.842798462935,1.5698829535321361,1.6214029784141302,0.90618933156610526,1.0001977949579324,1.9887803350944804E-2,1.0000000000739693,1.2162999999400208E-5,1.0000000000739693,1.2162999999400208E-5,1.0015081776314962,0.10201286178876427,11.876305291416045,-121.01367905493728,58.986320945062715,null,1000000000,147938569,null,4.4867759102050417,-39.166330624199993,null,null,null,7.389529381211001,-81.847348430737313,null,0,0]
[12233,12.233000000000001,4.3157204754861835,1.3369601210029127,1.000042535245945,9.223203163088195E-3,1,0,1101.1437877040119,1.5698881800581836,1.6271912234160488,0.90897341274420018,1.0002000779638012,2.000223038410557E-2,1.0000000000748233,1.2232999999389792E-5,1.0000000000748233,1.2232999999389792E-5,1.0015256536688375,0.10260022827464092,11.810090712767828,-120.96595191996546,59.034048080034538,null,1000000000,149646289,null,4.467863279256048,-39.013670166819701,null,null,null,7.342227433511777,-81.95228175314584,null,0,0]
[12303,12.303000000000001,4.3390936742334052,1.3382429916630931,1.0000430234208582,9.2759774043027071E-3,1,0,1107.4447769748256,1.5698933471098715,1.6329919914842133,0.91173773581214701,1.0002023740657759,2.0116656893398623E-2,1.0000000000756819,1.2302999999379258E-5,1.0000000000756819,1.2302999999379258E-5,1.0015432315229729,0.10318759925707624,11.744356521326605,-120.91855329276554,59.081446707234463,null,1000000000,151363809,null,4.4491916496751225,-38.862138328116828,null,null,null,7.2951648716514814,-82.056414964648724,null,0,0]
[12374.5,12.374499999999999,4.3629750196660293,1.33953916015078,1.0000435249320649,9.3298824687689293E-3,1,0,1113.8807874744746,1.569898564533823,1.6389298519360636,0.914541071093525,1.0002047328899009,2.0233534855380989E-2,1.0000000000765641,1.2374499999368371E-5,1.0000000000765641,1.2374499999368371E-5,1.0015612911854541,0.10378756142685834,11.677703299393684,-120.87048131428456,59.129518685715439,null,1000000000,153128250.25,null,4.4303647022002606,-38.708514598245792,null,null,null,7.2473385971934245,-82.161966716038776,null,0,0]
[12446,12.446,4.3868636153128149,1.3408212142433487,1.0000440293491513,9.3837874790129085E-3,1,0,1120.3167980040971,1.5699037220115246,1.6448804991786588,0.91732414498847448,1.0002071053772159,2.0350412264491816E-2,1.0000000000774514,1.244599999935736E-5,1.0000000000774514,1.244599999935736E-5,1.0015794571303667,0.10438752833695665,11.611538443582603,-120.82275834082486,59.177241659175138,null,1000000000,154902916,null,4.4117811304227512,-38.556048293959847,null,null,null,7.19975731315985,-82.266710046864986,null,0,0]
[12517.5,12.5175,4.4107593433726642,1.3420893790900934,1.0000445366721127,9.4376924347214612E-3,1,0,1126.7528085631791,1.5699088205702145,1.6508437949378423,0.92008713371937734,1.0002094915276241,2.0467289117541882E-2,1.000000000078344,1.2517499999346219E-5,1.000000000078344,1.2517499999346219E-5,1.0015977293858953,0.10498750001205367,11.545855634858871,-120.77538723579779,59.224612764202206,null,1000000000,156687806.25,null,4.3934369760107845,-38.404729377133982,null,null,null,7.1524186588480845,-82.370657858663819,null,0,0]
[12589,12.589,4.4346620885487189,1.3433438751669866,1.0000450469009448,9.4915973355814004E-3,1,0,1133.1888191512182,1.5699138612137944,1.6568196026383795,0.92283021220096739,1.0002118913410272,2.0584165411342056E-2,1.0000000000792415,1.2588999999334951E-5,1.0000000000792415,1.2588999999334951E-5,1.0016161079803849,0.10558747647678532,11.480648661359629,-120.72837066843623,59.271629331563773,null,1000000000,158482921,null,4.3753283568926209,-38.25454788322876,null,null,null,7.1053203044670052,-82.473822785207474,null,0,{"$f":"IF(AJ218>0,W218,0)","v":0}]
[12662.25,12.66225,4.4591570248141341,1.344615126714767,1.0000455726313158,9.5468215299555469E-3,1,0,1139.7823545034466,1.5699189661967592,1.6629545053900503,0.9256199632707548,1.0002143640597203,2.070390173044839E-2,1.0000000000801663,1.2662249999323277E-5,1.0000000000801663,1.2662249999323277E-5,1.0016350467052797,0.10620214267278369,11.4143327763258,-120.68057359992559,59.319426400074406,null,1000000000,160332575.0625,null,4.3570167927675376,-38.101859800755427,null,null,null,7.0573159835582642,-82.578713799170188,null,0,0]
[12735.5,12.7355,4.4836590886905787,1.3458724861391633,1.000046101411534,9.60204566609788E-3,1,0,1146.3758898850369,1.5699240124557297,1.669102255236961,0.92838918496252865,1.0002168511182019,2.0823637455818011E-2,1.0000000000810965,1.2735499999311464E-5,1.0000000000810965,1.2735499999311464E-5,1.0016540970989818,0.10681681394793877,11.348503440871431,-120.63315371378782,59.36684628621218,null,1000000000,162192960.25,null,4.3389444242569848,-37.950344566342658,null,null,null,7.0095590166144461,-82.682809147445198,null,0,0]
[12808.75,12.80875,4.5081681639615496,1.3471161760092274,1.0000466332415949,9.6572697436716586E-3,1,0,1152.9694252954853,1.5699290009981874,1.6752627107432811,0.93113806104808772,1.0002193525163647,2.0943372584022141E-2,1.0000000000820322,1.2808749999299514E-5,1.0000000000820322,1.2808749999299514E-5,1.00167325919249,0.10743149032858637,11.28315431170471,-120.58611329199803,59.413886708001968,null,1000000000,164064076.5625,null,4.3211073152472981,-37.799991708169998,null,null,null,6.9620469964574134,-82.786121583828049,null,0,0]
[12882,12.882,4.5326841368912643,1.348346414249989,1.0000471681214935,9.7124937623401433E-3,1,0,1159.5629607342998,1.5699339328086996,1.6814357322557758,0.9338667738387697,1.0002218682541015,2.1063107111632114E-2,1.000000000082973,1.2881999999287428E-5,1.000000000082973,1.2881999999287428E-5,1.0016925330169781,0.10804617184100983,11.218279154307796,-120.53945443281071,59.460545567189286,null,1000000000,165945924,null,4.3035016063730671,-37.650790836782292,null,null,null,6.914777547934726,-82.888663596028408,null,0,0]
[12957.25,12.95725,4.5578765536904697,1.3495964592593304,1.0000477207814988,9.7692255423503412E-3,1,0,1166.3365244735139,1.5699389412106033,1.6877902408836056,0.93664918414712262,1.0002244676130148,2.1186110212342627E-2,1.0000000000839453,1.2957249999274867E-5,1.0000000000839453,1.2957249999274867E-5,1.0017124494708192,0.10867764183782722,11.152119783266743,-120.49192096148185,59.508079038518147,null,1000000000,167890327.5625,null,4.2856521830024716,-37.498704988068909,null,null,null,6.8664676002642713,-82.993215973412987,null,0,0]
[13032.5,13.032500000000001,4.5830760143791425,1.3508327597558076,1.0000482766601491,9.825957259474204E-3,1,0,1173.110088241647,1.5699438917752588,1.6941577179782332,0.93941070037096219,1.0002270821050081,2.1309112671878908E-2,1.0000000000849232,1.3032499999262159E-5,1.0000000000849232,1.3032499999262159E-5,1.0017324839075543,0.10930911730654209,11.086447624060312,-120.44479409698683,59.555205903013174,null,1000000000,169846056.25,null,4.2680389527322227,-37.347812931648122,null,null,null,6.8184086713280854,-83.096981165338747,null,0,0]
[13107.75,13.107749999999999,4.6082824034030274,1.3520555374681325,1.0000488357574389,9.8826889133466593E-3,1,0,1179.8836520382004,1.569948785498775,1.7005380178626837,0.94215151533375463,1.000229711729963,2.1432114486524042E-2,1.0000000000859064,1.3107749999249305E-5,1.0000000000859064,1.3107749999249305E-5,1.0017526363615616,0.10994059827547521,11.021256261497021,-120.39807555397765,59.601924446022352,null,1000000000,171813110.0625,null,4.2506579731174021,-37.198103676408998,null,null,null,6.7705982883796159,-83.199971877568629,null,0,0]
[13183,13.183,4.6334956076909197,1.353265009462612,1.0000493980733627,9.9394205036026275E-3,1,0,1186.6572158626877,1.5699536233545175,1.7069309967468895,0.94487182022301608,1.0002323564877598,2.155511565256123E-2,1.0000000000868958,1.3182999999236302E-5,1.0000000000868958,1.3182999999236302E-5,1.0017729068674139,0.11057208477288756,10.956539391876072,-120.35176687239664,59.648233127603362,null,1000000000,173791489,null,4.2335053797202145,-37.049566323670575,null,null,null,6.7230340121558605,-83.302200548726063,null,0,0]
[13259.75,13.25975,4.6592183064359114,1.3544851046786386,1.0000499749137479,9.9972828902130002E-3,1,0,1193.5658009212605,1.5699585010828829,1.7134643238897973,0.94762541959790569,1.0002350695531825,2.1680567997099824E-2,1.0000000000879106,1.3259749999222886E-5,1.0000000000879106,1.3259749999222886E-5,1.0017937030776485,0.11121616476513592,10.89101483688596,-120.3049587140284,59.695041285971598,null,1000000000,175820970.0625,null,4.2162422068112164,-36.899264064140567,null,null,null,6.6747726300747434,-83.405694649887806,null,0,0]
[13336.5,13.336499999999999,4.6849478648752605,1.3556918002400065,1.0000505551023526,1.0055145209878298E-2,1,0,1200.4743860079036,1.5699633226697733,1.7200105442940004,0.95035807961049812,1.0002377983605097,2.1806019659105027E-2,1.0000000000889311,1.3336499999209314E-5,1.0000000000889311,1.3336499999209314E-5,1.0018146221662905,0.11186025056765744,10.825970978652164,-120.25857963005053,59.741420369949466,null,1000000000,177862232.25,null,4.199208736027475,-36.75015828592003,null,null,null,6.6267622426246895,-83.508421344130483,null,0,0]
[13413.25,13.41325,4.7106841706068856,1.356885312226068,1.0000511386391706,1.0113007462211188E-2,1,0,1207.382971122136,1.5699680890789047,1.7265695113066253,0.95306999785190427,1.0002405429096133,2.1931470634633687E-2,1.0000000000899576,1.3413249999195584E-5,1.0000000000899576,1.3413249999195584E-5,1.0018356641706505,0.11250434221024293,10.761401472639655,-120.21263073648127,59.787369263518727,null,1000000000,179915275.5625,null,4.1824011066738747,-36.602237722863173,null,null,null,6.5790003659657836,-83.610393013618094,null,0,0]
[13490,13.49,4.7364271136425771,1.3580658521706173,1.0000517255241961,1.0170869646824336E-2,1,0,1214.2915562634862,1.5699728012520611,1.7331410802113858,0.95576137014550133,1.0002433032003628,2.20569209197428E-2,1.0000000000909901,1.3489999999181696E-5,1.0000000000909901,1.3489999999181696E-5,1.0018568291282506,0.11314843972261704,10.697300085232776,-120.16711298892085,59.832887011079151,null,1000000000,181980100,null,4.1658155350170309,-36.455491208851271,null,null,null,6.5314845502157493,-83.711621780069535,null,0,0]
[13568.5,13.5685,4.7627637831789391,1.3592601067261834,1.0000523292545518,1.0230051094179919E-2,1,0,1221.3576661750458,1.5699775657231625,1.7398753767882345,0.95849305749477387,1.0002461427133358,2.2185230916483049E-2,1.0000000000920521,1.3568499999167328E-5,1.0000000000920521,1.3568499999167328E-5,1.0018786039042349,0.11380722960047411,10.632214969925339,-120.12100421635289,59.878995783647113,null,1000000000,184104192.25,null,4.1490776358886858,-36.30660165815695,null,null,null,6.4831373340366536,-83.814402558195951,null,0,0]
[13647,13.647,4.789107170860893,1.3604412245058339,1.0000529364875306,1.0289232469872732E-2,1,0,1228.4237761140118,1.5699822753821098,1.7466225563443603,0.96120365999763036,1.0002489986937229,2.2313540182616484E-2,1.0000000000931202,1.3646999999152791E-5,1.0000000000931202,1.3646999999152791E-5,1.0019005073844478,0.11446602568153628,10.567606718391161,-120.0753480118376,59.924651988162395,null,1000000000,186240609,null,4.1325642684920449,-36.15891699780817,null,null,null,6.4350424498991181,-83.916431014029428,null,0,0]
[13725.5,13.7255,4.8154571664317984,1.3616094178386156,1.0000535472231253,1.0348413773488347E-2,1,0,1235.4898860799135,1.5699869311693608,1.7533824701550458,0.96389338146035763,1.0002518711413826,2.2441848713924597E-2,1.0000000000941947,1.3725499999138087E-5,1.0000000000941947,1.3725499999138087E-5,1.0019225396097229,0.11512482799739117,10.503469005993393,-120.03014491916923,59.969855080830769,null,1000000000,188389350.25,null,4.1162716228383562,-36.012425604207422,null,null,null,6.3871973831550353,-84.017719314961809,null,0,0]
[13804,13.804,4.8418136620078007,1.3627648945731545,1.0000541614613303,1.0407595004612342E-2,1,0,1242.5559960722915,1.5699915340039805,1.760154971501745,0.9665624237699153,1.0002547600561735,2.2570156506189029E-2,1.0000000000952753,1.3803999999123214E-5,1.0000000000952753,1.3803999999123214E-5,1.0019447006211244,0.1157836365795526,10.439795619601496,-119.98539533417231,60.01460466582769,null,1000000000,190550416,null,4.1001959656664475,-35.867115962500819,null,null,null,6.3395996539350463,-84.11827937167152,null,0,0]
[13884.25,13.88425,4.8687643318207057,1.3639331972254476,1.0000547930133425,1.0468095487179554E-2,1,0,1249.7796308366233,1.5699961856483851,1.7670913130458052,0.96926979946548375,1.0002577303952502,2.2701323894915883E-2,1.0000000000963862,1.3884249999107834E-5,1.0000000000963862,1.3884249999107834E-5,1.0019674888354884,0.11645713848738512,10.375176375153179,-119.94011719630949,60.059882803690513,null,1000000000,192772398.0625,null,4.0839824231349366,-35.719776618964424,null,null,null,6.2911939520182418,-84.220340577345041,null,0,0]
[13964.5,13.964499999999999,4.8957215739896389,1.3650886354237926,1.0000554282258594,1.0528595893111146E-2,1,0,1257.0032656276865,1.5700007838294756,1.7740405058207569,0.9719559842982799,1.0002607179435425,2.2832490502365896E-2,1.0000000000975038,1.3964499999092274E-5,1.0000000000975038,1.3964499999092274E-5,1.0019904117295664,0.11713064701039261,10.311029605204451,-119.89531340195714,60.104686598042861,null,1000000000,195007260.25,null,4.0679879992422023,-35.573648314443005,null,null,null,6.2430416059622482,-84.32166508751412,null,0,0]
[14044.75,14.044750000000001,4.9226852805414625,1.3662314174502386,1.0000560670988734,1.058909622196437E-2,1,0,1264.2269004450231,1.5700053294636995,1.7810023993961279,0.97462118777922524,1.0002637227008966,2.296365632403273E-2,1.0000000000986276,1.4044749999076534E-5,1.0000000000986276,1.4044749999076534E-5,1.0020134693479794,0.11780416218200135,10.247349018009791,-119.85098393489702,60.149016065102984,null,1000000000,197255002.5625,null,4.0522089427088321,-35.428719097095382,null,null,null,6.1951400753009578,-84.422264837801663,null,0,0]
[14125,14.125,4.9496553458302035,1.3673617471810873,1.0000567096323776,1.0649596473296472E-2,1,0,1271.4505352881854,1.5700098234466784,1.7879768454115792,0.97726561735148965,1.0002667446671569,2.3094821355410213E-2,1.0000000000997578,1.4124999999060613E-5,1.0000000000997578,1.4124999999060613E-5,1.0020366617355998,0.11847768403555495,10.18412843359668,-119.80712864375563,60.192871356244368,null,1000000000,199515625,null,4.0366415785280703,-35.284977132360574,null,null,null,6.1474868550686104,-84.522151511395094,null,0,0]
[14207.25,14.20725,4.9773040525462084,1.3685075342550246,1.0000573719776387,1.0711604438147867E-2,1,0,1278.8541984403848,1.5700143767468557,1.795137981901211,0.97995460963878078,1.0002698598046293,2.3229254472433992E-2,1.0000000001009228,1.4207249999044108E-5,1.0000000001009228,1.4207249999044108E-5,1.0020605720230289,0.11916799844908717,10.11980324926515,-119.76267214097342,60.237327859026578,null,1000000000,201845952.5625,null,4.0209021476895792,-35.138872558270826,null,null,null,6.0989011015755681,-84.623799582702603,null,0,0]
[14289.5,14.2895,5.0049592214065992,1.3696406605878362,1.0000580381681026,1.0773612320624244E-2,1,0,1286.2578616187925,1.5700188776297042,1.8023119952562379,0.98262221428659946,1.0002729930191288,2.3363686749701584E-2,1.0000000001020948,1.4289499999027409E-5,1.0000000001020948,1.4289499999027409E-5,1.0020846239771017,0.11985831995242846,10.055948486275799,-119.71871301216439,60.281286987835614,null,1000000000,204189810.25,null,4.0053775132522729,-34.9939903542504,null,null,null,6.050570973023528,-84.724722657913986,null,0,0]
[14371.75,14.37175,5.0326207458793908,1.3707613320126764,1.0000587082037622,1.0835620120248935E-2,1,0,1293.6615248229593,1.5700233269951809,1.8094987323202107,0.98526864793624569,1.0002761443104857,2.3498118182361968E-2,1.0000000001032736,1.4371749999010518E-5,1.0000000001032736,1.4371749999010518E-5,1.0021088176469537,0.12054864858120497,9.9925578410359499,-119.67525069142174,60.324749308578262,null,1000000000,206547198.0625,null,3.9900639564114919,-34.850318158952923,null,null,null,6.0024938846244584,-84.824932532468807,null,0,0]
[14454,14.454000000000001,5.060288521737764,1.3718697499877173,1.0000593820846098,1.0897627836545267E-2,1,0,1301.0651880524447,1.5700277257227591,1.8166980420906873,0.98789412499025897,1.0002793136785288,2.3632548765564317E-2,1.0000000001044591,1.4453999998993431E-5,1.0000000001044591,1.4453999998993431E-5,1.0021331530819986,0.12123898437094957,9.9296251230396226,-119.63228448926321,60.367715510736787,null,1000000000,208918116,null,3.9749578348872996,-34.707843738129966,null,null,null,5.954667288152323,-84.924440751133247,null,0,0]
[14622.5,14.6225,5.116988713006152,1.3741030526069768,1.0000607746262031,1.1024658579743406E-2,1,0,1316.2325711591113,1.5700365825687519,1.8314854165054322,0.9932082111191054,1.0002858629964997,2.3907944916412637E-2,1.0000000001069087,1.4622499998957817E-5,1.0000000001069087,1.4622499998957817E-5,1.0021834503471208,0.12265325102289663,9.8021036248391198,-119.54580827841232,60.454191721587677,null,1000000000,213817506.25,null,3.9446437647673918,-34.419655528010985,null,null,null,5.857459860071728,-85.126152750401346,null,0,0]
[14706.75,14.70675,5.145348221066933,1.3752012434389174,1.0000614769486584,1.1088173818166468E-2,1,0,1323.816262750498,1.5700409348849762,1.8388982647139325,0.99583316751283302,1.0002891661044753,2.4045641634263468E-2,1.0000000001081442,1.4706749998939699E-5,1.0000000001081442,1.4706749998939699E-5,1.0022088223075156,0.12336039576968787,9.7390380851041698,-119.50334711995205,60.496652880047947,null,1000000000,216288495.5625,null,3.929798275700866,-34.27739541538093,null,null,null,5.8092398094033033,-85.22595170457106,null,0,0]
[14791,14.791,5.1737138665027986,1.37628739358408,1.0000621833055416,1.1151688967122491E-2,1,0,1331.3999543666757,1.5700452376193692,1.8463236818650344,0.99843702799131329,1.0002924881781943,2.4183337440115266E-2,1.0000000001093867,1.4790999998921372E-5,1.0000000001093867,1.4790999998921372E-5,1.0022343432254537,0.12406754818076061,9.6764277324078822,-119.46140233903918,60.538597660960818,null,1000000000,218773681,null,3.9151556585250642,-34.136341116576141,null,null,null,5.7612720738828216,-85.325061222463049,null,0,0]
[14877.25,14.87725,5.2027591332128775,1.3773870578493326,1.0000629106097556,1.1216711800882398E-2,1,0,1339.1636742957185,1.570049592013981,1.8539382324056912,1.0010810761533584,1.0002959087604253,2.43243010389598E-2,1.0000000001106661,1.4877249998902393E-5,1.0000000001106661,1.4877249998902393E-5,1.002260624341879,0.12479149557137352,9.6127962627943759,-119.41899536364261,60.581004636357392,null,1000000000,221332567.5625,null,3.9003719148721676,-33.993174423773993,null,null,null,5.7124243479222079,-85.425820939868586,null,0,0]
[14963.5,14.9635,5.2318106215582665,1.378474510863948,1.0000636421421985,1.1281734539790646E-2,1,0,1346.9273942498603,1.5700538962109347,1.8615656377283751,1.0037034755712857,1.0002993492191363,2.4465263670936731E-2,1.0000000001119531,1.4963499998883192E-5,1.0000000001119531,1.4963499998883192E-5,1.0022870616881419,0.12551545107425208,9.5496290833932171,-119.37712665551342,60.622873344486578,null,1000000000,223906332.25,null,3.8857933918035794,-33.851245181130174,null,null,null,5.6638356915896377,-85.525881474383212,null,0,0]
[15049.75,15.04975,5.2608682284678991,1.3795499523754111,1.0000643779028606,1.1346757183297621E-2,1,0,1354.6911142286692,1.5700581510732772,1.8692057404689826,1.0063044554129463,1.0003028095541222,2.4606225330454083E-2,1.0000000001132476,1.5049749998863769E-5,1.0000000001132476,1.5049749998863769E-5,1.0023136553235135,0.12623941472958142,9.4869199125231205,-119.33579458045125,60.66420541954875,null,1000000000,226494975.0625,null,3.871416464240951,-33.710540307422541,null,null,null,5.61550344828217,-85.625254273028716,null,0,0]
[15136,15.135999999999999,5.2899318531139183,1.3806135778539743,1.000065117891733,1.1411779730853706E-2,1,0,1362.4548342317239,1.570062357444383,1.8768583855658836,1.0088842422771513,1.0003062897651769,2.4747186011920112E-2,1.0000000001145493,1.5135999998844122E-5,1.0000000001145493,1.5135999998844122E-5,1.002340405307599,0.12696338657742903,9.4246625831041637,-119.29499740524982,60.705002594750184,null,1000000000,229098496,null,3.8572375833442347,-33.571046867497039,null,null,null,5.5674249997599308,-85.723950537752785,null,0,0]
[15224,15.224,5.3195912742717804,1.3816868045349782,1.0000658772526276,1.1478121477014986E-2,1,0,1370.3760790130248,1.5700666000402743,1.8846790698541309,1.0114947627625284,1.0003098610740777,2.4891005751362751E-2,1.0000000001158851,1.5223999998823844E-5,1.0000000001158851,1.5223999998823844E-5,1.0023678592465173,0.12770205619413882,9.3616014654878406,-119.25392185473856,60.746078145261436,null,1000000000,231770176,null,3.8429715252113845,-33.429958408271972,null,null,null,5.5186299402764538,-85.823963446466593,null,0,0]
[15312,15.311999999999999,5.3492567546678282,1.3827481287977292,1.0000666410150327,1.1544463122136341E-2,1,0,1378.2973238187083,1.5700707938707215,1.8925124916830542,1.0140836900185026,1.0003134530733573,2.5034824460903094E-2,1.0000000001172287,1.5311999998803327E-5,1.0000000001172287,1.5311999998803327E-5,1.0023954760695213,0.12844073442307807,9.2989980945920632,-119.21339919297661,60.78660080702339,null,1000000000,234457344,null,3.8289044029741488,-33.290104296894555,null,null,null,5.470093691617917,-85.923294896082055,null,0,0]
[15400,15.4,5.3789281940496307,1.3837977452009178,1.0000674091789383,1.1610804665634033E-2,1,0,1386.2185686483565,1.5700749397717029,1.9003584935373332,1.0166512565801433,1.0003170657627924,2.517864213460283E-2,1.00000000011858,1.5399999998782582E-5,1.00000000011858,1.5399999998782582E-5,1.0024232558409949,0.12917942130641938,9.2368462730267424,-119.17342729408529,60.826572705914714,null,1000000000,237160000,null,3.8150326810161777,-33.151471257644523,null,null,null,5.4218135920105652,-86.021956036440798,null,0,0]
[15488,15.488,5.4086054943447621,1.3848358441374988,1.0000681817443344,1.1677146106924332E-2,1,0,1394.1398135015611,1.5700790385601975,1.9082169202413743,1.0191976922877788,1.0003206991421594,2.5322458766523896E-2,1.0000000001199392,1.5487999998761592E-5,1.0000000001199392,1.5487999998761592E-5,1.002451198625685,0.12991811688620483,9.1751399169476731,-119.13400394680818,60.865996053191822,null,1000000000,239878144,null,3.8013528986029108,-33.014046168110333,null,null,null,5.3737870183447605,-86.119957778697838,null,0,0]
[15578.25,15.578250000000001,5.4390475763605135,1.3858887175911232,1.0000689786345482,1.1745183671475468E-2,1,0,1402.2635902074478,1.5700831940488544,1.9162890179356873,1.0217875254982602,1.0003244469103947,2.5469951439944599E-2,1.0000000001213409,1.5578249998739814E-5,1.0000000001213409,1.5578249998739814E-5,1.0024800252432069,0.1306757086455998,9.1123122812596016,-119.09413998422687,60.905860015773129,null,1000000000,242681873.0625,null,3.7875191644103423,-32.874348455164885,null,null,null,5.3247931168492615,-86.219791529061965,null,0,0]
[15668.5,15.6685,5.4694956206708794,1.3869298697407484,1.0000697801541842,1.1813221127282279E-2,1,0,1410.3873669372701,1.5700873016666033,1.9243738607547536,1.0243556145589421,1.0003282164396134,2.5617443004982785E-2,1.0000000001227509,1.5668499998717786E-5,1.0000000001227509,1.5668499998717786E-5,1.0025090234555234,0.13143330964097374,9.0499405759024949,-119.0548480175152,60.945151982484802,null,1000000000,245501892.25,null,3.7738801711616237,-32.735893783925427,null,null,null,5.276060404740873,-86.31895423358975,null,0,0]
[15758.75,15.758749999999999,5.49994952825302,1.3879594930171839,1.0000705863032313,1.1881258473715123E-2,1,0,1418.5111436906166,1.5700913622359103,1.9324712887339826,1.0269021987191005,1.0003320077295696,2.5764933455234028E-2,1.0000000001241691,1.57587499986955E-5,1.0000000001241691,1.57587499986955E-5,1.0025381933336612,0.13219091991724427,8.9880185940722033,-119.0161254135392,60.9838745864608,null,1000000000,248338201.5625,null,3.7604324193961984,-32.59866849317509,null,null,null,5.2275861746760057,-86.417456920364117,null,0,0]
[15849,15.849,5.5304092022463616,1.3889777757108623,1.0000713970816781,1.1949295710144364E-2,1,0,1426.6349204670853,1.5700953765605079,1.9405811443317675,1.0294275143536615,1.0003358207800159,2.591242278429419E-2,1.0000000001255955,1.584899999867296E-5,1.0000000001255955,1.584899999867296E-5,1.002567534949047,0.13294853951918123,8.9265402437132835,-118.97796946554507,61.022030534454927,null,1000000000,251190801,null,3.747172484661589,-32.462659085311735,null,null,null,5.1793677590516936,-86.515310380233345,null,0,0]
[15941.25,15.94125,5.5615497437328916,1.3900070956999295,1.000072230611925,1.2018840582622625E-2,1,0,1434.9387255612573,1.5700994328696509,1.9488834019722061,1.0319870550413652,1.0003397408191097,2.6063179409537108E-2,1.0000000001270617,1.5941249998649649E-5,1.0000000001270617,1.5941249998649649E-5,1.0025977043570529,0.13372295815958402,8.8641517542496473,-118.93955069753557,61.060449302464434,null,1000000000,254123451.5625,null,3.73380931864562,-32.324878334168652,null,null,null,5.1303424356040237,-86.614672363366907,null,0,0]
[16033.5,16.0335,5.5926961120564584,1.3910249519544571,1.0000730689790025,1.2088385338837496E-2,1,0,1443.2425306787677,1.5701034425022307,1.9571983188654518,1.0345248644483784,1.0003436835933064,2.6213934849816073E-2,1.0000000001285365,1.6033499998626073E-5,1.0000000001285365,1.6033499998626073E-5,1.0026280533504544,0.13449738663767255,8.8022142611024421,-118.90171804464222,61.098281955357777,null,1000000000,257073122.25,null,3.7206353829743648,-32.188339951429036,null,null,null,5.0815788781280773,-86.713378093213166,null,0,0]
[16125.75,16.12575,5.6238482104053364,1.3920315328503485,1.0000739121828983,1.2157929978116568E-2,1,0,1451.5463358192158,1.5701074062593097,1.9655257343512362,1.0370411858858111,1.0003476491023371,2.6364689098292638E-2,1.00000000013002,1.612574999860222E-5,1.00000000013002,1.612574999860222E-5,1.002658582006827,0.13527182500077595,8.7407216133266292,-118.86446840756548,61.135531592434518,null,1000000000,260039813.0625,null,3.7076472515727827,-32.053030041898872,null,null,null,5.0330743617538465,-86.811438365666646,null,0,0]
[16218,16.218,5.6550059440834426,1.3930270227044272,1.0000747602236002,1.2227474499787436E-2,1,0,1459.8501409822102,1.570111324923724,1.9738654902410162,1.0395362596504703,1.000351637345932,2.651544214812868E-2,1.0000000001315117,1.6217999998578096E-5,1.0000000001315117,1.6217999998578096E-5,1.0026892904041809,0.13604627329605878,8.6796677743039794,-118.82779862609092,61.172201373909076,null,1000000000,263023524,null,3.6948415724259336,-31.918934882046674,null,null,null,4.9848262018780485,-86.908863744044254,null,0,0]
[16312.5,16.3125,5.6869293688391176,1.3940354812016973,1.00007563396341,1.2298715106655145E-2,1,0,1468.3564780014262,1.5701152932091953,1.9824212875623677,1.0420704055748133,1.0003557464365549,2.6669870851621879E-2,1.0000000001330487,1.6312499998553095E-5,1.0000000001330487,1.6312499998553095E-5,1.0027209342391734,0.13683962092178681,8.6175736178562303,-118.79083233915621,61.209167660843789,null,1000000000,266097656.25,null,3.6819093132860981,-31.782814494866791,null,null,null,4.9356643045701336,-87.008017844289398,null,0,0]
[16407,16.407,5.7188585125643909,1.3950326799892578,1.0000765127788189,1.236995558867931E-2,1,0,1476.862815043499,1.5701192157821289,1.9909897063227855,1.0445827556285141,1.0003598793836899,2.6824298282765755E-2,1.0000000001345948,1.6406999998527803E-5,1.0000000001345948,1.6406999998527803E-5,1.002752766857048,0.13763297906975905,8.5559274692962983,-118.7544676477726,61.2455323522274,null,1000000000,269189649,null,3.6691616245433192,-31.647940227049787,null,null,null,4.8867658447529756,-87.106527420722841,null,0,0]
[16501.5,16.5015,5.7507932800018997,1.39601880464627,1.0000773966698135,1.2441195945137139E-2,1,0,1485.3691521080348,1.5701230934278771,1.9995705842687761,1.0470735584928694,1.0003640361870412,2.6978724434210601E-2,1.0000000001361498,1.6501499998502217E-5,1.0000000001361498,1.6501499998502217E-5,1.0027847883430845,0.13842634779013219,8.4947231958668628,-118.71870098394565,61.281299016054348,null,1000000000,272299502.25,null,3.656595132719259,-31.514297874783189,null,null,null,4.8381280631476029,-87.20440310916247,null,0,0]
[16596,16.596,5.7827335779818965,1.396994036739029,1.0000782856363801,1.251243617530585E-2,1,0,1493.875489194651,1.5701269269139053,2.0081637616861543,1.049543059671356,1.0003682168463115,2.7133149298607093E-2,1.0000000001377136,1.6595999998476335E-5,1.0000000001377136,1.6595999998476335E-5,1.0028169987830422,0.13921972713287736,8.4339547796182721,-118.68352873080053,61.316471269199468,null,1000000000,275427216,null,3.6442065380234019,-31.381873415305364,null,null,null,4.7897482415948716,-87.301655315495211,null,0,0]
[16692.5,16.692499999999999,5.8153554737533568,1.3979788524773218,1.0000791986548783,1.2585184004135858E-2,1,0,1502.5618546017922,1.5701307967398384,2.0169513346011723,1.052043094581727,1.0003725106034249,2.7290841078269217E-2,1.0000000001393197,1.6692499998449604E-5,1.0000000001393197,1.6692499998449604E-5,1.0028500860098342,0.14002990858653047,8.3723439138894324,-118.64822169970856,61.351778300291443,null,1000000000,278639556.25,null,3.6317359810788234,-31.247888764437704,null,null,null,4.7406079328106081,-87.400332935270853,null,0,0]
[16789,16.789000000000001,5.8479829466897275,1.398952680046492,1.0000801169660323,1.265793169975128E-2,1,0,1511.2482200311767,1.5701346220797341,2.0257514043978269,1.0545214240591947,1.0003768292362847,2.7448531500339803E-2,1.0000000001409353,1.6788999998422558E-5,1.0000000001409353,1.6788999998422558E-5,1.0028833704555049,0.14084010122166274,8.3111752207835625,-118.61352674423685,61.38647325576315,null,1000000000,281870521,null,3.6194442032821983,-31.115145116621449,null,null,null,4.6917310175013665,-87.498381627615387,null,0,0]
[16885.5,16.8855,5.880615903959507,1.3999157005119667,1.0000810405698279,1.2730679261382495E-2,1,0,1519.9345854824228,1.5701384036963006,2.0345638089183722,1.056978299501999,1.0003811727445691,2.7606220556994149E-2,1.0000000001425602,1.6885499998395201E-5,1.0000000001425602,1.6885499998395201E-5,1.0029168522129193,0.14165030509088042,8.2504426459641262,-118.5794398809219,61.420560119078104,null,1000000000,285120110.25,null,3.6073279169203021,-30.983628111050123,null,null,null,4.6431147290438242,-87.595811769871801,null,0,0]
[16982,16.981999999999999,{"$f":"SQRT(1+(A269/p_dom)^2)","v":5.9132542547649702},{"$f":"ATAN(A269/p_dom)","v":1.4008680910227858},{"$f":"SQRT(1+(A269/z_ESR)^2)","v":1.0000819694662504},{"$f":"ATAN(A269/z_ESR)","v":1.2803426688259879E-2},{"$f":"IF(VIN_nom>Vout, 1, SQRT(1+(A269/z_RHP)^2))","v":1},{"$f":"IF(VIN_nom>Vout, 0, -ATAN(A269/z_RHP))","v":0},{"$f":"SQRT(1+(A269/EA_p1)^2)","v":1528.6209509551579},{"$f":"ATAN(A269/EA_p1)","v":1.5701421423349091},{"$f":"SQRT(1+(A269/EA_z1)^2)","v":2.0433883885770356},{"$f":"ATAN(A269/EA_z1)","v":1.0594139690107678},{"$f":"SQRT(1+(A269/EA_hf_p)^2)","v":1.0003855411279536},{"$f":"ATAN(A269/EA_hf_p)","v":2.7763908240407947E-2},{"$f":"SQRT(1+(A269/Zero3)^2)","v":1.0000000001441942},{"$f":"ATAN(A269/Zero3)","v":1.6981999998367531E-5},{"$f":"SQRT(1+(A269/pole5)^2)","v":1.0000000001441942},{"$f":"ATAN(A269/pole5)","v":1.6981999998367531E-5},{"$f":"SQRT((1-(Z269/pterm2))^2+(A269/pterm1)^2)","v":1.0029505313754614},{"$f":"IF((ATAN((A269/pterm1)/(1-A269^2/pterm2))>0),ATAN((A269/pterm1)/(1-A269^2/pterm2)),PI()+ATAN((A269/pterm1)/(1-A269^2/pterm2)))","v":0.14246052024658371},{"$f":"20*LOG10(((E269*K269*G269*O269)/(C269*I269*S269*M269*Q269))*Adc)","v":8.1901402488527033},{"$f":"((F269+L269+H269+P269)-(D269+J269+T269+N269+R269))*radconv","v":-118.54595708984202},{"$f":"IF(V269>0,V269,V269+180)","v":61.45404291015798},null,{"$f":"IF(U269<0,A269,1000000000)","v":1000000000},{"$f":"A269^2","v":288388324},null,{"$f":"20*LOG10((K269/(I269*M269))*Aea_stability*Afb*0.8)","v":3.5953839066070703},{"$f":"(L269-(J269+N269))*radconv","v":-30.853323574863161},null,null,null,{"$f":"20*LOG10((E269*G269/(C269*S269))*Am_stability)","v":4.5947563422456339},{"$f":"(F269+H269-(D269+T269))*radconv","v":-87.692633514978866},null,{"$f":"SUM((U270<0)*(U269>0))*A269","v":0},0]
[17081,{"$f":"A270/1000","v":17.081},5.9467436705549259,1.4018342899210472,1.0000829279274064,1.2878058622659685E-2,1,0,1537.532351824784,1.5701459339304376,2.0524540720319018,1.0618909582656506,1.0003900485316477,2.7925679661700759E-2,1.0000000001458802,1.7080999998338814E-5,1.0000000001458802,1.7080999998338814E-5,1.0029852882961545,0.14329173721580019,8.1287165427922154,-118.51223037012362,61.487769629876382,null,1000000000,291760561,null,3.5833061985895975,-30.720888606766422,null,null,null,4.5454103442026188,-87.791341763357195,null,0,0]
[17180,17.18,5.9802385756895875,1.4027896664756745,1.0000838919589392,1.2952690413592181E-2,1,0,1546.443752716259,1.5701496818277356,2.0615322374694673,1.0643461471292341,1.0003945821153057,2.8087449620997063E-2,1.0000000001475762,1.7179999998309761E-5,1.0000000001475762,1.7179999998309761E-5,1.0030202531835051,0.14412296617492806,8.0677332816615994,-118.47913075390471,61.520869246095288,null,1000000000,295152400,null,3.5714031782625222,-30.589700121592482,null,null,null,4.496330103399079,-87.889430632312255,null,0,0]
[17279,17.279,6.0137388784464409,1.4037343997896596,1.0000848615608331,1.3027322060226394E-2,1,0,1555.3551536292077,1.5701533867779096,2.0706227207166581,1.0667797929314355,1.0003991418785718,2.824921810984991E-2,1.0000000001492819,1.7278999998280369E-5,1.0000000001492819,1.7278999998280369E-5,1.0030554261400479,0.14495420717986263,8.0071844073330496,-118.44665380491405,61.55334619508595,null,1000000000,298563841,null,3.5596715992081163,-30.459743417974366,null,null,null,4.4475128081249329,-87.986910386939712,null,0,0]
[17378,17.378,6.0472444891208408,1.4046686650735714,1.0000858367330712,1.3101953561731368E-2,1,0,1564.2665545632628,1.5701570495149502,2.0797253602499768,1.0691921495269003,1.000403727821088,2.8410985119812805E-2,1.0000000001509974,1.7377999998250642E-5,1.0000000001509974,1.7377999998250642E-5,1.0030908072688924,0.14578546028626579,7.9470639764126725,-118.41479506198542,61.585204938014584,null,1000000000,301994884,null,3.5481082872520275,-30.331003992682902,null,null,null,4.3989556891606441,-88.083791069302521,null,0,0]
[17479.25,17.47925,6.0815169897554622,1.4056135146929289,1.0000868398299789,1.317828108274478E-2,1,0,1573.3804873581862,1.5701607525804198,2.0890472861879328,1.0716375729031959,1.0004084450676809,2.8576427114238492E-2,1.0000000001527622,1.747924999821989E-5,1.0000000001527622,1.747924999821989E-5,1.0031272079452105,0.14663561808363176,7.8860142554758355,-118.38284702581669,61.617152974183313,null,1000000000,305524180.5625,null,3.5364529853761439,-30.200582852156018,null,null,null,4.3495612700996933,-88.182264173660698,null,0,0]
[17580.5,17.580500000000001,6.1157948587556925,1.4065477737331216,1.0000878487532714,1.3254608450199171E-2,1,0,1582.4944201744363,1.5701644129923555,2.098381593788726,1.0740612545336252,1.0004131896962485,2.8741867543919202E-2,1.0000000001545368,1.7580499998188775E-5,1.0000000001545368,1.7580499998188775E-5,1.0031638265837222,0.14748578865579598,7.8254004553724616,-118.35153611165616,61.648463888343841,null,1000000000,309073980.25,null,3.5249671937592963,-30.071404888385771,null,null,null,4.3004332616131657,-88.28013122327043,null,0,0]
[17681.75,17.681750000000001,6.1500780063587026,1.4074716176586075,1.0000888635029312,1.3330935663205654E-2,1,0,1591.6083530116468,1.5701680314834903,2.1077281185516648,1.0764634549885073,1.0004179617064006,2.8907306399820875E-2,1.0000000001563221,1.7681749998157301E-5,1.0000000001563221,1.7681749998157301E-5,1.0032006632965902,0.14833597206153662,7.7652165734269349,-118.32085748818076,61.679142511819236,null,1000000000,312644283.0625,null,3.5136477394236088,-29.943455213257483,null,null,null,4.2515688340033257,-88.377402274923313,null,0,0]
[17783,17.783000000000001,6.1843663447784012,1.4083852181145096,1.0000898840789398,1.3407262720875366E-2,1,0,1600.7222858694597,1.5701716087698694,2.1170866986675922,1.0788444312314731,1.0004227610977459,2.9072743672909979E-2,1.0000000001581175,1.7782999998125464E-5,1.0000000001581175,1.7782999998125464E-5,1.0032377181966046,0.14918616835937085,7.7054567211565956,-118.29080631091256,61.709193689087442,null,1000000000,316235089,null,3.5024915205804246,-29.816719144348411,null,null,null,4.2029652005761724,-88.474087166564146,null,0,0]
[17886.5,17.886500000000002,6.219421922006779,1.4093087081868245,1.0000909333563968,1.3485285773903649E-2,1,0,1610.0387505894873,1.5701752236916771,2.1266655416892806,1.081256644966208,1.000427695442482,2.9241855684476181E-2,1.0000000001599636,1.7886499998092542E-5,1.0000000001599636,1.7886499998092542E-5,1.0032758221708631,0.15005527129393681,7.6448011263136291,-118.26073079095501,61.739269209044991,null,1000000000,319926882.25,null,3.4912529456473655,-29.68840600235518,null,null,null,4.1535481806662631,-88.572324788599829,null,0,0]
[17990,17.989999999999998,6.2544827439084862,1.4102218453939621,1.000091988721991,1.356330866273636E-2,1,0,1619.3552153303121,1.5701787970187917,2.136256648283906,1.0836472123766199,1.0004326583980394,2.9410966023013855E-2,1.0000000001618199,1.7989999998059236E-5,1.0000000001618199,1.7989999998059236E-5,1.0033141543775597,0.15092438782275686,7.5845765270492151,-118.23130064778589,61.768699352214114,null,1000000000,323640100,null,3.480178607089873,-29.561330624329791,null,null,null,4.104397919959343,-88.669970023456102,null,0,0]
[18093.5,18.093499999999999,6.2895487227749003,1.4111248013605491,1.0000930501757035,1.3641331386424078E-2,1,0,1628.6716800915774,1.5701823294650137,2.1458598540121683,1.0860163965715071,1.0004376499639924,2.9580074678875433E-2,1.0000000001636873,1.8093499998025548E-5,1.0000000001636873,1.8093499998025548E-5,1.0033527149392016,0.15179351800748173,7.5247769863529266,-118.20251068367995,61.797489316320053,null,1000000000,327374742.25,null,3.4692654105485374,-29.435477975593525,null,null,null,4.0555115758043909,-88.767032708086418,null,0,0]
[18197,18.196999999999999,6.324619772829787,1.4120177439717181,1.0000941177175151,1.3719353944017401E-2,1,0,1637.9881448729343,1.5701858217279037,2.1554749971596445,1.0883644569340496,1.0004426701399129,2.9749181642413927E-2,1.0000000001655653,1.819699999799147E-5,1.0000000001655653,1.819699999799147E-5,1.0033915039789787,0.15266266190947109,7.4653966805703629,-118.17435569916985,61.825644300830149,null,1000000000,331130809,null,3.4585103316109467,-29.310833233999457,null,null,null,4.006886348959414,-88.863522465170405,null,0,0]
[18303,18.303000000000001,6.3605431184549754,1.4129220477588698,1.0000952173557986,1.3799260931298383E-2,1,0,1647.5296450559531,1.5701893574062711,2.1653345973979823,1.0907476055404022,1.0004478412305777,2.9922371551004572E-2,1.0000000001674998,1.8302999997956168E-5,1.0000000001674998,1.8302999997956168E-5,1.0034314669044988,0.15355281390759146,7.4050106461483747,-118.14617338223212,61.853826617767879,null,1000000000,334999809,null,3.4476562722700521,-29.184414507167638,null,null,null,3.9573543738783226,-88.961758875064533,null,0,{"$f":"IF(AJ282>0,W282,0)","v":0}]
[18409,18.408999999999999,6.3964716070856831,1.4138161934608713,1.0000963233798026,1.3879167742348514E-2,1,0,1657.0711452593303,1.5701928523674058,2.1752063839063016,1.0931091364671692,1.0004530423291091,3.009555966405016E-2,1.0000000001694458,1.8408999997920449E-5,1.0000000001694458,1.8408999997920449E-5,1.0034716697427899,0.1544429804229801,7.345052332749896,-118.11864605776327,61.881353942236728,null,1000000000,338891281,null,3.4369618571500253,-29.059231946336197,null,null,null,3.9080904755998738,-89.059414111427103,null,0,0]
[18515,18.515000000000001,6.4324051525424419,1.41470034987516,1.0000974357895058,1.3959074376147951E-2,1,0,1666.6126454827163,1.5701963073106364,2.1850901915194516,1.0954493165443331,1.0004582734350389,3.0268745971189521E-2,1.0000000001714024,1.8514999997884323E-5,1.0000000001714024,1.8514999997884323E-5,1.0035121126284112,0.15533316152059093,7.2855158368877966,-118.09176815216711,61.908231847832894,null,1000000000,342805225,null,3.4264240536906891,-28.935270302748215,null,null,null,3.8590917831971057,-89.156497849418869,null,0,0]
[18621,18.620999999999999,6.4683436705488004,1.415574682111044,1.0000985545848873,1.4038980831676871E-2,1,0,1676.1541457257699,1.5701997229193685,2.1949858578478434,1.0977684087342801,1.0004635345478967,3.0441930462062141E-2,1.0000000001733709,1.8620999997847774E-5,1.0000000001733709,1.8620999997847774E-5,1.0035527956966712,0.15622335726505041,7.2263953683747797,-118.06553410119908,61.934465898800923,null,1000000000,346741641,null,3.4160398985107774,-28.81251454833145,null,null,null,3.8103554698640032,-89.253019552867656,null,0,0]
[18729.5,18.729500000000002,6.5051348589359339,1.4164596294990774,1.0000997063802923,1.4120771687729777E-2,1,0,1685.9206813719341,1.5702031790450133,2.2051270274325225,1.1001206271876329,1.0004689508199502,3.0619197600973633E-2,1.000000000175397,1.8729499997809933E-5,1.000000000175397,1.8729499997809933E-5,1.0035946871597463,0.1571345634283626,7.1663054825324632,-118.039342338643,61.960657661357004,null,1000000000,350794170.25,null,3.4055669382346139,-28.68809703878043,null,null,null,3.760738544297848,-89.351245299862583,null,0,0]
[18838,18.838000000000001,6.5419310843986587,1.417334622485948,1.000100864866093,1.4202562354841863E-2,1,0,1695.6872170380043,1.5702065953586293,2.2152802860887029,1.1024512966678179,1.0004743985300373,3.0796462814971243E-2,1.000000000177435,1.8837999997771654E-5,1.000000000177435,1.8837999997771654E-5,1.0036368305577112,0.15804578507351999,7.106639555352448,-118.01381340264736,61.986186597352642,null,1000000000,354870244,null,3.3952488906350813,-28.564911803094123,null,null,null,3.7113906647173653,-89.448901599553224,null,0,0]
[18946.5,18.9465,6.5787322624167244,1.4181998267741016,1.0001020300422661,1.4284352831919473E-2,1,0,1705.4537527236387,1.5702099725441849,2.2254454683527047,1.1047606869679978,1.0004798776776447,3.0973726092946123E-2,1.0000000001794849,1.8946499997732925E-5,1.0000000001794849,1.8946499997732925E-5,1.0036792260381129,0.15895702226875277,7.0473917286827215,-117.98894137177727,62.011058628222727,null,1000000000,358969862.25,null,3.385082791117747,-28.442943421814952,null,null,null,3.6623089375649758,-89.545997949962327,null,0,0]
[19055,19.055,6.6155383103393186,1.4190554044377597,1.0001032019087883,1.4366143117868973E-2,1,0,1715.2202884285027,1.57021331127007,2.2356224115776855,1.1070490638853161,1.0004853882622557,3.1150987423790143E-2,1.0000000001815466,1.9054999997693753E-5,1.0000000001815466,1.9054999997693753E-5,1.0037218737493194,0.15986827508192403,6.9885562572812008,-117.9647203447575,62.035279655242505,null,1000000000,363093025,null,3.3750657432837343,-28.322176703547854,null,null,null,3.6134905139974673,-89.642543641209642,null,0,0]
[19165.75,19.165749999999999,6.6531125558241699,1.4199189609766438,1.0001044049765631,1.4449629317488971E-2,1,0,1725.1893559992741,1.5702166802462318,2.2460223607121286,1.109363495990449,1.0004910455427656,3.1331922661198379E-2,1.0000000001836629,1.9165749997653307E-5,1.0000000001836629,1.9165749997653307E-5,1.0037656661459238,0.1607984410200286,6.9289201149926773,-117.94066232741125,62.059337672588754,null,1000000000,367325973.0625,null,3.3649917503014706,-28.200129365538199,null,null,null,3.563928364691209,-89.740532961873029,null,0,0]
[19276.5,19.276499999999999,6.6906917070060921,1.4207728175882539,1.0001056150149945,1.4533115315669179E-2,1,0,1735.1584235894013,1.5702200105105955,2.2564342299409628,1.1116565813065797,1.0004967355765404,3.1512855846496955E-2,1.0000000001857918,1.9276499997612391E-5,1.0000000001857918,1.9276499997612391E-5,1.0038097216579733,0.16172862337223848,6.8697018594721584,-117.91727024248731,62.082729757512695,null,1000000000,371583452.25,null,3.3550671662563278,-28.07930277284466,null,null,null,3.5146346932158314,-89.837967469642649,null,0,0]
[19387.25,19.387250000000002,6.7282756816863447,1.421617135567629,1.0001068320240569,1.4616601111246548E-2,1,0,1745.1274911985529,1.5702233027265866,2.2668578550141985,1.1139285900260794,1.0005024583630209,3.1693786967874608E-2,1.0000000001879328,1.9387249997571001E-5,1.0000000001879328,1.9387249997571001E-5,1.0038540404459013,0.16265882220952968,6.8108957273375106,-117.89453789209622,62.105462107903776,null,1000000000,375865462.5625,null,3.3452891190698546,-27.959681481919453,null,null,null,3.4656066082676551,-89.934856410176749,null,0,0]
[19498,19.498000000000001,6.7658643994821883,1.4224520726805101,1.0001080560037248,1.470008670305805E-2,1,0,1755.0965588264041,1.5702265575425571,2.2772930745053008,1.1161797882676971,1.0005082139016455,3.1874716013520932E-2,1.0000000001900859,1.9497999997529132E-5,1.0000000001900859,1.9497999997529132E-5,1.0038986226710291,0.1635890376024709,6.7524960664215712,-117.87245910864894,62.12754089135106,null,1000000000,380172004,null,3.3356548030879378,-27.841250281752547,null,null,null,3.416841263333636,-90.031208826896361,null,0,0]
[19611.75,19.611750000000001,6.804476176835383,1.4233000232139177,1.0001093203949647,1.4785833542254143E-2,1,0,1765.3356689373493,1.5702298622572586,2.2880228667395479,1.1184705786548694,1.0005141594408611,3.2060543898451484E-2,1.0000000001923104,1.9611749997485638E-5,1.0000000001923104,1.9611749997485638E-5,1.0039446869493169,0.16454446801167913,6.6929317872318101,-117.8504561723157,62.149543827684298,null,1000000000,384620738.0625,null,3.325906257736349,-27.720834160545696,null,null,null,3.3670255294954616,-90.129622011770053,null,0,0]
[19725.5,19.7255,6.8430927915297781,1.4241384041165084,1.0001105921395099,1.4871580164008656E-2,1,0,1775.5747790673518,1.5702331288577247,2.2987645537542849,1.1207399720081355,1.0005201395294236,3.2246369568419919E-2,1.0000000001945477,1.9725499997441631E-5,1.0000000001945477,1.9725499997441631E-5,1.0039910294779442,0.16549991603517894,6.6337845608953465,-117.82912960725241,62.170870392747588,null,1000000000,389095350.25,null,3.316303543862174,-27.601641688382948,null,null,null,3.3174810170331721,-90.227487918869471,null,0,0]
[19839.25,19.83925,6.8817141621314155,1.4249673753189549,1.0001118712373329,1.4957326567061517E-2,1,0,1785.8138892160835,1.5702363579995482,2.3095179695798085,1.122988243669891,1.0005261541667128,3.2432193010632514E-2,1.0000000001967979,1.983924999739712E-5,1.0000000001967979,1.983924999739712E-5,1.0040376504346238,0.1664553817480737,6.5750486123121821,-117.8084728420593,62.191527157940698,null,1000000000,393595840.5625,null,3.3068438288038688,-27.483657126136805,null,null,null,3.2682047835083128,-90.324815715922512,null,0,0]
[19953,19.952999999999999,6.9203402090143005,1.4257870932336947,1.0001131576884048,1.5043072750152679E-2,1,0,1796.0529993832242,1.5702395503233726,2.3202829511436245,1.1252156647352065,1.0005322033521058,3.2618014212296445E-2,1.0000000001990612,1.9952999997352091E-5,1.0000000001990612,1.9952999997352091E-5,1.0040845499980549,0.1674108652250034,6.5167182786039382,-117.78847934622752,62.211520653772482,null,1000000000,398122209,null,3.2975243461560151,-27.366864977177062,null,null,null,3.2191939324479235,-90.421614369050459,null,0,0]
[20069,20.068999999999999,6.9597350228234571,1.4266136542835106,1.0001144771585939,1.5130514783753416E-2,1,0,1806.494641418459,1.5702427685234555,2.3312726114756268,1.1274659480400446,1.000538407770982,3.2807508677443545E-2,1.0000000002013825,2.0068999997305639E-5,1.0000000002013825,2.0068999997305639E-5,1.0041326643590425,0.16838526674656892,6.4576461306338881,-117.76876672745176,62.231233272548238,null,1000000000,402764761,null,3.288162142013606,-27.248974863477478,null,null,null,3.1694839886202848,-90.519791863974262,null,0,0]
[20185,20.184999999999999,6.9991345380174463,1.4274309101345868,1.000115804275747,1.5217956585957967E-2,1,0,1816.9362834721885,1.5702459497345769,2.3422739660372249,1.1296951039717638,1.0005446481168974,3.2997000785660272E-2,1.000000000203717,2.0184999997258646E-5,1.000000000203717,2.0184999997258646E-5,1.0041810688360735,0.1693596868971709,6.3989842526057181,-117.74973029564224,62.250269704357763,null,1000000000,407434225,null,3.278940164810817,-27.13229300473628,null,null,null,3.1200440877948998,-90.617437290905968,null,0,0]
[20301,20.300999999999998,7.0385386756456692,1.4282390159669698,1.000117139039834,1.530539815543009E-2,1,0,1827.3779255440952,1.5702490945908014,2.3532868508207518,1.1319034068347851,1.0005509243891797,3.3186490523382559E-2,1.0000000002060654,2.0300999997211114E-5,1.0000000002060654,2.0300999997211114E-5,1.0042297636218251,0.17033412575446222,6.3407269821929182,-117.73136326555286,62.268636734447142,null,1000000000,412130601,null,3.2698556821992346,-27.016803720019862,null,null,null,3.0708712999936827,-90.714559545533007,null,0,0]
[20417,20.417000000000002,7.0779473585064929,1.429038123553066,1.0001184814508246,1.5392839490833551E-2,1,0,1837.8195676338696,1.5702522037117843,2.3643111047040102,1.1340911266390385,1.0005572365871531,3.3375977877047387E-2,1.0000000002084271,2.0416999997163034E-5,1.0000000002084271,2.0416999997163034E-5,1.004278748910038,0.171308583395584,6.2828687670528547,-117.71365890189551,62.286341098104486,null,1000000000,416853889,null,3.2609060259964999,-26.902491573625372,null,null,null,3.0219627410563534,-90.811167328270159,null,0,0]
[20536,20.536000000000001,7.1183798753978165,1.4298487029630536,1.0001198665254158,1.5482541995456012E-2,1,0,1848.5312522097324,1.5702553567422781,2.3756321166572185,1.1363143155212665,1.0005637493622874,3.3570363274166896E-2,1.0000000002108638,2.0535999997113137E-5,1.0000000002108638,2.0535999997113137E-5,1.0043293031324347,0.17230826212652731,6.2239231819359295,-117.69617825645525,62.303821743544745,null,1000000000,421727296,null,3.2518622843504468,-26.786430351807191,null,null,null,2.9720608975854845,-90.909747904648071,null,0,0]
[20655,20.655000000000001,7.1588170165090483,1.4306501256515278,1.0001212596474887,1.5572244250897489E-2,1,0,1859.2429368037613,1.570258473441567,2.3869647589235088,1.1385164050412975,1.000570299943913,3.3764746133407929E-2,1.0000000002133145,2.065499999706266E-5,1.0000000002133145,2.065499999706266E-5,1.0043801634940694,0.17330796078824176,6.1653860659247144,-117.6793808031141,62.3206191968859,null,1000000000,426629025,null,3.2429549442352075,-26.671575807358884,null,null,null,2.9224311216895043,-91.007804995755194,null,0,0]
[20774,20.774000000000001,7.1992587039195701,1.4314425448933275,1.0001226608170097,1.5661946255715448E-2,1,0,1869.954621415643,1.5702615544340002,2.3983088666339931,1.1406976730926084,1.0005768883312873,3.395912644013109E-2,1.0000000002157794,2.0773999997011598E-5,1.0000000002157794,2.0773999997011598E-5,1.0044313302075898,0.17430767946231232,6.1072517680981271,-117.66325944144089,62.336740558559114,null,1000000000,431559076,null,3.2341813242125728,-26.557912053090877,null,null,null,2.8730704438855552,-91.105347388349998,null,0,0]
[20893,20.893000000000001,7.2397048614411874,1.432226110583888,1.0001240700339444,1.575164800846738E-2,1,0,1880.6663060450733,1.5702646003297029,2.4096642778591884,1.1428583931309402,1.0005835145236637,3.4153504179698126E-2,1.0000000002182587,2.0892999996959949E-5,1.0000000002182587,2.0892999996959949E-5,1.0044828034868163,0.17530741822974474,6.0495147478644897,-117.64780713079445,62.352192869205552,null,1000000000,436517449,null,3.225538806426107,-26.445423455262208,null,null,null,2.8239759414383809,-91.202383675532246,null,0,0]
[21014.75,21.014749999999999,7.2810902476397139,1.4330187739499272,1.0001255201452988,1.5843422438508462E-2,1,0,1891.625529622866,1.5702676809128666,2.4212936365480857,1.1450480606165467,1.0005903329671151,3.4352371169723971E-2,1.0000000002208098,2.1014749996906491E-5,1.0000000002208098,2.1014749996906491E-5,1.0045357837731375,0.17633028108309892,5.9908489581916218,-117.63268287141688,62.367317128583124,null,1000000000,441619717.5625,null,3.2168295830210218,-26.3315354934266,null,null,null,2.7740193751705968,-91.301147377990247,null,0,0]
[21136.5,21.136500000000002,7.3224801569441622,1.4338024768331159,1.0001269786802318,1.5935196601644077E-2,1,0,1902.5847532184034,1.5702707260066262,2.4329344934612811,1.1472167846222134,1.0005971909814524,3.4551235441577052E-2,1.0000000002233758,2.1136499996852412E-5,1.0000000002233758,2.1136499996852412E-5,1.0045890854144501,0.17735316513890653,5.93258762863206,-117.61824422816916,62.381755771830839,null,1000000000,446751632.25,null,3.2082522437016707,-26.218845315466965,null,null,null,2.7243353849303906,-91.399398912702182,null,0,0]
[21258.25,21.25825,7.3638745130858743,1.4345773693705475,1.0001284456387067,1.6026970496329465E-2,1,0,1913.5439768313809,1.5702737362207448,2.4445866843388862,1.1493648440835207,1.0006040885658622,3.4750096979584449E-2,1.0000000002259566,2.1258249996797703E-5,1.0000000002259566,2.1258249996797703E-5,1.0046427086435525,0.17837607048201792,5.8747251667125653,-117.60448386043058,62.395516139569423,null,1000000000,451913193.0625,null,3.1998041802858914,-26.107336973590641,null,null,null,2.6749209864266721,-91.497146886839914,null,0,0]
[21380,21.38,7.4052732414934104,1.4353435983848513,1.0001299210206864,1.6118744121019889E-2,1,0,1924.5032004614998,1.5702767121510965,2.4562500478795144,1.1514925134085532,1.0006110257195262,3.4948955768074552E-2,1.0000000002285523,2.1379999996742367E-5,1.0000000002285523,2.1379999996742367E-5,1.0046966536945241,0.17939899719663513,5.8172560893835303,-117.59139449624899,62.408605503751005,null,1000000000,457104400,null,3.1914828468561556,-25.996994778615672,null,null,null,2.6257732425273774,-91.594399717633351,null,0,0]
[21504.5,21.5045,7.4476114996645038,1.436118324758838,1.0001314384385267,1.6212590380436754E-2,1,0,1935.7099630411399,1.5702797204522247,2.4681882439735046,1.1536474360523781,1.0006181604836786,3.5152303373810007E-2,1.0000000002312217,2.1504499996685127E-5,1.0000000002312217,2.1504499996685127E-5,1.0047521502696872,0.18044505122020893,5.7588901546221303,-117.57869588373428,62.421304116265716,null,1000000000,462443520.25,null,3.1831020240456098,-25.885350128488216,null,null,null,2.5757881305765205,-91.693345755246057,null,0,0]
[21629,21.629000000000001,7.4899541773619633,1.4368842921249936,1.000132964664618,1.6306436354256992E-2,1,0,1946.9167256380963,1.5702826941208325,2.480137791201241,1.155781603269747,1.0006253366230495,3.5355648071276113E-2,1.0000000002339067,2.1628999996627219E-5,1.0000000002339067,2.1628999996627219E-5,1.0048079838682367,0.18149112776763704,5.7009243182393092,-117.56668377133245,62.43331622866755,null,1000000000,467813641,null,3.1748485281627028,-25.774892525769879,null,null,null,2.5260757900766047,-91.791791245562564,null,0,0]
[21753.5,21.753499999999999,7.5323012000529568,1.4376416473077676,1.0001344996989201,1.6400282040828905E-2,1,0,1958.1234882520714,1.5702856337515481,2.4920985262775623,1.1578952943235634,1.0006325541367493,3.5558989843719371E-2,1.0000000002366074,2.1753499996568643E-5,1.0000000002366074,2.1753499996568643E-5,1.0048641547446264,0.18253722692683169,5.6433530548871156,-117.5553506091205,62.444649390879505,null,1000000000,473214762.25,null,3.166719827768282,-25.665606002984671,null,null,null,2.476633227118838,-91.889744606135835,null,0,0]
[21878,21.878,7.5746524948638285,1.4383905338879444,1.0001360435413928,1.6494127438500813E-2,1,0,1969.3302508827751,1.570288539925464,2.5040702888856159,1.1599887838755556,1.0006398130238823,3.5762328674387778E-2,1.0000000002393234,2.1877999996509387E-5,1.0000000002393234,2.1877999996509387E-5,1.0049206631547072,0.18358334878498125,5.5861709474737689,-117.54468892413813,62.455311075861871,null,1000000000,478646884,null,3.1587134522224263,-25.55747485550912,null,null,null,2.4274574952513412,-91.987214068628973,null,0,0]
[22005.25,22.00525,7.6179436005784833,1.439147357048111,1.0001376305869172,1.6590045426220938E-2,1,0,1980.7845524640798,1.5702914763096507,2.5163177197619024,1.16210792059915,1.0006472750012751,3.5970155867612687E-2,1.0000000002421157,2.2005249996448127E-5,1.0000000002421157,2.2005249996448127E-5,1.0049787688096947,0.18465260129901351,5.5281223974494589,-117.53447793045309,62.465522069546907,null,1000000000,484231027.5625,null,3.1506541266009567,-25.448133128496742,null,null,null,2.3774682708485004,-92.086344801956329,null,0,0]
[22132.5,22.1325,7.661239020394885,1.4398956266701353,1.0001392268339389,1.6685963108648557E-2,1,0,1992.2388540622669,1.5702943789285788,2.5285763412717488,1.1642065193815616,1.0006547801981218,3.6177979952287151E-2,1.0000000002449236,2.2132499996386149E-5,1.0000000002449236,2.2132499996386149E-5,1.0050372276190995,0.18572187770768761,5.4704692763518823,-117.52495286632269,62.475047133677307,null,1000000000,489847556.25,null,3.1427175575027189,-25.3399660261204,null,null,null,2.3277517188491625,-92.184986840202328,null,0,0]
[22259.75,22.25975,7.7045386815841441,1.4406354861221153,1.0001408322824137,1.6781880484020205E-2,1,0,2003.6931556770476,1.5702972483613151,2.5408459914434283,1.1662848591338175,1.0006623286134497,3.6385800910529127E-2,1.0000000002477483,2.2259749996323457E-5,1.0000000002477483,2.2259749996323457E-5,1.0050960398606195,0.18679117810172857,5.4132061336006707,-117.51610600316197,62.483893996838034,null,1000000000,495496470.0625,null,3.1349012929647668,-25.232957600108886,null,null,null,2.2783048406359021,-92.283148403053104,null,0,0]
[22387,22.387,7.747842513036141,1.4413670756042305,1.0001424469322977,1.6877797550572459E-2,1,0,2015.147457308138,1.5703000851737607,2.5531265112744581,1.1683432141080274,1.000669920246281,3.6593618724458175E-2,1.0000000002505889,2.2386999996260046E-5,1.0000000002505889,2.2386999996260046E-5,1.0051552058134705,0.18786050257105449,5.3563276254691852,-117.50792969701327,62.492070302986733,null,1000000000,501177769,null,3.127202940231431,-25.127092168373075,null,null,null,2.2291246852377542,-92.380837528640171,null,0,0]
[22517.5,22.517499999999998,7.7922565948143179,1.4421089041987123,1.0001441123776569,1.6976164042788133E-2,1,0,2026.8943049700329,1.5703029611378339,2.5657318050956666,1.1704336655678067,1.0006777506577516,3.6806740977989048E-2,1.000000000253519,2.2517499996194256E-5,1.000000000253519,2.2517499996194256E-5,1.0052162505526254,0.18895716298024737,5.2983904325718818,-117.50023311308429,62.499766886915708,null,1000000000,507037806.25,null,3.1194279912533975,-25.019693908701814,null,null,null,2.1789624413184843,-92.480539204382481,null,0,0]
[22648,22.648,7.8366749161393061,1.4428423238149823,1.000145787500345,1.7074530206451746E-2,1,0,2038.6411526484994,1.5703058039587403,2.5783482014730104,1.1725036679684779,1.0006856265203887,3.7019859886456806E-2,1.000000000256466,2.2647999996127708E-5,1.000000000256466,2.2647999996127708E-5,1.0052776679013256,0.19005384889914129,5.2408467220985786,-117.49322576477699,62.506774235223006,null,1000000000,512931904,null,3.1117721405556025,-24.913465203190896,null,null,null,2.1290745815429761,-92.579760561586099,null,0,0]
[22778.5,22.778500000000001,7.8810974053281102,1.4435674758510804,1.0001474723003134,1.7172896039661382E-2,1,0,2050.3880003432523,1.57030861420612,2.5909755382194182,1.1745535024204576,1.0006935478331191,3.7232975430581065E-2,1.00000000025943,2.2778499996060381E-5,1.00000000025943,2.2778499996060381E-5,1.0053394581657,0.19115056042204928,5.183691063316882,-117.48689968420778,62.513100315792215,null,1000000000,518860062.25,null,3.1042329905647148,-24.808389976933146,null,null,null,2.0794580727521659,-92.678509707274628,null,0,0]
[22909,22.908999999999999,7.9255239922982161,1.4442844985698426,1.0001491667775133,1.7271261540515184E-2,1,0,2062.1348480540141,1.5703113924366332,2.6036136561549137,1.1765834452610937,1.0007015145948639,3.7446087591083303E-2,1.000000000262411,2.2908999995992281E-5,1.000000000262411,2.2908999995992281E-5,1.0054016216535506,0.19224729764237297,5.1269181323450477,-117.48124699654005,62.518753003459949,null,1000000000,524822281,null,3.0968082020940155,-24.704452427754514,null,null,null,2.0301099302510268,-92.776794568785533,null,0,0]
[23042.25,23.042249999999999,7.9708909287368694,1.4450083833605434,1.0001509069473058,1.7371699532682593E-2,1,0,2074.1292347174449,1.5703141967414731,2.6165290566221691,1.1786359221360478,1.0007096961331452,3.7663687109511283E-2,1.0000000002654725,2.3042249995921944E-5,1.0000000002654725,2.3042249995921944E-5,1.0054654805251722,0.19336717279492199,5.0693383243163446,-117.47616193304832,62.523838066951683,null,1000000000,530945285.0625,null,3.0893425830014039,-24.599482374133238,null,null,null,1.9799957413149398,-92.876679558915072,null,0,0]
[23175.5,23.1755,8.0162619947180715,1.4457240743233462,1.0001526572063755,1.7472137174331839E-2,1,0,2086.1236213969987,1.570316968799023,2.6294553713317694,1.1806682276870191,1.0007179250538045,3.7881283059593047E-2,1.0000000002685518,2.3175499995850781E-5,1.0000000002685518,2.3175499995850781E-5,1.005529729169641,0.19448707493321729,5.0121466553144813,-117.47176264369919,62.528237356300806,null,1000000000,537103800.25,null,3.0819914460581961,-24.495666000158586,null,null,null,1.9301552092562855,-92.976096643540572,null,0,0]
[23308.75,23.30875,8.0616371205183643,1.4464317090763124,1.0001544175546695,1.7572574463438399E-2,1,0,2098.1180080924005,1.5703197091623309,2.6423924401096333,1.1826806412763202,1.0007262013556733,3.8098875420811418E-2,1.0000000002716489,2.3308749995778801E-5,1.0000000002716489,2.3308749995778801E-5,1.0055943679200214,0.19560700415371796,4.9553377855916896,-117.46804104329971,62.531958956700294,null,1000000000,543297826.5625,null,3.0747524789376133,-24.392987330060816,null,null,null,1.8805853066540756,-93.075053713238844,null,0,0]
[23442,23.442,8.1070162379690913,1.4471314221889169,1.0001561879921348,1.7673011397977789E-2,1,0,2110.1123948033787,1.5703224183718694,2.6553401057712445,1.1846734374687682,1.0007345250375757,3.8316464172651242E-2,1.0000000002747638,2.3441999995705994E-5,1.0000000002747638,2.3441999995705994E-5,1.0056593971111893,0.19672696055187155,4.8989064803570868,-117.46498914608372,62.535010853916276,null,1000000000,549527364,null,3.067623425846544,-24.291430662226123,null,null,null,1.8312830545105452,-93.17355848385759,null,0,0]
[23578.5,23.578499999999998,8.1535062323684624,1.4478401252115696,1.0001580120722338,1.7775897644086623E-2,1,0,2122.3993275475732,1.570325161908996,2.6686143946500542,1.1866947795646334,1.0007431008624161,3.8539356203273721E-2,1.0000000002779728,2.3578499995630548E-5,1.0000000002779728,2.3578499995630548E-5,1.0057264175734844,0.19787426123848034,4.8414849275699829,-117.46254897240784,62.537451027592155,null,1000000000,555945662.25,null,3.06043216112226,-24.188544256920974,null,null,null,1.7810527664477205,-93.274004715486896,null,0,0]
[23715,23.715,8.2000002755111367,1.4485407918833568,1.0001598467395465,1.7878783513820835E-2,1,0,2134.6862603075597,1.5703278738633495,2.6818994790559341,1.188696103888873,1.0007517264041785,3.8762244402728595E-2,1.0000000002812006,2.3714999995554218E-5,1.0000000002812006,2.3714999995554218E-5,1.005793848471938,0.19902159064413555,4.784448787534668,-117.46079492154969,62.539205078450308,null,1000000000,562401225,null,3.0533516203344169,-24.086802756375906,null,null,null,1.7310971672002515,-93.373992165173789,null,0,0]
[23851.5,23.851500000000001,8.2464982989162454,1.4492335574497426,1.0001616919940146,1.7981669005004301E-2,1,0,2146.9731930830658,1.5703305547771653,2.6951951993498158,1.1906776905403118,1.0007604016615768,3.8985128748969422E-2,1.0000000002844471,2.3851499995477007E-5,1.0000000002844471,2.3851499995477007E-5,1.0058616901724338,0.20016894886810371,4.7277927586780741,-117.45971872963975,62.540281270360254,null,1000000000,568894052.25,null,3.0463795527132174,-23.986190141915021,null,null,null,1.6814132059648588,-93.473528587724743,null,0,0]
[23988,23.988,8.293000235632995,1.4499185541534307,1.0001635478355793,1.8084554115460949E-2,1,0,2159.2601258738273,1.5703332051803378,2.7085013989006703,1.1926398147402,1.0007691266333185,3.9208009219952052E-2,1.0000000002877121,2.3987999995398908E-5,1.0000000002877121,2.3987999995398908E-5,1.0059299430428417,0.20131633600851401,4.6715116438381541,-117.45931223945557,62.540687760544429,null,1000000000,575424144,null,3.0395137629017581,-23.886690673619924,null,null,null,1.6319978809363958,-93.572621565835632,null,0,0]
[24127.75,24.127749999999999,8.3406133471523631,1.4506119468015857,1.0001654588319946,1.8189888474700291E-2,1,0,2171.839604698951,1.5703358876201203,2.7221351087443901,1.1946287754978875,1.0007781108450717,3.9436192331039996E-2,1.0000000002910743,2.4127749995318022E-5,1.0000000002910743,2.4127749995318022E-5,1.0060002473389107,0.20249107194899871,4.614273592459524,-117.45958147361738,62.540418526382624,null,1000000000,582148320.0625,null,3.0325923695659003,-23.785959238287127,null,null,null,1.5816812228936259,-93.673622235330299,null,0,0]
[24267.5,24.267499999999998,8.3882304232579337,1.4512974674768631,1.0001673809255305,1.8295222430251133E-2,1,0,2184.4190835395216,1.570338539165012,2.7357794799033628,1.1965979045755968,1.000787147163934,3.9664371333381319E-2,1.0000000002944558,2.4267499995236196E-5,1.0000000002944558,2.4267499995236196E-5,1.0060709834042447,0.203665838403778,4.5574178198959201,-117.4605357144296,62.539464285570403,null,1000000000,588911556.25,null,3.02577788920558,-23.686362068957038,null,null,null,1.5316399306903408,-93.774173645472558,null,0,0]
[24407.25,24.407250000000001,8.4358513968140958,1.4519752488429585,1.000169314116123,1.8400555979778389E-2,1,0,2196.9985623952743,1.5703411603457027,2.749434353653736,1.198547482066149,1.0007962355884945,3.9892546203327064E-2,1.0000000002978569,2.4407249995153419E-5,1.0000000002978569,2.4407249995153419E-5,1.0061421516400781,0.20484063547441475,4.5009390721153402,-117.46216654982967,62.537833450170325,null,1000000000,595713852.5625,null,3.0190681361627658,-23.587883146544449,null,null,null,1.4818709359525759,-93.874283403285219,null,0,0]
[24547,24.547000000000001,{"$f":"SQRT(1+(A333/p_dom)^2)","v":8.4834762021872425},{"$f":"ATAN(A333/p_dom)","v":1.4526454206133719},{"$f":"SQRT(1+(A333/z_ESR)^2)","v":1.0001712584037079},{"$f":"ATAN(A333/z_ESR)","v":1.8505889120947035E-2},{"$f":"IF(VIN_nom>Vout, 1, SQRT(1+(A333/z_RHP)^2))","v":1},{"$f":"IF(VIN_nom>Vout, 0, -ATAN(A333/z_RHP))","v":0},{"$f":"SQRT(1+(A333/EA_p1)^2)","v":2209.5780412659501},{"$f":"ATAN(A333/EA_p1)","v":1.5703437516807972},{"$f":"SQRT(1+(A333/EA_z1)^2)","v":2.763099574288248},{"$f":"ATAN(A333/EA_z1)","v":1.200477783122355},{"$f":"SQRT(1+(A333/EA_hf_p)^2)","v":1.0008053761173332},{"$f":"ATAN(A333/EA_hf_p)","v":4.0120716917230841E-2},{"$f":"SQRT(1+(A333/Zero3)^2)","v":1.0000000003012777},{"$f":"ATAN(A333/Zero3)","v":2.4546999995069693E-5},{"$f":"SQRT(1+(A333/pole5)^2)","v":1.0000000003012777},{"$f":"ATAN(A333/pole5)","v":2.4546999995069693E-5},{"$f":"SQRT((1-(Z333/pterm2))^2+(A333/pterm1)^2)","v":1.0062137524498187},{"$f":"IF((ATAN((A333/pterm1)/(1-A333^2/pterm2))>0),ATAN((A333/pterm1)/(1-A333^2/pterm2)),PI()+ATAN((A333/pterm1)/(1-A333^2/pterm2)))","v":0.20601546326119624},{"$f":"20*LOG10(((E333*K333*G333*O333)/(C333*I333*S333*M333*Q333))*Adc)","v":4.4448321986760506},{"$f":"((F333+L333+H333+P333)-(D333+J333+T333+N333+R333))*radconv","v":-117.46446568099776},{"$f":"IF(V333>0,V333,V333+180)","v":62.535534319002238},null,{"$f":"IF(U333<0,A333,1000000000)","v":1000000000},{"$f":"A333^2","v":602555209},null,{"$f":"20*LOG10((K333/(I333*M333))*Aea_stability*Afb*0.8)","v":3.0124609789230226},{"$f":"(L333-(J333+N333))*radconv","v":-23.490506734313595},null,null,null,{"$f":"20*LOG10((E333*G333/(C333*S333))*Am_stability)","v":1.4323712197530283},{"$f":"(F333+H333-(D333+T333))*radconv","v":-93.973958946684164},null,{"$f":"SUM((U334<0)*(U333>0))*A333","v":0},0]
[24690,{"$f":"A334/1000","v":24.69},8.5322124607594318,1.4533234329737565,1.0001732593943129,1.8613671444899952E-2,1,0,2222.4500661720572,1.5703463729133835,2.777093142034039,1.2024333027760548,1.0008147831510803,4.0354189599998071E-2,1.000000000304798,2.4689999994983023E-5,1.000000000304798,2.4689999994983023E-5,1.0062874665984434,0.2072176445236309,4.3878001946030301,-117.46750152999073,62.532498470009273,null,1000000000,609596100,null,3.0058042009418298,-23.391990896320195,null,null,null,1.3819959936611994,-94.075510633670518,null,0,0]
[24833,24.832999999999998,8.5809525970414597,1.4539937433675161,1.0001752720039134,1.8721453336333516E-2,1,0,2235.3220910932587,1.5703489639574155,2.7910972230316506,1.2043692064806339,1.0008242447377069,4.0587657881085877E-2,1.0000000003083389,2.4832999994895347E-5,1.0000000003083389,2.4832999994895347E-5,1.0063616345361996,0.20841985815581601,4.3311469725093783,-117.47121989745506,62.528780102544943,null,1000000000,616677889,null,2.9992504975468592,-23.29459698754814,null,null,null,1.3318964749625206,-94.176622909906911,null,0,0]
[24976,24.975999999999999,8.6296965453299332,1.454656481698412,1.0001772962324393,1.8829234792746157E-2,1,0,2248.1941160292949,1.5703515253314264,2.8051116598237935,1.206285773621927,1.0008337608756661,4.0821121735167921E-2,1.0000000003119003,2.4975999994806651E-5,1.0000000003119003,2.4975999994806651E-5,1.0064362567023484,0.20962210426100875,4.2748673342616588,-117.47561225301709,62.52438774698291,null,1000000000,623800576,null,2.9927977510195687,-23.198309028626927,null,null,null,1.2820695832420916,-94.277303224390153,null,0,0]
[25119,25.119,8.6784442413925227,1.4553117749784261,1.0001793320798202,1.8937015811636364E-2,1,0,2261.0661409799131,1.5703540575421417,2.8191362979688859,1.2081832786006155,1.0008433315634018,4.1054581136920794E-2,1.0000000003154821,2.5118999994716938E-5,1.0000000003154821,2.5118999994716938E-5,1.0065113335385227,0.21082438294103867,4.2189561842471592,-117.48067018548642,62.519329814513583,null,1000000000,630964161,null,2.9864438963884918,-23.103111325137927,null,null,null,1.2325122878586674,-94.377558860348501,null,0,0]
[25265.25,25.265250000000002,8.7283036507022871,1.4559743899282678,1.0001814262143387,1.9047245943979767E-2,1,0,2274.2307119669604,1.5703566176541477,2.8334900717824287,1.2101044726200727,1.0008531761886532,4.1293341802516384E-2,1.0000000003191665,2.5265249994624119E-5,1.0000000003191665,2.5265249994624119E-5,1.0065885874167373,0.21205401993490125,4.1621502659350273,-117.48652286740239,62.513477132597615,null,1000000000,638332857.5625,null,2.9800458263062839,-23.006861678262634,null,null,null,1.1821044396287408,-94.479661189139733,null,0,0]
[25411.5,25.4115,8.7781668487139104,1.4566294773725272,1.0001835325016928,1.9157475613395071E-2,1,0,2287.3952829687423,1.5703591482978962,2.8478541985223491,1.2120062932019151,1.0008630778680725,4.1532097757536635E-2,1.0000000003228722,2.5411499994530223E-5,1.0000000003228722,2.5411499994530223E-5,1.0066663178085931,0.21328369121194196,4.1057193119927771,-117.49305430373056,62.50694569626944,null,1000000000,645744332.25,null,2.9737469877249225,-22.911720089294473,null,null,null,1.1319723242678514,-94.581334214436097,null,0,0]
[25557.75,25.557749999999999,8.8280337712284584,1.4572771643060218,1.0001856509418054,1.9267704817206504E-2,1,0,2300.5598539850048,1.5703616499792692,2.8622285223198092,1.2138890183686981,1.0008730365999663,4.1770848974901464E-2,1.0000000003265992,2.5557749994435239E-5,1.0000000003265992,2.5557749994435239E-5,1.0067445251942,0.21451339687641141,4.0496581875695155,-117.50025587477877,62.499744125221227,null,1000000000,653198585.0625,null,2.9675453330149089,-22.817670656147722,null,null,null,1.0821128545546075,-94.682585218631047,null,0,0]
[25704,25.704000000000001,8.8779043554846631,1.4579175748952113,1.0001877815345999,1.9377933552738355E-2,1,0,2313.7244250155018,1.5703641231926346,2.8766128903119026,1.2157529211294504,1.0008830523826315,4.2009595427534054E-2,1.0000000003303477,2.570399999433916E-5,1.0000000003303477,2.570399999433916E-5,1.0068232100562491,0.21574313703096615,3.99396185904298,-117.50811908530486,62.491880914695145,null,1000000000,660695616,null,2.9614388657907593,-22.724697763331072,null,null,null,1.0325229932522189,-94.78342132197379,null,0,0]
[25853.75,25.853750000000002,8.9289721539633859,1.4585658987158723,1.0001899757082704,1.9490799752897126E-2,1,0,2327.2040456236177,1.5703666266005134,2.8913517506484929,1.21764220662544,1.0008933669725371,4.2254050505070723E-2,1.0000000003342082,2.5853749994239644E-5,1.0000000003342082,2.5853749994239644E-5,1.0069042732350346,0.21700234270803712,3.9373054688199423,-117.51684731161659,62.483152688383413,null,1000000000,668416389.0625,null,2.9552828597538672,-22.63059935704484,null,null,null,0.98202260906607441,-94.886247954571786,null,0,0]
[26003.5,26.003499999999999,8.980043662814623,1.4592068484793932,1.0001921826230842,1.9603665456417205E-2,1,0,2340.683666246151,1.5703691011749461,2.9061008266699853,1.2195123216937429,1.000903741372879,4.2498500529645142E-2,1.0000000003380909,2.6003499994138965E-5,1.0000000003380909,2.6003499994138965E-5,1.0069858380498282,0.21826158475843205,3.8810211768238805,-117.52625159111929,62.473748408880709,null,1000000000,676182012.25,null,2.9492225736490973,-22.53759739380833,null,null,null,0.93179860317478269,-94.988654197310993,null,0,0]
[26153.25,26.15325,9.0311188190912457,1.4598405487657471,1.0001944022789566,1.971653066042638E-2,1,0,2354.1632868828538,1.5703715474112214,2.9208599636220498,1.2213635437586947,1.0009141755817972,4.2742945472200276E-2,1.0000000003419962,2.6153249994037124E-5,1.0000000003419962,2.6153249994037124E-5,1.0070679050272031,0.21952086328710732,3.8251038927411942,-117.5363231993673,62.463676800632697,null,1000000000,683992485.5625,null,2.9432560216564645,-22.445676005091094,null,null,null,0.88184787108473128,-95.090647194276215,null,0,0]
[26303,26.303000000000001,9.0821975612576633,1.4604671213759215,1.0001966346758031,1.9829395362052492E-2,1,0,2367.6429075334827,1.5703739657933495,2.93562900975801,1.2231961451854823,1.0009246695974212,4.2987385303682721E-2,1.000000000345924,2.6302999993934108E-5,1.000000000345924,2.6302999993934108E-5,1.0071504746965547,0.22078017839723155,3.7695486266582101,-117.54705354181026,62.452946458189743,null,1000000000,691847809,null,2.9373812679381968,-22.354819611584528,null,null,null,0.83216735872001135,-95.192233930225697,null,0,0]
[26456,26.456,9.1343884979860963,1.461100054877883,1.0001989286806559,1.9944709026177301E-2,1,0,2381.4150742223869,1.5703764083857905,2.9507286654302187,1.2250495662125243,1.000935453128764,4.3237124864361209E-2,1.0000000003499598,2.6455999993827639E-5,1.0000000003499598,2.6455999993827639E-5,1.0072353560908549,0.22206686210565044,3.7131564536382919,-117.55868829050308,62.441311709496915,null,1000000000,699919936,null,2.9314718606617287,-22.263075382116494,null,null,null,0.7816845929765639,-95.29561290838663,null,0,{"$f":"IF(AJ346>0,W346,0)","v":0}]
[26609,26.609000000000002,9.1865830524154219,1.4617257964693409,1.0002012359853336,2.0060022159814998E-2,1,0,2395.187240925336,1.5703788228887448,2.9658383541241169,1.2268841086998374,1.0009462990869513,4.3486859028407203E-2,1.0000000003540195,2.6608999993719931E-5,1.0000000003540195,2.6608999993719931E-5,1.0073207633598265,0.22335358421257262,3.657131961701352,-117.57099294558088,62.429007054419117,null,1000000000,708038881,null,2.9256543473558096,-22.172410894684976,null,null,null,0.73147761434554215,-95.398582050895925,null,0,0]
[26762,26.762,9.2387811632309642,1.4623444675566151,1.0002035565897447,2.0175334759902602E-2,1,0,2408.959407642089,1.5703812097839798,2.9809579232754952,1.2287000474629199,1.0009572074699544,4.3736587764846221E-2,1.0000000003581022,2.6761999993610975E-5,1.0000000003581022,2.6761999993610975E-5,1.0074066970771911,0.22464034482218911,3.6014701374003808,-117.58395874931882,62.416041250681175,null,1000000000,716204644,null,2.919926815647667,-22.082810429350332,null,null,null,0.68154332175271459,-95.501148319968522,null,0,0]
[26915,26.914999999999999,9.2909827704918175,1.4629561868394578,1.0002058904937963,2.0290646823377216E-2,1,0,2422.7315743724103,1.5703835695423092,2.9960872233010005,1.2304976522625852,1.0009681782757323,4.398631104270783E-2,1.0000000003622085,2.6914999993500769E-5,1.0000000003622085,2.6914999993500769E-5,1.0074931578197295,0.22592714403670297,3.5461660659860894,-117.59757707778817,62.402422922211827,null,1000000000,724417225,null,2.9142874014616265,-21.99425855515765,null,null,null,0.63187866452446095,-95.603318522630531,null,0,0]
[27071.75,27.071750000000002,9.3444673936866529,1.4635758111053065,1.000208295393874,2.0408784603212507E-2,1,0,2436.8412942226983,1.5703859594761722,3.0115972777199653,1.2323205793334617,1.0009794827081417,4.4242149295868047E-2,1.0000000003664398,2.7071749993386557E-5,1.0000000003664398,2.7071749993386557E-5,1.0075822848637719,0.22724552258819733,3.4898724782714079,-117.6121970214672,62.387802978532804,null,1000000000,732879648.0625,null,2.9085992502773905,-21.904607912904023,null,null,null,0.58127322799401426,-95.707589108563127,null,0,0]
[27228.5,27.2285,9.39795556370618,1.4641883824598756,1.0002107142533267,2.0526921813299605E-2,1,0,2450.9510140867442,1.5703883218931269,3.0271172372941675,1.2341248201395585,1.0009908526563909,4.4497981753796427E-2,1.0000000003706955,2.722849999327101E-5,1.0000000003706955,2.722849999327101E-5,1.0076719663196188,0.22856394187091589,3.4339442584410889,-117.62748396492967,62.372516035070333,null,1000000000,741391212.25,null,2.902999777222762,-21.816026006112114,null,null,null,0.53094448121832805,-95.81145795881757,null,0,0]
[27385.25,27.385249999999999,9.45144722033322,1.4647940201900114,1.0002131470720528,2.0645058450345123E-2,1,0,2465.060733964312,1.5703906572656838,3.0426469504507101,1.2359106489684102,1.0010022881182474,4.4753808383202413E-2,1.0000000003749758,2.7385249993154127E-5,1.0000000003749758,2.7385249993154127E-5,1.0077622028174689,0.22988240198820553,3.3783764275703709,-117.64342905856587,62.356570941434128,null,1000000000,749951917.5625,null,2.8974871262720079,-21.728497144429237,null,null,null,0.48088930129836049,-95.914931914136659,null,0,0]
[27542,27.542000000000002,9.5049423047022685,1.4653928409177199,1.0002155938499508,2.0763194511055755E-2,1,0,2479.1704538551717,1.5703929660555971,3.0581862686011947,1.2376783350077103,1.0010137890914659,4.5009629150800028E-2,1.0000000003792808,2.75419999930359E-5,1.0000000003792808,2.75419999930359E-5,1.0078529949908719,0.23120090304117896,3.3231641048131682,-117.66002359153734,62.339976408462661,null,1000000000,758561764,null,2.8920594885519346,-21.642005929086093,null,null,null,0.43110461626123187,-96.018017662451228,null,0,0]
[27702.5,27.702500000000001,9.5597206674060438,1.4659990429996066,1.0002181136271917,2.0884156192693272E-2,1,0,2493.6177268670044,1.5703953030068361,3.074107141064093,1.239469787056612,1.0010256330862213,4.5271563923857033E-2,1.0000000003837142,2.7702499992913439E-5,1.0000000003837142,2.7702499992913439E-5,1.0079465356661341,0.23255098970117258,3.2669942831005869,-117.67767909896006,62.322320901039944,null,1000000000,767428506.25,null,2.8865882501223079,-21.554504941930766,null,null,null,0.38040603297828168,-96.123174157029283,null,0,0]
[27863,27.863,9.6145025030938207,1.4665983372224196,1.0002206480392786,2.1005117263102408E-2,1,0,2508.0649998922991,1.5703976130348711,3.090037777579155,1.2412427731464455,1.0010375457595424,4.5533492480666071E-2,1.0000000003881733,2.7862999992789551E-5,1.0000000003881733,2.7862999992789551E-5,1.008040660277411,0.233901119486252,3.2111871305603397,-117.69599744388715,62.304002556112849,null,1000000000,776346769,null,2.8812024483800984,-21.468060077543985,null,null,null,0.32998468218023957,-96.227937366343156,null,0,0]
[28023.5,28.023499999999999,9.6692877527365031,1.4671908405697665,1.0002231970861,2.1126077718748131E-2,1,0,2522.5122729308237,1.570399896602297,3.1059780279062044,1.2429975663524804,1.0010495271089777,4.5795414785509685E-2,1.0000000003926581,2.8023499992664227E-5,1.0000000003926581,2.8023499992664227E-5,1.0081353695157045,0.23525129249760779,3.1557377111625806,-117.71496971338374,62.285030286616262,null,1000000000,785316552.25,null,2.8759002861331773,-21.382655714323569,null,null,null,0.27983742502940256,-96.332313999060204,null,0,0]
[28184,28.184000000000001,9.7240763586316366,1.467776667408079,1.0002257607675444,2.1247037556095489E-2,1,0,2536.9595459823527,1.570402154161171,3.1219277447837617,1.2447344346227294,1.001061577132061,4.6057330802675524E-2,1.000000000397169,2.818399999253746E-5,1.000000000397169,2.818399999253746E-5,1.0082306640756784,0.23660150883392569,3.1006411860937582,-117.73458713758512,62.265412862414877,null,1000000000,794337856,null,2.870680012083771,-21.298276523834076,null,null,null,0.22996117400998833,-96.436310613751033,null,0,0]
[28348,28.347999999999999,9.7800631397800419,1.4683684891310747,1.0002283954715026,2.1370634504557343E-2,1,0,2551.7218686151864,1.5704044345444534,3.1382349030789927,1.2464909365414802,1.0010739608619641,4.6324951852082408E-2,1.0000000004018046,2.8347999992406431E-5,1.0000000004018046,2.8347999992406431E-5,1.0083286420436472,0.23798121399267452,3.0447027652026684,-117.75528978992465,62.244710210075354,null,1000000000,803609104,null,2.8654287109538013,-21.213100590160657,null,null,null,0.17927405424886816,-96.54218919976401,null,0,0]
[28512,28.512,9.8360533074279122,1.4689535733551666,1.0002310454550749,2.1494230799998813E-2,1,0,2566.4841912611369,1.5704066886943746,3.1545516436454397,1.2482292729630566,1.0010864162880344,4.659256626122224E-2,1.0000000004064671,2.8511999992273874E-5,1.0000000004064671,2.8511999992273874E-5,1.008427232617749,0.23936096458681927,2.9891228829115453,-117.77664797548503,62.223352024514966,null,1000000000,812934144,null,2.8602593522222386,-21.128963579287927,null,null,null,0.12886353068930514,-96.647684396197093,null,0,0]
[28676,28.675999999999998,9.8920468040712759,1.4695320340882883,1.0002337107181398,2.1617826438648992E-2,1,0,2581.2465139199785,1.5704089170610251,3.1708778185574129,1.2499497138905751,1.0010989434075963,4.6860173992011853E-2,1.0000000004111564,2.8675999992139786E-5,1.0000000004111564,2.8675999992139786E-5,1.0085264365508961,0.24074076071345887,2.9338966755988261,-117.79865278578627,62.201347214213726,null,1000000000,822312976,null,2.8551702072195044,-21.04585004478314,null,null,null,7.8726468379319792E-2,-96.752802741003066,null,0,0]
[28840,28.84,9.9480435734974364,1.4701039827893669,1.0002363912605752,2.1741421416737069E-2,1,0,2596.0088365914926,1.5704111200842585,3.1872132828354971,1.251652524220318,1.0011115422179582,4.7127775006373808E-2,1.0000000004158727,2.883999999200415E-5,1.0000000004158727,2.883999999200415E-5,1.0086262545999656,0.24212060246690764,2.8790193752019375,-117.82129545815538,62.178704541844624,null,1000000000,831745600,null,2.8501595915514772,-20.963744832227402,null,null,null,2.8859783650460394E-2,-96.857550625927956,null,0,0]
[29008,29.007999999999999,10.005409453840066,1.4706832431479753,1.0002391530248824,2.1868030217618812E-2,1,0,2611.1312159264457,1.5704133510109355,3.2039566565304751,1.2533788572951623,1.0011245226485062,4.7401895870799446E-2,1.0000000004207319,2.9007999991863606E-5,1.0000000004207319,2.9007999991863606E-5,1.008729144797176,0.2435341463025687,2.8231604934562555,-117.84514277001188,62.154857229988124,null,1000000000,841464064,null,2.8451064759003901,-20.880667024296031,null,null,null,-2.1945982444134732E-2,-96.964475745715831,null,0,0]
[29176,29.175999999999998,10.062778653144866,1.4712558988208422,1.0002419308227231,2.1994638317312867E-2,1,0,2626.2535952742446,1.5704155562455622,3.2207094794445545,1.2550872360500009,1.0011375783038476,4.7676009606300251E-2,1.0000000004256195,2.9175999991721418E-5,1.0000000004256195,2.9175999991721418E-5,1.0088326810531041,0.24494773820921942,2.7676579139773079,-117.86964128194727,62.130358718052733,null,1000000000,851238976,null,2.8401323254821409,-20.798616042621674,null,null,null,-7.2474411504831554E-2,-97.071025239325621,null,0,0]
[29344,29.344000000000001,10.120151114968152,1.4718220617576352,1.0002447246539634,2.212124571176614E-2,1,0,2641.3759746346691,1.5704177362294143,3.2374716048881793,1.2567779293120935,1.0011507091810397,4.7950116171963007E-2,1.0000000004305352,2.9343999991577584E-5,1.0000000004305352,2.9343999991577584E-5,1.0089368641942691,0.2463613782790656,2.7125068074527121,-117.89478203399202,62.105217966007984,null,1000000000,861070336,null,2.8352354655705287,-20.717576507476,null,null,null,-0.12272865811781519,-97.177205526516047,null,0,0]
[29512,29.512,10.177526784135798,1.4723818414004279,1.0002475345184694,2.2247852396925668E-2,1,0,2656.4983540075027,1.5704198913937195,3.2542428891134771,1.2584512007759674,1.0011639152771223,4.8224215526880998E-2,1.000000000435479,2.9511999991432097E-5,1.000000000435479,2.9511999991432097E-5,1.009041695051526,0.24777506660118648,2.6577024394453437,-117.92055621583135,62.079443784168646,null,1000000000,870958144,null,2.8304142645608121,-20.637533332639258,null,null,null,-0.17271182511546887,-97.283022883192075,null,0,0]
[29684,29.684000000000001,10.236271807148361,1.4729484477728125,1.0002504278947966,2.2377472787911194E-2,1,0,2671.9807900447081,1.5704220725985079,3.271422831017293,1.260146533179477,1.0011775137275563,4.8504833543892019E-2,1.0000000004405698,2.9683999991281414E-5,1.0000000004405698,2.9683999991281414E-5,1.00914969378612,0.24922246424803726,2.6019475791626707,-117.94759125497943,62.052408745020571,null,1000000000,881139856,null,2.825554995666927,-20.55660114290507,null,null,null,-0.22360741650425728,-97.390990112074348,null,0,0]
[29856,29.856000000000002,10.295020078937393,1.4735085876734428,1.0002533380766796,2.2507092426827753E-2,1,0,2687.4632260944786,1.5704242286715189,3.2886120772324348,1.2618241476971788,1.0011911910150413,4.8785443915945949E-2,1.0000000004456904,2.985599999112898E-5,1.0000000004456904,2.985599999112898E-5,1.0092583732240261,0.25066991265110422,2.5465464163480762,-117.9752720259051,62.024727974094901,null,1000000000,891380736,null,2.8207717031040831,-20.476682235281018,null,null,null,-0.2742252867560086,-97.498589790624095,null,0,0]
[30028,30.027999999999999,10.353771544201312,1.4740623708278844,1.0002562650639719,2.2636711309326395E-2,1,0,2702.9456621565987,1.5704263600446162,3.3058104826198251,1.2634843113425029,1.0012049471363469,4.9066046599165268E-2,1.0000000004508403,3.0027999990974777E-5,1.0000000004508403,3.0027999990974777E-5,1.0093677342709477,0.25211741189569697,2.4914941637574017,-118.00358954404464,61.996410455955356,null,1000000000,901680784,null,2.8160627680215082,-20.397761333254454,null,null,null,-0.324568604264106,-97.605828210790207,null,0,0]
[30200,30.2,10.412526148883686,1.4746099045009138,1.0002592088565259,2.2766329431058305E-2,1,0,2718.4280982308587,1.5704284671398245,3.3230179049685344,1.265127285987439,1.0012187820882232,4.9346641549679701E-2,1.0000000004560199,3.0199999990818795E-5,1.0000000004560199,3.0199999990818795E-5,1.009477777837319,0.25356496206362339,2.4367861281142909,-118.03253497766033,61.967465022339667,null,1000000000,912040000,null,2.8114266134415762,-20.319823454332244,null,null,null,-0.37464048532728622,-97.712711523328068,null,0,0]
[30375.75,30.37575,10.47256492844444,1.4751630294357616,1.0002622341892957,2.2898772738929644E-2,1,0,2734.2480874295265,1.5704305955260733,3.3406096581571707,1.2667885932840242,1.001233000098166,4.9633346089595479E-2,1.000000000461343,3.0375749990657574E-5,1.000000000461343,3.0375749990657574E-5,1.0095909265639822,0.2550441248738492,2.3812360985888676,-118.06275105672847,61.937248943271527,null,1000000000,922686188.0625,null,2.8067629595900403,-20.241186465417268,null,null,null,-0.42552686100117371,-97.821564591311187,null,0,0]
[30551.5,30.551500000000001,10.532606875528511,1.4757098482726467,1.0002652770677891,2.3031215243320156E-2,1,0,2750.0680766404384,1.5704326994248938,3.3582105346242375,1.2684324907652405,1.0012473004066127,4.9920042463365316E-2,1.0000000004666971,3.0551499990494468E-5,1.0000000004666971,3.0551499990494468E-5,1.009704789832472,0.2565233410135444,2.3260358417970535,-118.09360456261842,61.906395437381576,null,1000000000,933394152.25,null,2.8021720938259302,-20.163545114533036,null,null,null,-0.47613625202887522,-97.930059448085387,null,0,0]
[30727.25,30.727250000000002,10.592651936272819,1.4762504679211912,1.0002683374918455,2.3163656939590833E-2,1,0,2765.8880658633834,1.5704347792564666,3.3758203916686944,1.2700592419291936,1.0012616830100369,5.0206730624210202E-2,1.0000000004720819,3.0727249990329482E-5,1.0000000004720819,3.0727249990329482E-5,1.0098193686293271,0.25800261055854534,2.2711806394269294,-118.12508654947628,61.874913450523721,null,1000000000,944163892.5625,null,2.7976524611173832,-20.086884325744528,null,null,null,-0.52647182169045426,-98.038202223731773,null,0,0]
[30903,30.902999999999999,10.65270005802595,1.4767849928951482,1.0002714154613042,2.3296097823102855E-2,1,0,2781.7080550981573,1.5704368354314135,3.3934390894795627,1.2716691051688693,1.0012761479048926,5.0493410525359245E-2,1.0000000004774976,3.0902999990162592E-5,1.0000000004774976,3.0902999990162592E-5,1.0099346639462039,0.25948193358079785,2.2166658655073093,-118.15718822590651,61.842811774093491,null,1000000000,954995409,null,2.7932025467545909,-20.011189315071316,null,null,null,-0.57653668124728286,-98.145998910835218,null,0,0]
[31083,31.082999999999998,10.714203387229443,1.4773262330239223,1.0002745860492464,2.3431740554908619E-2,1,0,2797.910604539848,1.5704389172266038,3.4114928648995071,1.273300657563645,1.0012910478876789,5.0787014331319644E-2,1.0000000004830765,3.108299998998969E-5,1.0000000004830765,3.108299998998969E-5,1.010053491104798,0.26099708520974846,2.1611809483341831,-118.19069950932916,61.809300490670836,null,1000000000,966152889,null,2.7887157501897999,-19.934649785804933,null,null,null,-0.62753480185561639,-98.256049723524242,null,0,0]
[31263,31.263000000000002,10.775709819232539,1.4778612946432059,1.0002777750410743,2.3567382424323147E-2,1,0,2814.1131539935259,1.5704409750494892,3.4295556259632125,1.2749150281192903,1.0013060341823792,5.1080609374000115E-2,1.0000000004886875,3.1262999989814776E-5,1.0000000004886875,3.1262999989814776E-5,1.0101730719782585,0.26251229307377627,2.1060435878270565,-118.22484263293389,61.775157367066114,null,1000000000,977375169,null,2.7842989928442803,-19.859092827794147,null,null,null,-0.67825540501722292,-98.365749805139728,null,0,0]
[31443,31.443000000000001,10.837219301205593,1.4783902826472497,1.0002809824366121,2.3703023426363455E-2,1,0,2830.3157034589835,1.5704430093117681,3.4476272314383007,1.2765124785431017,1.0013211067851182,5.1374195603180635E-2,1.000000000494331,3.144299998963783E-5,1.000000000494331,3.144299998963783E-5,1.0102934076485661,0.26402755723736082,2.0512491002420141,-118.25960863668602,61.740391363313975,null,1000000000,988662249,null,2.7799507710549074,-19.784503467026564,null,null,null,-0.72870167081289328,-98.475105169659471,null,0,0]
[31623,31.623000000000001,10.898731781509005,1.4789132995759842,1.0002842082356829,2.3838663556046719E-2,1,0,2846.5182529360204,1.5704450204157656,3.4657075429697231,1.2780932654305974,1.0013362656919986,5.1667772968650265E-2,1.0000000005000069,3.162299998945885E-5,1.0000000005000069,3.162299998945885E-5,1.0104144992032873,0.26554287776061924,1.9967928934248869,-118.29498871775526,61.70501128224474,null,1000000000,1000014129,null,2.7756696203293552,-19.710867021836645,null,null,null,-0.77887672690446952,-98.584121695918654,null,0,0]
[31807,31.806999999999999,10.961614252276176,1.4794418718897984,1.0002875247405201,2.3977317003994979E-2,1,0,2863.0808590798661,1.570447052684401,3.484198496487207,1.2796922197637184,1.0013518506616508,5.1967865061946387E-2,1.0000000005058425,3.180699998927378E-5,1.0000000005058425,3.180699998927378E-5,1.0105390640868972,0.26709193038353624,1.9414715009163011,-118.33178071656356,61.668219283436443,null,1000000000,1011685249,null,2.7713611711145751,-19.636564137741416,null,null,null,-0.82988967019827653,-98.695216578822112,null,0,0]
[31991,31.991,11.024499750657034,1.4799644142272832,1.0002908604755356,2.4115969529855431E-2,1,0,2879.6434652354001,1.570449061575375,3.5026982638342496,1.2812742881082197,1.0013675258054973,5.2267947787140459E-2,1.000000000511712,3.1990999989086549E-5,1.000000000511712,3.1990999989086549E-5,1.0106644211390057,0.26864104201183248,1.8864941701121427,-118.36919627645523,61.630803723544773,null,1000000000,1023424081,null,2.7671198325268294,-19.563226873332951,null,null,null,-0.88062566241468621,-98.80596940312229,null,0,0]
[32175,32.174999999999997,11.087388225135481,1.4804810289080177,1.0002942154405374,2.4254621128306286E-2,1,0,2896.2060714024224,1.5704510474897588,3.5212067060921739,1.2828397287537896,1.0013832911193028,5.2568021090628997E-2,1.0000000005176153,3.2174999988897156E-5,1.0000000005176153,3.2174999988897156E-5,1.0107905715393339,0.27019021269545501,1.8318562776379914,-118.40722648407655,61.592773515923454,null,1000000000,1035230625,null,2.7629441595014064,-19.490840449610676,null,null,null,-0.93108788186341651,-98.916386034465859,null,0,0]
[32359,32.359000000000002,11.150279625355225,1.4809918159559328,1.0002975896353317,2.4393271794025943E-2,1,0,2912.7686775807379,1.5704530108195014,3.5397236871833373,1.2843887949152588,1.0013991465988092,5.286808491881867E-2,1.0000000005235523,3.2358999988705574E-5,1.0000000005235523,3.2358999988705574E-5,1.010917516473651,0.27173944247949816,1.7775532902706324,-118.44586258451037,61.554137415489635,null,1000000000,1047104881,null,2.7588327447155732,-19.419390377819813,null,null,null,-0.9812794544449408,-99.02647220669057,null,0,0]
[32547.5,32.547499999999999,11.214712112959441,1.4815091541389247,1.0003010662919753,2.453531239997557E-2,1,0,2929.736347508619,1.570454999145988,3.5587022445102123,1.2859590252803097,1.001415483344092,5.317547738279603E-2,1.0000000005296699,3.2547499988507043E-5,1.0000000005296699,3.2547499988507043E-5,1.0110483912044201,0.27332662236363026,1.7222648850879252,-118.48606290120051,61.513937098799488,null,1000000000,1059339756.25,null,2.7546859809840338,-19.347149018595104,null,null,null,-1.032421095896108,-99.138913882605408,null,0,0]
[32736,32.735999999999997,11.279147567762998,1.4820205815638015,1.0003045631300862,2.4677352015707352E-2,1,0,2946.7040174479489,1.5704569645741668,3.5776894831528039,1.2875125926302597,1.0014319147101585,5.3482859788505172E-2,1.0000000005358227,3.2735999988306202E-5,1.0000000005358227,3.2735999988306202E-5,1.0111801023462796,0.27491386435441523,1.6673186150430628,-118.52688100374785,61.473118996252154,null,1000000000,1071645696,null,2.7506037833233488,-19.275860491536942,null,null,null,-1.0832851682802871,-99.251020512210928,null,0,0]
[32924.5,32.924500000000002,11.343585939201768,1.4825261986906744,1.0003080801494528,2.4819390635500337E-2,1,0,2963.6716873985324,1.5704589074973316,3.5966852656226749,1.2890497534214427,1.0014484406923512,5.379023207835721E-2,1.0000000005420113,3.2924499988103029E-5,1.0000000005420113,3.2924499988103029E-5,1.0113126511938064,0.27650116848434658,1.612709885596308,-118.56830797565124,61.431692024348763,null,1000000000,1084022700.25,null,2.7465847543600934,-19.205510122014228,null,null,null,-1.1338748687637841,-99.362797853637019,null,0,0]
[33113,33.113,11.40802717785181,1.4830261037217916,1.0003116173498625,2.4961428253633809E-2,1,0,2980.6393573601754,1.5704608282998203,3.6156894572594664,1.2905707590321995,1.0014650612859859,5.4097594194774723E-2,1.0000000005482352,3.3112999987897518E-5,1.0000000005482352,3.3112999987897518E-5,1.0114460390481821,0.27808853478047335,1.5584341917217688,-118.61033506116655,61.389664938833448,null,1000000000,1096470769,null,2.7426275333856651,-19.136083525830955,null,null,null,-1.1841933416638959,-99.474251535335625,null,0,0]
[33305.75,33.305750000000003,11.473924250252635,1.4835314731048472,1.0003152551699395,2.5106667269683716E-2,1,0,2997.9895875311345,1.5704627699264198,3.6351306836579989,1.2921096089283166,1.001482154444796,5.4411875646227056E-2,1.0000000005546363,3.3305749987684939E-5,1.0000000005546363,3.3305749987684939E-5,1.0115833032785577,0.2797117548092598,1.5032745565046901,-118.65392131154643,61.346078688453574,null,1000000000,1109272983.0625,null,2.7386436248439057,-19.066032169236305,null,null,null,-1.2353690683392167,-99.587889142310118,null,0,0]
[33498.5,33.4985,11.539824219605014,1.4840310706326314,1.0003189140908846,2.5251905226299998E-2,1,0,3015.3398177132653,1.5704646892088254,3.6545804266627431,1.2936320828239825,1.0014993465194511,5.4726146338597681E-2,1.0000000005610747,3.3498499987469887E-5,1.0000000005610747,3.3498499987469887E-5,1.0117214475482603,0.2813350398787689,1.4484538932457705,-118.69811702527244,61.301882974727562,null,1000000000,1122149502.25,null,2.7347215777120351,-18.996917191674843,null,null,null,-1.2862676844662668,-99.70119983359757,null,0,0]
[33691.25,33.691249999999997,11.605727036560285,1.4845249943795855,1.0003225941124665,2.5397142117366996E-2,1,0,3032.6900479063765,1.5704665865305356,3.6740385510172531,1.2951384337920817,1.001516637504857,5.5040406210363726E-2,1.00000000056755,3.3691249987252348E-5,1.00000000056755,3.3691249987252348E-5,1.0118604732698029,0.28295839000010031,1.3939676609776364,-118.74291334102212,61.257086658977883,null,1000000000,1135100326.5625,null,2.730860048835642,-18.928724111586199,null,null,null,-1.3368923878580039,-99.814189229435925,null,0,0]
[33884,33.884,11.671632652882256,1.4850133402162005,1.0003262952344518,2.554237793676932E-2,1,0,3050.0402781102812,1.5704684622663221,3.6935049242576379,1.2966289098664183,1.0015340273958913,5.5354655200015097E-2,1.0000000005740626,3.3883999987032308E-5,1.0000000005740626,3.3883999987032308E-5,1.0120003818628516,0.28458180517829301,1.3398114069534219,-118.78830155906761,61.211698440932395,null,1000000000,1148125456,null,2.7270577303950301,-18.861438735628795,null,null,null,-1.387246323441611,-99.926862823438796,null,0,0]
[34081.5,34.081499999999998,11.739165256809008,1.4855080327305008,1.0003301094509143,2.5691191730998118E-2,1,0,3067.8180756064785,1.5704703622190763,3.7134594342155065,1.2981399039074075,1.0015519484178983,5.5676636976203023E-2,1.0000000005807743,3.4081499986804232E-5,1.0000000005807743,3.4081499986804232E-5,1.0121446555352753,0.28624529417710926,1.2846582729057945,-118.83541332356138,61.164586676438617,null,1000000000,1161548642.25,null,2.7232217956482407,-18.793422210340484,null,null,null,-1.4385635227424463,-100.0419911132209,null,0,0]
[34279,34.279000000000003,11.806700700687719,1.4859970659874673,1.0003339458200629,2.5840004387094308E-2,1,0,3085.5958731136229,1.5704722402785065,3.7334223317433013,1.2996347425272705,1.0015699732693415,5.5998607196616625E-2,1.0000000005875249,3.4278999986573493E-5,1.0000000005875249,3.4278999986573493E-5,1.0122898591698166,0.28790885146981404,1.2298423903132594,-118.88312853561118,61.116871464388822,null,1000000000,1175049841,null,2.7194453546443342,-18.726329406006794,null,null,null,-1.4896029643310769,-100.15679912960437,null,0,0]
[34476.5,34.476500000000001,11.8742389360612,1.486480536317258,1.0003378043416433,2.5988815898480053E-2,1,0,3103.3736706315253,1.5704740968208626,3.7533934830099742,1.3011136768721323,1.0015881019446153,5.6320565795127626E-2,1.0000000005943144,3.4476499986340077E-5,1.0000000005943144,3.4476499986340077E-5,1.0124359943169585,0.28957247704184891,1.1753592427347463,-118.93143834222684,61.068561657773159,null,1000000000,1188629052.25,null,2.7157271088535948,-18.660145950783388,null,null,null,-1.5403678661188462,-100.27129239144344,null,0,0]
[34674,34.673999999999999,11.941779915566499,1.4869585378812507,1.0003416850153992,2.6137626258577809E-2,1,0,3121.1514681600033,1.5704759322138229,3.7733727569630084,1.3025769530506399,1.0016063344380821,5.6642512705622157E-2,1.0000000006011431,3.4673999986103978E-5,1.0000000006011431,3.4673999986103978E-5,1.0125830625349908,0.29123617087185522,1.1212044013918372,-118.98033405390264,61.019665946097362,null,1000000000,1202286276,null,2.7120657940613602,-18.594857760961862,null,null,null,-1.5908613926695259,-100.38547629294077,null,0,0]
[34875.75,34.875749999999996,12.01077709375677,1.4874412747154262,1.0003456720693995,2.6289637671374693E-2,1,0,3139.3118258991922,1.5704777856392644,3.7937902179618783,1.3040558010307248,1.0016250664637731,5.6971375450876563E-2,1.0000000006081589,3.4875749985859997E-5,1.0000000006081589,3.4875749985859997E-5,1.0127342605458152,0.29293573615601581,1.0662186659234931,-119.03087803551192,60.969121964488082,null,1000000000,1216317938.0625,null,2.7083831933849489,-18.52907465395915,null,null,null,-1.6421645274614562,-100.50180338155282,null,0,0]
[35077.5,35.077500000000001,12.079777038902504,1.4879184968534847,1.0003496822386722,2.6441647868927307E-2,1,0,3157.4721836490417,1.5704796177445697,3.8142158871092358,1.3055188132989277,1.001643906811863,5.7300225860255558E-2,1.0000000006152154,3.5077499985613184E-5,1.0000000006152154,3.5077499985613184E-5,1.0128864355290523,0.29463537260055811,1.0115664462271807,-119.08201558623536,60.917984413764643,null,1000000000,1230431006.25,null,2.7047574384060633,-18.464196938065442,null,null,null,-1.6931909921788839,-100.61781864816994,null,0,0]
[35279.25,35.279249999999998,12.148779703858279,1.4883902980433352,1.0003537155229396,2.6593656844225277E-2,1,0,3175.6325414093676,1.5704814288955058,3.8346496332403555,1.3069662366936972,1.0016628554762392,5.7629063863331782E-2,1.0000000006223126,3.5279249985363517E-5,1.0000000006223126,3.5279249985363517E-5,1.0130395891708726,0.29633508016053822,0.95724329047674783,-119.13373794937942,60.866262050620577,null,1000000000,1244625480.5625,null,2.7011872856336612,-18.400210487401143,null,null,null,-1.7439439951569133,-100.73352746197828,null,0,0]
[35481,35.481000000000002,{"$f":"SQRT(1+(A397/p_dom)^2)","v":12.2177850425419},{"$f":"ATAN(A397/p_dom)","v":1.488856769924735},{"$f":"SQRT(1+(A397/z_ESR)^2)","v":1.0003577719219221},{"$f":"ATAN(A397/z_ESR)","v":2.6745664590258577E-2},{"$f":"IF(VIN_nom>Vout, 1, SQRT(1+(A397/z_RHP)^2))","v":1},{"$f":"IF(VIN_nom>Vout, 0, -ATAN(A397/z_RHP))","v":0},{"$f":"SQRT(1+(A397/EA_p1)^2)","v":3193.7928991799922},{"$f":"ATAN(A397/EA_p1)","v":1.5704832194495217},{"$f":"SQRT(1+(A397/EA_z1)^2)","v":3.8550913279201215},{"$f":"ATAN(A397/EA_z1)","v":1.3083983130824086},{"$f":"SQRT(1+(A397/EA_hf_p)^2)","v":1.001681912450755},{"$f":"ATAN(A397/EA_hf_p)","v":5.7957889389693894E-2},{"$f":"SQRT(1+(A397/Zero3)^2)","v":1.0000000006294507},{"$f":"ATAN(A397/Zero3)","v":3.5480999985110978E-5},{"$f":"SQRT(1+(A397/pole5)^2)","v":1.0000000006294507},{"$f":"ATAN(A397/pole5)","v":3.5480999985110978E-5},{"$f":"SQRT((1-(Z397/pterm2))^2+(A397/pterm1)^2)","v":1.013193723165857},{"$f":"IF((ATAN((A397/pterm1)/(1-A397^2/pterm2))>0),ATAN((A397/pterm1)/(1-A397^2/pterm2)),PI()+ATAN((A397/pterm1)/(1-A397^2/pterm2)))","v":0.2980348587834758},{"$f":"20*LOG10(((E397*K397*G397*O397)/(C397*I397*S397*M397*Q397))*Adc)","v":0.90324483290425395},{"$f":"((F397+L397+H397+P397)-(D397+J397+T397+N397+R397))*radconv","v":-119.18603653137636},{"$f":"IF(V397>0,V397,V397+180)","v":60.813963468623641},null,{"$f":"IF(U397<0,A397,1000000000)","v":1000000000},{"$f":"A397^2","v":1258901361},null,{"$f":"20*LOG10((K397/(I397*M397))*Aea_stability*Afb*0.8)","v":2.697671524482379},{"$f":"(L397-(J397+N397))*radconv","v":-18.337101460432457},null,null,null,{"$f":"20*LOG10((E397*G397/(C397*S397))*Am_stability)","v":-1.7944266915781271},{"$f":"(F397+H397-(D397+T397))*radconv","v":-100.8489350709439},null,{"$f":"SUM((U398<0)*(U397>0))*A397","v":0},0]
[35687.75,{"$f":"A398/1000","v":35.687750000000001},12.288503277536863,1.4893293670901875,1.0003619528320413,2.6901438284004583E-2,1,0,3212.4033277856693,1.5704850333755738,3.8760477470580423,1.3098502064932769,1.0017015540804146,5.8294851229563294E-2,1.0000000006368077,3.5687749984849173E-5,1.0000000006368077,3.5687749984849173E-5,1.0133526959664065,0.29977683693433782,0.84824051349126184,-119.24022023204724,60.759779767952764,null,1000000000,1273615500.0625,null,2.6941238292339658,-18.273324517275462,null,null,null,-1.8458833157427033,-100.96689571477177,null,0,0]
[35894.5,35.894500000000001,12.359224225736291,1.4897965558448261,1.000366158016184,2.7057210671895843E-2,1,0,3231.013756401795,1.5704868264054341,3.8970122489964902,1.3112864815926595,1.001721309442088,5.8631799816961108E-2,1.0000000006442076,3.5894499984584326E-5,1.0000000006442076,3.5894499984584326E-5,1.0135127019450585,0.3015188895781295,0.79356817018264025,-119.29499130331199,60.705008696688012,null,1000000000,1288415130.25,null,2.6906307823921165,-18.210440480875437,null,null,null,-1.8970626122094747,-101.08455082243655,null,0,0]
[36101.25,36.10125,12.429947840829353,1.4902584283008811,1.0003703874740439,2.7212981746389232E-2,1,0,3249.6241850281885,1.570488598898117,3.9179847039861957,1.3127073832150415,1.0017411785290466,5.8968735076163195E-2,1.0000000006516501,3.6101249984316415E-5,1.0000000006516501,3.6101249984316415E-5,1.013673742952877,0.30326101663352401,0.73922337162665275,-119.3503410068338,60.649658993166199,null,1000000000,1303300251.5625,null,2.6871911820491134,-18.148435339481019,null,null,null,-1.9479678104224631,-101.20190566735282,null,0,0]
[36308,36.308,12.500674077551528,1.4907150744951656,1.0003746412053132,2.7368751499942008E-2,1,0,3268.2346136646756,1.5704903512044595,3.9389649849925128,1.3141131512299036,1.0017611613345232,5.9305656931463502E-2,1.0000000006591354,3.6307999984045408E-5,1.0000000006591354,3.6307999984045408E-5,1.0138358208501013,0.30500321801073899,0.68520177204779376,-119.40626076888515,60.593739231114853,null,1000000000,1318270864,null,2.6838038582427797,-18.087295365347199,null,null,null,-1.9986020861949871,-101.31896540353794,null,0,0]
[36519.5,36.519500000000001,12.573027888306505,1.4911768959698877,1.0003790177803873,2.7528098627691802E-2,1,0,3287.2726095957005,1.5704921232394919,3.9604352478124265,1.3155358020996388,1.0017817208974946,5.9650305485704332E-2,1.0000000006668368,3.6519499983764969E-5,1.0000000006668368,3.6519499983764969E-5,1.0140026972687384,0.30678552258012404,0.6302690260958882,-119.46404634915564,60.535953650844363,null,1000000000,1333673880.25,null,2.6803916164681487,-18.02563191249255,null,null,null,-2.0501225903722595,-101.43841443666308,null,0,0]
[36731,36.731000000000002,12.645384349938398,1.4916334324873304,1.0003834197563699,2.7687444357140819E-2,1,0,3306.3106055369285,1.570493874867491,3.9819134398483449,1.3169431084125087,1.0018023994498371,5.9994939852858579E-2,1.0000000006745831,3.6730999983481256E-5,1.0000000006745831,3.6730999983481256E-5,1.0141706627357387,0.30856790470827378,0.57566556532905955,-119.52241084383552,60.477589156164484,null,1000000000,1349166361,null,2.6770317021587009,-17.964845655887714,null,null,null,-2.1013661368296424,-101.55756518794783,null,0,0]
[36942.5,36.942500000000003,12.717743417201419,1.4920847740636638,1.0003878471329255,2.7846788680215669E-2,1,0,3325.3486014881842,1.5704956064389541,4.003399433479812,1.3183353116086405,1.0018231969841824,6.0339559951940881E-2,1.0000000006823742,3.6942499983194264E-5,1.0000000006823742,3.6942499983194264E-5,1.0143397192721533,0.31035036427137147,0.52138700149638795,-119.58134558578148,60.418654414218523,null,1000000000,1364748306.25,null,2.6737229602045764,-17.904922777474304,null,null,null,-2.1523359587081883,-101.67642280830718,null,0,0]
[37154,37.154000000000003,12.790105045872076,1.4925310086865238,1.0003922999097166,2.8006131588843363E-2,1,0,3344.3865974492978,1.5704973182963984,4.0248931037655975,1.3197126482078283,1.0018441134931209,6.0684165701986134E-2,1.0000000006902099,3.7153999982903958E-5,1.0000000006902099,3.7153999982903958E-5,1.0145098689089644,0.31213290113618275,0.46742903084803378,-119.64084207254228,60.359157927457716,null,1000000000,1380419716,null,2.6704642662753271,-17.845849740652152,null,null,null,-2.2030352354272953,-101.79499233189014,null,0,0]
[37370.25,37.370249999999999,12.864094420819562,1.4929820744326825,1.0003968789517392,2.8169051649851784E-2,1,0,3363.8521607056068,1.5704990485653685,4.0468773022012163,1.3211057880788701,1.0018656227630147,6.1036495904304586E-2,1.0000000006982677,3.7370249982603705E-5,1.0000000006982677,3.7370249982603705E-5,1.0146849721996942,0.31395555111148749,0.41258631544786339,-119.70224689111603,60.297753108883967,null,1000000000,1396535585.0625,null,2.6671829932404689,-17.786314876467305,null,null,null,-2.2545966777926063,-101.91593201464873,null,0,0]
[37586.5,37.586500000000001,12.938086383163727,1.4934279810451954,1.0004014845469988,2.8331970215099051E-2,1,0,3383.3177239718711,1.5705007589244968,4.06886927008975,1.322483870943749,1.0018872563957228,6.1388810934708091E-2,1.0000000007063725,3.7586499982299949E-5,1.0000000007063725,3.7586499982299949E-5,1.0148612225670277,0.31577828158767934,0.35806991675877931,-119.7642215040365,60.235778495963501,null,1000000000,1412744982.25,null,2.6639517586433397,-17.727640705151096,null,null,null,-2.3058818418845624,-102.03658079888537,null,0,0]
[37802.75,37.802750000000003,13.012080888765611,1.4938688163590064,1.000406116695129,2.8494887275957365E-2,1,0,3402.7832872479189,1.5705024497154654,4.0908688821285564,1.3238471344433524,1.0019090143831897,6.1741110706719469E-2,1.000000000714524,3.7802749981992689E-5,1.000000000714524,3.7802749981992689E-5,1.0150386222138823,0.31760109239154954,0.3038754947311092,-119.82675733324763,60.173242666752373,null,1000000000,1429047907.5625,null,2.6607694543079727,-17.669813625505789,null,null,null,-2.3568939595768654,-102.15694370774182,null,0,0]
[38019,38.018999999999998,13.086077894483088,1.4943046662303483,1.0004107753957605,2.8657802823799396E-2,1,0,3422.2488505335841,1.5705041212721818,4.1128760156528621,1.3251958113552968,1.0019308967173137,6.2093395133884177E-2,1.0000000007227221,3.8018999981681886E-5,1.0000000007227221,3.8018999981681886E-5,1.0152171733538937,0.3194239833394249,0.24999879260064142,-119.88984596492291,60.110154035077088,null,1000000000,1445444361,null,2.6576350016442625,-17.612820314534432,null,null,null,-2.4076362090436194,-102.2770256503885,null,0,0]
[38240.5,38.240499999999997,13.161873907126674,1.4947460166718873,1.0004155747246744,2.8824671969215003E-2,1,0,3442.1869881978346,1.5705058138107111,4.1354250985179029,1.3265623469284495,1.0019534392018732,6.2454216132457663E-2,1.0000000007311678,3.8240499981359848E-5,1.0000000007311678,3.8240499981359848E-5,1.0154012553516574,0.321291212326418,0.19513912143373813,-119.95503069988145,60.044969300118552,null,1000000000,1462335840.25,null,2.6544729636774367,-17.555294089330644,null,null,null,-2.4593338422436997,-102.39973661055083,null,0,{"$f":"IF(AJ410>0,W410,0)","v":0}]
[38462,38.462000000000003,13.237672454214621,1.495182312876711,1.0004204019102041,2.8991539508937392E-2,1,0,3462.1251258718312,1.570507486854817,4.1579818201876204,1.3279140583087932,1.0019761121266682,6.2815020848537309E-2,1.0000000007396628,3.8461999981034064E-5,1.0000000007396628,3.8461999981034064E-5,1.0155865501674579,0.32315852497212649,0.14060400270132348,-120.0207780475146,59.979221952485403,null,1000000000,1479325444,null,2.6513589294982198,-17.49861517794314,null,null,null,-2.5107549267968969,-102.52216286957149,null,0,0]
[38683.5,38.683500000000002,13.313473492458328,1.4956136410070575,1.0004252569519463,2.9158405433697097E-2,1,0,3482.063263555408,1.5705091407393725,4.1805460570132933,1.3292511805544149,1.0019989154828437,6.3175809189292498E-2,1.0000000007482066,3.8683499980704505E-5,1.0000000007482066,3.8683499980704505E-5,1.0157730602148458,0.32502592104474826,8.6389120127493224E-2,-120.08707947783644,59.91292052216356,null,1000000000,1496413172.25,null,2.648291830572985,-17.442770126403584,null,null,null,-2.5619027104454926,-102.64430935143287,null,0,0]
[38905,38.905000000000001,13.389276979548079,1.4960400852814237,1.0004301398494952,2.9325269734225189E-2,1,0,3502.0014012484012,1.5705107757916237,4.2031176879606571,1.3305739438853581,1.0020218492614952,6.3536581061918049E-2,1.0000000007567995,3.8904999980371144E-5,1.0000000007567995,3.8904999980371144E-5,1.0159607879190129,0.32689340030077568,3.2490240119002402E-2,-120.15392662558614,59.846073374413862,null,1000000000,1513599025,null,2.6452706269977124,-17.38774575750762,null,null,null,-2.6127803868787081,-102.76618086807849,null,38905,59.846073374413862]
[39131.5,39.131500000000003,13.466794095603644,1.4964711911370712,1.0004351617761433,2.9495899033954106E-2,1,0,3522.3896097792494,1.5705124286109318,4.226206359470507,1.3319119525906533,1.002045435595152,6.3905479642536692E-2,1.0000000007656371,3.9131499980026316E-5,1.0000000007656371,3.9131499980026316E-5,1.0161540150047523,0.3288031205999184,-2.230286249978394E-2,-120.22283852563697,59.777161474363027,null,39131.5,1531274292.25,null,2.6422276313291375,-17.332314537050912,null,null,null,-2.6645304938289192,-102.89052398858608,null,0,0]
[39358,39.357999999999997,13.544313685844493,1.4968973622845048,1.000440212829526,2.9666526615693758E-2,1,0,3542.7778183196087,1.5705140624067355,4.2493025147910819,1.3332354187359836,1.0020691582868968,6.4274360806959072E-2,1.000000000774526,3.9357999979677469E-5,1.000000000774526,3.9357999979677469E-5,1.016348520507121,0.33071292732765228,-7.6774233094774449E-2,-120.29230387762935,59.707696122370649,null,39358,1549052164,null,2.6392305148718282,-17.277714456062458,null,null,null,-2.7160047479666041,-103.01458942156691,null,0,0]
[39584.5,39.584499999999998,13.621835708030096,1.4973186828180256,1.0004452930092018,2.9837152469535017E-2,1,0,3563.1660268693172,1.5705156775055886,4.2724060325524187,1.334544573568694,1.0020930173270455,6.464322445603593E-2,1.0000000007834662,3.9584499979324583E-5,1.0000000007834662,3.9584499979324583E-5,1.016544307056787,0.33262282018532768,-0.13092814371862055,-120.36231424680054,59.637685753199463,null,39584.5,1566932640.25,null,2.6362782527785376,-17.223932278074674,null,null,null,-2.7672063964971616,-103.13838196872589,null,0,0]
[39811,39.811,13.699360120874744,1.4977352349353614,1.0004504023147271,3.0007776585569364E-2,1,0,3583.5542354282147,1.5705172742266134,4.2955167939574421,1.3358396435581084,1.0021170127058596,6.5012070490646418E-2,1.0000000007924579,3.9810999978967646E-5,1.0000000007924579,3.9810999978967646E-5,1.0167413772969711,0.33453279886129239,-0.18476878487440329,-120.4328613623136,59.567138637686398,null,39811,1584915721,null,2.6333698477112439,-17.170955039956276,null,null,null,-2.8181386325856495,-103.26190632235733,null,0,0]
[40042.75,40.042749999999998,13.778683889527155,1.4981565905490852,1.000455660193726,3.0182353756191924E-2,1,0,3604.4150183670299,1.5705188892612794,4.3191706114200397,1.3371503847235742,1.0021417053742767,6.5389447601677253E-2,1.0000000008017109,4.0042749978598193E-5,1.0000000008017109,4.0042749978598193E-5,1.0169443468274721,0.33648713705250372,-0.23953742993306382,-120.5055907692775,59.494409230722496,null,40042.75,1603421827.5625,null,2.6304384106009038,-17.117569753558055,null,null,null,-2.8699758405339666,-103.38802101571949,null,0,0]
[40274.5,40.274500000000003,13.858010076449334,1.4985731223783754,1.0004609485634794,3.0356929086528477E-2,1,0,3625.2758013151392,1.5705204857092836,4.3428317685597992,1.3384468454095748,1.0021665407541407,6.5766806062362154E-2,1.0000000008110177,4.0274499978224445E-5,1.0000000008110177,4.0274499978224445E-5,1.017148665885528,0.33844156438444689,-0.29398673791128638,-120.57886508425986,59.42113491574014,null,40274.5,1622035350.25,null,2.6275508592310741,-17.06500054483924,null,null,null,-2.9215375971423625,-103.51386453942065,null,0,0]
[40506.25,40.506250000000001,13.937338640349584,1.4989849126455173,1.0004662674235043,3.0531502565967379E-2,1,0,3646.1365842723822,1.5705220638896478,4.3665001460601687,1.3397292534417984,1.0021915188348416,6.6144145766620435E-2,1.000000000820378,4.0506249977846374E-5,1.000000000820378,4.0506249977846374E-5,1.0173543373429581,0.34039608048069658,-0.34812094569557828,-120.65267595604122,59.347324043958778,null,40506.25,1640756289.0625,null,2.6247062091261606,-17.013234372550048,null,null,null,-2.9728271548217382,-103.63944158349118,null,0,0]
[40738,40.738,14.016669540869762,1.4993920417178812,1.0004716167733139,3.0706074183897671E-2,1,0,3666.9973672386031,1.5705236241141343,4.3901756271416144,1.3409978319185725,1.0022166396057104,6.6521466608403287E-2,1.0000000008297922,4.0737999977463952E-5,1.0000000008297922,4.0737999977463952E-5,1.0175613640851371,0.34235068495035653,-0.4019442095343102,-120.72701519673784,59.272984803262162,null,40738,1659584644,null,2.6219035022973749,-16.962258465884403,null,null,null,-3.0238477118316842,-103.76475673085345,null,0,0]
[40975.25,40.975250000000003,14.097885538907642,1.4998040865451241,1.0004771246596669,3.0884786878193664E-2,1,0,3688.353228126864,1.5705252030845573,4.4144202250035196,1.342282419224498,1.0022425043532628,6.6907722555914026E-2,1.0000000008394856,4.0975249977067908E-5,1.0000000008394856,4.0975249977067908E-5,1.0177747110228605,0.34435176813350438,-0.45672698856705174,-120.80365763692923,59.196342363070769,null,40975.25,1678971112.5625,null,2.6190767552429604,-16.910878338784201,null,null,null,-3.0758037438100141,-103.89277929814507,null,0,0]
[41212.5,41.212499999999999,14.17910390307765,1.5002114110287614,1.0004826644991329,3.1063497599073286E-2,1,0,3709.7090890242139,1.5705267638755105,4.4386720278002381,1.3435529712752869,1.0022685186213087,6.7293958510200452E-2,1.0000000008492351,4.1212499976667263E-5,1.0000000008492351,4.1212499976667263E-5,1.0179894845001476,0.34635294305871689,-0.51119245451110573,-120.88083696460519,59.119163035394806,null,41212.5,1698470156.25,null,2.6162920155384284,-16.860300185433434,null,null,null,-3.1274844700495348,-104.02053677917176,null,0,0]
[41449.75,41.449750000000002,14.260324592951527,1.5006140956876197,1.0004882362911813,3.1242206335154267E-2,1,0,3731.0649499304977,1.5705283067991602,4.4629309180757799,1.3448097128068617,1.0022946823982064,6.768017435758783E-2,1.0000000008590408,4.1449749976261984E-5,1.0000000008590408,4.1449749976261984E-5,1.018205687656518,0.34835420925911587,-0.56534481711517337,-120.95854490200948,59.041455097990521,null,41449.75,1718081775.0625,null,2.6135483362132184,-16.81051114078501,null,null,null,-3.1788931533283886,-104.1480337612245,null,0,0]
[41687,41.686999999999998,14.341547569015692,1.501012219222557,1.0004938400352783,3.1420913075055068E-2,1,0,3752.4208108455628,1.5705298321605672,4.48719678088018,1.3460528638704741,1.0023209956722476,6.8066369984437283E-2,1.0000000008689029,4.1686999975852028E-5,1.0000000008689029,4.1686999975852028E-5,1.0184233236461471,0.35035556625169068,-0.61918820620671067,-121.03677333430649,58.963226665693512,null,41687,1737805969,null,2.6108447958447512,-16.761498607798551,null,null,null,-3.2300330020514609,-104.2752747265079,null,0,0]
[41929.75,41.929749999999999,14.424655806268365,1.5014149314547005,1.0004996067581935,3.1603760569702641E-2,1,0,3774.2717496832929,1.5705313750166405,4.5120322816505976,1.3473109920573725,1.0023480736719919,6.8461497465466994E-2,1.0000000008790519,4.1929749975427719E-5,1.0000000008790519,4.1929749975427719E-5,1.0186474912860244,0.35240341274972398,-0.67396423399444738,-121.11734571823503,58.882654281764971,null,41929.75,1758103935.0625,null,2.6081191915739392,-16.712140708776857,null,null,null,-3.2820834255683868,-104.40520500945813,null,0,0]
[42172.5,42.172499999999999,14.507766356068183,1.5018130297207328,1.0005054069306321,3.1786605950440729E-2,1,0,3796.1226885299038,1.5705329001109838,4.5368748462565645,1.3485553439315277,1.002375308155588,6.8856603536995006E-2,1.0000000008892598,4.2172499974998464E-5,1.0000000008892598,4.2172499974998464E-5,1.0188731656894181,0.35445135322324739,-0.72842529648682675,-121.19844632712675,58.801553672873254,null,42172.5,1778519756.25,null,2.6054337356385453,-16.663569889986359,null,null,null,-3.3338590321253738,-104.53487643714041,null,0,0]
[42415.25,42.41525,14.590879178897913,1.5022065927398454,1.0005112405520125,3.1969449205080283E-2,1,0,3817.9736273852427,1.5705344077485572,4.5617243592918602,1.3497861407426257,1.002402699110281,6.9251688077412346E-2,1.0000000008995267,4.2415249974564228E-5,1.0000000008995267,4.2415249974564228E-5,1.0191003502822322,0.35649938710204759,-0.7825755706109867,-121.28006697311883,58.719933026881165,null,42415.25,1799053432.5625,null,2.602787518865608,-16.615773485259048,null,null,null,-3.385363089476594,-104.66429348785977,null,0,0]
[42658,42.658000000000001,14.673994236134543,1.5025956974534271,1.0005171076217494,3.2152290321433095E-2,1,0,3839.8245662491618,1.5705358982273798,4.5865807078193574,1.3510035991105147,1.0024302465232449,6.9646750965150175E-2,1.0000000009098524,4.2657999974125004E-5,1.0000000009098524,4.2657999974125004E-5,1.0193290485061655,0.35854751379797289,-0.83641915424116098,-121.36219963033449,58.637800369665513,null,42658,1819704964,null,2.6001796566626312,-16.568739093301737,null,null,null,-3.436598810903797,-104.79346053703277,null,0,0]
[42906.5,42.906500000000001,14.75908030815458,1.5029894794095269,1.0005231483098607,3.2339460153225495E-2,1,0,3862.1930865779123,1.5705374065418807,4.6120327916001784,1.3522363006245464,1.0024586084973135,7.0051149121225495E-2,1.0000000009204839,4.290649997367017E-5,1.0000000009204839,4.290649997367017E-5,1.0195647353320383,0.36064424981659204,-0.89122465042682131,-121.44679989116116,58.553200108838837,null,42906.5,1840967742.25,null,2.5975488517954211,-16.521367226789401,null,null,null,-3.4887735022222421,-104.92543266437175,null,0,0]
[43155,43.155000000000001,14.844168642543464,1.503378747026316,1.0005292240484212,3.2526627718387886E-2,1,0,3884.561606915348,1.5705388974856884,4.6374918066762616,1.3534554693448775,1.0024871344020345,7.0455524329021732E-2,1.0000000009311769,4.3154999973210038E-5,1.0000000009311769,4.3154999973210038E-5,1.0198020156939911,0.36274108179637049,-0.94571720001016657,-121.53192018929288,58.468079810707124,null,43155,1862354025,null,2.5949564396239531,-16.47476842213419,null,null,null,-3.5406736396341203,-105.0571517671587,null,0,0]
[43403.5,43.403500000000001,14.929259200618525,1.5037635773743634,1.0005353348367925,3.271379300384808E-2,1,0,3906.9301272613188,1.5705403713571628,4.6629576395162626,1.354661323337363,1.0025158242234145,7.0859876458257171E-2,1.0000000009419319,4.3403499972744572E-5,1.0000000009419319,4.3403499972744572E-5,1.0200408933351064,0.36483800904753988,-0.9999009544273646,-121.61755241715322,58.38244758284678,null,43403.5,1883863812.25,null,2.5924015461932481,-16.428930194713114,null,null,null,-3.5923025006206122,-105.18862222244012,null,0,0]
[43652,43.652000000000001,15.014351944572997,1.5041440457823969,1.000541480674332,3.2900955996534857E-2,1,0,3929.2986476156811,1.5705418284478694,4.6884301790254055,1.3558540760855917,1.0025446779473806,7.126420537869517E-2,1.0000000009527485,4.3651999972273747E-5,1.0000000009527485,4.3651999972273747E-5,1.0202813720155028,0.36693503086035723,-1.0537799867529889,-121.70368862837887,58.29631137162113,null,43652,1905497104,null,2.5898833212363654,-16.383840322061012,null,null,null,-3.6436633079893532,-105.31984830631782,null,0,0]
[43906,43.905999999999999,15.101330249452761,1.5045285038494236,1.0005477987571298,3.3092259046643376E-2,1,0,3952.1622458938537,1.5705433007427123,4.7144733148686999,1.3570599059619204,1.0025743396543878,7.1677459108428571E-2,1.0000000009638683,4.3905999971786935E-5,1.0000000009638683,4.3905999971786935E-5,1.0205288316785934,0.36907856259511002,-1.1085407598896158,-121.79224400543175,58.207755994568245,null,43906,1927736836,null,2.5873463945491091,-16.338513410199063,null,null,null,-3.6958871544387257,-105.4537305952327,null,0,0]
[44160,44.16,15.188310760864908,1.5049085585384483,1.0005541534563691,3.3283559673752711E-2,1,0,3975.0258441804949,1.5705447561008312,4.7405232303529337,1.3582524851094726,1.0026041725695345,7.2090688315646925E-2,1.0000000009750527,4.4159999971294444E-5,1.0000000009750527,4.4159999971294444E-5,1.0207779720340726,0.37122219156010067,-1.16299153581698,-121.88130963261442,58.118690367385582,null,44160,1950105600,null,2.5848460536274787,-16.293943333732052,null,null,null,-3.7478375894444591,-105.58736629888236,null,0,0]
[44414,44.414000000000001,15.275293441116149,1.5052842849616956,1.0005605447713521,3.3474857863907533E-2,1,0,3997.8894424754585,1.5705461948128054,4.7665798143235172,1.3594320274138161,1.002634176677538,7.2503892861420838E-2,1.0000000009863017,4.4413999970796261E-5,1.0000000009863017,4.4413999970796261E-5,1.0210287971519543,0.37336591693227245,-1.2171364228978836,-121.9708775211307,58.029122478869297,null,44414,1972603396,null,2.5823814623703099,-16.250117846608553,null,null,null,-3.7995178852681937,-105.72075967452217,null,0,0]
[44668,44.667999999999999,15.362278253365968,1.505655756535131,1.0005669727013773,3.3666153603153559E-2,1,0,4020.7530407786035,1.5705476171626045,4.7926429580150103,1.3605987422548464,1.0026643519630298,7.2917072606871164E-2,1.0000000009976151,4.4667999970292352E-5,1.0000000009976151,4.4667999970292352E-5,1.0212813111204975,0.37550973786647307,-1.2709794522716389,-122.06093984151026,57.939060158489738,null,44668,1995230224,null,2.5799518073600387,-16.207024960557305,null,null,null,-3.8509312596316785,-105.85391488095296,null,0,0]
[44928.25,44.928249999999998,15.45140561361492,1.5060320305052339,1.0005735967758018,3.3862153865893967E-2,1,0,4044.179227631013,1.5705490578303172,4.8193541117499441,1.3617810751637731,1.0026954472818401,7.3340393308393426E-2,1.0000000010092738,4.4928249969770063E-5,1.0000000010092738,4.4928249969770063E-5,1.021541794514061,0.37770640851102438,-1.3258384050851557,-122.15372306910885,57.84627693089115,null,44928.25,2018547648.0625,null,2.5774977763219842,-16.163619308653747,null,null,null,-3.9033361814071403,-105.99010376045509,null,0,0]
[45188.5,45.188499999999998,15.540535136413226,1.5064039884445437,1.000580259287855,3.405815152597011E-2,1,0,4067.6054144917193,1.5705504819038187,4.8460719282401579,1.3629503725957868,1.002726722272929,7.3763687679067658E-2,1.0000000010210002,4.5188499969241689E-5,1.0000000010210002,4.5188499969241689E-5,1.0218040596413605,0.37990317761054987,-1.3803887900422103,-122.24700921492118,57.752990785078822,null,45188.5,2042000532.25,null,2.575078762983348,-16.120958075136521,null,null,null,-3.9554675530255592,-106.12605113978468,null,0,0]
[45448.75,45.448749999999997,15.629666784764508,1.5067717040886208,1.0005869602367687,3.4254146568375617E-2,1,0,4091.0316013605802,1.5705518896681765,4.8727962978888639,1.3641068458022008,1.0027581769194851,7.4186955569674543E-2,1.0000000010327943,4.5448749968707189E-5,1.0000000010327943,4.5448749968707189E-5,1.0220681109589338,0.38210004418331639,-1.4346347035066118,-122.34079035226927,57.659209647730734,null,45448.75,2065588876.5625,null,2.5726939617999571,-16.079029163980465,null,null,null,-4.0073286653065674,-106.2617611882888,null,0,0]
[45709,45.709000000000003,15.718800522510662,1.5071352495052004,1.000593699621771,3.4450138978105289E-2,1,0,4114.457788237456,1.5705532814019645,4.8995271134638614,1.3652507015630666,1.0027898112046028,7.4610196831051315E-2,1.0000000010446564,4.5708999968166536E-5,1.0000000010446564,4.5708999968166536E-5,1.0223339529430211,0.38429700722292687,-1.4885801649861354,-122.43505871331797,57.564941286682028,null,45709,2089312681,null,2.5703425891534746,-16.037820734976062,null,null,null,-4.058922754139612,-106.39723797834193,null,0,0]
[45975.25,45.975250000000003,15.809991342101153,1.5075029342735418,1.0006006341563389,3.4650647204766433E-2,1,0,4138.4240601225283,1.570554688916515,4.9268807625894038,1.3664080825642031,1.002822360691273,7.5043168103343369E-2,1.0000000010568617,4.597524996760701E-5,1.0000000010568617,4.597524996760701E-5,1.0226077816047829,0.3865447194603448,-1.5434625167315865,-122.53199667289616,57.468003327103844,null,45975.25,2113723612.5625,null,2.5679708047311705,-15.996395759518409,null,null,null,-4.1114333214627559,-106.53560091337776,null,0,0]
[46241.5,46.241500000000002,15.90118427456208,1.5078664017628784,1.0006076089180451,3.4851152644192751E-2,1,0,4162.3903320157051,1.5705560802226499,4.954240938540857,1.3675526816336094,1.0028550981589333,7.5476111188734332E-2,1.0000000010691381,4.6241499967040966E-5,1.0000000010691381,4.6241499967040966E-5,1.0228834939923299,0.38879253045359724,-1.5980386759978606,-122.62942862525352,57.370571374746476,null,46241.5,2138276322.25,null,2.5656324159937061,-15.955700591138639,null,null,null,-4.1636710919915645,-106.6737280341149,null,0,0]
[46507.75,46.507750000000001,15.992379283748946,1.5082257240222319,1.0006146239060481,3.5051655280321101E-2,1,0,4186.3566039168463,1.5705574555987414,4.9816075337775736,1.3686847064008743,1.0028880235891751,7.5909025927691096E-2,1.0000000010814853,4.6507749966468363E-5,1.0000000010814853,4.6507749966468363E-5,1.0231610949620287,0.39104043904442648,-1.6523127094140355,-122.72734674356184,57.272653256438161,null,46507.75,2162970810.0625,null,2.5633266505870873,-15.915723340346601,null,null,null,-4.2156393600011226,-106.81162340321526,null,0,0]
[46774,46.774000000000001,16.0835763343362,1.5085809714708336,1.0006216791195017,3.5252155097089656E-2,1,0,4210.3228758258174,1.5705588153168237,5.0089804430841403,1.3698043600875107,1.0029211369634856,7.6341912160743888E-2,1.0000000010939034,4.6773999965889173E-5,1.0000000010939034,4.6773999965889173E-5,1.0234405893913652,0.39328844404722707,-1.706288607569282,-122.82574335825048,57.174256641749523,null,46774,2187807076,null,2.5610527572150135,-15.87645236985675,null,null,null,-4.2673413647842944,-106.94929098839371,null,0,0]
[47046.25,47.046250000000001,16.176830604679996,1.5089400826153423,1.0006289349181929,3.5457170287478086E-2,1,0,4234.8292327435092,1.57056018976213,5.036976628546479,1.3709366602306652,1.002955190880118,7.6784523933718693E-2,1.0000000011066748,4.7046249965290067E-5,1.0000000011066748,4.7046249965290067E-5,1.0237283453348913,0.3955872067492151,-1.7611766550477177,-122.92684432411224,57.073155675887762,null,47046.25,2213349639.0625,null,2.5587598172947983,-15.837014886981418,null,null,null,-4.3199364723425173,-107.08982943713086,null,0,0]
[47318.5,47.3185,16.270086937286454,1.5092950771230329,1.0006362327739364,3.5662182496043367E-2,1,0,4259.335589669111,1.5705615483915203,5.064979200538831,1.3720564415805092,1.0029894412675044,7.7227105564510692E-2,1.0000000011195203,4.7318499964683989E-5,1.0000000011195203,4.7318499964683989E-5,1.0240180914202301,0.39788606766238876,-1.8157611825497333,-123.02842986280713,56.97157013719287,null,47318.5,2239040442.25,null,2.5564986777872223,-15.798292044922281,null,null,null,-4.372259860336956,-107.23013781788484,null,0,0]
[47590.75,47.59075,16.363345296896444,1.5096460252885564,1.0006435726858121,3.586719170561762E-2,1,0,4283.8419466024843,1.5705628914764262,5.0929880537167893,1.3731639078464759,1.0030238881055182,7.7669656882832186E-2,1.0000000011324397,4.7590749964070897E-5,1.0000000011324397,4.7590749964070897E-5,1.0243098329298235,0.40018502542994611,-1.8700462221401006,-123.13049225927087,56.869507740729134,null,47590.75,2264879485.5625,null,2.5542685994098613,-15.760272177783687,null,null,null,-4.4243148215499648,-107.37022008148713,null,0,0]
[47863,47.863,16.45660564904934,1.5099929958171499,1.0006509546528941,3.6072197899034431E-2,1,0,4308.3483035434965,1.5705642192821041,5.1210030850172643,1.3742592584026745,1.00305853137392,7.8112177718466264E-2,1.0000000011454333,4.7862999963450744E-5,1.0000000011454333,4.7862999963450744E-5,1.0246035751686735,0.40248407866484337,-1.9240357307837974,-123.23302395368565,56.766976046314355,null,47863,2290866769,null,2.5520688630588184,-15.722943867715999,null,null,null,-4.4761045938426118,-107.51008008596966,null,0,0]
[48141.75,48.141750000000002,16.552094632110222,1.510344199215679,1.0006585564376178,3.6282095495890815E-2,1,0,4333.4397525771992,1.570565563229237,5.1496932742434112,1.3753684113000801,1.0030942052541458,7.8565232029113627E-2,1.0000000011588139,4.814174996280844E-5,1.0000000011588139,4.814174996280844E-5,1.0249064090519409,0.40483811949269888,-1.9790121017249351,-123.3384821065127,56.6615178934873,null,48141.75,2317628093.0625,null,2.5498473145718226,-15.685429190248856,null,null,null,-4.5288594162967577,-107.65305291626382,null,0,0]
[48420.5,48.420499999999997,16.647585633348818,1.5106913736322451,1.0006662023076855,3.6491989894431774E-2,1,0,4358.531201618639,1.5705668917025422,5.1783897285221583,1.3764652726182651,1.0031300850130225,7.9018254023227624E-2,1.0000000011722723,4.8420499962158656E-5,1.0000000011722723,4.8420499962158656E-5,1.025211351667541,0.40719225736055559,-2.0336868237614727,-123.44441667633687,56.555583323663129,null,48420.5,2344544820.25,null,2.5476561105694957,-15.648616030208608,null,null,null,-4.5813429343309675,-107.79580064612826,null,0,0]
[48699.25,48.699249999999999,16.743078618234243,1.5110345879194893,1.000673892262087,3.6701881076236773E-2,1,0,4383.6226506676812,1.5705682049677314,5.207092344272783,1.3775500429573995,1.0031661706284589,7.9471243518339424E-2,1.0000000011858083,4.8699249961501343E-5,1.0000000011858083,4.8699249961501343E-5,1.025518408782208,0.40954649068054838,-2.0880639114667412,-123.5508200294278,56.449179970572203,null,48699.25,2371616950.5625,null,2.5454945407654477,-15.612492898821626,null,null,null,-4.6335584522321902,-107.93832713060615,null,0,0]
[48978,48.978000000000002,16.838573553018204,1.5113739093719252,1.0006816262998059,3.6911769022886953E-2,1,0,4408.7140997241995,1.5705695032844682,5.2358010201638807,1.3786229186332164,1.0032024620782409,7.9924200332059644E-2,1.0000000011994221,4.897799996083646E-5,1.0000000011994221,4.897799996083646E-5,1.0258275861868615,0.4119008178312184,-2.1421473048358508,-123.65768468599414,56.342315314005859,null,48978,2398844484,null,2.543361914305847,-15.57704855245243,null,null,null,-4.6855092191417,-108.08063613354172,null,0,0]
[49263.25,49.263249999999999,16.936297259739053,1.5117171818169384,1.0006895863189627,3.7126547849213688E-2,1,0,4434.3906408739458,1.5705708166652166,5.2651853063663312,1.3797086985318741,1.003239812852633,8.0387685343850199E-2,1.0000000012134338,4.9263249960148207E-5,1.0000000012134338,4.9263249960148207E-5,1.0261461742053766,0.41431013950148693,-2.1971918230086316,-123.76751117177872,56.232488828221278,null,49263.25,2426867800.5625,null,2.5412088209840995,-15.541468932996139,null,null,null,-4.7384006439927298,-108.22604223878261,null,0,0]
[49548.5,49.548499999999997,17.034022939266197,1.5120565155334715,1.0006975924991388,3.7341323248729331E-2,1,0,4460.0671820312518,1.5705721149237375,5.2945757308874777,1.3807824252600116,1.0032773791252785,8.0851135746138308E-2,1.000000001227527,4.9548499959451925E-5,1.000000001227527,4.9548499959451925E-5,1.0264669948968299,0.41671955588579612,-2.2519369069459696,-123.87780535448374,56.122194645516259,null,49548.5,2455053852.25,null,2.539084632433207,-15.506577059922188,null,null,null,-4.7910215393791757,-108.37122829456155,null,0,0]
[49833.75,49.833750000000002,17.131750557838849,1.5123919778478188,1.000705644839226,3.7556095201701854E-2,1,0,4485.7437231959902,1.5705733983197117,5.3239721920695064,1.3818442959768811,1.0033151608719717,8.1314551343737163E-2,1.0000000012417012,4.9833749958747578E-5,1.0000000012417012,4.9833749958747578E-5,1.0267900545443951,0.41912906513678017,-2.3063865481451229,-123.98855969420812,56.011440305791879,null,49833.75,2483402639.0625,null,2.5369886675001552,-15.47236164053275,null,null,null,-4.8433752156452794,-108.51619805367535,null,0,0]
[50119,50.119,17.229480082461528,1.5127236345622457,1.0007137433381104,3.7770863688401116E-2,1,0,4511.4202643680328,1.5705746671069072,5.3533745904668466,1.3828945036185818,1.0033531580683712,8.1777931941549142E-2,1.0000000012559571,5.011899995803512E-5,1.0000000012559571,5.011899995803512E-5,1.0271153594570714,0.42153866536986662,-2.3605446641890424,-124.09976680323369,55.900233196766308,null,50119,2511914161,null,2.5349202636998958,-15.438811623765181,null,null,null,-4.8954649278889377,-108.6609551794685,null,0,0]
[50410.75,50.41075,17.329438510671476,1.5130589791154858,1.0007220741250684,3.79905225046034E-2,1,0,4537.6818976338054,1.5705759499525676,5.383453022465492,1.3839567744055745,1.0033922439523018,8.2251835198004053E-2,1.0000000012706218,5.0410749957297998E-5,1.0000000012706218,5.0410749957297998E-5,1.027450406297356,0.42400326534531685,-2.4156393252011847,-124.21396880983693,55.786031190163072,null,50410.75,2541243715.5625,null,2.5328325658885769,-15.405174149104935,null,null,null,-4.9484718910897616,-108.80879466073198,null,0,0]
[50702.5,50.702500000000001,17.429398865327197,1.5133904771977194,1.0007304531960568,3.8210177653017152E-2,1,0,4563.9435309069604,1.5705772180348452,5.4135374617471284,1.3850072397354674,1.0034315551647885,8.2725701428872228E-2,1.0000000012853716,5.070249995655229E-5,1.0000000012853716,5.070249995655229E-5,1.0277878153263651,0.42646795638921753,-2.4704370845539749,-124.32862929344978,55.671370706550221,null,50702.5,2570743506.25,null,2.5307723549540544,-15.372210110022367,null,null,null,-5.0012094395080311,-108.9564191834274,null,0,0]
[50994.25,50.994250000000001,17.529361113472291,1.5137181945396634,1.0007388805498629,3.8429829112538762E-2,1,0,4590.2051641873713,1.5705784716071347,5.4436278087132459,1.3860460930390106,1.0034710916793494,8.3199530425705132E-2,1.0000000013002066,5.0994249955797949E-5,1.0000000013002066,5.0994249955797949E-5,1.0281275933769545,0.42893273636385537,-2.5249419056310947,-124.44374081870174,55.556259181298259,null,50994.25,2600413533.0625,null,2.5287389788109293,-15.339908426327064,null,null,null,-5.0536808844420245,-109.10383239237468,null,0,0]
[51286,51.286000000000001,{"$f":"SQRT(1+(A461/p_dom)^2)","v":17.629325222897222},{"$f":"ATAN(A461/p_dom)","v":1.5140421953844665},{"$f":"SQRT(1+(A461/z_ESR)^2)","v":1.0007473561852664},{"$f":"ATAN(A461/z_ESR)","v":3.8649476862066753E-2},{"$f":"IF(VIN_nom>Vout, 1, SQRT(1+(A461/z_RHP)^2))","v":1},{"$f":"IF(VIN_nom>Vout, 0, -ATAN(A461/z_RHP))","v":0},{"$f":"SQRT(1+(A461/EA_p1)^2)","v":4616.4667974749118},{"$f":"ATAN(A461/EA_p1)","v":1.5705797109170641},{"$f":"SQRT(1+(A461/EA_z1)^2)","v":5.473723965936057},{"$f":"ATAN(A461/EA_z1)","v":1.3870735235943081},{"$f":"SQRT(1+(A461/EA_hf_p)^2)","v":1.0035108534693553},{"$f":"ATAN(A461/EA_hf_p)","v":8.3673321980153842E-2},{"$f":"SQRT(1+(A461/Zero3)^2)","v":1.0000000013151269},{"$f":"ATAN(A461/Zero3)","v":5.1285999955034941E-5},{"$f":"SQRT(1+(A461/pole5)^2)","v":1.0000000013151269},{"$f":"ATAN(A461/pole5)","v":5.1285999955034941E-5},{"$f":"SQRT((1-(Z461/pterm2))^2+(A461/pterm1)^2)","v":1.0284697473094451},{"$f":"IF((ATAN((A461/pterm1)/(1-A461^2/pterm2))>0),ATAN((A461/pterm1)/(1-A461^2/pterm2)),PI()+ATAN((A461/pterm1)/(1-A461^2/pterm2)))","v":0.43139760309042796},{"$f":"20*LOG10(((E461*K461*G461*O461)/(C461*I461*S461*M461*Q461))*Adc)","v":-2.5791576786926966},{"$f":"((F461+L461+H461+P461)-(D461+J461+T461+N461+R461))*radconv","v":-124.55929610024093},{"$f":"IF(V461>0,V461,V461+180)","v":55.440703899759072},null,{"$f":"IF(U461<0,A461,1000000000)","v":51286},{"$f":"A461^2","v":2630253796},null,{"$f":"20*LOG10((K461/(I461*M461))*Aea_stability*Afb*0.8)","v":2.526731803266173},{"$f":"(L461-(J461+N461))*radconv","v":-15.30825825543304},null,null,null,{"$f":"20*LOG10((E461*G461/(C461*S461))*Am_stability)","v":-5.1058894819588705},{"$f":"(F461+H461-(D461+T461))*radconv","v":-109.25103784480793},null,{"$f":"SUM((U462<0)*(U461>0))*A461","v":0},0]
[51584.75,{"$f":"A462/1000","v":51.58475},17.731689681596155,1.5143701842930135,1.0007560852096724,3.8874390785234886E-2,1,0,4643.358529940283,1.5705809654349494,5.5045481461059111,1.3881139617673091,1.0035518026896626,8.4158442265749853E-2,1.0000000013304933,5.1584749954244559E-5,1.0000000013304933,5.1584749954244559E-5,1.0288225798585695,0.43392169730123414,-2.6343787133831253,-124.67807631459284,55.321923685407157,null,51584.75,2660986432.5625,null,2.524702976091064,-15.276512762776772,null,null,null,-5.1590816894741902,-109.40156355181608,null,0,0]
[51883.5,51.883499999999998,17.834056025914411,1.5146944079652678,1.0007648648577139,3.9099300773468432E-2,1,0,4670.2502624128783,1.5705822055055751,5.5353782186458282,1.3891428113083732,1.0035929880682426,8.4643522848833336E-2,1.0000000013459487,5.1883499953444974E-5,1.0000000013459487,5.1883499953444974E-5,1.0291779183139842,0.43644587772038668,-2.6893046923581716,-124.79730683877278,55.202693161227216,null,51883.5,2691897572.25,null,2.5227003309319591,-15.245428147267411,null,null,null,-5.2120050232901294,-109.55187869150538,null,0,0]
[52182.25,52.182250000000003,17.936424223567293,1.5150149308002487,1.0007736951280588,3.9324206804117343E-2,1,0,4697.1419948925723,1.5705834313770783,5.5662140856460667,1.3901602626181375,1.0036344095760226,8.5128563506024116E-2,1.0000000013614936,5.2182249952636133E-5,1.0000000013614936,5.2182249952636133E-5,1.029535770129941,0.43897014187395395,-2.7439395659892285,-124.9169803143902,55.083019685609798,null,52182.25,2722987215.0625,null,2.5207232414323815,-15.214993501170502,null,null,null,-5.26466280742161,-109.7019868132197,null,0,0]
[52481,52.481000000000002,18.038794243002396,1.5153318157382007,1.0007825760193672,3.9549108854533964E-2,1,0,4724.0337273792456,1.5705846432919461,5.5970556513363414,1.3911665019961508,1.0036760671837672,8.5613564014053956E-2,1.0000000013771275,5.2480999951817975E-5,1.0000000013771275,5.2480999951817975E-5,1.029896142789976,0.44149448724245505,-2.7982872119473741,-125.03708953152076,54.962910468479237,null,52481,2754255361,null,2.5187710984615679,-15.185198151409342,null,null,null,-5.3170583104089433,-109.85189138011143,null,0,0]
[52786.5,52.786499999999997,18.143479077079348,1.5156521623954757,1.0007917099148833,3.9779088234134112E-2,1,0,4751.5330555024175,1.570585868402689,5.6285998514241538,1.3921840716393115,1.0037189101407404,8.6109480939932315E-2,1.0000000013932073,5.2786499950971639E-5,1.0000000013932073,5.2786499950971639E-5,1.0302672725109381,0.44407594934450634,-2.8535697268661075,-125.16035577316133,54.839644226838672,null,52786.5,2786414582.25,null,2.5168000296427806,-15.155379846012529,null,null,null,-5.3703697565088868,-110.00497592714878,null,0,0]
[53092,53.091999999999999,18.248165751713287,1.5159688335345585,1.0008008967418205,4.0009063403717599E-2,1,0,4779.0323836326379,1.5705870794144599,5.6601498146701763,1.3931902983447122,1.0037619999248082,8.6605355410025064E-2,1.0000000014093802,5.3091999950115457E-5,1.0000000014093802,5.3091999950115457E-5,1.0306410541960551,0.44665749089800599,-2.9085598645261008,-125.28406287868276,54.715937121317239,null,53092,2818760464,null,2.5148538117907169,-15.126208202727723,null,null,null,-5.4234136763168186,-110.15785467595506,null,0,0]
[53397.5,53.397500000000001,18.352854235407992,1.5162818919891392,1.0008101364987212,4.0239034339074567E-2,1,0,4806.5317117697887,1.5705882765692494,5.6917054452362974,1.3941853687182473,1.0038053365041844,8.7101187185952805E-2,1.0000000014256465,5.3397499949249362E-5,1.0000000014256465,5.3397499949249362E-5,1.0310174959411325,0.44923910906048314,-2.9632615471023778,-125.4082035951927,54.591796404807297,null,53397.5,2851293006.25,null,2.5129318458442089,-15.097672530031661,null,null,null,-5.4761933929465867,-110.31053106516104,null,0,0]
[53703,53.703000000000003,18.457544497381289,1.51659139917022,1.0008194291841195,4.0469001015997853E-2,1,0,4834.0310399137488,1.5705894601035419,5.7232666493810234,1.3951694653391113,1.0038489198469065,8.7596976029461107E-2,1.0000000014420061,5.3702999948373292E-5,1.0000000014420061,5.3702999948373292E-5,1.031396605872958,0.45182080093929661,-3.0176786248661731,-125.53277081581447,54.467229184185527,null,53703,2884012209,null,2.5110335492318221,-15.069762366805628,null,null,null,-5.5287121740979952,-110.46300844900883,null,0,0]
[54015.75,54.015749999999997,18.564721036144686,1.5169046354241051,1.0008289972256734,4.0704420730757605E-2,1,0,4862.18297077837,1.5705906578570841,5.7555825288276754,1.396165735165088,1.0038937930749476,8.8104486007907351E-2,1.0000000014588506,5.4015749947466063E-5,1.0000000014588506,5.4015749947466063E-5,1.0317874851211002,0.45446383375328253,-3.073096236452852,-125.66072875020252,54.339271249797477,null,54015.75,2917701248.0625,null,2.5091141300961399,-15.041827116569547,null,null,null,-5.5822103665489919,-110.618901633633,null,0,0]
[54328.5,54.328499999999998,18.671899375510854,1.5172142757009641,1.0008386207345523,4.0939835931233723E-2,1,0,4890.3349016498869,1.570591841820538,5.7879040572027574,1.3971508789738818,1.0039389248491235,8.8611950487130969E-2,1.0000000014757928,5.4328499946548257E-5,1.0000000014757928,5.4328499946548257E-5,1.0321811780339176,0.45710693752742304,-3.1282235175506306,-125.7891190514507,54.210880948549303,null,54328.5,2951585912.25,null,2.5072183321019277,-15.014525943133544,null,null,null,-5.6354418496525582,-110.77459310831713,null,0,0]
[54641.25,54.641249999999999,18.779079484649905,1.5175203815121703,1.0008482997091557,4.1175246591463217E-2,1,0,4918.4868325281795,1.5705930122306944,5.8202311403955775,1.3981250802276195,1.0039843151345675,8.9119369211920901E-2,1.000000001492833,5.4641249945619819E-5,1.000000001492833,5.4641249945619819E-5,1.0325776934297664,0.45975010899428265,-3.183064376349241,-125.91793454551724,54.082065454482759,null,54641.25,2985666201.5625,null,2.505345580463763,-14.987848333836654,null,null,null,-5.6884099568130067,-110.93008621168059,null,0,0]
[54954,54.954000000000001,18.886261333431296,1.5178230129754431,1.0008580341478748,4.1410652685486146E-2,1,0,4946.6387634131333,1.570594169318954,5.8525636863587547,1.3990885184184045,1.0040299638962189,8.9626741927206308E-2,1.000000001509971,5.4953999944680701E-5,1.000000001509971,5.4953999944680701E-5,1.0329770401598375,0.46239334483097749,-3.2376226495857514,-126.04716820249787,53.952831797502128,null,54954,3019942116,null,2.5034953162485731,-14.961784003182697,null,null,null,-5.7411179658343254,-111.08538419931516,null,0,0]
[55274,55.274000000000001,18.995929583285964,1.5181291250685724,1.0008680516509842,4.1651511081961329E-2,1,0,4975.4432970192238,1.5705953396773604,5.8856513080632942,1.4000633334617263,1.0040769383592441,9.0145828392557706E-2,1.0000000015276074,5.5273999943708684E-5,1.0000000015276074,5.5273999943708684E-5,1.0333885841410013,0.46509791782110455,-3.2931571041215806,-126.17982331410914,53.820176685890857,null,55274,3055215076,null,2.5016248687140981,-14.935739735658705,null,null,null,-5.79478197283568,-111.24408357845043,null,0,{"$f":"IF(AJ474>0,W474,0)","v":0}]
[55594,55.594000000000001,19.105599592711915,1.5184317228990176,1.0008781272160543,4.189236464309827E-2,1,0,5004.24783063205,1.5705964965625621,5.9187444601571011,1.4010272485524642,1.004124183346206,9.066486615074075E-2,1.0000000015453463,5.5593999942725343E-5,1.0000000015453463,5.5593999942725343E-5,1.0338031110981674,0.46780255098385348,-3.348403624678741,-126.31290175658926,53.687098243410745,null,55594,3090692836,null,2.4997768280179868,-14.910316426741705,null,null,null,-5.8481804526967265,-111.40258532984755,null,0,0]
[55914,55.914000000000001,19.215271331581196,1.5187308665841628,1.0008882608413321,4.2133213341099388E-2,1,0,5033.0523642514981,1.5705976402058832,5.9518430503907629,1.4019804437303611,1.0041716988189211,9.1183854928992336E-2,1.0000000015631876,5.5913999941730618E-5,1.0000000015631876,5.5913999941730618E-5,1.0342206306171902,0.47050724057912113,-3.4033661000803166,-126.44639644381948,53.553603556180519,null,55914,3126375396,null,2.4979506436635179,-14.885503758540022,null,null,null,-5.9013167437438332,-111.56089268527944,null,0,0]
[56234,56.234000000000002,19.324944770449328,1.5190266148791793,1.0008984525250537,4.2374057148170476E-2,1,0,5061.8568978774538,1.5705987708333831,5.9849469885405409,1.4029230951307214,1.0042194847389949,9.1702794454706416E-2,1.0000000015811312,5.6233999940724435E-5,1.0000000015811312,5.6233999940724435E-5,1.0346411523185486,0.47321198280572191,-3.4580483482793229,-126.58030043154723,53.419699568452771,null,56234,3162262756,null,2.4961457803573706,-14.861291636577162,null,null,null,-5.9541941286366926,-111.71900879497009,null,0,0]
[56561.5,56.561500000000002,19.437190410743426,1.5193258390057753,1.0009089431900196,4.2620540638749406E-2,1,0,5091.3365377668906,1.5705999147135086,6.0188322455563901,1.403877102382515,1.0042686706308368,9.2233845343650506E-2,1.0000000015996016,5.6561499939682754E-5,1.0000000015996016,5.6561499939682754E-5,1.0350746486248072,0.47598016789356951,-3.5137259673209797,-126.71775949483856,53.28224050516144,null,56561.5,3199203282.25,null,2.4943201488834874,-14.837123561571142,null,null,null,-6.0080461162044676,-111.88063593326743,null,0,0]
[56889,56.889000000000003,19.549437771363355,1.5196216270374368,1.0009194946630415,4.2867018947553223E-2,1,0,5120.8161776629131,1.5706010454234001,6.0527229191535517,1.4048204270457523,1.0043181397137673,9.2764844067035793E-2,1.0000000016181791,5.6888999938628936E-5,1.0000000016181791,5.6888999938628936E-5,1.0355113099890469,0.47874839985629464,-3.5691179414165815,-126.85563299079202,53.144367009207983,null,56889,3236358321,null,2.492515761743304,-14.813563810338502,null,null,null,-6.0616337031598855,-112.0420691804535,null,0,0]
[57216.5,57.216500000000003,19.661686822845411,1.5199140377722085,1.0009301069421968,4.3113492044798404E-2,1,0,5150.2958175654076,1.5706021631892115,6.0866189188524409,1.4057532458993991,1.0043678919459413,9.3295790333152148E-2,1.000000001636864,5.7216499937562915E-5,1.000000001636864,5.7216499937562915E-5,1.035951146834527,0.48151667441997598,-3.6242281439179713,-126.9939139126714,53.006086087328598,null,57216.5,3273727872.25,null,2.4907320913939253,-14.790602250434482,null,null,null,-6.1149602353118961,-112.20331166223693,null,0,0]
[57544,57.543999999999997,19.773937536394467,1.5202031286753599,1.0009407800255512,4.3359959900705194E-2,1,0,5179.7754574742621,1.5706032682319488,6.1205201561637415,1.4066757318798042,1.0044179272852831,9.38266838504654E-2,1.0000000016556558,5.7543999936484628E-5,1.0000000016556558,5.7543999936484628E-5,1.0363941696209369,0.4842849872434179,-3.6790603777945656,-127.13259539340443,52.867404606595571,null,57544,3311311936,null,2.4889686248851515,-14.76822896929521,null,null,null,-6.1680290026797167,-112.36436642410921,null,0,0]
[57879,57.878999999999998,19.888760567230008,1.5204954637890118,1.0009517604374714,4.3612066604855185E-2,1,0,5209.9302036470417,1.5706043856427023,6.155203086370836,1.4076088293320412,1.0044694013344437,9.4369680356228364E-2,1.0000000016749893,5.7878999935368865E-5,1.0000000016749893,5.7878999935368865E-5,1.0368506451265358,0.48711673153145713,-3.7348646142863511,-127.27486019295344,52.72513980704656,null,57879,3349978641,null,2.4871851568504275,-14.74594185439835,null,null,null,-6.2220497711367813,-112.52891833855512,null,0,0]
[58214,58.213999999999999,20.003585278242486,1.5207844427992621,1.0009628044662755,4.3864167761836735E-2,1,0,5240.0849498262514,1.5706054901928863,6.1898913156747826,1.4085314694002358,1.0045211715161881,9.4912621053050969E-2,1.0000000016944348,5.8213999934240111E-5,1.0000000016944348,5.8213999934240111E-5,1.037310476418974,0.48994850644733479,-3.7903858363069549,-127.41753000411448,52.582469995885518,null,58214,3388869796,null,2.4854217876054321,-14.724249968998764,null,null,null,-6.2758076239123826,-112.69328003511571,null,0,0]
[58549,58.548999999999999,20.118411640663339,1.5210701231225732,1.0009739121098578,4.4116263339789408E-2,1,0,5270.2396960117812,1.5706065821032544,6.2245847554835105,1.40944382535659,1.004573237784733,9.5455505629485224E-2,1.0000000017139927,5.8548999933098293E-5,1.0000000017139927,5.8548999933098293E-5,1.037773674808822,0.49278030712592719,-3.8456278966131645,-127.56059790672057,52.439402093279426,null,58549,3427985401,null,2.4836780124786815,-14.703143380134183,null,null,null,-6.3293059090918433,-112.85745452658641,null,0,0]
[58884,58.884,20.233239626376687,1.5213525608741858,1.0009850833661007,4.4368353306857032E-2,1,0,5300.3944422035229,1.5706076615895357,6.2592833191559523,1.4103460667004966,1.0046256000940428,9.5998333774279881E-2,1.0000000017336628,5.8883999931943336E-5,1.0000000017336628,5.8883999931943336E-5,1.0382402516447589,0.49561212862826837,-3.900594578188838,-127.7040571177087,52.2959428822913,null,58884,3467325456,null,2.4819533407734395,-14.682612370731727,null,null,null,-6.3825479189622776,-113.02144474697694,null,0,0]
[59227,59.226999999999997,20.350811426149352,1.5216384410355785,1.0009965873058493,4.4626457486103187E-2,1,0,5331.269301743484,1.5706087542020928,6.2948157256203574,1.4112595474557663,1.004679519527842,9.6554066185237541E-2,1.0000000017539188,5.9226999930747102E-5,1.0000000017539188,5.9226999930747102E-5,1.0387214829340725,0.49851159205869922,-3.9565924546379434,-127.851340713505,52.148659286495004,null,59227,3507837529,null,2.4802067777850429,-14.662177502563019,null,null,null,-6.4367992324229863,-113.18916321094197,null,0,0]
[59570,59.57,20.4683848700349,1.5219210369436005,1.0010081579282204,4.4884555715706466E-2,1,0,5362.1441612897352,1.570609834232273,6.3303533258059614,1.4121627726853543,1.0047337492120105,9.7109738777386198E-2,1.0000000017742925,5.9569999929536936E-5,1.0000000017742925,5.9569999929536936E-5,1.0392062801536825,0.50141106660301216,-4.0123094524125777,-127.99902056316817,52.000979436831827,null,59570,3548584900,null,2.4784792433320417,-14.642326084450181,null,null,null,-6.4907886957446195,-113.35669447871798,null,0,0]
[59913,59.912999999999997,20.585959929863062,1.5222004048259732,1.0010197952309015,4.5142647961487523E-2,1,0,5393.0190208421691,1.5706109018961774,6.3658960327309542,1.4130559126820785,1.0047882890963151,9.7665351217286922E-2,1.0000000017947837,5.9912999928312749E-5,1.0000000017947837,5.9912999928312749E-5,1.0396946556060649,0.50431054671909281,-4.0677494156518339,-128.14708980894517,51.852910191054832,null,59913,3589567569,null,2.4767702533113924,-14.623048352610487,null,null,null,-6.5445196689632281,-113.52404145633466,null,0,0]
[60256,60.256,20.703536578103094,1.5224765996351779,1.0010314992115672,4.5400734189271763E-2,1,0,5423.8938804006821,1.5706119574049868,6.4014437613329607,1.413939134021337,1.0048431391302448,9.8220903171721538E-2,1.0000000018153927,6.0255999927074462E-5,1.0000000018153927,6.0255999927074462E-5,1.0401866216335478,0.50721002678357985,-4.1229161190400969,-128.29554172808494,51.704458271915058,null,60256,3630785536,null,2.475079337051783,-14.604334755984461,null,null,null,-6.5979954560918808,-113.69120697210046,null,0,0]
[60607,60.606999999999999,20.823857155182825,1.5227560073901849,1.0010435451978119,4.5664833655085668E-2,1,0,5455.4888533078511,1.5706130251637342,6.437825703418067,1.4148328569050101,1.004899589496971,9.8789349640699825E-2,1.0000000018366042,6.0606999925792613E-5,1.0000000018366042,6.0606999925792613E-5,1.0406937921749353,0.51017712719969277,-4.1790904821474335,-128.44784537201463,51.552154627985374,null,60607,3673208449,null,2.473367216082333,-14.585758968317052,null,null,null,-6.6524576982297656,-113.86208640369757,null,0,0]
[60958,60.957999999999998,20.944179339275184,1.523032204828173,1.0010556610036869,4.5928926746512229E-2,1,0,5487.0838262211682,1.5706140806260378,6.4742127298606933,1.4157165345040856,1.0049563645417552,9.9357732064516979E-2,1.0000000018579389,6.0957999924495844E-5,1.0000000018579389,6.0957999924495844E-5,1.0412047490116254,0.51314421538638977,-4.2349864722425918,-128.60053592121955,51.399464078780454,null,60958,3715877764,null,2.4716730657264168,-14.567754359009342,null,null,null,-6.7066595379690073,-114.03278156221019,null,0,0]
[61309,61.308999999999997,21.064503102842014,1.5233052469201489,1.0010678466266574,4.619301342694513E-2,1,0,5518.6787991405281,1.5706151240030928,6.5106047554131585,1.4165903338757448,1.0050134642095729,9.9926050086816695E-2,1.0000000018793966,6.1308999923184051E-5,1.0000000018793966,6.1308999923184051E-5,1.0417195054960449,0.51611128505335335,-4.2906079193151818,-128.75360658700646,51.246393412993541,null,61309,3758793481,null,2.4699964224620166,-14.550311348072773,null,null,null,-6.7606043417771966,-114.20329523893369,null,0,0]
[61660,61.66,21.184828418970422,1.5235751873901311,1.0010801020641737,4.6457093659783413E-2,1,0,5550.273772065827,1.5706161555012852,6.5470016967116251,1.4174544184233726,1.005070888445097,0.10049430335148984,1.0000000019009778,6.1659999921857147E-5,1.0000000019009778,6.1659999921857147E-5,1.0422380750220066,0.5190783298212035,-4.3459585843472581,-128.90705071321773,51.092949286782272,null,61660,3801955600,null,2.4683368356461139,-14.533420564604533,null,null,null,-6.8142954199933712,-114.37363014861317,null,0,0]
[62019,62.018999999999998,21.307897771075744,1.5238481266102488,1.0010927090447299,4.6727186107463792E-2,1,0,5582.5888583401929,1.5706171984315649,6.5842331980380937,1.4183283143177416,1.0051299571854626,0.10107544089822601,1.0000000019231781,6.2018999920484278E-5,1.0000000019231781,6.2018999920484278E-5,1.0427724221919776,0.52211296704159682,-4.4022945426420987,-129.0643716641122,50.935628335887799,null,62019,3846356361,null,2.4666566108402486,-14.516706502371299,null,null,null,-6.8689511534823442,-114.54766516174091,null,0,0]
[62378,62.378,21.43096869229926,1.5241179310520534,1.001105389053087,4.6997271732860543E-2,1,0,5614.9039446205597,1.5706182293572291,6.621469671154796,1.419192381990183,1.0051893653392079,0.10165650994903321,1.0000000019455073,6.2377999919095429E-5,1.0000000019455073,6.2377999919095429E-5,1.0433107866700972,0.52514756443079968,-4.4583549794800392,-129.22206961746375,50.777930382536255,null,62378,3891014884,null,2.4649933146968741,-14.50055094343319,null,null,null,-6.9233482941769147,-114.72151867403056,null,0,0]
[62737,62.737000000000002,21.554041155762565,1.5243846543741919,1.0011181420864701,4.7267350496830202E-2,1,0,5647.2190309068264,1.5706192484843595,6.6587110326528274,1.420046785043656,1.0052491128461569,0.10223751012370458,1.0000000019679656,6.2736999917690508E-5,1.0000000019679656,6.2736999917690508E-5,1.0438531829175028,0.52818211487432676,-4.5141437056253935,-129.38013785856342,50.619862141436585,null,62737,3935931169,null,2.4633465041535278,-14.484944504054495,null,null,null,-6.9774902097789226,-114.89519335450888,null,0,0]
[63096,63.095999999999997,21.677115135197312,1.5246483490184779,1.0011309681420886,4.7537422360235268E-2,1,0,5679.5341171988921,1.5706202560143481,6.6959572009680572,1.4208916834981242,1.0053091996458046,0.10281844104230933,1.0000000019905526,6.3095999916269391E-5,1.0000000019905526,6.3095999916269391E-5,1.0443996254379904,0.53121661116042773,-4.5696644633971175,-129.53856980244717,50.461430197552829,null,63096,3981105216,null,2.4617157484694827,-14.469878005537133,null,null,null,-7.0313802118666011,-115.06869179691004,null,0,0]
[63463.25,63.463250000000002,21.803018958248959,1.5249150230586268,1.001144164502618,4.7813693429418297E-2,1,0,5712.5918203823958,1.5706212749031196,6.7340641955248435,1.4217463265945243,1.0053710182847673,0.10341264998718773,1.000000002013792,6.3463249914798815E-5,1.000000002013792,6.3463249914798815E-5,1.0449628274677363,0.53432077803275624,-4.6261876717540389,-129.70101219417953,50.298987805820474,null,63463.25,4027584100.5625,null,2.4600636931007238,-14.455014605840271,null,null,null,-7.0862513648547623,-115.24599758833926,null,0,0]
[63830.5,63.830500000000001,21.928924314018694,1.5251786348887162,1.0011574372741623,4.8089957194399874E-2,1,0,5745.6495235717621,1.5706222820674995,6.7721760533853068,1.4225913509315899,1.0054331918606978,0.10400678565291396,1.0000000020371662,6.3830499913311096E-5,1.0000000020371662,6.3830499913311096E-5,1.0455302947168985,0.53742487265116834,-4.6824381644828348,-129.86382165682468,50.136178343175317,null,63830.5,4074332730.25,null,2.4584275648249561,-14.440697450113117,null,null,null,-7.1408657293077908,-115.42312420671156,null,0,0]
[64197.75,64.197749999999999,22.054831176256833,1.5254392369165264,1.0011707864536827,4.8366213613301519E-2,1,0,5778.7072267668909,1.5706232777086997,6.8102926929011751,1.4234269167984488,1.0054957203077544,0.10460084763366405,1.0000000020606754,6.4197749911806178E-5,1.0000000020606754,6.4197749911806178E-5,1.0461020428465084,0.54052888697979284,-4.7384197361534959,-130.02699153949121,49.973008460508794,null,64197.75,4121351105.0625,null,2.456806939949713,-14.426917342741755,null,null,null,-7.1952266761032107,-115.60007419674949,null,0,0]
[64565,64.564999999999998,22.180739519309402,1.5256968803615296,1.0011842120381229,4.8642462644251476E-2,1,0,5811.7649299676823,1.5706242620233539,6.848414034231789,1.4242531809687666,1.0055586035597364,0.10519483552392273,1.0000000020843196,6.456499991028394E-5,1.0000000020843196,6.456499991028394E-5,1.0466780875613242,0.54363281287664977,-4.7941361133718141,-130.19051531829942,49.809484681700582,null,64565,4168639225,null,2.4552014065786274,-14.413665289288771,null,null,null,-7.2493375199504415,-115.77685002901065,null,0,0]
[64941,64.941000000000003,22.309649228749549,1.5259576494649922,1.0011980366509377,4.8925285812718995E-2,1,0,5845.6102571443071,1.570625258256132,6.8874484340749555,1.4250896548398055,1.0056233525675684,0.10580289842779679,1.0000000021086666,6.4940999908707386E-5,1.0000000021086666,6.4940999908707386E-5,1.0472723247664926,0.5468105918485392,-4.8509090484900677,-130.35829513228876,49.64170486771124,null,64941,4217333481,null,2.4535728371947085,-14.400635384809318,null,null,null,-7.3044818856847797,-115.95765974747943,null,0,0]
[65317,65.316999999999993,22.438560437826368,1.5262154223097844,1.0012119413463116,4.9208101148188639E-2,1,0,5879.4555843266671,1.5706262430192002,6.9264875986689125,1.42591670019304,1.005688473347119,0.10641088280933333,1.0000000021331552,6.5316999907112468E-5,1.0000000021331552,6.5316999907112468E-5,1.0478710991878832,0.54998826051187044,-4.9074116961058873,-130.52643245999758,49.473567540002421,null,65317,4266310489,null,2.4519592494338363,-14.388140538442624,null,null,null,-7.359370945539724,-116.13829192155497,null,0,0]
[65693,65.692999999999998,22.567473120840926,1.5264702502081389,1.001225926120908,4.9490908605745995E-2,1,0,5913.3009115146624,1.5706272165095028,6.9655314478997932,1.4267344744362793,1.0057539658261732,0.10701878823435194,1.0000000021577851,6.5692999905499078E-5,1.0000000021577851,6.5692999905499078E-5,1.0484744278171783,0.55316580978396357,-4.9636478447057168,-130.69492069117877,49.305079308821234,null,65693,4315570249,null,2.4503602371875051,-14.376171717792907,null,null,null,-7.4140080818932228,-116.31874897338584,null,0,0]
[66069,66.069000000000003,22.696387252677876,1.526722183308038,1.0012399909713714,4.9773708140484221E-2,1,0,5947.1462387081983,1.5706281789195,7.0045799034304563,1.4275431315175604,1.0058198299321233,0.10762661426901843,1.0000000021825564,6.6068999903867121E-5,1.0000000021825564,6.6068999903867121E-5,1.0490823276906973,0.55634323046622969,-5.0196212150420827,-130.86375334023006,49.136246659769938,null,66069,4365112761,null,2.4487754056755837,-14.364720088457698,null,null,null,-7.4683966207176695,-116.49903325177235,null,0,0]
[66453.75,66.453749999999999,22.82830285511697,1.526977033709729,1.0012544660180906,5.0063080533051647E-2,1,0,5981.779189877966,1.5706291524521274,7.0445417548001927,1.428361326267223,1.005887611403615,0.10824850255612427,1.0000000022080504,6.6453749902177839E-5,1.0000000022080504,6.6453749902177839E-5,1.0497091240386991,0.55959445095329208,-5.0766289471234058,-131.0368648355427,48.963135164457299,null,66453.75,4416100889.0625,null,2.4471679723455635,-14.353528335972822,null,null,null,-7.5237969194689711,-116.68333649956988,null,0,0]
[66838.5,66.838499999999996,22.96021992318817,1.5272289556610954,1.0012690249038079,5.0352444534648703E-2,1,0,6016.412141053338,1.5706301147766439,7.0845082688822929,1.4291702900327683,1.0059557818446407,0.10887030679687895,1.0000000022336926,6.6838499900468893E-5,1.0000000022336926,6.6838499900468893E-5,1.0503407430953058,0.56284551693769247,-5.1333692005548937,-131.21032361018001,48.789676389819988,null,66838.5,4467385082.25,null,2.4455745858105407,-14.342860022239975,null,null,null,-7.5789437863654356,-116.86746358794004,null,0,0]
[67223.25,67.223249999999993,23.092138431773598,1.5274779993179768,1.0012836676248658,5.0641800097184678E-2,1,0,6051.045092234217,1.570631066085497,7.124479367206872,1.4299701771146041,1.0060243411761276,0.10949202652758765,1.0000000022594826,6.7223249898740146E-5,1.0000000022594826,6.7223249898740146E-5,1.0509772032535383,0.56609641818810619,-5.1898457521334729,-131.38412309810005,48.615876901899952,null,67223.25,4518965340.5625,null,2.4439948575255874,-14.332706290955652,null,null,null,-7.6338406096590639,-117.05141680714439,null,0,0]
[67608,67.608000000000004,23.224058356325799,1.5277242136980564,1.0012983941775864,5.093114717257733E-2,1,0,6085.6780434205102,1.5706320065667536,7.1644549730463032,1.4307611384163841,1.0060932893185739,0.11011366128494289,1.0000000022854207,6.7607999896991504E-5,1.0000000022854207,6.7607999896991504E-5,1.0516185229514869,0.56934714434714162,-5.246062311273139,-131.55825685521677,48.441743144783231,null,67608,4570841664,null,2.4424284097995592,-14.323058480207301,null,null,null,-7.6884907210726992,-117.23519837500943,null,0,0]
[68001.75,68.001750000000001,23.359065568071635,1.5279733081411306,1.0013135520032725,5.1227253763189221E-2,1,0,6121.1211221254425,1.5706329580288656,7.2053702694010715,1.4315615143199731,1.0061642527594843,0.11074974874506825,1.0000000023121189,6.8001749895181245E-5,1.0000000023121189,6.8001749895181245E-5,1.0522798949443897,0.57267371866207084,-5.3033284930381033,-131.73680340638919,48.263196593610814,null,68001.75,4624238003.0625,null,2.4408386871154368,-14.313699960537432,null,null,null,-7.744167180153541,-117.42310344585177,null,0,0]
[68395.5,68.395499999999998,23.494074212544096,1.5282195397580263,1.0013287976205805,5.152335136308784E-2,1,0,6156.5642008358527,1.5706338985359236,7.2462901294009692,1.4323528512671038,1.0062356232442362,0.11138574622941122,1.0000000023389721,6.8395499893349884E-5,1.0000000023389721,6.8395499893349884E-5,1.0529463956965113,0.57600008724634721,-5.3603300282950475,-131.91568676848124,48.084313231518763,null,68395.5,4677944420.25,null,2.4392621064654678,-14.304853552012903,null,null,null,-7.7995921347605162,-117.61083321646835,null,0,0]
[68789.25,68.789249999999996,23.629084265184829,1.5284629575908175,1.0013441310255,5.1819439920765036E-2,1,0,6192.0072795516453,1.5706348282760481,7.2872144761673541,1.4331353005441616,1.0063074006862234,0.11202165324265806,1.0000000023659803,6.8789249891497314E-5,1.0000000023659803,6.8789249891497314E-5,1.0536180451104689,0.57932623859052446,-5.4170706840558172,-132.09490040923302,47.90509959076698,null,68789.25,4731960915.5625,null,2.4376982960401379,-14.296510568961418,null,null,null,-7.8547689800959528,-117.7983898402716,null,0,0]
[69183,69.183000000000007,23.764095701993327,1.5287036095684354,1.0013595522139986,5.2115519384722142E-2,1,0,6227.4503582727302,1.5706357474330765,7.3281432345305753,1.4339090101017931,1.0063795849983703,0.11265746928992866,1.0000000023931437,6.9182999889623426E-5,1.0000000023931437,6.9182999889623426E-5,1.0542948631339206,0.58265216104830198,-5.4735541602394511,-132.27443791566773,47.725562084332267,null,69183,4786287489,null,2.4361468944324667,-14.288662516613938,null,null,null,-7.909701054671916,-117.98577539905379,null,0,0]
[69586,69.585999999999999,23.902280244894111,1.5289470997600416,1.0013754265749315,5.2418544895835292E-2,1,0,6263.7260680548707,1.570636677411545,7.370037985450046,1.4346919965901215,1.0064538862973555,0.11330812725559526,1.0000000024211055,6.958599988768329E-5,1.0000000024211055,6.958599988768329E-5,1.0549929540409513,0.58605596697497042,-5.531102029342069,-132.45852192499129,47.541478075008712,null,69586,4842211396,null,2.4345715300889612,-14.281133934597499,null,null,null,-7.9656735594310284,-118.17738799039378,null,0,0]
[69989,69.989000000000004,24.040466188609614,1.5291877907753124,1.0013913928837026,5.2721560771819193E-2,1,0,6300.0017778423662,1.570637596680293,7.4119372036229212,1.4354661312011363,1.0065286136214071,0.11395868888353926,1.0000000024492299,6.9988999885720561E-5,1.0000000024492299,6.9988999885720561E-5,1.0556965016748772,0.58945950801112679,-5.5883881277761036,-132.64293197011276,47.357068029887245,null,69989,4898460121,null,2.4330084302689974,-14.274106394425196,null,null,null,-8.0213965580450992,-118.36882557568755,null,0,0]
[70392,70.391999999999996,24.178653509122007,1.5294257305801902,1.0014074511359135,5.3024566957491033E-2,1,0,6336.2774876351241,1.5706385054232628,7.4538408137157877,1.4362315622881257,1.006603766875644,0.11460915364460279,1.0000000024775169,7.0391999883735092E-5,1.0000000024775169,7.0391999883735092E-5,1.0564055275616844,0.59286277122766184,-5.6454162143263487,-132.82766154185978,47.172338458140217,null,70392,4955033664,null,2.431457239139275,-14.267571376300346,null,null,null,-8.0768734534656268,-118.56009016555943,null,0,0]
[70795,70.795000000000002,24.316842182959171,1.5296609660515492,1.0014236013271414,5.3327563397678662E-2,1,0,6372.5531974330552,1.5706394038202078,7.4957487420719735,1.4369884349279867,1.0066793459646735,0.11525952101011346,1.0000000025059659,7.0794999881726759E-5,1.0000000025059659,7.0794999881726759E-5,1.057120053271797,0.59626574354723116,-5.7021899809191172,-133.01270424767847,46.987295752321529,null,70795,5011932025,null,2.4299176108390217,-14.26152054793747,null,null,null,-8.1321075917581389,-118.75118369974101,null,0,0]
[71207.25,71.207250000000002,24.458204057554862,1.529898850458721,1.0014402173353358,5.3637504329705543E-2,1,0,6409.6615382924037,1.5706403123161161,7.5386229699622964,1.4377539725090456,1.0067571003176243,0.11592471483739523,1.0000000025352362,7.1207249879648533E-5,1.0000000025352362,7.1207249879648533E-5,1.0578566925477175,0.59974650901385973,-5.7600075052576196,-133.20231166301991,46.797688336980087,null,71207.25,5070472452.5625,null,2.4283542571624821,-14.255823327326786,null,null,null,-8.1883617624201008,-118.9464883356931,null,0,0]
[71619.5,71.619500000000002,24.59956730030849,1.5301340008382021,1.0014569295420659,5.3947434946981968E-2,1,0,6446.769879156981,1.5706412103532126,7.5815015658759553,1.4385108512484039,1.0068353000743844,0.1165898056292288,1.0000000025646762,7.1619499877546101E-5,1.0000000025646762,7.1619499877546101E-5,1.0585991328166982,0.60322694192068727,-5.8175665088599029,-133.39223357917504,46.607766420824959,null,71619.5,5129352780.25,null,2.4268023016007207,-14.250615719058917,null,null,null,-8.2443688104606228,-119.14161786011613,null,0,0]
[72031.75,72.031750000000002,24.740931887768152,1.5303664640287742,1.001473737942516,5.4257355190483796E-2,1,0,6483.8782200266978,1.5706420981110705,7.6243844561172818,1.4392592163748814,1.0069139451311797,0.11725479282128891,1.0000000025942863,7.203174987541933E-5,1.0000000025942863,7.203174987541933E-5,1.0593473973048408,0.60670702779122021,-5.8748707367502684,-133.58246351070517,46.417536489294832,null,72031.75,5188573008.0625,null,2.42526140420807,-14.245889380090771,null,null,null,-8.3001321409583397,-119.33657413061438,null,0,0]
[72444,72.444000000000003,24.882297797014701,1.5305962858059592,1.0014906425318424,5.4567265001198857E-2,1,0,6520.9865609014669,1.5706429757651743,7.6672715686320183,1.4399992099065657,1.0069930353836778,0.11791967584979257,1.0000000026240665,7.2443999873268082E-5,1.0000000026240665,7.2443999873268082E-5,1.0601015092812724,0.61018675198920069,-5.9319238674368391,-133.77299508585489,46.227004914145112,null,72444,5248133136,null,2.4237312345780175,-14.241636151137451,null,null,null,-8.3556551020148557,-119.53135893471743,null,0,0]
[72865.75,72.865750000000006,25.026922724807747,1.5308287168894572,1.0015080362093174,5.4884305599331495E-2,1,0,6558.9500363800653,1.5706438633673163,7.7111512791954153,1.4407477376736797,1.0070744088065946,0.1185997722427236,1.0000000026547087,7.2865749871041768E-5,1.0000000026547087,7.2865749871041768E-5,1.0608790746929042,0.61374627418900252,-5.9900356701930519,-133.9682229438211,46.031777056178896,null,72865.75,5309417523.0625,null,2.4221765698679834,-14.237766178067108,null,null,null,-8.412212240061038,-119.73045676575398,null,0,0]
[73287.5,73.287499999999994,25.171548989123732,1.531058477061872,1.0015255305496109,5.5201335153393802E-2,1,0,6596.9135118637714,1.5706447407536319,7.7550352613749896,1.4414877943544853,1.0071562479573539,0.11927975842405641,1.0000000026855287,7.3287499868789541E-5,1.0000000026855287,7.3287499868789541E-5,1.0616628096010292,0.61730538635614485,-6.0478922519550791,-134.16375336700276,45.836246632997245,null,73287.5,5371057656.25,null,2.4206324626759632,-14.234374662506955,null,null,null,-8.4685247146310445,-119.92937870449579,null,0,0]
[73709.25,73.709249999999997,25.316176567056797,1.5312856120742973,1.0015431255474474,5.5518353600238352E-2,1,0,6634.876987352498,1.5706456080994797,7.798923443062507,1.4422195221436953,1.0072385527224337,0.11995963379190673,1.0000000027165268,7.3709249866511239E-5,1.0000000027165268,7.3709249866511239E-5,1.0624527390511829,0.62086407230467,-6.1054973453815187,-134.35957988138037,{"$f":"IF(V524>0,V524,V524+180)","v":45.64042011861963},null,73709.25,5433053535.5625,null,2.4190985881965834,-14.231453432861967,null,null,null,-8.5245959335781034,-120.12812644851844,null,0,0]
[74131,74.131,{"$f":"SQRT(1+(A525/p_dom)^2)","v":25.460805436221314},{"$f":"ATAN(A525/p_dom)","v":1.5315101666393762},{"$f":"SQRT(1+(A525/z_ESR)^2)","v":1.0015608211975227},{"$f":"ATAN(A525/z_ESR)","v":5.5835360876731056E-2},{"$f":"IF(VIN_nom>Vout, 1, SQRT(1+(A525/z_RHP)^2))","v":1},{"$f":"IF(VIN_nom>Vout, 0, -ATAN(A525/z_RHP))","v":0},{"$f":"SQRT(1+(A525/EA_p1)^2)","v":6672.8404628461585},{"$f":"ATAN(A525/EA_p1)","v":1.570646465576228},{"$f":"SQRT(1+(A525/EA_z1)^2)","v":7.8428157537569758},{"$f":"ATAN(A525/EA_z1)","v":1.4429430600889877},{"$f":"SQRT(1+(A525/EA_hf_p)^2)","v":1.0073213229877023},{"$f":"ATAN(A525/EA_hf_p)","v":0.12063939774499625},{"$f":"SQRT(1+(A525/Zero3)^2)","v":1.0000000027477025},{"$f":"ATAN(A525/Zero3)","v":7.4130999864206713E-5},{"$f":"SQRT(1+(A525/pole5)^2)","v":1.0000000027477025},{"$f":"ATAN(A525/pole5)","v":7.4130999864206713E-5},{"$f":"SQRT((1-(Z525/pterm2))^2+(A525/pterm1)^2)","v":1.06324888812967},{"$f":"IF((ATAN((A525/pterm1)/(1-A525^2/pterm2))>0),ATAN((A525/pterm1)/(1-A525^2/pterm2)),PI()+ATAN((A525/pterm1)/(1-A525^2/pterm2)))","v":0.62442231567691531},{"$f":"20*LOG10(((E525*K525*G525*O525)/(C525*I525*S525*M525*Q525))*Adc)","v":-6.162854616896885},{"$f":"((F525+L525+H525+P525)-(D525+J525+T525+N525+R525))*radconv","v":-134.55569612371497},{"$f":"IF(V525>0,V525,V525+180)","v":45.444303876285034},null,{"$f":"IF(U525<0,A525,1000000000)","v":74131},{"$f":"A525^2","v":5495405161},null,{"$f":"20*LOG10((K525/(I525*M525))*Aea_stability*Afb*0.8)","v":2.4175746307517123},{"$f":"(L525-(J525+N525))*radconv","v":-14.228994497655014},null,null,null,{"$f":"20*LOG10((E525*G525/(C525*S525))*Am_stability)","v":-8.5804292476485973},{"$f":"(F525+H525-(D525+T525))*radconv","v":-120.32670162605993},null,{"$f":"SUM((U526<0)*(U525>0))*A525","v":0},0]
[74562.75,{"$f":"A526/1000","v":74.562749999999994},25.608864876001377,1.531737418229592,1.0015790406791316,5.6159872990203349E-2,1,0,6711.7040800281547,1.5706473333363389,7.887752988196099,1.4436754121759245,1.0074065378635775,0.12133516336124993,1.0000000027798017,7.4562749861820216E-5,1.0000000027798017,7.4562749861820216E-5,1.0640703832999034,0.62806445189512128,-6.2213189254563508,-134.75675600856866,45.243243991431342,null,74562.75,5559603687.5625,null,2.4160244913845057,-14.226947966289567,null,null,null,-8.6373434168408547,-120.52980804227904,null,0,0]
[74994.5,74.994500000000002,25.756925623102667,1.5319620571716415,1.0015973656312942,5.6484373263476904E-2,1,0,6750.5676972151468,1.5706481911049057,7.9326944052178794,1.4443994665992712,1.0074922403320408,0.12203081094341278,1.0000000028120875,7.4994499859405936E-5,1.0000000028120875,7.4994499859405936E-5,1.0648984498663345,0.63170608906169623,-6.2795310905027808,-134.95810637032517,45.041893629674831,null,74994.5,5624175030.25,null,2.4144841034227547,-14.225369520699116,null,null,null,-8.694015193925539,-120.73273684962608,null,0,0]
[75426.25,75.426249999999996,25.904987655109089,1.5321841282410555,1.0016157960482219,5.6808861628863443E-2,1,0,6789.4313144070493,1.5706490390535075,7.9776399341355502,1.4451153628389288,1.0075784302686712,0.12272633984840702,1.0000000028445595,7.5426249856963684E-5,1.0000000028445595,7.5426249856963684E-5,1.0657331148644942,0.63534720907450881,-6.3374948397855499,-135.15974072251157,44.840259277488428,null,75426.25,5689119189.0625,null,2.4129531559810315,-14.224251142259108,null,null,null,-8.7504479957665833,-120.93548958025247,null,0,0]
[75858,75.858000000000004,26.05305095011391,1.5324036751965284,1.001634331924093,5.7133338018689681E-2,1,0,6828.2949316037775,1.5706498773498168,8.0225895058400045,1.4458232372827231,1.0076651075483836,0.12342174943383348,1.000000002877218,7.5857999854493337E-5,1.000000002877218,7.5857999854493337E-5,1.0665744053674968,0.63898779364706193,-6.3952138348943377,-135.36165268680801,44.638347313191986,null,75858,5754436164,null,2.4114313469287718,-14.2235849893229,null,null,null,-8.8066451818231091,-121.13806769748507,null,0,0]
[76299.75,76.299750000000003,26.204544905686355,1.5326257393195184,1.0016534062646265,5.7465317319835688E-2,1,0,6868.0586904891843,1.5706507252430464,8.0685842932341423,1.4465393436520173,1.0077542966824748,0.12413314161809177,1.0000000029108258,7.6299749851936466E-5,1.0000000029108258,7.6299749851936466E-5,1.0674420672063376,0.64271212635649855,-6.4540201196083089,-135.56852203454557,44.431477965454434,null,76299.75,5821651850.0625,null,2.4098834425021081,-14.223363467120034,null,null,null,-8.8639035621104174,-121.34515856742553,null,0,0]
[76741.5,76.741500000000002,26.356040138614517,1.5328452505920365,1.0016725909934272,5.7797283940970598E-2,1,0,6907.8224493794723,1.5706515633747564,8.1145831713586958,1.4472473316424013,1.0078439957292753,0.12484440753313009,1.0000000029446288,7.6741499849349834E-5,1.0000000029446288,7.6741499849349834E-5,1.0683167224708277,0.64643585921896873,-6.5125777307011399,-135.77566882739782,44.224331172602177,null,76741.5,5889257822.25,null,2.4083444916084606,-14.223599299777954,null,null,null,-8.9209222223096045,-121.55206952761984,null,0,0]
[77183.25,77.183250000000001,26.507536626997467,1.5330622527630753,1.0016918861041528,5.8129237809658417E-2,1,0,6947.5862082745571,1.5706523919125541,8.1605860710388463,1.4479473378329595,1.0079342045526491,0.12555554649309841,1.0000000029786269,7.7183249846733251E-5,1.0000000029786269,7.7183249846733251E-5,1.0691984002693411,0.65015897205605699,-6.5708903849785152,-135.98308656491122,44.016913435088782,null,77183.25,5957254080.5625,null,2.4068141972328743,-14.224284632198421,null,null,null,-8.9777045822113895,-121.75880193271283,null,0,0]
[77625,77.625,26.659034349431906,1.5332767885881202,1.0017112915904245,5.8461178853479956E-2,1,0,6987.3499671743566,1.5706532110202307,8.2065929246448661,1.4486394957717736,1.0080249230157357,0.12626655781290522,1.0000000030128202,7.7624999844086554E-5,1.0000000030128202,7.7624999844086554E-5,1.070087129743343,0.65388144449259067,-6.628961733265907,-136.19076885192294,43.80923114807706,null,77625,6025640625,null,2.4052922707391469,-14.225411782771683,null,null,null,-9.034254004005053,-121.96535706915127,null,0,0]
[78077,78.076999999999998,26.814048554671945,1.5334937930583274,1.0017312615856391,5.8800808631303936E-2,1,0,7028.0363713052648,1.570654039539888,8.2536713066985037,1.449339726656482,1.0081182738059451,0.12699393401786679,1.000000003048009,7.8076999841347075E-5,1.000000003048009,7.8076999841347075E-5,1.0710038099927195,0.65768960576718494,-6.6881344918195493,-136.40353729103808,43.596462708961923,null,78077,6096017929,null,2.4037433995304438,-14.227014565735329,null,null,null,-9.0918778913499896,-122.17652272530275,null,0,0]
[78529,78.528999999999996,26.969064008095089,1.533708302899027,1.0017513471243229,5.9140424828859076E-2,1,0,7068.7227754409414,1.5706548585218998,8.3007536898128844,1.4500320143725389,1.0082121578685483,0.12772117514193332,1.0000000030834018,7.8528999838575693E-5,1.0000000030834018,7.8528999838575693E-5,1.0719279347807287,0.66149705279487003,-6.747062144447824,-136.61656947717728,43.383430522822721,null,78529,6166803841,null,2.402202703322402,-14.229064172706657,null,null,null,-9.1492648477702261,-122.38750530447066,null,0,0]
[78981,78.980999999999995,27.124080688301056,1.533920360861436,1.0017715481995264,5.9480027368622505E-2,1,0,7109.4091795813047,1.570655668130015,8.3478400062892497,1.4507164926619474,1.0083065750545852,0.1284482804536991,1.0000000031189991,7.8980999835772219E-5,1.0000000031189991,7.8980999835772219E-5,1.0728595354188981,0.66530376311888051,-6.8057483973696078,-136.82985888219216,43.170141117807844,null,78981,6237998361,null,2.4006698983762256,-14.231552908308998,null,null,null,-9.2064182957458325,-122.59830597388314,null,0,0]
[79433,79.433000000000007,27.279098574375837,1.5341300087259016,1.0017918648042603,5.9819616173090187E-2,1,0,7150.0955837262754,1.5706564685242552,8.3949301899421052,1.4513932922955299,1.0084015252143061,0.12917524922260587,1.0000000031548006,7.9432999832936476E-5,1.0000000031548006,7.9432999832936476E-5,1.0737986432459243,0.66910971407336184,-6.8641968909514279,-137.04339908039739,42.956600919602607,null,79433,6309601489,null,2.3991447089726137,-14.234473247236814,null,null,null,-9.2633415999240469,-122.80892583316061,null,0,0]
[79895.5,79.895499999999998,27.437718766555047,1.5343420745929846,1.0018127729445319,6.016707935710084E-2,1,0,7191.7271366447876,1.5706572781374293,8.4431182182041606,1.452077999132767,1.0084992326066327,0.12991896344161932,1.0000000031916454,7.9895499830001261E-5,1.0000000031916454,7.9895499830001261E-5,1.0747673701507263,0.67300326770961993,-6.9237607698442849,-137.2621528375993,42.737847162400698,null,79895.5,6383290920.25,null,2.3975916927680712,-14.237900508590625,null,null,null,-9.3213524626123583,-123.02425232900869,null,0,{"$f":"IF(AJ538>0,W538,0)","v":0}]
[80358,80.358000000000004,27.596340178476542,1.5345517025963362,1.0018338020292681,6.0514527996141772E-2,1,0,7233.35868956796,1.5706580784311555,8.4913101598700589,1.4527549342559485,1.0085974977025609,0.13066253315546272,1.000000003228704,8.0357999827031866E-5,1.000000003228704,8.0357999827031866E-5,1.0757440235434939,0.67689597760981612,-6.9830832215529632,-137.48115587926196,42.518844120738038,null,80358,6457408164,null,2.3960460905484591,-14.241764242858016,null,null,null,-9.379129312101421,-123.23939163640391,null,0,0]
[80820.5,80.820499999999996,27.754962789227598,1.534758934515337,1.0018549520508528,6.0861962007243149E-2,1,0,7274.9902424957108,1.5706588695654273,8.5395059486849565,1.4534242286267964,1.0086963203390999,0.13140595758425566,1.0000000032659766,8.0820499824028088E-5,1.0000000032659766,8.0820499824028088E-5,1.0767286370712728,0.68078781882347728,-7.0421679417125729,-137.70040163529362,42.299598364706384,null,80820.5,6531953220.25,null,2.3945076312985956,-14.246056910968131,null,null,null,-9.4366755730111667,-123.45434472432548,null,0,0]
[81283,81.283000000000001,27.913586578370698,1.5349638111805264,1.0018762230016274,6.1209381307456262E-2,1,0,7316.6217954279646,1.5706596516965967,8.5877055198761276,1.454086010294612,1.0087957003523982,0.13214923594906472,1.0000000033034631,8.1282999820989738E-5,1.0000000033034631,8.1282999820989738E-5,1.0777212444006821,0.68467876617902002,-7.1010185601837623,-137.9198836352833,42.080116364716702,null,81283,6606926089,null,2.3929760516792702,-14.250771140565147,null,null,null,-9.4939946118630321,-123.66911249471815,null,0,0]
[81756.25,81.756249999999994,28.075898497788806,1.5351710534635101,1.001898113528285,6.1564860444710372E-2,1,0,7359.2210006761961,1.5706604428469917,8.6370292546385059,1.4547555278568978,1.0088979670678799,0.13290963850621446,1.0000000033420422,8.1756249817844777E-5,1.0000000033420422,8.1756249817844777E-5,1.0787452329447773,0.68865920001900316,-7.1609984501241666,-138.14470500503271,41.855294994967295,null,81756.25,6684084414.0625,null,2.3914157276096795,-14.256023796770513,null,null,null,-9.5524141777338443,-123.88868120826224,null,0,0]
[82229.5,82.229500000000002,28.238211609186614,1.5353759132998155,1.0019201306546741,6.192032400362165E-2,1,0,7401.8202059289806,1.5706612248908756,8.6863568170127774,1.4554174416806924,1.0090008170218741,0.13366988648343978,1.0000000033808454,8.2229499814663183E-5,1.0000000033808454,8.2229499814663183E-5,1.0797776625835698,0.69263864394281871,-7.2207407143200175,-138.36976032877959,41.630239671220409,null,82229.5,6761690670.25,null,2.389862072365021,-14.261702736558021,null,null,null,-9.6106027866850425,-124.10805759222158,null,0,0]
[82702.75,82.702749999999995,28.400525892127121,1.5355784315204752,1.0019422743724486,6.2275771895391324E-2,1,0,7444.4194111862407,1.5706619979845793,8.7356881421591446,1.4560718799982872,1.0091042500360459,0.13442997904932924,1.0000000034198724,8.2702749811444754E-5,1.0000000034198724,8.2702749811444754E-5,1.0808185694329497,0.69661707027801789,-7.2802490374646824,-138.59504297969457,41.404957020305432,null,82702.75,6839744857.5625,null,2.3883148271386321,-14.267800574079326,null,null,null,-9.6685638646033176,-124.32724240561528,null,0,0]
[83176,83.176000000000002,28.562841326637717,1.53577864802917,1.0019645446732155,6.2631204031244281E-2,1,0,7487.0186164478991,1.5706627622808755,8.7850231666893137,1.4567189681874049,1.0092082659311232,0.1351899153735297,1.0000000034591234,8.3175999808189299E-5,1.0000000034591234,8.3175999808189299E-5,1.0818679896188388,0.70059445111963969,-7.3395270385062217,-138.82054642790331,41.179453572096691,null,83176,6918246976,null,2.3867737404708649,-14.274310086897559,null,null,null,-9.7263007789770874,-124.54623634100572,null,0,0]
[83660.5,83.660499999999999,28.729016462279809,1.5359812803257431,1.0019874755025149,6.2995069010619742E-2,1,0,7530.6304811101136,1.5706635357881613,8.8355347407379643,1.4573739525254557,1.0093153581119112,0.13596775402210876,1.0000000034995395,8.3660499804817849E-5,1.0000000034995395,8.3660499804817849E-5,1.0829512134380213,0.70466526897934634,-7.3999792950906693,-139.05163251037797,40.948367489622029,null,83660.5,6999079260.25,null,2.3852021442096123,-14.281393439088717,null,null,null,-9.7851814393002812,-124.77023907128927,null,0,0]
[84145,84.144999999999996,28.895192763963149,1.5361815819531122,1.0020105389865928,6.335891728785488E-2,1,0,7574.2423457767827,1.5706643003878642,8.8860500621766789,1.4580214902428925,1.0094230608319712,0.13674542715454741,1.0000000035401904,8.414499980140711E-5,1.0000000035401904,8.414499980140711E-5,1.0840434368067515,0.70873493112279173,-7.4601976206077065,-139.28293646083154,40.717063539168464,null,84145,7080381025,null,2.3836364919558881,-14.288893457469499,null,null,null,-9.8438341125635951,-124.99404300336202,null,0,0]
[84629.5,84.629499999999993,29.061370211685038,1.5363795928764552,1.0020337351162891,6.3722748767769788E-2,1,0,7617.8542104478283,1.5706650562329711,8.9365690674573734,1.4586617070807164,1.0095313738958949,0.13752293388333622,1.0000000035810761,8.4629499797956879E-5,1.0000000035810761,8.4629499797956879E-5,1.0851446985027462,0.71280340686740495,-7.520185693719899,-139.51445157005782,40.485548429942185,null,84629.5,7162152270.25,null,2.3820765362526268,-14.29680289552619,null,null,null,-9.9022622299725267,-125.21764867453165,null,0,0]
[85114,85.114000000000004,29.227548785897593,1.5365753521527612,1.0020570638823922,6.4086563355211179E-2,1,0,7661.4660751231768,1.5706658034729848,8.9870916944562698,1.4592947259767373,1.0096402971072516,0.13830027332215031,1.0000000036221965,8.5113999794466912E-5,1.0000000036221965,8.5113999794466912E-5,1.0862550373019533,0.716870665287201,-7.5799471271912484,-139.74617122334655,40.253828776653449,null,85114,7244392996,null,2.3805220366888569,-14.30511466722435,null,null,null,-9.9604691638801057,-125.44105655612219,null,0,0]
[85609.5,85.609499999999997,29.397501393511838,1.5367732667813365,1.0020810594785305,6.4458620351718052E-2,1,0,7706.0680956572414,1.5706665589300928,9.0387650607033461,1.459934797152779,1.0097523241693376,0.13909508738169385,1.0000000036644932,8.5609499790856379E-5,1.0000000036644932,8.5609499790856379E-5,1.0874000140063755,0.72102897442697089,-7.6408346544663601,-139.98335656288737,40.016643437112634,null,85609.5,7328986490.25,null,2.3789376440033965,-14.314024065862579,null,null,null,-10.019772298469753,-125.66933249702477,null,0,0]
[86105,86.105000000000004,29.56745513939445,1.5369689061907477,1.002105193782497,6.4830659478776684E-2,1,0,7750.6701161956535,1.5706673056924909,9.0904420879516952,1.4605675912771494,1.0098649889798819,0.13988972459750187,1.0000000037070356,8.6104999787203805E-5,1.0000000037070356,8.6104999787203805E-5,1.0885545666773415,0.72518594414625359,-7.7014925725937289,-140.22074213645385,39.77925786354615,null,86105,7414071025,null,2.3773584709671751,-14.323339778279017,null,null,null,-10.078851043560906,-125.89740235817487,null,0,0]
[86600.5,86.600499999999997,29.737410004029304,1.5371623093757989,1.0021294667842697,6.5202680634691659E-2,1,0,7795.2721367383383,1.5706680439094243,9.1421227141184698,1.461193231250737,1.0099782913254587,0.14068418402538008,1.0000000037498233,8.6600499783508948E-5,1.0000000037498233,8.6600499783508948E-5,1.0897187367654912,0.72934154059553113,-7.7619245416763194,-140.45832115742655,39.541678842573447,null,86600.5,7499646600.25,null,2.3757842817900143,-14.333054717224217,null,null,null,-10.137708823466333,-126.12526644020232,null,0,0]
[87096,87.096000000000004,29.907365968343768,1.5373535144455823,1.0021538784737707,6.5574683717797316E-2,1,0,7839.8741572852232,1.5706687737267415,9.1938068785124845,1.4618118372335103,1.0100922309915303,0.14147846472245429,1.0000000037928565,8.7095999779771563E-5,1.0000000037928565,8.7095999779771563E-5,1.0908925657053217,0.7334957296734228,-7.8221341559893398,-140.69608693093008,39.303913069069921,null,87096,7585713216,null,2.3742148474107605,-14.343161952372919,null,null,null,-10.196349003400101,-126.35292497855716,null,0,0]
[87603.25,87.603250000000003,30.081353289599821,1.5375470156046527,1.0021790126972185,6.5955489439692289E-2,1,0,7885.533844317566,1.5706695122985768,9.2467202543788538,1.4624379489647288,1.0102095325009566,0.14229139441038205,1.0000000038371646,8.7603249775901264E-5,1.0000000038371646,8.7603249775901264E-5,1.0921042785172661,0.73774693509379385,-7.8835449047228643,-140.93967749593281,39.060322504067187,null,87603.25,7674329410.5625,null,2.3726128893190492,-14.353908149878645,null,null,null,-10.256157794041915,-126.58576934605418,null,0,0]
[88110.5,88.110500000000002,30.255341724228714,1.5377382912488529,1.0022042922423475,6.6336276005959371E-2,1,0,7931.1935313541617,1.570670242366532,9.2996372138560588,1.4630569355123015,1.0103275014567998,0.14310413479495246,1.00000000388173,8.8110499771985889E-5,1.00000000388173,8.8110499771985889E-5,1.0933262015094438,0.74199659248879513,-7.9447300458416681,-141.1834498599739,38.816550140026095,null,88110.5,7763460210.25,null,2.3710154490516833,-14.365051256815663,null,null,null,-10.315745494893351,-126.81839860315823,null,0,0]
[88617.75,88.617750000000001,30.42933125313235,1.5379273795393649,1.0022297170981616,6.6717043307625401E-2,1,0,7976.8532183949355,1.5706709640766365,9.3525576961156673,1.4636689173491824,1.0104461376252885,0.14391668486895121,1.0000000039265529,8.861774976802514E-5,1.0000000039265529,8.861774976802514E-5,1.0945583790584517,0.74624466447808968,-8.0056932304989115,-141.42739712210209,38.572602877897907,null,88617.75,7853105615.0625,null,2.3694223013414559,-14.376584321249929,null,null,null,-10.375115531840365,-127.05081280085216,null,0,0]
[89125,89.125,30.603321857646851,1.5381143177701664,1.0022552872536017,6.7097791235750562E-2,1,0,8022.5129054398167,1.570671677571595,9.405481641694271,1.4642740122580153,1.0105654407714384,0.14472904362664088,1.0000000039716328,8.9124999764018814E-5,1.0000000039716328,8.9124999764018814E-5,1.0958008555073542,0.7504911134220047,-8.0664380437771328,-141.67151247085579,38.328487529144212,null,89125,7943265625,null,2.3678332273725791,-14.388500545284872,null,null,null,-10.434271271149711,-127.28301192557095,null,0,0]
[89644,89.644000000000005,30.781343895696601,1.5383033989316326,1.0022816000948136,6.7487338689185314E-2,1,0,8069.2302589704495,1.5706723992366951,9.4596350478692113,1.4648861156920683,1.0106881975551834,0.14556002089770284,1.0000000040180232,8.9643999759872201E-5,1.0000000040180232,8.9643999759872201E-5,1.0970828185512724,0.75483420821877933,-8.1283676111677234,-141.92144949574276,38.078550504257237,null,89644,8036046736,null,2.3662113385995158,-14.401082440755783,null,null,null,-10.49457894976724,-127.52036705498691,null,0,0]
[90163,90.162999999999997,30.959367021575279,1.5384903055837209,1.0023080650214715,6.787686563051723E-2,1,0,8115.9476125052352,1.5706731125936382,9.513791957942269,1.4654912505982249,1.0108116520728088,0.14639079576108383,1.0000000040646833,9.0162999755677301E-5,1.0000000040646833,9.0162999755677301E-5,1.0983756569442902,0.7591755233746742,-8.1900759608130542,-142.17154833387491,37.82845166612509,null,90163,8129366569,null,2.3645932707998538,-14.414051530336382,null,null,null,-10.554669231612909,-127.7574968035385,null,0,0]
[90682,90.682000000000002,31.137391216624408,1.5386750750107272,1.0023346820215286,6.826637194316898E-2,1,0,8162.6649660441044,1.5706738177850743,9.5679523124147288,1.4660895348676475,1.0109358040686951,0.14722136714436854,1.0000000041116126,9.0681999751433828E-5,1.0000000041116126,9.0681999751433828E-5,1.0996794180479446,0.76351501776035458,-8.2515667273632278,-142.42180196368955,37.578198036310454,null,90682,8223225124,null,2.3629788091932853,-14.42740100608899,null,null,null,-10.614545536556516,-127.99440095760056,null,0,0]
[91201,91.200999999999993,31.315416462609701,1.5388577436497071,1.0023614510828702,6.8655857510600549E-2,1,0,8209.3823195869863,1.5706745149504067,9.622116053123742,1.4666810837568907,1.0110606532859039,0.14805173397678989,1.0000000041588111,9.1200999747141498E-5,1.0000000041588111,9.1200999747141498E-5,1.1009941491695387,0.767852649982813,-8.3128434792414847,-142.67220345083149,37.327796549168511,null,91201,8317622401,null,2.3613677451711479,-14.441124210936266,null,null,null,-10.67421122441263,-128.23107923989525,null,0,0]
[91732,91.731999999999999,31.497558968334626,1.5390424987694056,1.0023889964450727,6.90543269329221E-2,1,0,8257.1798431580646,1.5706752200706349,9.6775355799443687,1.467279456816847,1.011189110509644,0.14890108722754758,1.0000000042073798,9.1731999742699087E-5,1.0000000042073798,9.1731999742699087E-5,1.1023506813883441,0.77228860359434559,-8.3753191939372567,-142.9285404494137,37.071459550586297,null,91732,8414759824,null,2.3597227361353852,-14.455544717023693,null,null,null,-10.735041930072642,-128.47299573238999,null,0,0]
[92263,92.263000000000005,31.679702536848342,1.5392251293831076,1.0024167009557141,6.9452774392933903E-2,1,0,8304.9773667331992,1.5706759170745255,9.7329585323490058,1.4678710153855028,1.0113182970205423,0.14975022409677954,1.0000000042562305,9.2262999738204932E-5,1.0000000042562305,9.2262999738204932E-5,1.1037187967664615,0.7767225194532581,-8.4375782338894343,-143.18501780530252,36.814982194697478,null,92263,8512461169,null,2.3580808607362607,-14.470342801922101,null,null,null,-10.795659094625696,-128.71467500338042,null,0,0]
[92794,92.793999999999997,31.861847149924021,1.5394056719140132,1.0024445646015987,6.9851199765946809E-2,1,0,8352.7748903123229,1.5706766061014121,9.7883848521495107,1.4684558748055949,1.0114482125391551,0.15059914344312078,1.0000000043053632,9.2793999733658763E-5,1.0000000043053632,9.2793999733658763E-5,1.1050985457641778,0.78115435240703424,-8.4996242148799936,-143.44162835942504,36.558371640574961,null,92794,8610726436,null,2.356441914301787,-14.485511799567288,null,null,null,-10.85606612918178,-128.95611655985772,null,0,0]
[93325,93.325000000000003,32.04399278974914,1.5395841619577217,1.0024725873694575,7.0249602927313526E-2,1,0,8400.5724138953683,1.5706772872874568,9.8438144824647704,1.4690341478404925,1.0115788567846069,0.15144784412704509,1.0000000043547776,9.332499972906024E-5,1.0000000043547776,9.332499972906024E-5,1.1064899787630837,0.78558405703850021,-8.56146068626005,-143.69836503783446,36.301634962165537,null,93325,8709555625,null,2.3548056980629228,-14.501045191605582,null,null,null,-10.91626638432297,-129.19731984622891,null,0,0]
[93868.5,93.868499999999997,32.230427272242615,1.5397647645211325,1.0025014345778422,7.0657361562011842E-2,1,0,8449.495114591231,1.5706779765279548,9.9005523237132795,1.4696193279856291,1.0117133308255424,0.15231629600909463,1.0000000044056476,9.3868499724298972E-5,1.0000000044056476,9.3868499724298972E-5,1.1079263190815831,0.79011578734759469,-8.6245394891360263,-143.96126873981365,36.038731260186353,null,93868.5,8811295292.25,null,2.3531335903817512,-14.517314957157643,null,null,null,-10.977673079517773,-129.443953782656,null,0,0]
[94412,94.412000000000006,32.416862793913097,1.5399432897311696,1.0025304484596287,7.1065096662900812E-2,1,0,8498.4178152910627,1.5706786578329743,9.9572935166279866,1.4701978390810868,1.0118485677062934,0.15318451640293149,1.0000000044568129,9.4411999719482261E-5,1.0000000044568129,9.4411999719482261E-5,1.1093750065025334,0.79464519084816621,-8.6874061197416133,-144.22428984072465,35.775710159275349,null,94412,8913625744,null,2.3514639396757411,-14.533953113142642,null,null,null,-11.038870059417354,-129.69033672758204,null,0,0]
[94955.5,94.955500000000001,32.603299336933617,1.5401197732133536,1.0025596290003467,7.1472808096459325E-2,1,0,8547.3405159947924,1.5706793313387766,10.014038004235612,1.4707697941067024,1.011984567121033,0.15405250409268362,1.0000000045082735,9.4955499714609754E-5,1.0000000045082735,9.4955499714609754E-5,1.1108360947623137,0.79917221801997551,-8.7500641770838943,-144.48742101698417,35.512578983015828,null,94955.5,9016546980.25,null,2.3497965507588607,-14.550953124435628,null,null,null,-11.099860727842758,-129.93646789254854,null,0,0]
[95499,95.498999999999995,32.789736883882526,1.5402942497834746,1.0025889761854443,7.1880495729213234E-2,1,0,8596.2632167023567,1.5706799971785219,10.07078573084368,1.4713353035131791,1.0121213287623747,0.1549202578645332,1.0000000045600295,9.5498999709681167E-5,1.0000000045600295,9.5498999709681167E-5,1.1123096374897408,0.80369681908085422,-8.8125171933660749,-144.75065502845302,35.249344971546975,null,95499,9120059001,null,2.3481312341001837,-14.568308600760341,null,null,null,-11.16064842746626,-130.18234642769269,null,0,0]
[96611.5,96.611500000000007,33.171362337029372,1.5406452729958324,1.0026495670720008,7.271492415177383E-2,1,0,8696.4039794319106,1.5706813367364116,10.186953553670813,1.4724732066227626,1.0124036442676463,0.15669574424290653,1.0000000046668909,9.6611499699416435E-5,1.0000000046668909,9.6611499699416435E-5,1.1153649217574679,0.81295053066063416,-8.9397285182827559,-145.2897641498698,34.710235850130204,null,96611.5,9333781932.25,null,2.3447281608989217,-14.604916182163642,null,null,null,-11.28445667918168,-130.68484796770616,null,0,0]
[97724,97.724000000000004,33.552991784485457,1.5409883112213547,1.0027108559895126,7.3549251149286884E-2,1,0,8796.5447421767167,1.5706826457949741,10.303134269353464,1.4735854485861506,1.0126891494401686,0.15847023509472782,1.00000000477499,9.7723999688912583E-5,1.00000000477499,9.7723999688912583E-5,1.1184730701587693,0.82219343491222818,-9.0661241072488181,-145.82921385059768,34.170786149402318,null,97724,9549980176,null,2.3413314941568859,-14.642935251988867,null,null,null,-11.407455601405704,-131.18627859860879,null,0,0]
[98862,98.861999999999995,33.94337268566666,1.5413312314267835,1.0027742718122457,7.4402595916157679E-2,1,0,8898.9808662401265,1.5706839543763988,10.421990893690676,1.4746975263458988,1.0129844961366474,0.16028435888532774,1.0000000048868474,9.8861999677917663E-5,1.0000000048868474,9.8861999677917663E-5,1.121707631593295,0.83163656228576999,-9.1946018646744356,-146.38131927216014,33.618680727839859,null,98862,9773695044,null,2.3378621155306405,-14.683234502773374,null,null,null,-11.53246398020508,-131.69808476938675,null,0,0]
[100000,100,34.333757487624467,1.5416663534660622,1.002838417759824,7.5255832136932072E-2,1,0,9001.4169903184302,1.5706852331745107,10.540860116402694,1.475784523635,1.0132831746609932,0.16209741916624604,1.000000005,9.9999999666666668E-5,1.000000005,9.9999999666666668E-5,1.1249984691029999,0.84106745343147504,-9.322283850896051,-146.93365739077714,33.066342609222858,null,100000,10000000000,null,2.3343965141835223,-14.724908117599794,null,null,null,-11.65668036507957,-132.20874927317738,null,0,0]
[101165,101.16500000000001,34.733408398276055,1.5420016231176683,1.0029048417918554,7.6129198384460847E-2,1,0,9106.283496968852,1.5706865125109088,10.662562221019845,1.4768722038663187,1.0135923878485102,0.16395238270031895,1.0000000051171785,1.0116499965488042E-4,1.0000000051171785,1.0116499965488042E-4,1.1284261820220034,0.85070892925266239,-9.4521996837733191,-147.49927799520677,32.500722004793232,null,101165,10234357225,null,2.3308511885073444,-14.768943513114653,null,null,null,-11.783050872280665,-132.73033448209213,null,0,0]
[102330,102.33,35.133063124337788,1.5423292651129239,1.0029720307065453,7.7002448284709743E-2,1,0,9211.1500036338366,1.5706877627174938,10.784276655245419,1.4779353335907617,1.0139050865613688,0.16580620843043581,1.0000000052357143,1.0232999964281957E-4,1.0000000052357143,1.0232999964281957E-4,1.1319138912195379,0.86033657009622411,-9.5813389262183541,-148.0650153275493,31.934984672450696,null,102330,10471428900,null,2.3273070348558957,-14.814318688678451,null,null,null,-11.908645961074251,-133.25069663887089,null,0,0]
[103520,103.52,35.541297937343138,1.5426563305988947,1.0030414509630619,7.789431597367702E-2,1,0,9318.2668645336271,1.5706890107009859,10.908615287388479,1.4789967828770612,1.0142280907175261,0.16769862898962912,1.0000000053581952,1.0351999963021309E-4,1.0000000053581952,1.0351999963021309E-4,1.1355389153285491,0.87015599168178814,-9.7124761011369323,-148.64294861019087,31.357051389809129,null,103520,10716390400,null,2.3236866966970036,-14.862001339698891,null,null,null,-12.036162797833935,-133.78094727049196,null,0,0]
[104710,104.71,35.949536465918584,1.5429759678872947,1.0031116689560082,7.8786059510090101E-2,1,0,9425.3837254476002,1.5706902303185084,11.03296593296268,1.480034306488818,1.0145547247633242,0.16958983779540429,1.0000000054820919,1.0470999961731343E-4,1.0000000054820919,1.0470999961731343E-4,1.1392276093969456,0.87995988454632024,-9.8428596300377471,-149.22087345826949,30.779126541730506,null,104710,10964184100,null,2.3200649432429477,-14.910983777285614,null,null,null,-12.162924573280694,-134.30988968098387,null,0,0]
[105930,105.93,36.368070448373857,1.5432962136050701,1.0031844851315164,7.9700153631903747E-2,1,0,9535.2010114408549,1.5706914522358146,11.160463519919967,1.4810739830477899,1.0148933579195087,0.17152745324268412,1.0000000056105824,1.0592999960378067E-4,1.0000000056105824,1.0592999960378067E-4,1.14307595349293,0.88999423013270529,-9.9757759799756869,-149.81329222258839,30.186707777411613,null,105930,11221164900,null,2.3163491410238541,-14.962501896550874,null,null,null,-12.292125120999541,-134.85079032603747,null,0,0]
[107150,107.15,36.786608075770026,1.5436091721979541,1.0032581394138569,8.0614114300704101E-2,1,0,9645.0182974480231,1.5706926463278459,11.287972898002259,1.4820901722314259,1.0152357987940661,0.17346376883310896,1.0000000057405611,1.0714999958993258E-4,1.0000000057405611,1.0714999958993258E-4,1.1469923516540319,0.90001106522754781,-10.107956465707396,-150.40556749133404,29.59443250866596,null,107150,11481122500,null,2.3126293354745941,-15.015289672712154,null,null,null,-12.420585801181991,-135.39027781862188,null,0,0]
[108400,108.4,37.215441263928547,1.5439225254091611,1.0033344739480532,8.1550409430620752E-2,1,0,9757.5360085348802,1.570693841905179,11.418629569148623,1.4831078094879224,1.015590605636125,0.17544633674589277,1.00000000587528,1.0839999957541311E-4,1.00000000587528,1.0839999957541311E-4,1.1510762312709428,0.91025542099944934,-10.242652087955221,-151.01218885373396,28.98781114626604,null,108400,11750560000,null,2.3088126915073639,-15.070644628375478,null,null,null,-12.551464779462584,-135.94154422535848,null,0,0]
[109650,109.65,37.644278023024683,1.5442287393244447,1.0034116879197053,8.2486561282596793E-2,1,0,9870.0537196353653,1.5706950102235673,11.549297797705494,1.4841024207520725,1.0159494015364117,0.17742751210138091,1.0000000060115612,1.0964999956055487E-4,1.0000000060115612,1.0964999956055487E-4,1.1552327497322061,0.92048010536017622,-10.376631024087759,-151.61852022769497,28.381479772305028,null,109650,12023122500,null,2.3049894476413604,-15.127237526741078,null,null,null,-12.68162047172912,-136.49128270095389,null,0,0]
[110925,110.925,38.081695070974241,1.544533972683285,1.0034913519567144,8.3441286899510636E-2,1,0,9984.8217849714256,1.5706961747818504,11.682590895098199,1.4850940021260026,1.0163194785008145,0.17944686176099683,1.0000000061521777,1.1092499954504645E-4,1.0000000061521777,1.1092499954504645E-4,1.1595478493660745,0.93088833871119203,-10.512578735918446,-152.23660841504326,27.763391584956736,null,110925,12304355625,null,2.301081792280244,-15.186191036102896,null,null,null,-12.813660528198692,-137.05041737894035,null,0,0]
[112200,112.2,38.519115586315827,1.5448322736499394,1.0035719305313955,8.4395860073168433E-2,1,0,10099.589850320719,1.5706973128729003,11.815895220041186,1.4860632108301408,1.0166936967584719,0.18146473310482425,1.0000000062944199,1.1219999952917739E-4,1.0000000062944199,1.1219999952917739E-4,1.1639397682419128,0.94127472848639826,-10.647835439721183,-152.85425223706847,27.145747762931535,null,112200,12588840000,null,2.2971650148386562,-15.246340187303996,null,null,null,-12.945000454559839,-137.60791204976448,null,0,0]
[113510,113.51,38.968547212391783,1.5451317881330806,1.0036556733750921,8.5376476648857155E-2,1,0,10217.508411594874,1.5706984555760717,11.95287017865062,1.4870365078268339,1.0170824962465932,0.18353644170378761,1.0000000064422601,1.1350999951249271E-4,1.0000000064422601,1.1350999951249271E-4,1.1685329104554016,0.9519227515156089,-10.786112557090174,-153.48831456252708,26.51168543747292,null,113510,12884520100,null,2.2931301261559436,-15.309340008351246,null,null,null,-13.079242683246118,-138.17897455417588,null,0,0]
[114820,114.82,39.417982254577396,1.5454244726473108,1.0037403811814016,8.6356928654547874E-2,1,0,10335.426972882067,1.5706995722046717,12.089856203717781,1.4879877495170377,1.0174756576818351,0.18560655812954097,1.0000000065918162,1.1481999949541845E-4,1.0000000065918162,1.1481999949541845E-4,1.1732084614587064,0.96254622471549056,-10.923714431916014,-154.12175934436056,25.878240655639445,null,114820,13183632400,null,2.2890834540441451,-15.373510786608113,null,null,null,-13.212797885960159,-138.74824855775245,null,0,0]
[116155,116.155,39.875997696315494,1.5457159550680668,1.0038276980572731,8.7355920357202577E-2,1,0,10455.595888405256,1.570700684230647,12.229467466142033,1.4889352195919652,1.017880804570791,0.18771452610492936,1.000000006745992,1.1615499947761287E-4,1.000000006745992,1.1615499947761287E-4,1.1780586991972166,0.97334639780942223,-11.063274249007911,-154.76658173105969,25.233418268940312,null,116155,13491984025,null,2.2849464040259693,-15.440066132833412,null,null,null,-13.348220653033881,-139.32651559822634,null,0,0]
[117490,117.49,40.334016449053976,1.5460008175710633,1.0039160165627001,8.8354737285927895E-2,1,0,10575.76480394108,1.570701770985456,12.369089459119456,1.4898613004425039,1.0182904708317719,0.18982080732922244,1.0000000069019499,1.1748999945939327E-4,1.0000000069019499,1.1748999945939327E-4,1.1829958800594533,0.98411949484536376,-11.202185596945494,-155.4106109150049,24.589389084995105,null,117490,13803900100,null,2.280795097495059,-15.507748899693226,null,null,null,-13.482980694440554,-139.90286201531174,null,0,0]
[118860,118.86,40.804046509487797,1.5462864995961849,1.004007691621039,8.9379556677730732E-2,1,0,10699.084215402518,1.5707028608513334,12.512382733283268,1.4907901721428496,1.0187155703415285,0.19198053829270767,1.0000000070638497,1.1885999944026054E-4,1.0000000070638497,1.1885999944026054E-4,1.1881535956301275,0.99514604938210383,-11.34409074204774,-156.07062198660719,23.929378013392807,null,118860,14127699600,null,2.2765191616882761,-15.5783343853607,null,null,null,-13.620609903736018,-140.49228760124655,null,0,0]
[120230,120.23,{"$f":"SQRT(1+(A589/p_dom)^2)","v":41.27407982426331},{"$f":"ATAN(A589/p_dom)","v":1.546565674893186},{"$f":"SQRT(1+(A589/z_ESR)^2)","v":1.0041004209500684},{"$f":"ATAN(A589/z_ESR)","v":9.0404187860013571E-2},{"$f":"IF(VIN_nom>Vout, 1, SQRT(1+(A589/z_RHP)^2))","v":1},{"$f":"IF(VIN_nom>Vout, 0, -ATAN(A589/z_RHP))","v":0},{"$f":"SQRT(1+(A589/EA_p1)^2)","v":10822.403626876376},{"$f":"ATAN(A589/EA_p1)","v":1.5707039258795454},{"$f":"SQRT(1+(A589/EA_z1)^2)","v":12.655686558690768},{"$f":"ATAN(A589/EA_z1)","v":1.4916980088714502},{"$f":"SQRT(1+(A589/EA_hf_p)^2)","v":1.0191454176097832},{"$f":"ATAN(A589/EA_hf_p)","v":0.19413845748540531},{"$f":"SQRT(1+(A589/Zero3)^2)","v":1.0000000072276265},{"$f":"ATAN(A589/Zero3)","v":1.2022999942068166E-4},{"$f":"SQRT(1+(A589/pole5)^2)","v":1.0000000072276265},{"$f":"ATAN(A589/pole5)","v":1.2022999942068166E-4},{"$f":"SQRT((1-(Z589/pterm2))^2+(A589/pterm1)^2)","v":1.193404292621844},{"$f":"IF((ATAN((A589/pterm1)/(1-A589^2/pterm2))>0),ATAN((A589/pterm1)/(1-A589^2/pterm2)),PI()+ATAN((A589/pterm1)/(1-A589^2/pterm2)))","v":1.0061423979011273},{"$f":"20*LOG10(((E589*K589*G589*O589)/(C589*I589*S589*M589*Q589))*Adc)","v":-11.485364919632319},{"$f":"((F589+L589+H589+P589)-(D589+J589+T589+N589+R589))*radconv","v":-156.7296403416201},{"$f":"IF(V589>0,V589,V589+180)","v":23.270359658379903},null,{"$f":"IF(U589<0,A589,1000000000)","v":120230},{"$f":"A589^2","v":14455252900},null,{"$f":"20*LOG10((K589/(I589*M589))*Aea_stability*Afb*0.8)","v":2.2722262969455049},{"$f":"(L589-(J589+N589))*radconv","v":-15.650019856218391},null,null,null,{"$f":"20*LOG10((E589*G589/(C589*S589))*Am_stability)","v":-13.757591216577826},{"$f":"(F589+H589-(D589+T589))*radconv","v":-141.07962048540165},null,{"$f":"SUM((U590<0)*(U589>0))*A589","v":0},0]
[126030,{"$f":"A590/1000","v":126.03},43.264035497997106,1.5476803818337037,1.0045046704937035,9.4739909171438638E-2,1,0,11344.485806966946,1.5707081782425241,13.262483303674813,1.4953240375753643,1.0210176671428883,0.20325369455449155,1.0000000079417803,1.2602999933273163E-4,1.0000000079417803,1.2602999933273163E-4,1.2166795187942625,1.0523421673526323,-12.07701425617193,-159.50689373110865,20.493106268891353,null,126030,15883560900,null,2.2538452998650889,-15.964771970862303,null,null,null,-14.330859556037021,-143.54212176024635,null,0,0]
[131830,131.83000000000001,45.25404020249578,1.54869705352612,1.0049277877984608,9.9072060818882798E-2,1,0,11866.567987244607,1.5707120564311101,13.869439165500996,1.4986327413629759,1.0229744359003856,0.2123348121289953,1.0000000086895744,1.3182999923630226E-4,1.0000000086895744,1.3182999923630226E-4,1.2416842336363134,1.0979221521093667,-12.659418180529896,-162.25942863088702,17.740571369112985,null,131830,17379148900,null,2.2350895048938915,-16.295729122292478,null,null,null,-14.89450768542379,-145.96369950859454,null,0,0]
[144540,144.54,49.615037965551295,1.550639782355995,1.0059208565017088,0.1085521953875643,1,0,13010.64807594896,1.5707194666726991,15.199972947792165,1.5049591841573577,1.0275556127620897,0.23210938501553194,1.0000000104459057,1.4453999899343253E-4,1.0000000104459057,1.4453999899343253E-4,1.302747134659465,1.1953473389244862,-13.90954638338494,-168.18056478854726,11.819435211452742,null,144540,20891811600,null,2.1924807449395427,-17.066674794484058,null,null,null,-16.102027128324487,-151.11388999406319,null,0,0]
[158490,158.49,54.401678231734024,1.5524135056011621,1.0071146538949582,0.11893465849524927,1,0,14266.345734967057,1.5707262317600925,16.660897868170231,1.5107394559752234,1.033041835340091,0.25360192641334423,1.0000000125595401,1.5848999867295902E-4,1.0000000125595401,1.5848999867295902E-4,1.3800644107769169,1.2978505801052003,-15.249424348278888,-174.46095777802381,5.5390422219761888,null,158490,25119080100,null,2.1430647159377108,-17.967309138942465,null,null,null,-17.392489064216605,-156.49364863908136,null,0,0]
[173780,173.78,59.648273999506799,1.5540305969126249,1.0085475117259977,0.1302848358366186,1,0,15642.662381209988,1.5707323990582804,18.262687573484076,1.5160124740387366,1.0395969718275262,0.27688644095937309,1.0000000150997441,1.7377999825064433E-4,1.0000000150997441,1.7377999825064433E-4,1.4776408200664897,1.4042134575410732,-16.687752280224014,-181.02977309213529,-1.0297730921352866,null,173780,30199488400,null,2.0854899936724691,-18.999645230262502,null,null,null,-18.773242273896489,-162.03012786187276,null,0,0]
[190550,190.55,65.402864719802011,1.55550588085439,1.0102680074223167,0.14269485242787944,1,0,17152.199998358097,1.5707380252358742,20.020008908960119,1.5208255047870589,1.0474259938667057,0.30207445959343199,1.0000000181546511,1.9054999769375417E-4,1.0000000181546511,1.9054999769375417E-4,1.6004682456259682,1.5131140680863726,-18.233847456173542,-187.81052760157255,-7.8105276015725451,null,190550,36309302500,null,2.0181314947204227,-20.167368399976308,null,null,null,-20.251978950893967,-167.64315920159626,null,0,0]
[208930,208.93,71.710059601687107,1.5568508298994255,1.0123317371920253,0.15624551277831933,1,0,18806.66042840467,1.5707431541434163,21.946484757223978,1.5252151611186766,1.0567577554258427,0.32923281568083435,1.0000000218258722,2.0892999695994706E-4,1.0000000218258722,2.0892999695994706E-4,1.7543040793652214,1.6228596377447084,-19.891809800511439,-194.70399408526214,-14.703994085262138,null,208930,43651744900,null,1.939266576402471,-21.472212665738994,null,null,null,-21.831076376913909,-173.23178141952312,null,0,0]
[229090,229.09,78.628195040007526,1.5580778997760527,1.0148081496398424,0.17104207043824776,1,0,20621.346080115025,1.5707478333553071,24.059933646035596,1.5292214766375158,1.0678727130353429,0.35845150733570563,1.0000000262411137,2.2908999599228225E-4,1.0000000262411137,2.2908999599228225E-4,1.9461545023859406,1.731836262624189,-21.664399538285632,-201.61525121948301,-21.615251219483014,null,229090,52482228100,null,1.8468682595411803,-22.917043508922781,null,null,null,-23.511267797826815,-178.69820771056024,null,0,0]
[251190,251.19,86.212176895702498,1.55919677715718,1.0177768085211665,0.18717583564411153,1,0,22610.659220566296,1.5707520998667663,26.377129234482119,1.5328756078717471,1.0810816035309039,0.38976190926846116,1.0000000315482076,2.5118999471693726E-4,1.0000000315482076,2.5118999471693726E-4,2.1839981218594424,1.838359681930043,-23.548374449079951,-208.4431359039877,-28.443135903987695,null,251190,63096416100,null,1.7388262678468094,-24.501875550119397,null,null,null,-25.287200716926762,-183.9412603538683,null,0,0]
[275420,275.42,94.527206779698545,1.5602171645893919,1.0213341363437147,0.20475169182267097,1,0,24791.702541916031,1.5707559907188009,28.917993107165817,1.5362088847832192,1.0967500148736622,0.42318691824707522,1.0000000379280876,2.7541999303589765E-4,1.0000000379280876,2.7541999303589765E-4,2.4773276207663422,1.9410407498291489,-25.538490006255739,-215.10212141856226,-35.102121418562263,null,275420,75856176400,null,1.6127927262980224,-26.226227725205398,null,null,null,-27.151282732553756,-188.87589369335683,null,0,0]
[302000,302,103.64878233784826,1.5611482104159973,1.0255966508468641,0.22388535606402732,1,0,27184.279161403272,1.5707595408277466,31.705595715490773,1.5392509213613421,1.1153048733967295,0.45872946505110807,1.0000000456019988,3.0199999081879784E-4,1.0000000456019988,3.0199999081879784E-4,2.8374999285704177,2.038834794486041,-27.628104002542724,-221.5247197018895,-41.524719701889495,null,302000,91204000000,null,1.4661996826231791,-28.088573199431213,null,null,null,-29.094303685165901,-193.43614650245831,null,0,0]
[331130,331.13,113.64553844766874,1.561996923679807,1.0306954838892797,0.24466441547898196,1,0,29806.391912884188,1.5707627769441428,34.760912317338935,1.5420244126776026,1.137201344377651,0.49629720375770903,1.000000054823537,3.3112998789752197E-4,1.000000054823537,3.3112998789752197E-4,3.2773799599478504,2.1308964180740624,-29.806212875519673,-227.6512864125219,-47.651286412521898,null,331130,109647076900,null,1.2965976424397943,-30.082322142043314,null,null,null,-31.102810517959462,-197.56896427047855,null,0,0]
[363080,363.08,124.61013297206962,1.5627712111002381,1.0367942306291518,0.26720918615798317,1,0,32682.344622067576,1.5707657292349075,38.112262007124521,1.5445550405508235,1.162988579406196,0.5358133382236282,1.0000000659135411,3.630799840454084E-4,1.0000000659135411,3.630799840454084E-4,3.8130276982204134,2.2168768032817852,-32.065218080360523,-233.44952538187277,-53.449525381872775,null,363080,131827086400,null,1.1012311640410579,-32.201604726758923,null,null,null,-33.166449244401576,-201.24792065511386,null,0,{"$f":"IF(AJ602>0,W602,0)","v":0}]
[398110,398.11,136.63179268435778,1.5634773206662052,1.044078899877755,0.29161079499170439,1,0,35835.540972971925,1.5707684215373512,41.786917243523028,1.5468631070492758,1.1932521592067624,0.57710470413246162,1.0000000792457828,3.9810997896764209E-4,1.0000000792457828,3.9810997896764209E-4,4.4630753950961966,2.2965946147011329,-34.395295170128449,-238.89310021200041,-58.893100212000405,null,398110,158491572100,null,0.8775925406647499,-34.435337512035801,null,null,null,-35.272887710793199,-204.4577626999646,null,0,0]
[436520,436.52,149.81347212967961,1.5641213101104985,1.0527703714478633,0.31796128577066535,1,0,39292.985216389985,1.57077087695965,45.816348112432742,1.5489683231257492,1.2286509382496338,0.61996151877169026,1.0000000952748507,4.3651997227374997E-4,1.0000000952748507,4.3651997227374997E-4,5.2501162311706562,2.3701239960920724,-36.788308642239748,-243.96818469477705,-63.968184694777051,null,436520,190549710400,null,0.62324832597469038,-36.770372803427705,null,null,null,-37.411556968214441,-207.19781189134935,null,0,0]
[478630,478.63,164.26499002779704,1.5647085647181125,1.0631243129450285,0.34633308762189852,1,0,43083.481886502777,1.5707731160432048,50.234124454156003,1.5508882250943086,1.2698983172681682,0.66411167557284689,1.0000001145433319,4.7862996345075299E-4,1.0000001145433319,4.7862996345075299E-4,6.2011035448087073,2.4376720499735334,-39.236341524610381,-248.66620946347317,-68.666209463473166,null,478630,229086676900,null,0.33609165738933189,-39.190116463135155,null,null,null,-39.572433181999706,-209.4760930003381,null,0,0]
[524810,524.80999999999995,180.1133248100696,1.565244238193525,1.0754424421586035,0.37679176033578149,1,0,47240.336225959109,1.5707751584442886,55.079063140322269,1.5526396100773452,1.3177878371526364,0.7092546714354715,1.0000001377127585,5.2480995181798282E-4,1.0000001377127585,5.2480995181798282E-4,7.3489116569224038,2.4995692007358725,-41.733197097507727,-252.98446658993919,-72.984466589939188,null,524810,275425536100,null,1.4271153565604872E-2,-41.676389653771665,null,null,null,-41.747468251073336,-211.30807693616759,null,0,0]
[575440,575.44000000000005,197.48888720462986,1.5657327291033791,1.0900662878081726,0.40936085927595905,1,0,51797.753619102732,1.5707770209383645,60.391031604044173,1.5542368198982912,1.3731486682826572,0.75502667293068437,1.000000165565583,5.7543993648463459E-4,1.000000165565583,5.7543993648463459E-4,8.7324627351443116,2.556161467561993,-44.271775182059521,-256.92001702465825,-76.92001702465825,null,575440,331131193600,null,-0.34341098761103062,-44.207525490626715,null,null,null,-43.928364194448491,-212.71249153403147,null,0,0]
[630960,630.96,216.54267953098767,1.5661782831068685,1.1073940298338041,0.44404592876702831,1,0,56795.340300438547,1.5707787197166616,66.216193515782805,1.5556937066838665,1.4368920242136547,0.8010591690708152,1.000000199055241,6.3095991626941511E-4,1.000000199055241,6.3095991626941511E-4,10.399229537354564,2.6078448553124858,-46.846426968649759,-260.47356890175513,-80.473568901755129,null,630960,398110521600,null,-0.73774281789494311,-46.761617108693358,null,null,null,-46.108684150754812,-213.7119517930617,null,0,0]
[691830,691.83,237.43256822380067,1.5665845922214203,1.1278720144688248,0.48079955532010543,1,0,62274.502787859463,1.5707802688585779,72.602812112063702,1.5570223200842499,1.5099625525651981,0.84695453536740417,1.0000002393143459,6.9182988962345599E-4,1.0000002393143459,6.9182988962345599E-4,12.405660246177323,2.6549943283552904,-49.450591641720209,-263.64606243437254,-83.646062434372539,null,691830,478628748900,null,-1.1687503037283782,-49.315192715542054,null,null,null,-48.281841337991835,-214.33086971883051,null,0,0]
[758580,758.58,260.34044322948199,1.5669551930599657,1.152012798931684,0.51954350729798016,1,0,68282.948591113018,1.5707816818502849,79.606496204276027,1.5582342075043016,1.593391633293447,0.89233981752038072,1.0000002877217669,7.5857985449337743E-4,1.0000002877217669,7.5857985449337743E-4,14.820529596824466,2.6979932796624557,-52.07881150086881,-266.44211984512788,-86.442119845127877,null,758580,575443616400,null,-1.636016034594463,-51.846222758965375,null,null,null,-50.442795466274347,-214.59589708616252,null,0,0]
[831760,831.76,285.45505857326879,1.5672931412132995,1.1803791247816948,0.56013116054006529,1,0,74870.185503334636,1.570782970343416,87.284954052384037,1.5593393478888207,1.6882335153557642,0.93684228477081044,1.000000345912289,8.3175980818937605E-4,1.000000345912289,8.3175980818937605E-4,17.725429007522347,2.7371848522704427,-54.724424888750391,-268.86805081659912,-88.868050816599123,null,831760,691824697600,null,-2.1383310284932406,-54.332780255750102,null,null,null,-52.586093860257151,-214.53527056084897,null,0,0]
[912010,912.01,312.99605560241275,1.5676013929183517,1.2136094354015761,0.60238195801484717,1,0,82093.822592901226,1.5707841456103879,95.705338064175706,1.5603473986876231,1.7956515425582658,0.98014644067355483,1.0000004158810336,9.1200974714163261E-4,1.0000004158810336,9.1200974714163261E-4,21.219982305254423,2.772909316542933,-57.382150883080627,-270.93523664027373,-90.935236640273729,null,912010,831762240100,null,-2.6742178376086461,-56.756235905885006,null,null,null,-54.707933045471975,-214.17900073438878,null,0,0]
[1000000,1000,343.19337161708251,1.5678825134821837,1.2523933940670349,0.64604487254999832,1,0,90014.169353270874,1.5707852174328127,104.9379492812629,1.5612667415256127,1.9168409441333618,1.0219636582073961,1.0000004999998751,9.9999966666686679E-4,1.0000004999998751,9.9999966666686679E-4,25.422670110521619,2.8054660322400533,-60.045797891995235,-272.65834236429191,-92.658342364291912,null,1000000,1000000000000,null,-3.241577897304762,-59.099572927913499,null,null,null,-56.80421999469047,-213.55876943637844,null,0,0]
[null,null,null,null,null,null,null,null,null,null,null,null,null,null,null,null,null,null,null,null,null,null,null,null,null,null,null,null,null,null,null,null,{"$error":"#DIV/0!"}]
[null,null,null,null,null,null,null,null,null,null,null,null,null,null,null,null,null,null,null,null,null,null,null,null,null,null,null,null,null,null,null,null,{"$error":"#DIV/0!"}]
["Pole/Zero Locations for Chart",null,null,null,null,null,null,null,null,null,null,null,null,null,null,null,null,null,null,null,null,null,null,null,null,null,null,null,null,null,null,null,{"$error":"#DIV/0!"}]
[{"$f":"Q4*1000","v":38905},null,{"$f":"SQRT(1+(A617/pole1)^2)","v":13.389276979548079},{"$f":"ATAN(A617/pole1)","v":1.4960400852814237},{"$f":"SQRT(1+(A617/Zero1)^2)","v":1.0004301398494952},{"$f":"ATAN(A617/Zero1)","v":2.9325269734225189E-2},{"$f":"IF(VIN_nom>Vout, 1, SQRT(1+(A617/z_RHP)^2))","v":1},{"$f":"IF(VIN_nom>Vout, 0, -ATAN(A617/z_RHP))","v":0},{"$f":"SQRT(1+(A617/Pole2)^2)","v":3502.0014012484012},{"$f":"ATAN(A617/Pole2)","v":1.5705107757916237},{"$f":"SQRT(1+(A617/Zero2)^2)","v":4.2031176879606571},{"$f":"ATAN(A617/Zero2)","v":1.3305739438853581},{"$f":"SQRT(1+(A617/pole4)^2)","v":1.0020218492614952},{"$f":"ATAN(A617/pole4)","v":6.3536581061918049E-2},{"$f":"SQRT(1+(A617/Zero3)^2)","v":1.0000000007567995},{"$f":"ATAN(A617/Zero3)","v":3.8904999980371144E-5},{"$f":"SQRT(1+(A617/pole5)^2)","v":1.0000000007567995},{"$f":"ATAN(A617/pole5)","v":3.8904999980371144E-5},{"$f":"SQRT((1-(A617^2/(pole3^2)))^2+(A617/(Q*pole3))^2)","v":1.0159607879190129},{"$f":"ATAN((A617/(Q*pole3))/(1-A617^2/pole3^2))","v":0.32689340030077568},{"$f":"20*LOG10(((E617*K617*G617*O617)/(C617*I617*S617*M617*Q617))*Adc)","v":3.2490240119002402E-2},{"$f":"((F617+L617+H617+R617)-(D617+J617+T617+N617+T617))*radconv","v":-138.88130972120032},{"$f":"IF(V617>0,V617,V617+180)","v":41.118690278799676},"crossover",null,null,null,{"$f":"20*LOG10((K617/(I617*M617))*AEA)","v":14.953749684716588},{"$f":"(L617-(J617+N617))*radconv","v":-17.38774575750762},null,null,null,-2.6127803868787081,{"$f":"(F617+H617-(D617+T617))*radconv","v":-102.76618086807849}]
[{"$f":"A617","v":38905},null,null,null,null,null,null,null,null,null,null,null,null,null,null,null,null,null,null,null,null,-180,null,null,null,null,null,null,null,null,null,null,{"$error":"#DIV/0!"}]
[{"$f":"A618","v":38905},null,null,null,null,null,null,null,null,null,null,null,null,null,null,null,null,null,null,null,null,null,null,null,null,null,null,null,null,null,null,null,{"$error":"#DIV/0!"}]
[1000000,null,null,null,null,null,null,null,null,null,null,null,null,null,null,null,null,null,null,null,null,null,null,null,null,null,null,null,null,null,null,null,{"$error":"#DIV/0!"}]
[null,null,null,null,null,null,null,null,null,null,null,null,null,null,null,null,null,null,null,null,null,null,null,null,null,null,null,null,null,null,null,null,{"$error":"#DIV/0!"}]
[{"$f":"pole1","v":2913.8215591319222},null,1.4142135623730951,0.78539816339744828,1.0000024133350127,2.1969661622930742E-3,{"$f":"IF(VIN_nom>Vout, 1, SQRT(1+(A622/z_RHP)^2))","v":1},{"$f":"IF(VIN_nom>Vout, 0, -ATAN(A622/z_RHP))","v":0},{"$f":"SQRT(1+(A622/Pole2)^2)","v":262.28713358742209},{"$f":"ATAN(A622/Pole2)","v":1.5669837020236728},{"$f":"SQRT(1+(A622/Zero2)^2)","v":1.0456993273560722},{"$f":"ATAN(A622/Zero2)","v":0.29672965291306103},{"$f":"SQRT(1+(A622/pole4)^2)","v":1.0000113527269101},{"$f":"ATAN(A622/pole4)","v":4.7650014706086272E-3},{"$f":"SQRT(1+(A622/Zero3)^2)","v":1.000000000004245},{"$f":"ATAN(A622/Zero3)","v":2.913821559123676E-6},{"$f":"SQRT(1+(A622/pole5)^2)","v":1.000000000004245},{"$f":"ATAN(A622/pole5)","v":2.913821559123676E-6},{"$f":"SQRT((1-(A622^2/(pole3^2)))^2+(A622/(Q*pole3))^2)","v":1.0000862475242667},{"$f":"ATAN((A622/(Q*pole3))/(1-A622^2/pole3^2))","v":2.4433400608313009E-2},{"$f":"20*LOG10(((E622*K622*G622*O622)/(C622*I622*S622*M622*Q622))*Adc)","v":30.135345593996657},{"$f":"((F622+L622+H622+R622)-(D622+J622+T622+N622+T622))*radconv","v":-120.7270280265885},59.272971973411501,"p1",null,null,null,{"$f":"20*LOG10((K622/(I622*M622))*AEA)","v":25.398687041908165},{"$f":"(L622-(J622+N622))*radconv","v":-73.053210397081159},null,null,null,17.045137609807369,{"$f":"(F622+H622-(D622+T622))*radconv","v":-46.274053845176269}]
[{"$f":"Zero1","v":1326291.1924324611},null,455.17351227662641,1.5685993606326036,1.4142135623730951,0.78539816339744828,1,0,119385.00000418813,1.5707879505332225,139.17555096472611,1.563611094922539,2.3883438533854653,1.1387828039401402,1.0000008795237769,1.3262904147631808E-3,1.0000008795237769,1.3262904147631808E-3,44.391856786590061,-0.25322233811002048,-68.195103769395104,-81.439641748226023,98.560358251773977,"z1",null,null,null,{"$f":"20*LOG10((K623/(I623*M623))*AEA)","v":7.1565154655279422},{"$f":"(L623-(J623+N623))*radconv","v":-65.658651984510882},null,null,null,-63.043140177204158,-30.365551859028646]
[{"$f":"Pole2","v":11.109362084285808},null,1.0000072680978438,3.8126247712238948E-3,1.0000000000350808,8.3762616742188101E-6,1,0,1.4142135623730951,0.78539816339744828,1.0000006794755065,1.1657402126794719E-3,1.0000000001650271,1.8167388165389426E-5,1,1.1109362084285808E-8,1,1.1109362084285808E-8,1.000000001253442,9.3154604867820811E-5,78.123518269855225,-45.162890399170273,134.83710960082973,"p2",null,null,{"$f":"Pole2","v":11.109362084285808},{"$f":"20*LOG10((K624/(I624*M624))*AEA)","v":70.37589475913849},{"$f":"(L624-(J624+N624))*radconv","v":-44.93424892047144},null,null,null,20.056102568435623,-0.22330474951726526]
[{"$f":"Zero2","v":9529.8737498242026},null,3.4200387250028852,1.2740666738818356,1.0000258143338341,7.185231872357538E-3,1,0,857.8242524492033,1.5696305865822171,1.4142135623730951,0.78539816339744828,1.0001214296319763,1.5583154085077525E-2,1.0000000000454092,9.5298737495357072E-6,1.0000000000454092,9.5298737495357072E-6,1.0009245098256421,7.9921470536859704E-2,14.786731618380461,-127.57079662390991,52.429203376090086,"z2",null,null,{"$f":"Zero2","v":9529.8737498242026},{"$f":"20*LOG10((K625/(I625*M625))*AEA)","v":17.72746770222534},{"$f":"(L625-(J625+N625))*radconv","v":-45.826056966381771},null,null,null,9.3677429738739999,-77.16612272483205]
[{"$f":"pole3","v":200000},null,68.645667109265062,1.5562282496755857,1.011305872889162,0.14966877809032958,1,0,18002.833897316646,1.5707407799845323,21.010448066956499,1.5231829710312725,1.0521269734230005,0.31609800789440068,1.0000000199999999,1.999999973333334E-4,1.0000000199999999,1.999999973333334E-4,1.6770468752948957,{"$error":"#DIV/0!"},-19.091114882498879,{"$error":"#DIV/0!"},{"$error":"#DIV/0!"},"p3",null,null,null,{"$f":"20*LOG10((K626/(I626*M626))*AEA)","v":14.286714514632884},{"$f":"(L626-(J626+N626))*radconv","v":-20.835943500753402},null,null,null,-21.069350339412878,{"$error":"#DIV/0!"}]
[{"$f":"Fp2_u","v":183765.81257006983},null,{"$f":"SQRT(1+(A627/pole1)^2)","v":63.074868659694502},{"$f":"ATAN(A627/pole1)","v":1.5549414876415779},{"$f":"SQRT(1+(A627/Zero1)^2)","v":1.009553272014994},{"$f":"ATAN(A627/Zero1)","v":0.13767957534298736},1,0,16541.527003229894,1.5707358728839358,19.309043894588523,1.5189839446738014,1.044179137623598,0.29193043483861619,1.0000000168849368,1.8376581050148712E-4,1.0000000168849368,1.8376581050148712E-4,1.5487710189424508,1.4700603968329318,-17.612207891093558,-269.34065866547326,{"$f":"IF(V627>0,V627,V627+180)","v":-89.340658665473256},"p4",null,null,null,null,null,null,null,null,-19.658120842540512,-165.43138240720342]
[{"$f":"z_RHP","v":117132.67936334232},null,{"$f":"SQRT(1+(A628/pole1)^2)","v":40.211424705986111},{"$f":"ATAN(A628/pole1)","v":1.545925208445464},{"$f":"SQRT(1+(A628/Zero1)^2)","v":1.0038922794400578},{"$f":"ATAN(A628/Zero1)","v":8.8087415273797751E-2},1,0,10543.600883785766,1.5707014825369887,12.331717776812784,1.4896154847247212,1.018180378609407,0.18925721497517281,1.0000000068600323,1.1713267882765301E-4,1.0000000068600323,1.1713267882765301E-4,1.1816658551550505,0.98123871046198397,-11.165067279185921,-211.452440276652,{"$f":"IF(V628>0,V628,V628+180)","v":-31.452440276651998},"z_RHP",null,null,null,null,null,null,null,null,-13.446974949145103,-139.74878956773335]
[{"$f":"Fp2_u","v":183765.81257006983},null,null,null,null,null,null,null,null,null,null,null,null,null,null,null,null,null,null,null,-25]
[]
[null,null,null,"System","Plant"]
["p1","p-dom",{"$f":"pole1","v":2913.8215591319222},{"$f":"U622","v":30.135345593996657},{"$f":"AG622","v":17.045137609807369}]
["z1","ESR zero",{"$f":"Zero1","v":1326291.1924324611},{"$f":"U623","v":-68.195103769395104},{"$f":"AG623","v":-63.043140177204158}]
["p2","EA pole",{"$f":"Pole2","v":11.109362084285808},{"$f":"U624","v":78.123518269855225},{"$f":"AG624","v":20.056102568435623}]
["z2","EA zero",{"$f":"Zero2","v":9529.8737498242026},{"$f":"U625","v":14.786731618380461},{"$f":"AG625","v":9.3677429738739999}]
["p3","p_sampling",{"$f":"pole3","v":200000},{"$f":"U626","v":-19.091114882498879},{"$f":"AG626","v":-21.069350339412878}]
[]
[]
[{"$f":"Q4*1000","v":38905}]
[{"$f":"Q4*1000","v":38905}]
[]
[]
[]
[]
[]
[]
[]
[]
[]
[]
[]
[]
[]
[]
[]
[]
[]
[]
[]
[]
[]
[]
[]
[]
[]
[]
[]
[]
[]
[]
[]
[]
[]
[]
[]
[]
[]
[]
[]
[]
[]
[]
[]
[]
[]
[]
[null,null,null,null,null,null,null,null,null,null,null,null,null,null,null,null,null,null,null,null,null,null,null,null,null,null,null,null,null,null,null,null,null,null,null,"phase margin",{"$f":"SUM(AK689:AK1306)","v":0}]

{"sheet":"Efficiency Calculations","index":8,"n_rows":109,"n_cols":57,"rows_kept":109,"cut":false,"hidden":true,"merged":[[6,51,6,56],[6,27,6,32],[6,33,6,36],[6,38,6,42],[6,45,6,49],[6,24,6,26],[0,0,3,3],[5,0,6,3],[6,6,6,13],[6,17,6,20],[6,21,6,23]]}
["BUCK CONTROLLER POWER DESIGN TOOL",null,null,null,null,null,"*Assuming CCM conditions",null,null,null,null,null,null,null,null,null,null,null,null,null,null,null,null,null,null,null,null,null,null,null,null,null,null,null,null,null,null,null,null,null,{"$f":"Ext_VCC","v":1}]
[null,null,null,null,null,null,null,{"$f":"AV19","v":0.89147336534117516},"10% load"]
[null,null,null,null,null,null,null,{"$f":"AV59","v":0.94247104984853303},"50% load",null,null,null,null,null,null,{"$f":"Ext_VCC","v":1},null,null,null,null,null,null,null,null,null,null,null,null,null,null,null,null,null,null,null,null,null,null,null,{"$f":"IF(MODE=1, (Qg_Q1+Qg_Q2)*Fsw*Vin, (Qg_Q1+Qg_Q2+Qg_Q3+Qg_Q4)*Fsw*Vin)","v":3.9499199999999998E-2}]
[null,null,null,null,null,null,null,{"$f":"AV109","v":0.92275698534286321},"100% load",null,null,null,null,null,null,null,null,null,null,null,3,null,null,null,null,null,null,null,null,null,null,null,1,null,null,null,2,null,"I_VCC",{"$f":"(Qg_Q1+Qg_Q2)*Fsw*1000","v":3.2915999999999999},"mA",{"$f":"AN4*5/1000","v":1.6457999999999997E-2}]
[null,null,null,null,null,null,null,null,null,null,null,null,null,null,null,null,null,null,null,null,null,null,null,null,null,null,null,null,null,null,null,null,null,null,null,null,null,null,null,null,null,{"$f":"VCC","v":3.15}]
["Enter the values of your design and MOSFET datasheet specifications below. Note that thermal resistance (θJA) will change when components are placed on the PCB"]
[null,null,null,null,null,null,"Operating Point Condtions",null,null,null,null,null,null,null,null,null,null,"Filter Inductor",null,null,null,"Cout",null,null,"Cin",null,null,"High-side BUCK \"Control\" MOSFET Losses ",null,null,null,null,null,"Low-side BUCK \"Sync\" MOSFET Losses ",null,null,null,"Diode/FET","\"Controller\" Losses",null,null,null,null,null,null,"RESULTS",null,null,null,null,null,"Consolidated Buck Efficiency & Losses"]
["Input Parameters",null,null,null,null,null,"Step","Vin","Mode","Iout","Iout/ phase","Iin","Duty Cycle BUCK Leg","Ripple Current pk-pk","Peak Inductor Current","Valley Inductor Current","SW node voltage at Q1 turn-on","Irms Lf","DCR    Loss","Core Loss","Total Inductor Loss","Irms Cout","Cout ESR Loss","Total Cout Loss","Irms Cin","Cin ESR Loss","Total Cin Loss","Irms","RDS(on) Loss","Transition Loss (not including capacitive loss)","MOSFET Output Capacitance Loss","Dead Time Loss ","Total Control MOSFET Loss","Irms","RDS(on) Loss","Deadtime Loss","Total Sync MOSFET Loss","Reverse Recovery Loss","IQ Loss","Switching Current Loss","Switching Current Diss from VCC","LDO Loss Saved from Gate Drive Current (ext VCC = Vout)","Total \"Control\" Loss","Total Loss (not considering total loss)","Total Loss (considering total loss)","Total Loss","Pout","EFF, h",{"$f":"IF(Vin>Vout, \"Buck ''CONTROL'' MOSFET Temp Rise\", \"Boost ''CONTROL'' MOSFET Temp Rise\")","v":"Buck ''CONTROL'' MOSFET Temp Rise"},{"$f":"IF(Vin>Vout, \"Buck ''SYNC'' MOSFET Temp Rise\", \"Boost ''SYNC'' MOSFET Temp Rise\")","v":"Buck ''SYNC'' MOSFET Temp Rise"},null,"h","Inductor Cu & Core Loss","Total MOSFET Loss","Control MOSFET Loss","SYNC MOSFET Loss","IC Power Loss"]
["Design","Input Value","Units","Description",null,null,0,{"$f":"Vin","v":12},{"$f":"MODE","v":1},0,{"$f":"Iout*G9/100/Number_of_Phases","v":0},{"$f":"Vout*K9/(Vin*Efficiency)","v":0},{"$f":"(Vout+(Rdson2+Rs+Rdcr)*K9)/(Vin+(Rs+Rdson2-Rdson1)*K9)","v":0.27499999999999997},{"$f":"(Vin-(Rdson1+Rdcr)*K9-Vout)*M9/(Fsw*Lf)","v":1.8125},{"$f":"K9+N9/2","v":0.90625},{"$f":"K9-N9/2","v":-0.90625},{"$f":"IF(MIN(Vin, -P9/(Coss_Q1+Coss_Q2)*0.00000002)<0, 0, MIN(Vin, -P9/(Coss_Q1+Coss_Q2)*0.00000002))","v":12},{"$f":"SQRT(K9^2+(N9^2)/12)","v":0.52322368145309828},{"$f":"R9^2*Rdcr","v":1.6152018229166664E-3},{"$f":"Core_Loss","v":0.2},{"$f":"(T9+S9*(1+Ltc*(Ta-25)))/(1-S9*Ltc*ThetaCa)","v":0.20164336138883104},{"$f":"N9/SQRT(12)","v":0.52322368145309839},{"$f":"RCoutEsr*V9^2","v":2.7376302083333338E-4},{"$f":"W9","v":2.7376302083333338E-4},{"$f":"SQRT(M9*(1-M9))*SQRT(K9^2+(N9^2)/12)","v":0.23362684408827214},{"$f":"RCinEsr*Y9^2","v":1.6374450683593743E-5},{"$f":"Z9","v":1.6374450683593743E-5},{"$f":"SQRT(M9)*SQRT(K9^2+(N9^2)/12)","v":0.27438081334008513},{"$f":"Rdson1*AB9^2","v":2.6349690755208327E-3},{"$f":"(Vin*K9/2)*Fsw*(Tr_buck+Tf_buck)","v":0},{"$f":"(0.5*Coss_Q1*(Vin-Q9)^2-0.5*Coss_Q2*(Vin-Q9)^2+(Qoss_Q2*(Vin-Q9)/Vin)*Vin)*Fsw","v":0},{"$f":"IF(K9>N9/2,0,ABS(K9-N9/2)*Vsd_Q1*Deadtime*Fsw)","v":1.4083124999999998E-3},{"$f":"(AF9+AE9+AD9+AC9*(1+RdsonTC*(Ta-25))/(1-AC9*RdsonTC*ThetaJA_Q1))","v":4.0439204921118386E-3},{"$f":"SQRT((1-M9))*SQRT(K9^2+(N9^2)/12)","v":0.44550891136336052},{"$f":"Rdson2*AH9^2","v":4.7634765624999988E-3},{"$f":"IF(K9<N9/2,Deadtime*Fsw*Vsd_Q2*(K9+N9/2),2*Deadtime*Fsw*Vsd_Q2*K9)","v":1.4083125000000001E-3},{"$f":"(AJ9+AI9*(1+RdsonTC*(Ta-25)))/(1-AI9*RdsonTC*ThetaJA_Q2)","v":6.1744949722118561E-3},{"$f":"Qrr_Q2*K9/Iout*Fsw*Vin","v":0},{"$f":"Iq*Vin","v":4.1999999999999996E-4},{"$f":"IF(Ext_VCC=1,  (Qg_Q1+Qg_Q2)*Fsw*Vout, (Qg_Q1+Qg_Q2)*Fsw*Vin)","v":1.086228E-2},{"$f":"(Vin-VCC)*Fsw*(Qg_Q1+Qg_Q2)","v":2.9130660000000003E-2},{"$f":"(Qg_Q1+Qg_Q2)*Fsw*(Vin-Vout)","v":2.8636919999999996E-2},{"$f":"SUM(AM9:AN9)","v":1.128228E-2},{"$f":"SUM(S9,T9,AC9,AD9,AE9,AF9,AI9,AJ9,AQ9, AL9)","v":0.22311255246093753},{"$f":"U9 + ((AF9+AE9+AD9+AC9*(1+RdsonTC*(Ta-25))) + (AJ9+AI9*(1+RdsonTC*(Ta-25))) + AQ9 + AL9) / (1-AC9*RdsonTC*ThetaJA_Q1 -AI9*RdsonTC*ThetaJA_Q2)","v":0.22315535431539327},{"$f":"AS9","v":0.22315535431539327},{"$f":"Vout*K9","v":0},{"$f":"AU9/(AU9+AT9)","v":0},{"$f":"ThetaJA_Q1*BC9","v":9.3010171318572282E-2},{"$f":"ThetaJA_Q2*BD9","v":0.14201338436087269},null,{"$f":"AV9*100","v":0},{"$f":"U9","v":0.20164336138883104},{"$f":"AG9+AK9+AL9","v":1.0218415464323696E-2},{"$f":"AG9+AL9*0.66","v":4.0439204921118386E-3},{"$f":"AK9+AL9*0.33","v":6.1744949722118561E-3},{"$f":"AS9-BA9","v":2.1511992926562223E-2}]
[null,null,null,null,null,null,1,12,1,{"$f":"Iout*G10/100","v":0.06},0.06,1.833333333333333E-2,0.27540014196167034,1.8146253053925441,{"$f":"K10+N10/2","v":0.96731265269627209},{"$f":"K10-N10/2","v":-0.84731265269627198},12,{"$f":"SQRT(K10^2+(N10^2)/12)","v":0.52726218959917404},1.640231957827401E-3,0.2,0.20166883151327383,{"$f":"N10/SQRT(12)","v":0.52383720427334612},2.7440541658091535E-4,{"$f":"W10","v":2.7440541658091535E-4},{"$f":"SQRT(M10*(1-M10))*SQRT(K10^2+(N10^2)/12)","v":0.23553629052252309},1.6643203245933118E-5,{"$f":"Z10","v":1.6643203245933118E-5},{"$f":"SQRT(M10)*SQRT(K10^2+(N10^2)/12)","v":0.2766997130329148},2.6796955917374092E-3,2.3185714285714289E-4,0,1.3167238622900064E-3,{"$f":"(AF10+AE10+AD10+AC10*(1+RdsonTopTc*Ta-RdsonTopTc*25))/(1-AC10*RdsonTopTc*ThetaJA_Q1)","v":4.2293192593967008E-3},0.44882366848063837,4.8346244493220319E-3,1.5032038622900068E-3,{"$f":"(AJ10+AI10*(1+RdsonBotTc*Ta-RdsonBotTc*25))/(1-AI10*RdsonBotTc*ThetaJA_Q2)","v":6.3406485398219154E-3},3.3600000000000004E-4,4.1999999999999996E-4,1.086228E-2,2.9130660000000003E-2,2.8636919999999996E-2,1.128228E-2,{"$f":"SUM(S10,T10,AC10,AD10,AE10,AF10,AI10,AJ10,AQ10, AL10)","v":0.22382461686632402},0.2238685634837288,{"$f":"AS10","v":0.2238685634837288},0.19799999999999998,{"$f":"AU10/(AU10+AT10)","v":0.46934049402720357},0.10237482296612412,0.14838515641590405,null,{"$f":"AV10*100","v":46.934049402720355},0.20166883151327383,1.0905967799218616E-2,4.4510792593967004E-3,6.4515285398219152E-3,{"$f":"AS10-BA10","v":2.2199731970454967E-2}]
["Vin",{"$f":"Vin","v":12},"V","Vin",null,null,2,12,1,0.12,0.12,3.666666666666666E-2,0.27580006796329981,1.8167477004145034,1.0283738502072517,-0.7883738502072517,12,0.53800342370048992,1.7077413350893487E-3,0.2,0.20173752814657286,0.52444988694197359,2.7504768391344887E-4,2.7504768391344887E-4,0.24044262667168156,1.7343797016233288E-5,1.7343797016233288E-5,0.28254148526393236,2.794039181330212E-3,4.6371428571428578E-4,0,1.2251329632220688E-3,4.4840390597023216E-3,0.45784057598502559,5.0308318324392004E-3,1.5980929632220691E-3,6.6319943248921934E-3,6.7200000000000007E-4,4.1999999999999996E-4,1.086228E-2,2.9130660000000003E-2,2.8636919999999996E-2,1.128228E-2,0.22477383256101724,0.22482023634021298,0.22482023634021298,0.39599999999999996,0.63786580530050541,0.11333385837315341,0.15763634947252045,null,63.786580530050543,0.20173752814657286,1.1788033384594516E-2,4.9275590597023218E-3,6.8537543248921931E-3,2.3082708193640111E-2]
["Vout",{"$f":"Vout","v":3.3},"V","Vout",null,null,3,12,1,0.18,0.18,5.4999999999999993E-2,0.27619977817967445,1.8188671874213704,1.0894335937106852,-0.72943359371068528,12,0.55505839373574972,1.8177299406934126E-3,0.2,0.20184945278854935,0.52506173013895285,2.7568982045651053E-4,2.7568982045651053E-4,0.24817595011999283,1.8477390665388351E-5,1.8477390665388351E-5,0.29170934175905977,2.9783019024326382E-3,6.9557142857142864E-4,0,1.1335398046264048E-3,4.8087307460079514E-3,0.47222397269410898,5.3518915292881586E-3,1.6929798046264048E-3,7.048341754283349E-3,1.008E-3,4.1999999999999996E-4,1.086228E-2,2.9130660000000003E-2,2.8636919999999996E-2,1.128228E-2,0.22596029441023849,0.22601053377408226,0.22601053377408226,0.59399999999999997,0.72438093845712781,0.12590224715818288,0.16976258034851704,null,72.438093845712785,0.20184945278854935,1.2865072500291301E-2,5.4740107460079512E-3,7.3809817542833493E-3,2.4161080985532907E-2]
["Fsw",{"$f":"Fsw/1000","v":400},"kHz","Switching Frequency",null,null,4,12,1,0.24,0.24,7.333333333333332E-2,0.27659927278539176,1.8209837687660961,1.1504918843830481,-0.67049188438304808,12,0.5778683447312758,1.9701977606705417E-3,0.2,0.20200460789186833,0.52567273454352248,2.7633182384246462E-4,2.7633182384246462E-4,0.25849008670576795,2.0045137477546629E-5,2.0045137477546629E-5,0.30391659980120411,3.2327854872153841E-3,9.2742857142857156E-4,0,1.0419443883312566E-3,5.2037061138108225E-3,0.49149417515138399,5.7975965809857442E-3,1.7878643883312568E-3,7.5895090531969134E-3,1.3440000000000001E-3,4.1999999999999996E-4,1.086228E-2,2.9130660000000003E-2,2.8636919999999996E-2,1.128228E-2,0.22738409717696279,0.22743963860832686,0.22743963860832686,0.79199999999999993,0.77689739539771785,0.14008716061764892,0.18475966822352899,null,77.689739539771779,0.20200460789186833,1.4137215167007736E-2,6.0907461138108229E-3,8.0330290531969127E-3,2.5435030716458529E-2]
["Iout",{"$f":"Iout","v":6},"A","Max Output Current",null,null,5,12,1,0.3,0.3,9.1666666666666646E-2,0.27699855195486095,1.8230974467990948,1.2115487233995474,-0.61154872339954736,12,0.60578353535767893,2.1651447810916448E-3,0.2,0.20220299686217325,0.52628290083418849,2.7697369171044827E-4,2.7697369171044827E-4,0.27109767835568027,2.204818536295196E-5,2.204818536295196E-5,0.31882782376907404,3.5577913423263312E-3,1.1592857142857143E-3,0,9.503467161628967E-4,5.6692794231938569E-3,0.51509466168960094,6.3677402520269863E-3,1.8827467161628968E-3,8.2553232015435286E-3,1.6799999999999999E-3,4.1999999999999996E-4,1.086228E-2,2.9130660000000003E-2,2.8636919999999996E-2,1.128228E-2,0.2290453355220565,0.22910775565421354,0.22910775565421354,0.98999999999999988,0.81206931496283796,0.1558958267334587,0.20262363363550115,null,81.206931496283801,0.20220299686217325,1.5604602624737384E-2,6.7780794231938569E-3,8.8097232015435286E-3,2.6904758792040295E-2]
["Ta",{"$f":"Ta","v":25},"°C","Ambient Temperature",null,null,6,12,1,0.36,0.36,0.10999999999999999,0.27739761586230305,1.825208223868243,1.2726041119341214,-0.55260411193412151,12,0.63813432888879718,2.4025709880674982E-3,0.2,0.20244462405827346,0.5268922296887244,2.7761542170635548E-4,2.7761542170635548E-4,0.2857019243358076,2.4487676870755057E-5,2.4487676870755057E-5,0.33609609804891422,3.9536205493296873E-3,1.3911428571428573E-3,0,8.5874678994562472E-4,6.205767439388059E-3,0.54245261044873794,7.0621160299836052E-3,1.9776267899456247E-3,9.0456198919152946E-3,2.016E-3,4.1999999999999996E-4,1.086228E-2,2.9130660000000003E-2,2.8636919999999996E-2,1.128228E-2,0.23094410400441492,0.23101511177154732,0.23101511177154732,1.1879999999999999,0.83720038648274853,0.17333553110592537,0.22335069751405179,null,83.720038648274851,0.20244462405827346,1.7267387331303355E-2,7.5363274393880596E-3,9.7108998919152954E-3,2.8570487713273862E-2]
["Vcc",{"$f":"VCC","v":3.15},"V","Subregulated VCC Voltage",null,null,7,12,1,0.42,0.42,0.12833333333333333,0.27779646468175151,1.8273161023188906,1.3336580511594454,-0.49365805115944533,12,0.67428259022669801,2.6824763677486688E-3,0.2,0.202729494792384,0.52750072178417462,2.7825701148282523E-4,2.7825701148282523E-4,0.30201958657122102,2.7364749201795377E-5,2.7364749201795377E-5,0.35539008206856215,4.4205738651444774E-3,1.6230000000000001E-3,0,7.6714461150177813E-4,6.8134894737280714E-3,0.57302260081965861,7.8805176252030196E-3,2.0725046115017782E-3,9.9602434891466109E-3,2.3519999999999999E-3,4.1999999999999996E-4,1.086228E-2,2.9130660000000003E-2,2.8636919999999996E-2,1.128228E-2,0.23308049708109976,0.23316195593470357,0.23316195593470357,1.3859999999999999,0.85599837305953452,0.19241361789574563,0.24693728025037204,null,85.599837305953457,0.202729494792384,1.9125732962874682E-2,8.3658094737280708E-3,1.0736403489146611E-2,3.0432461142319567E-2]
["Components","Input Value","Units","Description",null,null,8,12,1,0.48,0.48,0.14666666666666664,0.27819509858705194,1.8294210844938574,1.3947105422469286,-0.43471054224692873,12,0.71365149666992456,3.0048609063254177E-3,0.2,0.20305761533041813,0.52810837779685282,2.7889845869922343E-4,2.7889845869922343E-4,0.3197943830096307,3.0680534221353113E-5,3.0680534221353113E-5,0.37640979653572254,4.9589517224822421E-3,1.8548571428571431E-3,0,6.7554018265172716E-4,7.4927674250085258E-3,0.60631190304261662,8.8227389705078235E-3,2.1673801826517271E-3,1.0999046991448302E-2,2.6880000000000003E-3,4.1999999999999996E-4,1.086228E-2,2.9130660000000003E-2,2.8636919999999996E-2,1.128228E-2,0.23545460910747606,0.23554855930446478,0.23554855930446478,1.5839999999999999,0.8705456042379518,0.21313749077519611,0.27338000080331093,null,87.054560423795181,0.20305761533041813,2.1179814416456829E-2,9.2668474250085266E-3,1.1886086991448302E-2,3.2490943974046643E-2]
["L",{"$f":"Lf*1000000","v":3.3},"uH","Filter Inductance",null,null,9,12,1,0.54,0.54,0.16499999999999998,0.27859351775186297,1.83152317273344,1.4557615863667199,-0.37576158636671997,12,0.75573789174662309,3.3697245900276207E-3,0.2,0.20342899289233224,0.5287151984023446,2.7953976102163062E-4,2.7953976102163062E-4,0.33880258987534162,3.443615847187168E-5,3.443615847187168E-5,0.39889326285483245,5.5690542302841073E-3,2.0867142857142859E-3,0,5.8393350521388279E-4,8.2439258212494235E-3,0.64189089872863603,9.8885742208957451E-3,2.262253505213883E-3,1.2161891993100535E-2,3.0239999999999998E-3,4.1999999999999996E-4,1.086228E-2,2.9130660000000003E-2,2.8636919999999996E-2,1.128228E-2,0.23806653433734956,0.23817521530569974,0.23817521530569974,1.782,0.88210170409913768,0.23551461388873676,0.30267567584131227,null,88.210170409913772,0.20342899289233224,2.3429817814349958E-2,1.0239765821249424E-2,1.3159811993100535E-2,3.47462224133675E-2]
["Rdcr",{"$f":"Rdcr*1000","v":5.9},"mW","Inductor DCR at 25°C",null,null,10,12,1,0.6,0.6,0.18333333333333329,0.27899172234965591,1.8336223693754141,1.516811184687707,-0.31681118468770708,12,0.80011306458701548,3.7770674051246715E-3,0.2,0.20384363565252361,0.52932118427550745,2.801809161228257E-4,2.801809161228257E-4,0.35885346677834334,3.8632743185650667E-5,3.8632743185650667E-5,0.42261705645239611,6.2511811741570722E-3,2.3185714285714285E-3,0,4.9232458100469676E-4,9.0672918618784522E-3,0.67939365593029932,1.1077817753240111E-2,2.357124581004697E-3,1.3448648648690503E-2,3.3599999999999997E-3,4.1999999999999996E-4,1.086228E-2,2.9130660000000003E-2,2.8636919999999996E-2,1.128228E-2,0.2409163669231027,0.24104223971092587,0.24104223971092587,1.9799999999999998,0.89147336534117516,0.25955251282320441,0.33482131891988159,null,89.147336534117514,0.20384363565252361,2.5875940510568952E-2,1.1284891861878452E-2,1.4557448648690503E-2,3.7198604058402251E-2]
["LTc",3930,"ppm","Inductor Series Resistance Temp Co",null,null,11,12,1,0.66,0.66,0.20166666666666666,0.27938971255371542,1.8357186767550377,1.577859338377519,-0.25785933837751884,12,0.84641710857134278,4.2268893379254066E-3,0.2,0.20430155274028067,0.52992633609047235,2.8082192168227228E-4,2.8082192168227228E-4,0.37978680114642166,4.3271404297509485E-5,4.3271404297509485E-5,0.4473934675048245,7.0056320168096669E-3,2.5504285714285715E-3,0,4.0071341183866422E-4,9.9631954603387161E-3,0.71851305271114019,1.2390264165990763E-2,2.4519934118386647E-3,1.4859195638881337E-2,3.6960000000000001E-3,4.1999999999999996E-4,1.086228E-2,2.9130660000000003E-2,2.8636919999999996E-2,1.128228E-2,0.24400420091583175,0.24414997072979736,0.24414997072979736,2.1779999999999999,0.89920113383555911,0.28525877558779045,0.36981413969427074,null,89.920113383555915,0.20430155274028067,2.8518391099220056E-2,1.2402555460338716E-2,1.6078875638881336E-2,3.9848417989516688E-2]
["ThetaCa",{"$f":"ThetaCa","v":22},"°C/W","Core to Ambient Thermal Resistance",null,null,12,12,1,0.72,0.72,0.21999999999999997,0.27978748853713964,1.837812097205056,1.638906048602528,-0.19890604860252803,11.314337235638684,0.89435047681884972,4.7191903747780132E-3,0.2,0.20480275424028618,0.53053065452064496,2.8146277538610391E-4,2.8146277538610391E-4,0.40146918710083462,4.835325245742148E-5,4.835325245742148E-5,0.47306616566778925,7.8327058984868497E-3,2.7822857142857146E-3,2.3391750554131075E-3,3.090999995283285E-4,1.3272831188562905E-2,0.75899352980541246,1.382570827887551E-2,2.5468599995283284E-3,1.6393420137699389E-2,4.032E-3,4.1999999999999996E-4,1.086228E-2,2.9130660000000003E-2,2.8636919999999996E-2,1.128228E-2,0.24966930532089587,0.24984261444551104,0.24984261444551104,2.3759999999999999,0.90485240315963511,0.36648087733694684,0.40765154316708596,null,90.485240315963509,0.20480275424028618,3.3698251326262293E-2,1.5933951188562907E-2,1.772398013769939E-2,4.5039860205224852E-2]
["Cin",{"$f":"Cin*1000000","v":6.58},"μF","Input Capacitance",null,null,13,12,1,0.78,0.78,0.23833333333333331,0.28018505047284031,1.839902633055702,1.699951316527851,-0.13995131652785098,7.96082574106092,0.94366491665585872,5.2539705020699422E-3,0.2,0.20534725119317288,0.53113414023870542,2.8210347492710878E-4,2.8210347492710878E-4,0.42379001499610142,5.3879393043118753E-5,5.3879393043118753E-5,0.49950551655481407,8.7327016374042082E-3,3.0141428571428576E-3,1.3442306408112512E-2,2.1748434588428041E-4,2.5427063568832755E-2,0.80062332832513516,1.5383945132602012E-2,2.6417243458842807E-3,1.8051217781327355E-2,4.3679999999999995E-3,4.1999999999999996E-4,1.086228E-2,2.9130660000000003E-2,2.8636919999999996E-2,1.128228E-2,0.26433655522910005,0.26456121580890402,0.26456121580890402,2.5739999999999998,0.90679742457711554,0.65112870208315343,0.44833112897052912,null,90.679742457711555,0.20534725119317288,4.7846281350160107E-2,2.8309943568832756E-2,1.9492657781327354E-2,5.9213964615731141E-2]
["RCinEsr",{"$f":"RCinEsr*1000","v":0.3},"mW","Input Capacitor ESR",null,null,14,12,1,0.84,0.84,0.25666666666666665,0.28058239853354316,1.8419902866347029,1.7609951433173514,-8.099514331735147E-2,4.6072322706115738,0.994154926560602,5.8312297062278248E-3,0.2,0.20593505559613229,0.53173679391661088,2.8274401800471635E-4,2.8274401800471635E-4,0.4466576846335753,5.9850926172667915E-5,5.9850926172667915E-5,0.52660415413101569,9.7059177301814896E-3,3.2460000000000002E-3,2.3985186021349216E-2,1.2586645271516419E-4,3.7096094955654926E-2,0.84322718341896064,1.7064769988560165E-2,2.736586452715164E-3,1.9832492638391333E-2,4.7039999999999998E-3,4.1999999999999996E-4,1.086228E-2,2.9130660000000003E-2,2.8636919999999996E-2,1.128228E-2,0.27868183635174903,0.27896552923399492,0.27896552923399492,2.7719999999999998,0.90856483740606708,0.92461690398006324,0.49185069068300064,null,90.856483740606706,0.20593505559613229,6.1632587594046259E-2,4.0200734955654925E-2,2.1384812638391332E-2,7.3030473637862636E-2]
["Cout",{"$f":"Cout*1000000","v":120},"μF","Output Capcitance",null,null,15,12,1,0.9,0.9,0.27499999999999997,0.28097953289178823,1.8440750602672813,1.8220375301336407,-2.2037530133640626E-2,1.2535568904232439,1.0456502294385928,6.4509679737173925E-3,0.2,0.2065661804035763,0.53233861622559508,2.833844023249814E-4,2.833844023249814E-4,0.46999626493911872,6.6268946717016681E-5,6.6268946717016681E-5,0.5542730722635193,1.0752652352275419E-2,3.4778571428571432E-3,3.3967772598695593E-2,3.4246321827677528E-5,4.828028940305832E-2,0.8866598917784323,1.8867978328524992E-2,2.8314463218276778E-3,2.1737157181730506E-2,5.0400000000000002E-3,4.1999999999999996E-4,1.086228E-2,2.9130660000000003E-2,2.8636919999999996E-2,1.128228E-2,0.29270520103972592,0.29305610699752371,0.29305610699752371,2.9699999999999998,0.91018968188469884,1.1869538562703414,0.53820821517980166,null,91.018968188469884,0.2065661804035763,7.5057446584788828E-2,5.160668940305832E-2,2.3400357181730506E-2,8.6489926593947414E-2]
["RCoutEsr",{"$f":"Cout_ESR*1000","v":1},"mW","Output Capacitor ESR",null,null,16,12,1,0.96,0.96,0.29333333333333328,0.28137645371992986,1.8461569562761597,1.8830784781380798,3.6921521861920104E-2,0,1.098009392309816,7.1131852910433719E-3,0.2,0.20724063952785149,0.53293960783617056,2.8402462560057131E-4,2.8402462560057131E-4,0.49374266007206297,7.3134544312511006E-5,7.3134544312511006E-5,0.58243830717845735,1.1873203358411747E-2,3.7097142857142862E-3,3.7555200000000004E-2,0,5.319622572787501E-2,0.93080086158730235,2.0793365854359945E-2,2.9836799999999998E-3,2.3822618276764195E-2,5.3760000000000006E-3,4.1999999999999996E-4,1.086228E-2,2.9130660000000003E-2,2.8636919999999996E-2,1.128228E-2,0.30068662878952929,0.30109614927681722,0.30109614927681722,3.1679999999999997,0.91320616773922936,1.3051208717411253,0.58872406036557656,null,91.320616773922936,0.20724063952785149,8.2394844004639214E-2,5.6744385727875012E-2,2.5596698276764196E-2,9.3855509748965726E-2]
["Top Driver","Input Value","Units","Description",null,null,17,12,1,1.02,1.02,0.31166666666666659,0.28177316119013729,1.8482359769815639,1.944117988490782,9.5882011509218046E-2,0,1.1511145405869694,7.8178816447494227E-3,0.2,0.2079584478400068,0.53353976941812853,2.8466468555074975E-4,2.8466468555074975E-4,0.51784426028612085,8.0448803373383903E-5,8.0448803373383903E-5,0.61103818639185714,1.3067868283016751E-2,3.9415714285714288E-3,3.7555200000000004E-2,0,5.4630318677992555E-2,0.97554959910898409,2.2840728487720788E-2,3.17016E-3,2.6065661487835266E-2,5.7120000000000001E-3,4.1999999999999996E-4,1.086228E-2,2.9130660000000003E-2,2.8636919999999996E-2,1.128228E-2,0.30538768984405834,0.30585165514843637,0.30585165514843637,3.3659999999999997,0.91670370051045202,1.3432054895938288,0.64286429422021119,null,91.670370051045197,0.2079584478400068,8.6407980165827819E-2,5.8400238677992558E-2,2.7950621487835267E-2,9.789320730842957E-2]
["RdsonDRT",1,"W","Drain to Source Resistance of pullup Top FET Driver",null,null,18,12,1,1.08,1.08,0.32999999999999996,0.28216965547439443,1.8503121247012246,2.0051560623506122,0.15484393764938775,0,1.2048670382666145,8.5650570214180453E-3,0.2,0.20871962117061429,0.53413910164054024,2.8530457990136337E-4,2.8530457990136337E-4,0.54225702117542807,8.8212803104214575E-5,8.8212803104214575E-5,0.64002107868520086,1.4336944340647884E-2,4.1734285714285719E-3,3.7555200000000004E-2,0,5.6139621009274242E-2,1.0208220210888845,2.5009862369759883E-2,3.3566400000000001E-3,2.8431921586772841E-2,6.0479999999999996E-3,4.1999999999999996E-4,1.086228E-2,2.9130660000000003E-2,2.8636919999999996E-2,1.128228E-2,0.31032741230325439,0.31085168494509946,0.31085168494509946,3.5640000000000001,0.91977713981857767,1.3830199232133076,0.69983851649577533,null,91.977713981857761,0.20871962117061429,9.0619542596047084E-2,6.0131301009274239E-2,3.042776158677284E-2,0.10213206377448517]
["RdsonDRT2",1,"W","Drain to Source Resistance of pulldown Top FET Driver",null,null,19,12,1,1.1399999999999999,1.1399999999999999,0.34833333333333327,0.2825659367445007,1.8523854017503842,2.0661927008751921,0.21380729912480778,0,1.2591839843266859,9.3547114076704841E-3,0.2,0.20952417631064274,0.53473760517175872,2.8594430638482772E-4,2.8594430638482772E-4,0.56694390525682947,9.6427617512359433E-5,9.6427617512359433E-5,0.66934356811994422,1.5680728426423846E-2,4.4052857142857149E-3,3.7555200000000004E-2,0,5.7724489048050692E-2,1.0665474645796544,2.7300563860830945E-2,3.5431199999999999E-3,3.0921347521316461E-2,6.3840000000000008E-3,4.1999999999999996E-4,1.086228E-2,2.9130660000000003E-2,2.8636919999999996E-2,1.128228E-2,0.31550588940921104,0.31609677207792386,0.31609677207792386,3.7619999999999996,0.92248914389619485,1.4245723681051659,0.75964555299027869,null,92.248914389619486,0.20952417631064274,9.5029836569367157E-2,6.1937929048050691E-2,3.3028067521316463E-2,0.10657259576728112]
["Bottom Driver","Input Value","Units","Description",null,null,20,12,1,1.2,1.2,0.36666666666666659,0.28296200517207082,1.8544558104417963,2.1272279052208982,0.2727720947791018,0,1.3139953815520478,1.018684479016666E-2,0.2,0.21037213101238497,0.53533528067941838,2.8658386274011164E-4,2.8658386274011164E-4,0.59187362226619977,1.0509431542035363E-4,1.0509431542035363E-4,0.6989689777799023,1.7099517116453855E-2,4.637142857142857E-3,3.7555200000000004E-2,0,5.9385282261442254E-2,1.1126662710990345,2.9712629540194321E-2,3.7296E-3,3.3533896522680746E-2,6.7199999999999994E-3,4.1999999999999996E-4,1.086228E-2,2.9130660000000003E-2,2.8636919999999996E-2,1.128228E-2,0.3209232143039577,0.3215874735874687,0.3215874735874687,3.9599999999999995,0.92489059827194986,1.4678710920131719,0.82228442002165714,null,92.489059827194993,0.21037213101238497,9.9639178784123011E-2,6.3820482261442255E-2,3.5751496522680747E-2,0.11121534257508373]
["RdsonDRB",1,"W","Drain to Source Resistance of pullup Bottom FET Driver",null,null,21,12,1,1.26,1.26,0.38499999999999995,0.28335786092853521,1.8565233530857315,2.188261676542866,0.33173832345713428,0,1.3692418510667588,1.1061457155605072E-2,0.2,0.21126350399043839,0.53593212883043684,2.8722324671272395E-4,2.8722324671272395E-4,0.61701961200133715,1.1421396047828417E-4,1.1421396047828417E-4,0.72886617757144478,1.8593606668266312E-2,4.8690000000000009E-3,3.7555200000000004E-2,0,6.1122363305003702E-2,1.1591278367398117,3.2245856205722775E-2,3.9160799999999997E-3,3.6269534086356123E-2,7.0560000000000015E-3,4.1999999999999996E-4,1.086228E-2,2.9130660000000003E-2,2.8636919999999996E-2,1.128228E-2,0.32657948002959419,0.3273243702979739,0.3273243702979739,4.1579999999999995,0.92702325556083953,1.5129244360150851,0.88775432398619081,null,92.702325556083949,0.21126350399043839,0.10444789739135983,6.5779323305003704E-2,3.8598014086356124E-2,0.11606086630753551]
["RdsonDRB2",1,"W","Drain to Source Resistance of pulldown Bottom FET Driver",null,null,22,12,1,1.32,1.32,0.40333333333333332,0.28375350418514028,1.8585880319899797,2.2492940159949901,0.39070598400501022,0,1.4248727859197463,1.1978548490722728E-2,0.2,0.21219831492273886,0.53652815029101586,2.8786245605469889E-4,2.8786245605469889E-4,0.64235922238815535,1.2378761117613467E-4,1.2378761117613467E-4,0.75900862071589825,2.0163293021236761E-2,5.1008571428571431E-3,3.7555200000000004E-2,0,6.2936098070899449E-2,1.2058890370733326,3.4900040873607589E-2,4.1025599999999999E-3,3.9128233954324847E-2,7.3920000000000001E-3,4.1999999999999996E-4,1.086228E-2,2.9130660000000003E-2,2.8636919999999996E-2,1.128228E-2,0.33247477952842419,0.33330806697825299,0.33330806697825299,4.3559999999999999,0.92892169543618119,1.5597408156306873,0.95605466094947156,null,92.892169543618124,0.21219831492273886,0.1094563320252243,6.7814818070899452E-2,4.1567593954324848E-2,0.12110975205551414]
["Deadtime","Input Value","Units","Description",null,null,23,12,1,1.38,1.38,0.42166666666666658,0.28414893511294859,1.8606498494598542,2.3103249247299269,0.44967507527007278,0,1.4808448563318783,1.2938118782295031E-2,0.2,0.21317658445164842,0.53712334572664178,2.8850148852458155E-4,2.8850148852458155E-4,0.66787304396394798,1.3381632085610086E-4,1.3381632085610086E-4,0.78937356351214327,2.180887179701509E-2,5.3327142857142852E-3,3.7555200000000004E-2,0,6.4826855736619629E-2,1.2529129521849161,3.7674980778065324E-2,4.28904E-3,4.2109978098685136E-2,7.7279999999999988E-3,4.1999999999999996E-4,1.086228E-2,2.9130660000000003E-2,2.8636919999999996E-2,1.128228E-2,0.33860920564308972,0.33953919250932402,0.33953919250932402,4.5539999999999994,0.93061480062751589,1.6083287219422515,1.0271850162697582,null,93.061480062751585,0.21317658445164842,0.11466483383530476,6.9927335736619634E-2,4.4660218098685138E-2,0.1263626080576756]
["Deadtime",15,"ns","Total Deadtime",null,null,24,12,1,1.44,1.44,0.43999999999999995,0.28454415388283921,1.862708807798195,2.3713544038990975,0.50864559610090243,0,1.5371207961274269,1.3940168017135749E-2,0.2,0.21419833418509648,0.53771771580208738,2.8914034188741439E-4,2.8914034188741439E-4,0.69354436946475262,1.4430113772487838E-4,1.4430113772487838E-4,0.81994143170546319,2.353063829995217E-2,5.5645714285714291E-3,3.7555200000000004E-2,0,6.6795008814247409E-2,1.3001678316510563,4.0570473371045031E-2,4.4755200000000002E-3,4.5214756706676108E-2,8.064E-3,4.1999999999999996E-4,1.086228E-2,2.9130660000000003E-2,2.8636919999999996E-2,1.128228E-2,0.34498285111670435,0.34601840005886597,0.34601840005886597,4.7519999999999998,0.93212688285807865,1.6586967227276905,1.1011451642535506,null,93.212688285807872,0.21419833418509648,0.12007376552092351,7.2117248814247414E-2,4.7875876706676111E-2,0.13182006587376949]
["IQ","Input Value","Units","Description",null,null,25,12,1,1.5,1.5,0.45833333333333326,0.28493916066550784,1.8647649093053711,2.4323824546526858,0.56761754534731446,0,1.593668414041868,1.4984696182096868E-2,0.2,0.21526358669777507,0.53831126118141204,2.8977901391472239E-4,2.8977901391472239E-4,0.71935875348795031,1.5524310486592126E-4,1.5524310486592126E-4,0.85069530414874883,2.5328887517525631E-2,5.7964285714285722E-3,3.7555200000000004E-2,0,6.8840933200288307E-2,1.347626251382033,4.358631632193577E-2,4.6620000000000003E-3,4.8442568167096946E-2,8.3999999999999995E-3,4.1999999999999996E-4,1.086228E-2,2.9130660000000003E-2,2.8636919999999996E-2,1.128228E-2,0.35159580859298684,0.35274636726259279,0.35274636726259279,4.9499999999999993,0.93347855189900608,1.7108534636066308,1.1779350678432299,null,93.347855189900613,0.21526358669777507,0.12568350136738524,7.43849332002883E-2,5.1214568167096949E-2,0.13748278056481772]
["IQ ",{"$f":"Iq*1000","v":3.4999999999999996E-2},"mA","Quiescent Current Of Controller (Not Switching!)",null,null,26,12,1,1.56,1.56,0.47666666666666663,0.28533395563146713,1.8668181562792838,2.4934090781396421,0.62659092186035814,0,1.6504597851460965,1.6071703264068544E-2,0.2,0.21637236553238789,0.53890398252796268,2.904175023844987E-4,2.904175023844987E-4,0.74530365232718598,1.6664326025167284E-4,1.6664326025167284E-4,0.88162049044059687,2.7203914120765151E-2,6.0282857142857152E-3,3.7555200000000004E-2,0,7.0965008226072115E-2,1.3952644241217436,4.6722307517274742E-2,4.8484800000000005E-3,5.179341905811434E-2,8.735999999999999E-3,4.1999999999999996E-4,1.086228E-2,2.9130660000000003E-2,2.8636919999999996E-2,1.128228E-2,0.35844817061639411,0.35972379641264079,0.35972379641264079,5.1479999999999997,0.93468739361132447,1.7648076691996586,1.2575548783366297,null,93.46873936113245,0.21637236553238789,0.13149442728418645,7.673076822607211E-2,5.4676299058114337E-2,0.1433514308802529]
["High-side FET","Input Value","Units","Description",null,null,27,12,1,1.62,1.62,0.495,0.28572853895104688,1.8688685510153713,2.5544342755076856,0.68556572449231445,0,1.7074705868861084,1.7201189249979033E-2,0.2,0.21752469520095327,0.53949588050437525,2.9105580508119114E-4,2.9105580508119114E-4,0.77136812818905931,1.7850263675576791E-4,1.7850263675576791E-4,0.91270418403894527,2.9156012464676893E-2,6.2601428571428582E-3,3.7555200000000004E-2,0,7.3167616708738656E-2,1.4430616333057278,4.9978245060455874E-2,5.0349600000000007E-3,5.5267324136452384E-2,9.0720000000000019E-3,4.1999999999999996E-4,1.086228E-2,2.9130660000000003E-2,2.8636919999999996E-2,1.128228E-2,0.36554002963225468,0.3669514146530688,0.3669514146530688,5.3460000000000001,0.93576850422500002,1.8205681443009889,1.3400049351384047,null,93.576850422500002,0.21752469520095327,0.13750694084519102,7.9155136708738652E-2,5.8261084136452382E-2,0.14942671945211553]
["RdsonTop",{"$f":"Rdson1*1000","v":35},"mW","Drain-Source Resistance of Top FET ",null,null,28,12,1,1.68,1.68,0.51333333333333331,0.28612291079439439,1.8709160958066116,2.6154580479033056,0.74454195209669416,0,1.7646795515888112,1.837315412679456E-2,0.2,0.21872060118616174,0.54008695577257548,2.9169391979568795E-4,2.9169391979568795E-4,0.79754260526780307,1.908222621652064E-4,1.908222621652064E-4,0.94393517617422618,3.1185476588667362E-2,6.4920000000000004E-3,3.7555200000000004E-2,0,7.5449145002818435E-2,1.4909997662563936,5.3353927271438895E-2,5.2214399999999999E-3,5.8864306327959817E-2,9.4079999999999997E-3,4.1999999999999996E-4,1.086228E-2,2.9130660000000003E-2,2.8636919999999996E-2,1.128228E-2,0.37287147798690079,0.3744299741825744,0.3744299741825744,5.5439999999999996,0.93673491520286356,1.878143775064824,1.4252857655430757,null,93.673491520286362,0.21872060118616174,0.14372145133077827,8.1658425002818433E-2,6.1968946327959816E-2,0.15570937299641266]
["RdsonTopTc",{"$f":"RdsonTopTc*1000000","v":4000},"ppm","Drain to Source Resistance Temp Co",null,null,29,12,1,1.74,1.74,0.53166666666666662,0.28651707133147453,1.8729607929435252,2.6764803964717627,0.80351960352823737,0,1.8220680130898801,1.9587597881519293E-2,0.2,0.21996010994278764,0.54067720899377969,2.9233184432530336E-4,2.9233184432530336E-4,0.82381866773479562,2.0360315919250004E-4,2.0360315919250004E-4,0.97530361890858719,3.3292600216966541E-2,6.7238571428571434E-3,3.7555200000000004E-2,0,7.7809983052419776E-2,1.5390629276508212,5.68491526864588E-2,5.4079200000000001E-3,6.2584396719549559E-2,9.7439999999999992E-3,4.1999999999999996E-4,1.086228E-2,2.9130660000000003E-2,2.8636919999999996E-2,1.128228E-2,0.38044260792780177,0.38216025246453494,0.38216025246453494,5.742,0.93759793396805002,1.9375435302056547,1.5133980845496398,null,93.759793396805009,0.21996010994278764,0.15013837977196934,8.4241023052419775E-2,6.5799916719549559E-2,0.1622001425217473]
["QgTop",{"$f":"Qg_Q1*1000000000","v":3.1819999999999999},"nC","Gate Charge Of Top FET",null,null,30,12,1,1.8,1.8,0.54999999999999993,0.2869110207320702,1.875002644714179,2.7375013223570894,0.86249867764291055,0,1.8796195297117351,2.0844520501195212E-2,0.2,0.22124324889915536,0.54126664082849574,2.9296957647376382E-4,2.9296957647376382E-4,0.85018889173286893,2.1684634548778915E-4,2.1684634548778915E-4,1.0068008280695031,3.5477676759050301E-2,6.9557142857142864E-3,3.7555200000000004E-2,0,8.0250524444033799E-2,1.587237118099349,6.0463720057735842E-2,5.5944000000000002E-3,6.6427634552506429E-2,1.008E-2,4.1999999999999996E-4,1.086228E-2,2.9130660000000003E-2,2.8636919999999996E-2,1.128228E-2,0.38825351160369559,0.390143052444484,0.390143052444484,5.9399999999999995,0.93836741931229739,1.9987764622127775,1.6043427947076476,null,93.836741931229739,0.22124324889915536,0.15675815899654025,8.69033244440338E-2,6.9754034552506422E-2,0.16889980354532863]
["QgdTop",{"$f":"Qgd_Q1*1000000000","v":1.446},"nC","Gate to Drain Charge",null,null,31,12,1,1.86,1.86,0.56833333333333325,0.28730475916578235,1.8770416534041887,2.7985208267020942,0.92147917329790574,0,1.9373195694183225,2.2143921972902051E-2,0.2,0.2225700464586601,0.54185525193652428,2.936071140511942E-4,2.936071140511942E-4,0.87664670506602071,2.3055283365093319E-4,2.3055283365093319E-4,1.0384191186615257,3.7740999310062293E-2,7.1875714285714295E-3,3.7555200000000004E-2,0,8.2771166459969528E-2,1.635509965744451,6.4197428353185954E-2,5.7808800000000004E-3,7.0394067217158948E-2,1.0416000000000002E-2,4.1999999999999996E-4,1.086228E-2,2.9130660000000003E-2,2.8636919999999996E-2,1.128228E-2,0.39630428106472171,0.39837920277514061,0.39837920277514061,6.1379999999999999,0.93905200564159408,2.0618517085792991,1.6981209859946558,null,93.905200564159401,0.2225700464586601,0.16358123367712848,8.964572645996953E-2,7.3831347217158949E-2,0.1758091563164805]
["QgsTop",{"$f":"Qgs_Q1*1000000000","v":1.9770000000000001},"nC",null,null,null,32,{"$f":"Vin","v":12},{"$f":"MODE","v":1},1.92,{"$f":"Iout*G41/100/Number_of_Phases","v":1.92},{"$f":"Vout*K41/(Vin*Efficiency)","v":0.58666666666666656},{"$f":"(Vout+(Rdson2+Rs+Rdcr)*K41)/(Vin+(Rs+Rdson2-Rdson1)*K41)","v":0.28769828680203041},{"$f":"(Vin-(Rdson1+Rdcr)*K41-Vout)*M41/(Fsw*Lf)","v":1.8790778212967238},2.8595389106483617,0.980461089351638,{"$f":"IF(MIN(Vin, -P41/(Coss_Q1+Coss_Q2)*0.00000002)<0, 0, MIN(Vin, -P41/(Coss_Q1+Coss_Q2)*0.00000002))","v":0},1.99515524580773,{"$f":"R41^2*Rdcr","v":2.3485802283757212E-2},{"$f":"Core_Loss","v":0.2},{"$f":"(T41+S41*(1+Ltc*(Ta-25)))/(1-S41*Ltc*ThetaCa)","v":0.22394053200134351},0.54244304297695956,2.9424445487410359E-4,2.9424445487410359E-4,0.90318626953612047,2.4472363124357208E-4,2.4472363124357208E-4,1.0701516668375946,{"$f":"Rdson1*AB41^2","v":4.0082860651234876E-2},{"$f":"(Vin*K41/2)*Fsw*(Tr_buck+Tf_buck)","v":7.4194285714285725E-3},{"$f":"(0.5*Coss_Q1*(Vin-Q41)^2-0.5*Coss_Q2*(Vin-Q41)^2+(Qoss_Q2*(Vin-Q41)/Vin)*Vin)*Fsw","v":3.7555200000000004E-2},{"$f":"IF(K41>N41/2,0,ABS(K41-N41/2)*Vsd_Q1*Deadtime*Fsw)","v":0},{"$f":"(AF41+AE41+AD41+AC41*(1+RdsonTopTc*Ta-RdsonTopTc*25))/(1-AC41*RdsonTopTc*ThetaJA_Q1)","v":8.5372310132430573E-2},{"$f":"SQRT((1-M41))*SQRT(K41^2+(N41^2)/12)","v":1.6838705012081012},{"$f":"Rdson2*AH41^2","v":6.8050076756131728E-2},{"$f":"IF(K41<N41/2,Deadtime*Fsw*Vsd_Q2*(K41+N41/2),2*Deadtime*Fsw*Vsd_Q2*K41)","v":5.9673599999999997E-3},{"$f":"(AJ41+AI41*(1+RdsonBotTc*Ta-RdsonBotTc*25))/(1-AI41*RdsonBotTc*ThetaJA_Q2)","v":7.4483750248911851E-2},{"$f":"Qrr_Q2*K41/Iout*Fsw*Vin","v":1.0752000000000001E-2},{"$f":"Iq*Vin","v":4.1999999999999996E-4},{"$f":"IF(Ext_VCC=1,  (Qg_Q1+Qg_Q2)*Fsw*Vout, (Qg_Q1+Qg_Q2)*Fsw*Vin)","v":1.086228E-2},{"$f":"(Vin-VCC)*Fsw*(Qg_Q1+Qg_Q2)","v":2.9130660000000003E-2},{"$f":"(Qg_Q1+Qg_Q2)*Fsw*(Vin-Vout)","v":2.8636919999999996E-2},{"$f":"SUM(AM41:AN41)","v":1.128228E-2},0.40459500826255235,{"$f":"U41 + ((AF41+AE41+AD41+AC41*(1+RdsonTC*(Ta-25))) + (AJ41+AI41*(1+RdsonTC*(Ta-25))) + AQ41 + AL41) / (1-AC41*RdsonTC*ThetaJA_Q1 -AI41*RdsonTC*ThetaJA_Q2)","v":0.40686955804911118},0.40686955804911118,{"$f":"Vout*K41","v":6.3359999999999994},0.93965928681455479,{"$f":"ThetaJA_Q1*BC41","v":2.1267784930459031},{"$f":"ThetaJA_Q2*BD41","v":1.7947339357249725},null,93.96592868145548,{"$f":"U41","v":0.22394053200134351},{"$f":"AG41+AK41+AL41","v":0.17060806038134244},{"$f":"AG41+AL41*0.66","v":9.2468630132430576E-2},{"$f":"AK41+AL41*0.33","v":7.8031910248911845E-2},0.18292902604776767]
["RGateTop",{"$f":"Rgate1","v":0},"W","Gate Resistance",null,null,33,12,1,{"$f":"Iout*G42/100","v":1.98},1.98,0.60499999999999998,0.28809160381005239,1.881111150672508,2.920555575336254,1.039444424663746,0,2.0531150958398241,2.4870161420915689E-2,0.2,0.22535473588552452,0.54303001460818956,2.9488159676537056E-4,2.9488159676537056E-4,0.9298023818732668,2.5935974080116007E-4,2.5935974080116007E-4,1.1019923936775307,4.2503553250309689E-2,7.6512857142857155E-3,3.7555200000000004E-2,0,8.8054360298246384E-2,1.7323089681238264,7.2021464665013676E-2,6.1538399999999998E-3,7.8696747325636029E-2,1.1088000000000001E-2,4.1999999999999996E-4,1.086228E-2,2.9130660000000003E-2,2.8636919999999996E-2,1.128228E-2,0.41312578505052477,0.41561499903939048,0.41561499903939048,6.5339999999999998,0.94019596782025494,2.1935661268596669,1.8941831084896288,null,94.019596782025488,0.22535473588552452,0.17783910762388239,9.5372440298246389E-2,8.2355787325636032E-2,0.19026026315386596]
["GfsTop",{"$f":"Gfs_Q1","v":100},"S","Transconductance of Top FET",null,null,34,12,1,2.04,2.04,0.62333333333333318,0.28848471035890522,1.8831416438098258,2.9815708219049131,1.098429178095087,0,2.1111888919644852,2.6296999371569964E-2,0.2,0.22681268944948474,0.54361616748789865,2.9551853755423109E-4,2.9551853755423109E-4,0.95649038999349445,2.7446215984497211E-4,2.7446215984497211E-4,1.1339358669438229,4.5003369261957381E-2,7.8831428571428577E-3,3.7555200000000004E-2,0,9.0817725654270071E-2,1.7808166629983537,7.6111391693102215E-2,6.34032E-3,8.3033130266413666E-2,1.1424E-2,4.1999999999999996E-4,1.086228E-2,2.9130660000000003E-2,2.8636919999999996E-2,1.128228E-2,0.42189670318377243,0.42461643294779006,0.42461643294779006,6.7319999999999993,0.94066799067322771,2.2622240100482118,1.9964701561275142,null,94.066799067322776,0.22681268944948474,0.18527485592068371,9.8357565654270077E-2,8.6803050266413662E-2,0.19780374349830532]
["VthTop",{"$f":"Vth_Q1","v":1.2},"V","Threshold Voltage of Top FET",null,null,35,12,1,2.1,2.1,0.64166666666666661,0.28887760661746492,1.8851693029845236,3.0425846514922616,1.1574153485077383,0,2.1693674827184681,2.7766316122949955E-2,0.2,0.22831442501320989,0.54420150227306696,2.9615527507626286E-4,2.9615527507626286E-4,0.98324612194180894,2.9003188089408196E-4,2.9003188089408196E-4,1.165977217716619,4.7582600528196586E-2,8.1150000000000024E-3,3.7555200000000004E-2,0,9.3662818813455576E-2,1.8293857993441609,8.0319657668209796E-2,6.5268000000000001E-3,8.749297903163554E-2,1.176E-2,4.1999999999999996E-4,1.086228E-2,2.9130660000000003E-2,2.8636919999999996E-2,1.128228E-2,0.4309078543193563,0.43387479366142923,0.43387479366142923,6.93,0.9410806394977147,2.3327616327094782,2.1015969177276177,null,94.108063949771463,0.22831442501320989,0.19291579784509111,0.10142441881345557,9.1373779031635544E-2,0.20556036864821933]
["VspTop",{"$f":"Vsp_Q1","v":1.26},"V",null,null,null,36,12,1,2.16,2.16,0.65999999999999992,0.28927029275442695,1.8871941304700133,3.1035970652350069,1.2164029347649934,0,2.2276426569747163,2.9278111662322907E-2,0.2,0.2298599758801862,0.54478601961997197,2.9679180717337249E-4,2.9679180717337249E-4,1.0100658253752788,3.0606989147731294E-4,3.0606989147731294E-4,1.1981120693921798,5.0241538578812403E-2,8.3468571428571437E-3,3.7555200000000004E-2,0,9.659005636162761E-2,1.8780093919760257,8.4646062632403887E-2,6.7132800000000003E-3,9.2076381724449874E-2,1.2095999999999999E-2,4.1999999999999996E-4,1.086228E-2,2.9130660000000003E-2,2.8636919999999996E-2,1.128228E-2,0.44015933001639634,0.44339104201742963,0.44339104201742963,7.1280000000000001,0.94143862870682138,2.405188576317435,2.2095654196623471,null,94.143862870682142,0.2298599758801862,0.20076243808607747,0.10457341636162761,9.6068061724449871E-2,0.21353106613724343]
["VsdTop",{"$f":"Vsd_Q1","v":0.7},"V",null,null,null,37,12,1,2.2200000000000002,2.2200000000000002,0.67833333333333334,0.28966276893830634,1.8892161285372766,3.1646080642686387,1.2753919357313619,0,2.2860070279187203,3.0832385976993313E-2,0.2,0.23144937633925247,0.54536972018418972,2.9742813169378139E-4,2.9742813169378139E-4,1.0369461158375273,3.2257717414516037E-4,3.2257717414516037E-4,1.2303364769940446,5.2980474631774105E-2,8.5787142857142867E-3,3.7555200000000004E-2,0,9.9599858914957026E-2,1.9266811581244221,8.9090406841719955E-2,6.8997600000000004E-3,9.678343459356005E-2,1.2432000000000002E-2,4.1999999999999996E-4,1.086228E-2,2.9130660000000003E-2,2.8636919999999996E-2,1.128228E-2,0.44965122173620159,0.45316616607595456,0.45316616607595456,7.3260000000000005,0.94174617736639188,2.4795145150440114,2.3203778756518814,null,94.174617736639192,0.23144937633925247,0.20881529350851707,0.10780497891495702,0.10088599459356005,0.22171678973670209]
["θJATop",{"$f":"ThetaJA_Q1","v":23},"°C/W","Junction to Ambient Resistance",null,null,38,12,1,2.2799999999999998,2.2799999999999998,0.69666666666666655,0.29005503533743787,1.8912352994548658,3.2256176497274325,1.3343823502725669,0,2.3444539335401773,3.2429139054302863E-2,0.2,0.23308266166650859,0.54595260462059469,2.9806424649201144E-4,2.9806424649201144E-4,1.0638839323937679,3.3955470648168814E-4,3.3955470648168814E-4,1.2626468751187736,5.5799699593652143E-2,8.8105714285714298E-3,3.7555200000000004E-2,0,0.10269265117815553,1.975395432627302,9.365249076587534E-2,7.0862399999999997E-3,0.10161424203737128,1.2768000000000002E-2,4.1999999999999996E-4,1.086228E-2,2.9130660000000003E-2,2.8636919999999996E-2,1.128228E-2,0.45938362084240181,0.4632011814017461,0.4632011814017461,7.5239999999999991,0.94200707220442714,2.5557492170975773,2.4340366868595393,null,94.200707220442709,0.23308266166650859,0.21707489321552681,0.11111953117815553,0.10582768203737128,0.2301185197352375]
["Low-side FET","Input Value","Units","Description",null,null,39,12,1,2.34,2.34,0.71499999999999986,0.2904470921199766,1.8932516454889106,3.2866258227444551,1.3933741772555446,0,2.4029773510020589,3.4068370881630353E-2,0.2,0.23475986812727939,0.54653467358336227,2.9870014942887238E-4,2.9870014942887238E-4,1.0908764994510849,3.5700346111639582E-4,3.5700346111639582E-4,1.2950400331378031,5.8699504060034685E-2,9.0424285714285728E-3,3.7555200000000004E-2,0,0.10586886200340326,2.0241470949511822,9.8332115087983452E-2,7.2727199999999999E-3,0.10656891660948524,1.3103999999999998E-2,4.1999999999999996E-4,1.086228E-2,2.9130660000000003E-2,2.8636919999999996E-2,1.128228E-2,0.46935661860107702,0.47349713135431282,0.47349713135431282,7.7219999999999995,0.94222472123834833,2.633902546078275,2.5505444420181607,null,94.222472123834834,0.23475986812727939,0.22554177861288849,0.11451750200340326,0.11089323660948525,0.23873726322703342]
["RdsonBot",{"$f":"Rdson2*1000","v":24},"mW","Drain-Source Resistance of Low-side FET",null,null,40,12,1,2.4,2.4,0.73333333333333317,0.29083893945389788,1.8952651689031188,3.3476325844515591,1.4523674155484405,0,2.4615718227123593,3.5750081446391538E-2,0.2,0.2364810329781353,0.54711592772596862,2.9933583837144732E-4,2.9933583837144732E-4,1.1179212937949601,3.7492440573605923E-4,3.7492440573605923E-4,1.3275130165188389,6.1680178315943156E-2,9.2742857142857141E-3,3.7555200000000004E-2,0,0.1091289244500233,2.0729315061874329,0.10312908070426798,7.4592E-3,0.11164757902554201,1.3439999999999999E-2,4.1999999999999996E-4,1.086228E-2,2.9130660000000003E-2,2.8636919999999996E-2,1.128228E-2,0.47957030618088836,0.48405508738692848,0.48405508738692848,7.919999999999999,0.94240219961035077,2.713984462350536,2.6699039175874661,null,94.240219961035081,0.2364810329781353,0.23421650347556533,0.1179993244500233,0.11608277902554201,0.24757405440879318]
["RdsonBotTc",{"$f":"RdsonBotTc*1000000","v":4000},"ppm","Drain To Source Resitance Temp Co",null,null,41,12,1,2.46,2.46,0.75166666666666659,0.29123057750699755,1.8972758719587801,3.4086379359793901,1.5113620640206098,0,2.520232392298988,3.7474270736039178E-2,0.2,0.23824619446896919,0.5476963677011919,2.9997131119307918E-4,2.9997131119307918E-4,1.1450160160401608,3.9331850309654449E-4,3.9331850309654449E-4,1.3600631533262115,6.4742012336247337E-2,9.5061428571428588E-3,3.7555200000000004E-2,0,0.11247327584491718,2.1217444544896167,0.10804318872377858,7.6456800000000002E-3,0.11685035817141123,1.3776E-2,4.1999999999999996E-4,1.086228E-2,2.9130660000000003E-2,2.8636919999999996E-2,1.128228E-2,0.49002477465320793,0.49487614935460855,0.49487614935460855,8.1180000000000003,0.94254228892032876,2.7960050244330952,2.7921180779424581,null,94.25422889203287,0.23824619446896919,0.24309963401632842,0.12156543584491718,0.12139643817141123,0.25662995488563933]
["QgBot",{"$f":"Qg_Q2*1000000000","v":5.0469999999999997},"nC","Gate Charge Of Top FET",null,null,42,12,1,2.52,2.52,0.76999999999999991,0.29162200644689223,1.8992837569147683,3.4696418784573844,1.5703581215426159,0,2.5789545489933237,3.9240938738062815E-2,0.2,0.24005539184513011,0.54827599416111261,3.0060656577335636E-4,3.0060656577335636E-4,1.1721585658299998,4.1218671103459252E-4,4.1218671103459252E-4,1.3926880051189787,6.7885295786079825E-2,9.7380000000000019E-3,3.7555200000000004E-2,0,0.11590235784377649,2.1705821076778178,0.11307424046810587,7.8321599999999995E-3,0.12217739111273097,1.4112000000000003E-2,4.1999999999999996E-4,1.086228E-2,2.9130660000000003E-2,2.8636919999999996E-2,1.128228E-2,0.50072011499224856,0.50596144583123437,0.50596144583123437,8.3159999999999989,0.94264751110759804,2.8799743904068591,2.9171900755928126,null,94.264751110759804,0.24005539184513011,0.25219174895650748,0.12521627784377648,0.12683435111273098,0.26590605398610423]
["RGateBot",{"$f":"Rgate2","v":0},"W","Gate Resistance",null,null,43,12,1,2.58,2.58,0.78833333333333322,0.29201322644101979,1.9012888260275476,3.530644413013774,1.6293555869862262,0,2.6377341791769129,4.1050085439988809E-2,0.2,0.24190866534961389,0.54885480775711615,3.012415999981009E-4,3.012415999981009E-4,1.1993470202288954,4.3152998247957908E-4,4.3152998247957908E-4,1.425385341595635,7.1110318021249688E-2,9.9698571428571432E-3,3.7555200000000004E-2,0,0.11941661649308455,2.219440971948206,0.11822203747109755,8.0186400000000005E-3,0.12762882310579726,1.4447999999999999E-2,4.1999999999999996E-4,1.086228E-2,2.9130660000000003E-2,2.8636919999999996E-2,1.128228E-2,0.51165641807519324,0.51731213443600421,0.51731213443600421,8.5139999999999993,0.94272015774280293,2.9659028193409442,3.0451232514333371,null,94.272015774280291,0.24190866534961389,0.26149343959888183,0.12895229649308454,0.13239666310579726,0.27540346908639035]
["VsdBot",{"$f":"Vsd_Q2","v":0.7},"V","Diode Forward Voltage of Bottom FET Body Diode",null,null,44,12,1,2.64,2.64,0.80666666666666664,0.29240423765663909,1.9032910815511717,3.5916455407755858,1.6883544592244144,0,2.6965675240496672,4.2901710829380185E-2,0.2,0.24380605622531079,0.54943280913989145,3.0187641175935238E-4,3.0187641175935238E-4,1.2265796148439847,4.513492654652453E-4,4.513492654652453E-4,1.4581531184408332,7.4417368088655428E-2,1.0201714285714286E-2,3.7555200000000004E-2,0,0.12301650229292398,2.2683178557998929,0.12348638147857496,8.2051199999999998E-3,0.13320480760980516,1.4784E-2,4.1999999999999996E-4,1.086228E-2,2.9130660000000003E-2,2.8636919999999996E-2,1.128228E-2,0.52283377468232495,0.52892940216939233,0.52892940216939233,8.7119999999999997,0.94276231543926503,3.0538006727372511,3.1759211350255185,null,94.2762315439265,0.24380605622531079,0.27100530990272914,0.13277394229292397,0.13808352760980516,0.28512334594408151]
["QrrBot",{"$f":"Qrr_Q2*1000000000","v":7},"nC","Reverse Recovery Charge of Body Diode",null,null,45,12,1,2.7,2.7,0.82499999999999996,0.29279504026083092,1.9052905257372919,3.6526452628686461,1.7473547371313543,0,2.7554511425455104,4.4795814893836619E-2,0.2,0.24574760671731077,0.55000999895943459,3.0251099895535721E-4,3.0251099895535721E-4,1.2538547272862253,4.7164550314140427E-4,4.7164550314140427E-4,1.4909894579171026,7.7806734726697746E-2,1.0433571428571431E-2,3.7555200000000004E-2,0,0.12670247026060533,2.317209838434021,0.12886707444805012,8.3916000000000008E-3,0.13890550630044315,1.5120000000000001E-2,4.1999999999999996E-4,1.086228E-2,2.9130660000000003E-2,2.8636919999999996E-2,1.128228E-2,0.53425227549715593,0.54081446575880887,0.54081446575880887,8.91,0.94277588797047807,3.1436784159939224,3.3095874449101927,null,94.277588797047812,0.24574760671731077,0.28072797656104853,0.13668167026060532,0.14389510630044317,0.2950668590414981]
["TrrBot",{"$f":"Trr_Q2*1000000000","v":40},"ns","Reverse Recovery Time of Body Diode",null,null,46,12,1,2.76,2.76,0.84333333333333316,0.29318563442049744,1.9072871608351554,3.7136435804175774,1.8063564195824222,0,2.8143818787596242,4.6732397620994265E-2,0.2,0.24773336007526622,0.55058637786504705,3.031453594905524E-4,3.031453594905524E-4,1.2811708626429892,4.9241963378561428E-4,4.9241963378561428E-4,1.5238926318167723,8.127870636569072E-2,1.066542857142857E-2,3.7555200000000004E-2,0,0.13047497999513191,2.3661142419978591,0.13436391854844248,8.5780800000000001E-3,0.144731089084843,1.5455999999999998E-2,4.1999999999999996E-4,1.086228E-2,2.9130660000000003E-2,2.8636919999999996E-2,1.128228E-2,0.54591201110655607,0.55296857201415051,0.55296857201415051,9.1079999999999988,0.94276261558121754,3.235546619888034,3.4461260889513889,null,94.27626155812176,0.24773336007526622,0.29066206907997494,0.14067593999513192,0.14983156908484299,0.30523521193888425]
["θJABot",{"$f":"ThetaJA_Q2","v":23},"°C/W","Junction to Ambient Resistance",null,null,47,12,1,2.82,2.82,0.86166666666666658,0.29357602030236302,1.9092809890916098,3.774640494545805,1.8653595054541949,0,2.8733568332658495,4.8711458998525761E-2,0.2,0.24976336055581258,0.55116194650533801,3.0377949127555312E-4,3.0377949127555312E-4,1.3085266406851568,5.136725908148344E-4,5.136725908148344E-4,1.556861046449125,8.4833571128273277E-2,1.0897285714285714E-2,3.7555200000000004E-2,0,0.13433449574251793,2.4150286071442069,0.13997671615979732,8.7645599999999994E-3,0.15068173411788921,1.5792E-2,4.1999999999999996E-4,1.086228E-2,2.9130660000000003E-2,2.8636919999999996E-2,1.128228E-2,0.55781307200088215,0.56539299819345201,0.56539299819345201,9.3059999999999992,0.94272409189899298,3.3294159620779125,3.5855411647114517,null,94.272409189899292,0.24976336055581258,0.30080822986040712,0.14475721574251793,0.15589309411788921,0.3156296376376394]
[null,null,null,null,null,null,48,12,1,2.88,2.88,0.87999999999999989,0.29396619807297425,1.9112720127511098,3.8356360063755548,1.924363993624445,0,2.9323733377977539,5.0732999014140127E-2,0.2,0.25183765342504721,0.55173670552822562,3.0441339222714E-4,3.0441339222714E-4,1.3359207845740013,5.3540530279704457E-4,5.3540530279704457E-4,1.5898932293874286,8.8471616829819549E-2,1.1129142857142858E-2,3.7555200000000004E-2,0,0.13828148646197522,2.4639506714573556,0.14570526987300367,8.9510400000000004E-3,0.15675762781988936,1.6128E-2,4.1999999999999996E-4,1.086228E-2,2.9130660000000003E-2,2.8636919999999996E-2,1.128228E-2,0.56995554857410624,0.57808905237884178,0.57808905237884178,9.5039999999999996,0.94266177878656576,3.4252972286254302,3.7278369598574557,null,94.266177878656578,0.25183765342504721,0.31116711428186455,0.14892596646197523,0.16207986781988937,0.32625139895379457]
[null,null,null,null,null,null,49,12,1,2.94,2.94,0.89833333333333332,0.29435616789870017,1.9132602340557159,3.8966301170278577,1.983369882972142,0,2.9914289328460142,5.2797017655582638E-2,0.2,0.25395628496106648,0.55231065558093706,3.0504706026824446E-4,3.0504706026824446E-4,1.363352110868457,5.5761869346284321E-4,5.5761869346284321E-4,1.6229878177418735,9.2193130978848514E-2,1.1361000000000001E-2,3.7555200000000004E-2,0,0.14231642589298554,2.5128783503643217,0.15154938248951316,9.1375199999999997E-3,0.16295896489561071,1.6463999999999999E-2,4.1999999999999996E-4,1.086228E-2,2.9130660000000003E-2,2.8636919999999996E-2,1.128228E-2,0.58233953112394432,0.59105807386301934,0.59105807386301934,9.702,0.94257701942206251,3.5232013155386674,3.8730179525990467,null,94.257701942206253,0.25395628496106648,0.3217393907885962,0.15318266589298554,0.16839208489561072,0.33710178890195286]
[null,null,null,null,null,null,50,12,1,3,3,0.91666666666666652,0.29474592994573257,1.9152456552451003,3.9576228276225502,2.0423771723774498,0,3.0505213477908879,5.4903514910634825E-2,0.2,0.25611930245656184,0.55288379731000992,3.0568049332793613E-4,3.0568049332793613E-4,1.3908195206628102,5.8031368171701872E-4,5.8031368171701872E-4,1.6561435477590116,9.5998400777433199E-2,1.1592857142857144E-2,3.7555200000000004E-2,0,0.14643979262327558,2.5618097202064267,0.15750885702105913,9.3240000000000007E-3,0.1692859483546858,1.6799999999999999E-2,4.1999999999999996E-4,1.086228E-2,2.9130660000000003E-2,2.8636919999999996E-2,1.128228E-2,0.59496510985198436,0.60430143354647892,0.60430143354647892,9.8999999999999986,0.94247104984853303,3.6231392303353389,4.0210888121577728,null,94.247104984853308,0.25611930245656184,0.33252574097796134,0.1575277926232756,0.17482994835468579,0.34818213108991708]
[null,null,null,null,null,null,51,12,1,3.06,3.06,0.93499999999999983,0.29513548438008619,1.9172282785565493,4.0186141392782746,2.1013858607217255,0,3.1096484832439519,5.7052490767114328E-2,0.2,0.25832675422147422,0.55345613136129335,3.0631368934140921E-4,3.0631368934140921E-4,1.4183219917095586,6.0349118165009075E-4,6.0349118165009075E-4,1.6893592455772704,9.9887713121609156E-2,1.1824714285714287E-2,3.7555200000000004E-2,0,0.15065207015771173,2.6107430031935368,0.16358349668937619,9.51048E-3,0.17573878953339261,1.7135999999999998E-2,4.1999999999999996E-4,1.086228E-2,2.9130660000000003E-2,2.8636919999999996E-2,1.128228E-2,0.60783237486381403,0.61782053434570861,0.61782053434570861,10.097999999999999,0.94234500919780173,3.7251220936273697,4.1720543992680303,null,94.234500919780174,0.25832675422147422,0.34352685969110436,0.16196183015771173,0.18139366953339262,0.35949378012423439]
["Controller","Input Value","Units","Std Units",null,null,52,12,1,3.12,3.12,0.95333333333333325,0.29552483136759888,1.9192081062249653,4.0796040531124831,2.1603959468875176,0,3.1688083953199144,5.9243945212874842E-2,0.2,0.26057868958570862,0.55402765837994783,3.069466462499682E-4,3.069466462499682E-4,1.4458585714029666,6.2715210254982818E-4,6.2715210254982818E-4,1.7226338189924832,0.10386135460178197,1.205657142857143E-2,3.7555200000000004E-2,0,0.15495374698813186,2.6596765540030134,0.16977310492592027,9.696960000000001E-3,0.18231770811781303,1.7471999999999998E-2,4.1999999999999996E-4,1.086228E-2,2.9130660000000003E-2,2.8636919999999996E-2,1.128228E-2,0.62094141616914855,0.63161681161260252,0.63161681161260252,10.295999999999999,0.94219994876271707,3.8291611407270323,4.3259197667097,null,94.219994876271713,0.26057868958570862,0.3547434551059449,0.16648526698813185,0.18808346811781304,0.3710381220268939]
["θJA",23,"°C/W","Junction to Ambient Resistance",null,null,53,12,1,3.18,3.18,0.97166666666666657,0.29591397107393203,1.9211851404828724,4.1405925702414361,2.2194074297585642,0,3.2279992815985907,6.1477878235806006E-2,0.2,0.26287515890190705,0.55459837901044773,3.0757936200101623E-4,3.0757936200101623E-4,1.4734283705163489,6.5129734891273888E-4,6.5129734891273888E-4,1.7559662501079392,0.10791961150313482,1.2288428571428575E-2,3.7555200000000004E-2,0,0.15934531666413324,2.7086088478189092,0.1760774853715891,9.8834400000000003E-3,0.18902293216837612,1.7808000000000001E-2,4.1999999999999996E-4,1.086228E-2,2.9130660000000003E-2,2.8636919999999996E-2,1.128228E-2,0.63429232368195854,0.64569173356533383,0.64569173356533383,10.494,0.94203684006624877,3.9352677232750644,4.482690159872651,null,94.203684006624883,0.26287515890190705,0.36617624883250938,0.17109859666413324,0.19489957216837611,0.38281657466342678]
["Theta JC",2,"°C/W","Junction to Ambient Resistance",null,null,54,12,1,3.24,3.24,0.99,0.29630290366457052,1.9231593835604166,4.2015796917802088,2.278420308219792,0,3.2872194685703664,6.3754289823833452E-2,0.2,0.26521621354828212,0.55516829389658062,3.0821183454804012E-4,3.0821183454804012E-4,1.5010305576009371,6.7592782045553391E-4,6.7592782045553391E-4,1.7893555887608157,0.1120627698060348,1.2520285714285716E-2,3.7555200000000004E-2,0,0.16382727786483361,2.7575384696352789,0.18249644187644343,1.0069920000000001E-2,0.19585469814579148,1.8144000000000004E-2,4.1999999999999996E-4,1.086228E-2,2.9130660000000003E-2,2.8636919999999996E-2,1.128228E-2,0.6478851872205974,0.66004680173094166,0.66004680173094166,10.692,0.94185658205440981,4.0434533108911728,4.642371017353204,null,94.185658205440987,0.26521621354828212,0.37782597601062512,0.17580231786483361,0.20184221814579148,0.39483058818265954]
[null,null,null,null,null,null,55,12,1,3.3,3.3,1.0083333333333331,0.29669162930482335,1.9251308376853722,4.2625654188426862,2.3374345811573138,0,3.3464674003866519,6.607317996491853E-2,0.2,0.26760190593151056,0.55573740368144975,3.0884406185059866E-4,3.0884406185059866E-4,1.5286643539667388,7.0104441212656395E-4,7.0104441212656395E-4,1.8228009466316115,0.11629111518643848,1.2752142857142858E-2,3.7555200000000004E-2,0,0.16840013447162447,2.8064641046714809,0.18902977849942793,1.0256400000000001E-2,0.20281325093837793,1.848E-2,4.1999999999999996E-4,1.086228E-2,2.9130660000000003E-2,2.8636919999999996E-2,1.128228E-2,0.66172009650792785,0.67468355139989156,0.67468355139989156,10.889999999999999,0.94166000752193335,4.1537294928473631,4.804967971582693,null,94.166000752193341,0.26760190593151056,0.38969338541000237,0.18059693447162448,0.20891165093837794,0.40708164546838099]
[null,null,null,null,null,null,56,12,1,3.36,3.36,1.0266666666666666,0.29708014815982348,1.927099505083143,4.3235497525415711,2.3964502474584286,0,3.405741628760806,6.8434548647058419E-2,0.2,0.27003228948968688,0.55630570900747367,3.0947604187430799E-4,3.0947604187430799E-4,1.5563290291764915,7.2664801411723211E-4,7.2664801411723211E-4,1.8563014919557324,0.12060493301629774,1.2984000000000001E-2,3.7555200000000004E-2,0,0.17306439564193671,2.8553845297677909,0.19567729950809348,1.044288E-2,0.2098988438907963,1.8815999999999999E-2,4.1999999999999996E-4,1.086228E-2,2.9130660000000003E-2,2.8636919999999996E-2,1.128228E-2,0.67579714117144962,0.68960355209288604,0.68960355209288604,11.087999999999999,0.94144788886442499,4.266107979764544,4.9704868494883154,null,94.144788886442498,0.27003228948968688,0.40177923953273303,0.1854829556419367,0.21610812389079631,0.41957126260319916]
["Outputs",null,null,null,null,null,57,12,1,3.42,3.42,1.0449999999999999,0.29746846039452818,1.929065387976765,4.3845326939883824,2.4554673060116174,0,3.4650408038854073,7.0838395858285899E-2,0.2,0.27250741869533779,0.55687321051638761,3.1010777259082894E-4,3.1010777259082894E-4,1.584023896992903,7.5273951187337495E-4,7.5273951187337495E-4,1.8898564447670434,0.12500450836396354,1.3215857142857144E-2,3.7555200000000004E-2,0,0.17782057588403571,2.9042986056470332,0.20243880937831923,1.0629360000000001E-2,0.21711173883419108,1.9151999999999995E-2,4.1999999999999996E-4,1.086228E-2,2.9130660000000003E-2,2.8636919999999996E-2,1.128228E-2,0.69011641074342578,0.70480840804019806,0.70480840804019806,11.286,0.9412209432378551,4.3806006053328215,5.1389336731863944,null,94.122094323785504,0.27250741869533779,0.41408431471822676,0.19046089588403572,0.22343189883419107,0.43230098934486028]
["Design","Value","Units",null,null,null,58,12,1,3.48,3.48,1.0633333333333332,0.29785656617371953,1.9310284885869109,4.4455142442934559,2.5144857557065445,0,3.5243636662492497,7.3284721586669335E-2,0.2,0.27502734905849796,0.55743990884924466,3.107392519778542E-4,3.107392519778542E-4,1.6117483117271789,7.7931978610662337E-4,7.7931978610662337E-4,1.9234650726123745,0.12949012599459048,1.3447714285714287E-2,3.7555200000000004E-2,0,0.18266919513286864,2.9532052699428335,0.20931411279403497,1.081584E-2,0.22445220611774944,1.9487999999999998E-2,4.1999999999999996E-4,1.086228E-2,2.9130660000000003E-2,2.8636919999999996E-2,1.128228E-2,0.704677994661009,0.7202997586738209,0.7202997586738209,11.484,0.9409798371953384,4.4972193280559782,5.3103146607082374,null,94.097983719533843,0.27502734905849796,0.42660940125061808,0.19553127513286864,0.23088324611774944,0.44527240961532294]
["Dmax",{"$f":"D1_Vinmin","v":0.36666666666666664},"index",null,null,null,59,12,1,3.54,3.54,1.0816666666666666,0.29824446566200424,1.9329888091318925,4.5064944045659461,2.573505595434054,0,3.5837090392523629,7.5773525820312659E-2,0.2,0.27759213712984687,0.55800580464641614,3.1137047801909436E-4,3.1137047801909436E-4,1.6395016649434837,8.0638971280573644E-4,8.0638971280573644E-4,1.9571266866837465,0.13406207037053949,1.367957142857143E-2,3.7555200000000004E-2,0,0.18761077882698138,3.0021035309078523,0.21630301464694546,1.1002320000000001E-2,0.2319205246416873,1.9824000000000001E-2,4.1999999999999996E-4,1.086228E-2,2.9130660000000003E-2,2.8636919999999996E-2,1.128228E-2,0.71948198226636906,0.73607927913273152,0.73607927913273152,11.681999999999999,0.94072519086187223,4.6159762330205716,5.4846362267588082,null,94.072519086187228,0.27759213712984687,0.43935530346866869,0.20069461882698139,0.23846244464168731,0.45848714200288465]
["Dprime",{"$f":"1-B68","v":0.6333333333333333},"index",null,null,null,60,12,{"$f":"MODE","v":1},3.6,3.6,1.0999999999999999,0.29863215902381418,1.9349463518276646,4.5674731759138325,2.6325268240861677,0,3.6430758225302236,7.8304808547355165E-2,0.2,0.28020184050390745,0.55857089854759323,3.120014487042657E-4,3.120014487042657E-4,1.6672833824797184,8.3395016324790323E-4,8.3395016324790323E-4,1.9908406383218482,0.13872062565178106,1.3911428571428573E-2,3.7555200000000004E-2,0,0.19264585798652825,3.0509924617262696,0.22340532003625257,1.11888E-2,0.23951698189166606,2.0160000000000001E-2,4.1999999999999996E-4,1.086228E-2,2.9130660000000003E-2,2.8636919999999996E-2,1.128228E-2,0.73452846280681727,0.75214868078157227,0.75214868078157227,11.879999999999999,0.94045758169978766,4.7368835336901496,5.6619049835083191,null,94.045758169978768,0.28020184050390745,0.45232283987819433,0.20595145798652825,0.24616978189166605,0.47194684027766481]
["Ipp",{"$f":"Iripple_Vinnom","v":1.867400452488688},"A",null,null,null,61,12,1,3.66,3.66,1.1183333333333332,0.2990196464234065,1.9369011188878267,4.6284505594439134,2.6915494405560869,0,3.7024629859093903,8.0878569755971561E-2,0.2,0.28285651782230664,0.55913519119178712,3.1263216202907632E-4,3.1263216202907632E-4,1.6950929217499413,8.6200200401002577E-4,8.6200200401002577E-4,2.0246063158500478,0.14346607569629663,1.4143285714285716E-2,3.7555200000000004E-2,0,0.19777496929239319,3.0998711953642806,0.23062083426838018,1.1375280000000002E-2,0.24724187397465455,2.0496E-2,4.1999999999999996E-4,1.086228E-2,2.9130660000000003E-2,2.8636919999999996E-2,1.128228E-2,0.74981752543493407,0.76850971174307237,0.76850971174307237,12.077999999999999,0.94017754791088726,4.8599535737250434,5.8421277414170554,null,94.01775479108872,0.28285651782230664,0.46551284326704773,0.21130232929239318,0.25400555397465457,0.48565319392076572]
["Top FET","Value","Units",null,null,null,62,12,1,3.72,3.72,1.1366666666666665,0.29940692802486379,1.9388531125236272,4.6894265562618136,2.7505734437381868,0,3.761869563926322,8.3494809434371778E-2,0.2,0.28555622877709846,0.55969868321732996,3.1326261599521309E-4,3.1326261599521309E-4,1.7229297692979948,8.9054609697997243E-4,8.9054609697997243E-4,2.0584231417032397,0.14829870406048026,1.4375142857142859E-2,3.7555200000000004E-2,0,0.20299865516644588,3.1487389199004387,0.23794936285669877,1.1561760000000001E-2,0.25509550565624173,2.0832000000000003E-2,4.1999999999999996E-4,1.086228E-2,2.9130660000000003E-2,2.8636919999999996E-2,1.128228E-2,0.76534925920869357,0.78516415744453538,0.78516415744453538,12.276,0.93988559151543838,4.9851988288282554,6.0253115100935588,null,93.988559151543839,0.28555622877709846,0.47892616082268763,0.21674777516644589,0.2619700656562417,0.49960792866743692]
["Tr",{"$f":"(Qgd_Q1+Qgs_Q1/2)*(RdsonDRT+Rgate1)/(VCC-Vsp_Q1)*1000000000","v":0.64404761904761909},"ns","Turn on of MOSFET -> Rise time of current",null,null,63,12,1,3.78,3.78,1.1549999999999998,0.29979400399209449,1.9408023349439667,4.750401167471983,2.8095988325280166,0,3.8212946508494121,8.615352757080097E-2,0.2,0.28830103411414992,0.56026137526187669,3.1389280861032943E-4,3.1389280861032943E-4,1.7507934385755939,9.1958329936780558E-4,9.1958329936780558E-4,2.0922905698201331,0.15321879399953903,1.4607000000000002E-2,3.7555200000000004E-2,0,0.20831746385295349,3.1975948742847446,0.24539071152124972,1.174824E-2,0.26307819039941044,2.1167999999999996E-2,4.1999999999999996E-4,1.086228E-2,2.9130660000000003E-2,2.8636919999999996E-2,1.128228E-2,0.78112375309158966,0.80211384117873075,0.80211384117873075,12.473999999999998,0.93958218114318959,5.1126319086179297,6.2114634991864399,null,93.958218114318953,0.28830103411414992,0.49256365425236398,0.22228834385295348,0.27006363039941045,0.51381280706458088]
["Tf",{"$f":"(Qgd_Q1+Qgs_Q1/2)*(RdsonDRT2+Rgate1)/(Vsp_Q1)*1000000000","v":0.96607142857142858},"ns","Turn off of MOSFET -> Fall time of current",null,null,64,{"$f":"Vin","v":12},{"$f":"MODE","v":1},3.84,{"$f":"Iout*G73/100/Number_of_Phases","v":3.84},{"$f":"Vout*K73/(Vin*Efficiency)","v":1.1733333333333331},{"$f":"(Vout+(Rdson2+Rs+Rdcr)*K73)/(Vin+(Rs+Rdson2-Rdson1)*K73)","v":0.30018087448883296},{"$f":"(Vin-(Rdson1+Rdcr)*K73-Vout)*M73/(Fsw*Lf)","v":1.9427487883554002},4.8113743941777001,2.8686256058222996,{"$f":"IF(MIN(Vin, -P73/(Coss_Q1+Coss_Q2)*0.00000002)<0, 0, MIN(Vin, -P73/(Coss_Q1+Coss_Q2)*0.00000002))","v":0},3.8807373961514107,{"$f":"R73^2*Rdcr","v":8.8854724153539399E-2},{"$f":"Core_Loss","v":0.2},{"$f":"(T73+S73*(1+Ltc*(Ta-25)))/(1-S73*Ltc*ThetaCa)","v":0.29109099563658969},0.56082326796240478,3.1452273788803124E-4,3.1452273788803124E-4,1.7786834679213208,9.4911446371698477E-4,9.4911446371698477E-4,2.1262080832713401,{"$f":"Rdson1*AB73^2","v":0.15822662846789354},{"$f":"(Vin*K73/2)*Fsw*(Tr_buck+Tf_buck)","v":1.4838857142857145E-2},{"$f":"(0.5*Coss_Q1*(Vin-Q73)^2-0.5*Coss_Q2*(Vin-Q73)^2+(Qoss_Q2*(Vin-Q73)/Vin)*Vin)*Fsw","v":3.7555200000000004E-2},{"$f":"IF(K73>N73/2,0,ABS(K73-N73/2)*Vsd_Q1*Deadtime*Fsw)","v":0},{"$f":"(AF73+AE73+AD73+AC73*(1+RdsonTopTc*Ta-RdsonTopTc*25))/(1-AC73*RdsonTopTc*ThetaJA_Q1)","v":0.21373194950117122},{"$f":"SQRT((1-M73))*SQRT(K73^2+(N73^2)/12)","v":3.2464383444814784},{"$f":"Rdson2*AH73^2","v":0.25294468618847143},{"$f":"IF(K73<N73/2,Deadtime*Fsw*Vsd_Q2*(K73+N73/2),2*Deadtime*Fsw*Vsd_Q2*K73)","v":1.1934719999999999E-2},{"$f":"(AJ73+AI73*(1+RdsonBotTc*Ta-RdsonBotTc*25))/(1-AI73*RdsonBotTc*ThetaJA_Q2)","v":0.27119025040478445},{"$f":"Qrr_Q2*K73/Iout*Fsw*Vin","v":2.1504000000000002E-2},{"$f":"Iq*Vin","v":4.1999999999999996E-4},{"$f":"IF(Ext_VCC=1,  (Qg_Q1+Qg_Q2)*Fsw*Vout, (Qg_Q1+Qg_Q2)*Fsw*Vin)","v":1.086228E-2},{"$f":"(Vin-VCC)*Fsw*(Qg_Q1+Qg_Q2)","v":2.9130660000000003E-2},{"$f":"(Qg_Q1+Qg_Q2)*Fsw*(Vin-Vout)","v":2.8636919999999996E-2},1.128228E-2,0.7971410959527615,{"$f":"U73 + ((AF73+AE73+AD73+AC73*(1+RdsonTC*(Ta-25))) + (AJ73+AI73*(1+RdsonTC*(Ta-25))) + AQ73 + AL73) / (1-AC73*RdsonTC*ThetaJA_Q1 -AI73*RdsonTC*ThetaJA_Q2)","v":0.81936062467954085},0.81936062467954085,{"$f":"Vout*K73","v":12.671999999999999},0.93926775456726752,{"$f":"ThetaJA_Q1*BC73","v":5.2422655585269382},{"$f":"ThetaJA_Q2*BD73","v":6.4005911193100422},null,93.926775456726759,{"$f":"U73","v":0.29109099563658969},{"$f":"AG73+AK73+AL73","v":0.50642619990595561},{"$f":"AG73+AL73*0.66","v":0.22792458950117123},{"$f":"AK73+AL73*0.33","v":0.27828657040478444},0.52826962904295116]
["Part Power","Value","Units",null,null,null,65,12,1,{"$f":"Iout*G74/100","v":3.9},3.9,1.1916666666666664,0.30056753967863986,1.9446924749621424,{"$f":"K74+N74/2","v":4.8723462374810715},{"$f":"K74-N74/2","v":2.9276537625189287},0,{"$f":"SQRT(K74^2+(N74^2)/12)","v":3.9401970003856235},9.1598399170902414E-2,0.2,0.29392617620832051,{"$f":"N74/SQRT(12)","v":0.56138436195521624},{"$f":"RCoutEsr*V74^2","v":3.1515240184786528E-4},{"$f":"W74","v":3.1515240184786528E-4},{"$f":"SQRT(M74*(1-M74))*SQRT(K74^2+(N74^2)/12)","v":1.806599418719733},{"$f":"RCinEsr*Y74^2","v":9.7914043791554311E-4},{"$f":"Z74","v":9.7914043791554311E-4},{"$f":"SQRT(M74)*SQRT(K74^2+(N74^2)/12)","v":2.1601751920988583},0.16332249011957692,1.5070714285714288E-2,3.7555200000000004E-2,0,0.21924267224913352,3.2952686599560477,0.26061109299092461,1.21212E-2,0.27943201665235606,2.1839999999999998E-2,4.1999999999999996E-4,1.086228E-2,2.9130660000000003E-2,2.8636919999999996E-2,1.128228E-2,{"$f":"SUM(S74,T74,AC74,AD74,AE74,AF74,AI74,AJ74,AQ74, AL74)","v":0.81340137656711831},0.8369064087127227,{"$f":"AS74","v":0.8369064087127227},12.87,{"$f":"AU74/(AU74+AT74)","v":0.93894272100809351},5.374112661730071,6.59270198300419,null,{"$f":"AV74*100","v":93.894272100809346},0.29392617620832051,0.52051468890148955,0.23365707224913351,0.28663921665235609,{"$f":"AS74-BA74","v":0.54298023250440219}]
["Power Dis",{"$f":"AQ9","v":1.128228E-2},"W",null,null,null,66,12,1,3.96,3.96,1.21,0.30095399972490222,1.9466333969660652,4.9333166984830328,2.9866833015169671,0,3.9996727114246862,9.4384552611240291E-2,0.2,0.29680663975759558,0.56194465787593673,3.1578179851530358E-4,3.1578179851530358E-4,1.8345408737222109,1.0096620652072358E-3,1.0096620652072358E-3,2.1941914313453896,0.16850666130863357,1.5302571428571431E-2,3.7555200000000004E-2,0,0.2248501983086702,3.3440851904707469,0.26838973826701856,1.230768E-2,0.28780382894470841,2.2176000000000001E-2,4.1999999999999996E-4,1.086228E-2,2.9130660000000003E-2,2.8636919999999996E-2,{"$f":"SUM(AM75:AN75)","v":1.128228E-2},0.82990468361546377,0.854753133682157,0.854753133682157,13.068,0.93860746323122513,5.5081862410994145,6.7878039057282935,null,93.860746323122513,0.29680663975759558,0.53483002725337858,0.23948635830867021,0.29512190894470841,0.55794649392456142]
["Temp rise",{"$f":"B75*B62","v":0.25949243999999999},"°C",null,null,null,67,12,1,4.0199999999999996,4.0199999999999996,1.2283333333333331,0.30134025479083382,1.9485715565667088,4.9942857782833538,3.0457142217166453,0,4.0591638210254253,9.721318446293821E-2,0.2,0.29973245128065834,0.56250415635951878,3.1641092592173397E-4,3.1641092592173397E-4,1.8625074355132736,1.0406801842026692E-3,1.0406801842026692E-3,2.2282563592543942,0.17377942408951771,1.5534428571428571E-2,3.7555200000000004E-2,0,0.23055510005167129,3.3928873431583435,0.27628042856073803,1.2494159999999999E-2,0.2963060359517431,2.2511999999999997E-2,4.1999999999999996E-4,1.086228E-2,2.9130660000000003E-2,2.8636919999999996E-2,1.128228E-2,0.84665110568462254,0.87290278025197288,0.87290278025197288,13.265999999999998,0.93826233946023241,5.64449946118844,6.9859049068900907,null,93.826233946023237,0.29973245128065834,0.54937313600341431,0.24541302005167129,0.30373499595174308,0.57317032897131459]
["Current (switching)",{"$f":"(Qg_Q1+Qg_Q2)*Fsw+Iq","v":3.3265999999999999E-3},"A",null,null,null,68,12,1,4.08,4.08,1.2466666666666664,0.30172630503947523,1.9505069559612787,5.0552534779806395,3.1047465220193606,0,4.1186696616874299,0.10008429471441625,0.2,0.30270367684544858,0.56306285804024092,3.1703978210444449E-4,3.1703978210444449E-4,1.8904987251079164,1.072195628890397E-3,1.072195628890397E-3,2.2623695556239296,0.1791410602174906,1.5766285714285715E-2,3.7555200000000004E-2,0,0.23635795609762372,3.4416745598458949,0.28428297062137042,1.268064E-2,0.30493899525692442,2.2848E-2,4.1999999999999996E-4,1.086228E-2,2.9130660000000003E-2,2.8636919999999996E-2,1.128228E-2,0.86364073126756302,0.89135736998494064,0.89135736998494064,13.463999999999999,0.93790768512328049,5.7830656302453454,7.1870132109092619,null,93.790768512328043,0.30270367684544858,0.56414495135454812,0.25143763609762371,0.31247883525692444,0.58865369313949212]
["Qrr Current",{"$f":"Qrr_Q2*Fsw","v":2.8E-3},"A",null,null,null,69,12,1,4.1399999999999997,4.1399999999999997,1.2649999999999999,0.30211215063369429,1.9524395973446516,5.1162197986723257,3.1637802013276737,0,4.1781896037765698,0.10299788335412902,0.2,0.30572038359537101,0.56362076355170954,3.1766836510661205E-4,3.1766836510661205E-4,1.9185143806671474,1.1042092286479943E-3,1.1042092286479943E-3,2.2965306202992184,0.18459185114901699,1.5998142857142857E-2,3.7555200000000004E-2,0,0.24225935140244531,3.4904463146042937,0.29239717140323274,1.2867119999999999E-2,0.31370307340505349,2.3183999999999996E-2,4.1999999999999996E-4,1.086228E-2,2.9130660000000003E-2,2.8636919999999996E-2,1.128228E-2,0.88087364876352159,0.9101189659975456,0.9101189659975456,13.661999999999999,0.93754381444996371,5.9238982022562423,7.3911372483162303,null,93.754381444996369,0.30572038359537101,0.57914642480749878,0.25756079140244531,0.32135379340505349,0.60439858240217459]
["Diode Current",{"$f":"Deadtime*Fsw*(Iripple_Vinnom/2)*(Vsd_Q2)/Vin","v":1.2091417929864256E-4},null,null,null,null,70,12,1,4.2,4.2,1.2833333333333332,0.30249779173618602,1.9543694829093765,5.1771847414546883,3.222815258545312,0,4.23772305288787,0.10595395037056603,0.2,0.30878263975313225,0.56417787352685911,3.1829667297728867E-4,3.1829667297728867E-4,1.9465540563203048,1.1367218082531097E-3,1.1367218082531097E-3,2.3307391717905559,0.19013207804216242,1.6230000000000005E-2,3.7555200000000004E-2,0,0.24825987734864308,3.539202111501738,0.30062283806540063,1.30536E-2,0.32259864595158655,2.3519999999999999E-2,4.1999999999999996E-4,1.086228E-2,2.9130660000000003E-2,2.8636919999999996E-2,1.128228E-2,0.89834994647812905,0.92918967363216931,0.92918967363216931,13.86,0.937171021933079,6.0670107790187915,7.5982856568864898,null,93.717102193307895,0.30878263975313225,0.59437852330022967,0.26378307734864309,0.33036024595158653,0.62040703387903706]
["Total",{"$f":"SUM(B77:B79)","v":6.2475141792986419E-3},"A",null,null,null,71,12,1,4.26,4.26,1.3016666666666663,0.30288322850947336,1.9562966148456811,5.2381483074228399,3.2818516925771593,0,4.2972694474248865,0.1089524957522512,0.2,0.31189051462464085,0.56473418859795388,3.1892470377138931E-4,3.1892470377138931E-4,1.9746174210839613,1.1697341878944821E-3,1.1697341878944821E-3,2.3649948460045795,0.1957620217569879,1.6461857142857146E-2,3.7555200000000004E-2,0,0.25436013183681799,3.5879414825416487,0.30895977797143592,1.324008E-2,0.33162609751350819,2.3856000000000002E-2,4.1999999999999996E-4,1.086228E-2,2.9130660000000003E-2,2.8636919999999996E-2,1.128228E-2,0.91606971262353221,0.9485716411468097,0.9485716411468097,14.057999999999998,0.93678958366840415,6.212417112246813,7.8084672828106889,null,93.678958366840419,0.31189051462464085,0.60984222935032617,0.27010509183681797,0.3394985775135082,0.63668112652216879]
[null,null,null,null,null,null,72,12,1,4.32,4.32,1.3199999999999998,0.30326846111590677,1.9582209953414711,5.2991104976707355,3.3408895023292646,0,4.3568282563752359,0.11199351948774311,0.2,0.3150440786029759,0.56528970939658763,3.1955245554967851E-4,3.1955245554967851E-4,2.0027041578683438,1.2032471831829455E-3,1.2032471831829455E-3,2.3992972950782607,0.20148196285594505,1.6693714285714287E-2,3.7555200000000004E-2,0,0.26056071937854558,3.6366639857677008,0.31740779868911567,1.3426560000000001E-2,0.34078582182177547,2.4191999999999998E-2,4.1999999999999996E-4,1.086228E-2,2.9130660000000003E-2,2.8636919999999996E-2,1.128228E-2,0.93403303531851822,0.96826706042279698,0.96826706042279698,14.256,0.93639975858411495,6.3601311057065484,8.0216911819008363,null,93.639975858411489,0.3150440786029759,0.62553854120032104,0.27652743937854557,0.34876918182177546,0.65322298181982108]
[null,null,null,null,null,null,73,12,1,4.38,4.38,1.3383333333333332,0.30365348971766482,1.9601426265823352,5.3600713132911677,3.3999286867088321,0,4.4163989772640289,0.11507702156563469,0.2,0.31824340317242034,0.56584443655368566,3.2017992637875796E-4,3.2017992637875796E-4,2.0308139625631187,1.2372616051623947E-3,1.2372616051623947E-3,2.4336461863060586,0.20729218160427085,1.6925571428571432E-2,3.7555200000000004E-2,0,0.26686225119065904,3.6853692035204197,0.32596670799016159,1.361304E-2,0.35007822177534831,2.4527999999999998E-2,4.1999999999999996E-4,1.086228E-2,2.9130660000000003E-2,2.8636919999999996E-2,1.128228E-2,0.9522400025886385,0.98827816769097265,0.98827816769097265,14.453999999999999,0.93600178957022717,6.5101668173851577,8.23796662083301,null,93.60017895702272,0.31824340317242034,0.64146847296600729,0.28305073119065904,0.35817246177534828,0.67003476451855226]
[null,null,null,null,null,null,74,12,1,4.4400000000000004,4.4400000000000004,1.3566666666666667,0.30403831447675439,1.9620615107515478,5.4210307553757744,3.4589692446242264,0,4.4759811342688938,0.11820300197455323,0.2,0.321488560912563,0.56639837069950494,3.2080711433105379E-4,3.2080711433105379E-4,2.0589465431952796,1.2717782603207373E-3,1.2717782603207373E-3,2.468041201151697,0.21319295797038093,1.7157428571428573E-2,3.7555200000000004E-2,0,0.27326534529096025,3.7340567408314436,0.33463631384996984,1.3799520000000001E-2,0.3595037094968192,2.4864000000000004E-2,4.1999999999999996E-4,1.086228E-2,2.9130660000000003E-2,2.8636919999999996E-2,1.128228E-2,0.97069070236633248,1.008607244276809,1.008607244276809,14.652000000000001,0.93559590451734198,6.662538461692086,8.4573030784268415,null,93.559590451734195,0.321488560912563,0.65763305478777945,0.28967558529096027,0.36770882949681921,0.68711868336424597]
[null,null,null,null,null,null,75,12,1,4.5,4.5,1.3749999999999998,0.30442293555501099,1.963977650030073,5.4819888250150361,3.5180111749849634,0,4.5355742764819542,0.12137146070316034,0.2,0.32477962550246708,0.56695151246363562,3.2143401748480402E-4,3.2143401748480402E-4,2.0871016191525942,1.3067979506008139E-3,1.3067979506008139E-3,2.5024820343368979,0.21918457162626287,1.7389285714285715E-2,3.7555200000000004E-2,0,0.27977062659538937,3.7827262239429733,0.34341642444734077,1.3986E-2,0.36906270638965871,2.52E-2,4.1999999999999996E-4,1.086228E-2,2.9130660000000003E-2,2.8636919999999996E-2,1.128228E-2,0.98938522249104965,1.0292566173649722,1.0292566173649722,14.85,0.93518231727300039,6.8172604116939555,8.6797102469621503,null,93.518231727300034,0.32477962550246708,0.67403333298504808,0.29640262659538935,0.3773787063896587,0.70447699186250512]
[null,null,null,null,null,null,76,12,1,4.5599999999999996,4.5599999999999996,1.3933333333333331,0.30480735311409868,1.965891046596566,5.5429455232982825,3.5770544767017167,0,4.5951779763056013,0.12458239774015185,0.2,0.32811667172490738,0.56750386247500129,3.2206063392404519E-4,3.2206063392404519E-4,2.1152789204667499,1.3423214734112935E-3,1.3423214734112935E-3,2.5369683930001883,0.22526730194786854,1.762114285714286E-2,3.7555200000000004E-2,0,0.28637872701668016,3.8313772989412151,0.35230684816420998,1.4172479999999999E-2,0.37875564319709421,2.5536000000000003E-2,4.1999999999999996E-4,1.086228E-2,2.9130660000000003E-2,2.8636919999999996E-2,1.128228E-2,1.0083236507093734,1.0502286607838429,1.0502286607838429,15.047999999999998,0.93476122852309473,6.9743472013836438,8.9051980335331677,null,93.476122852309473,0.32811667172490738,0.69067037021377442,0.30323248701668015,0.38718252319709423,0.72211198905893559]
[null,null,null,null,null,null,77,12,1,4.62,4.62,1.4116666666666664,0.3051915673155105,1.9678017026273766,5.6039008513136883,3.6360991486863119,0,4.6547918279702474,0.12783581307425773,0.2,0.33149977547067572,0.56805542136185994,3.2268696173860025E-4,3.2268696173860025E-4,2.1434781871509276,1.3783496216375481E-3,1.3783496216375481E-3,2.5714999959195928,0.23144142801550632,1.7853000000000001E-2,3.7555200000000004E-2,0,0.29309028556453087,3.8800096304937353,0.36130739358537922,1.435896E-2,0.3885829600626361,2.5871999999999999E-2,4.1999999999999996E-4,1.086228E-2,2.9130660000000003E-2,2.8636919999999996E-2,1.128228E-2,1.0275060746751432,1.0715257958105213,1.0715257958105213,15.245999999999999,0.93433282660502159,7.1338135279842101,9.1337765614406301,null,93.433282660502158,0.33149977547067572,0.70754524562716703,0.31016580556453088,0.3971207200626361,0.74002602033984566]
[null,null,null,null,null,null,78,12,1,4.68,4.68,1.4299999999999997,0.30557557832056881,1.9697096202965547,5.6648548101482774,3.6951451898517225,0,4.7144154461634011,0.13113170669424198,0.2,0.33492901374295481,0.56860618975180577,3.2331299902406657E-4,3.2331299902406657E-4,2.1716991685870446,1.4148831836524982E-3,1.4148831836524982E-3,2.6060765727936239,0.23770722861423163,1.8084857142857146E-2,3.7555200000000004E-2,0,0.2999059484473196,3.92862290068165,0.37041786949824723,1.454544E-2,0.39854510659227044,2.6207999999999995E-2,4.1999999999999996E-4,1.086228E-2,2.9130660000000003E-2,2.8636919999999996E-2,1.128228E-2,1.0469325819495781,1.0931504919968731,1.0931504919968731,15.443999999999999,0.93389728825858476,7.2956742542883513,9.3654561716222204,null,93.389728825858469,0.33492901374295481,0.72465905503959005,0.31720322844731963,0.40719374659227042,0.75822147825391828]
[null,null,null,null,null,null,79,12,1,4.74,4.74,1.4483333333333333,0.30595938629042518,1.9716148017758484,5.7258074008879243,3.7541925991120761,0,4.7740484647604697,0.13447007858890261,0.2,0.33840446466176294,0.5691561682717684,3.2393874388180155E-4,3.2393874388180155E-4,2.1999416229583861,1.4519229433274333E-3,1.4519229433274333E-3,2.6406978635755589,0.24406498223423828,1.8316714285714287E-2,3.7555200000000004E-2,0,0.30682636917539718,3.9772168079184813,0.37963808489254258,1.4731920000000001E-2,0.40864254191833638,2.6544000000000005E-2,4.1999999999999996E-4,1.086228E-2,2.9130660000000003E-2,2.8636919999999996E-2,1.128228E-2,1.0666032600013979,1.115105268017178,1.115105268017178,15.641999999999999,0.9334547793200606,7.4599444110341349,9.6002474241217364,null,93.345477932006062,0.33840446466176294,0.74201291109373357,0.32434540917539717,0.4174020619183364,0.77670080335541503]
[null,null,null,null,null,null,80,12,1,4.8,4.8,1.4666666666666663,0.30634299138606108,1.9735172492347119,5.7867586246173559,3.8132413753826437,0,4.8336905356486062,0.13785092874707158,0.2,0.34192620746846664,0.56970535754801543,3.2456419441891213E-4,3.2456419441891213E-4,2.2282053167237614,1.4894696800428111E-3,1.4894696800428111E-3,2.6753636178564477,0.25051496707124793,1.8548571428571428E-2,3.7555200000000004E-2,0,0.31385220866598557,4.025791065948277,0.38896784896005515,1.49184E-2,0.41887573476510453,2.6879999999999998E-2,4.1999999999999996E-4,1.086228E-2,2.9130660000000003E-2,2.8636919999999996E-2,1.128228E-2,1.0865181962069463,1.137392692537972,1.137392692537972,15.839999999999998,0.93300545536430424,7.6266391993176681,9.8381610995974036,null,93.30054553643042,0.34192620746846664,0.75960794343109006,0.33159300866598557,0.42774613476510454,0.79546648506950546]
[null,null,null,null,null,null,81,12,1,4.8600000000000003,4.8600000000000003,1.4849999999999999,0.30672639376828753,1.9754169648403062,5.8477084824201535,3.8722915175798471,0,4.893341327635774,0.14127425715761463,0.2,0.34549432253036572,0.57025375820615221,3.2518934874824071E-4,3.2518934874824071E-4,2.2564900241296795,1.5275241686990284E-3,1.5275241686990284E-3,2.7100735942927545,0.25705746102689975,1.8780428571428576E-2,3.7555200000000004E-2,0,0.32098413534971632,4.0743454029163244,0.39840697109436923,1.5104880000000001E-2,0.42924516351607717,2.7216000000000001E-2,4.1999999999999996E-4,1.086228E-2,2.9130660000000003E-2,2.8636919999999996E-2,1.128228E-2,1.1066774778503121,1.1600153851106851,1.1600153851106851,16.038,0.93254946229929658,7.7957739930434755,10.079208200869774,null,93.254946229929658,0.34549432253036572,0.7774452988657935,0.33894669534971633,0.43822644351607715,0.81452106258031942]
[null,null,null,null,null,null,82,12,1,4.92,4.92,1.5033333333333332,0.30710959359774592,1.9773139507575017,5.9086569753787508,3.9313430246212491,0,4.9530005254379246,0.14474006380943133,0.2,0.34910889134534767,0.57080137087112304,3.2581420498835334E-4,3.2581420498835334E-4,2.284795526757387,1.5660871797271694E-3,1.5660871797271694E-3,2.744827560074917,0.26369274170913881,1.9012285714285718E-2,3.7555200000000004E-2,0,0.32822282527883984,4.1228795605064104,0.40795526089059675,1.529136E-2,0.43975131628302955,2.7552E-2,4.1999999999999996E-4,1.086228E-2,2.9130660000000003E-2,2.8636919999999996E-2,1.128228E-2,1.1270811921234527,1.1829760170877051,1.1829760170877051,16.236000000000001,0.93208693691711697,7.9673643414133153,10.32339995450968,null,93.208693691711701,0.34910889134534767,0.7955261415618694,0.34640714527883981,0.44884347628302956,0.83386712574235733]
[null,null,null,null,null,null,83,12,1,4.9800000000000004,4.9800000000000004,1.5216666666666667,0.30749259103490773,1.9792082091488825,5.9696041045744419,3.9903958954255589,0,5.0126678287378601,0.14824834869145487,0.2,0.35276999654661423,0.57134819616721222,3.2643876126352723E-4,3.2643876126352723E-4,2.3131216131018908,1.6051594790997277E-3,1.6051594790997277E-3,2.7796252904334562,0.27042108643260471,1.9244142857142862E-2,3.7555200000000004E-2,0,0.33556896223714072,4.1713932931391469,0.41761252814511013,1.5477840000000001E-2,0.45039469097681062,2.7888000000000003E-2,4.1999999999999996E-4,1.086228E-2,2.9130660000000003E-2,2.8636919999999996E-2,1.128228E-2,1.1477294261263125,1.2062773125625106,1.2062773125625106,16.434000000000001,0.93161800740493694,8.1414259714542361,10.570747812466644,null,93.161800740493689,0.35276999654661423,0.81385165321395136,0.35397504223714071,0.45959773097681061,0.85350731601589636]
[null,null,null,null,null,null,84,12,1,5.04,5.04,1.5399999999999998,0.3078753862400751,1.9810997421747494,6.0305498710873744,4.0494501289126257,0,5.0723429513099507,0.1517991117926521,0.2,0.35647772190747989,0.5718942347180449,3.2706301570373827E-4,3.2706301570373827E-4,2.3414680781803714,1.6447418283413045E-3,1.6447418283413045E-3,2.8144665681795766,0.27724277221901833,1.9476000000000004E-2,3.7555200000000004E-2,0,0.34302323785159006,4.2198863672263993,0.42737858285527724,1.5664319999999999E-2,0.46117579537992709,2.8224000000000006E-2,4.1999999999999996E-4,1.086228E-2,2.9130660000000003E-2,2.8636919999999996E-2,1.128228E-2,1.1686222668669479,1.2299220493345484,1.2299220493345484,16.631999999999998,0.93114279381930409,8.3179747905865717,10.821263453738322,null,93.114279381930416,0.35647772190747989,0.83242303323151723,0.36165107785159006,0.47048971537992706,0.87344432742706846]
[null,null,null,null,null,null,85,12,1,5.0999999999999996,5.0999999999999996,1.5583333333333331,0.3082579793733809,1.9829885519931221,6.0914942759965607,4.1085057240034386,0,5.1320256202054022,0.1553923531020234,0.2,0.36023215234624251,0.57243948714658766,3.2768696644464831E-4,3.2768696644464831E-4,2.3698347231676187,1.6848349845392829E-3,1.6848349845392829E-3,2.849351183277494,0.28415807579756996,1.9707857142857145E-2,3.7555200000000004E-2,0,0.35058635170577457,4.2683585604772931,0.4372532352191949,1.5850799999999998E-2,0.47209514722092921,2.8559999999999995E-2,4.1999999999999996E-4,1.086228E-2,2.9130660000000003E-2,2.8636919999999996E-2,1.128228E-2,1.1897598012616455,1.2539130598995429,1.2539130598995429,16.829999999999998,0.93066140852667267,8.4970268892328153,11.074958786081373,null,93.066140852667274,0.36023215234624251,0.85124149892670375,0.36943595170577459,0.48151994722092922,0.89368090755330043]
[null,null,null,null,null,null,86,12,1,5.16,5.16,1.5766666666666664,0.30864037059478899,1.9848746407597413,6.152437320379871,4.1675626796201293,0,5.1917155749932595,0.1590280726086028,0.2,0.36403337393112745,0.57298395407514924,3.2831061162759276E-4,3.2831061162759276E-4,2.3982213550563376,1.7254397003544767E-3,1.7254397003544767E-3,2.8842789324459508,0.29116727360530442,1.9939714285714286E-2,3.7555200000000004E-2,0,0.35825901145513156,4.3168096612517024,0.44723629563542494,1.6037280000000001E-2,0.48315327425062266,2.8895999999999998E-2,4.1999999999999996E-4,1.086228E-2,2.9130660000000003E-2,2.8636919999999996E-2,1.128228E-2,1.2111421161350464,1.2782532324659552,1.2782532324659552,17.027999999999999,0.93017395661286995,8.6785985434680253,11.331845947764322,null,93.017395661286997,0.36403337393112745,0.87030828570575425,0.37733037145513154,0.49268895425062265,0.91421985853482779]
[null,null,null,null,null,null,87,12,1,5.22,5.22,1.5949999999999998,0.30902256006409445,1.9867580106280747,6.213379005314037,4.2266209946859625,0,5.2514125670527516,0.16270627030145748,0.2,0.36788147388530457,0.57352763612538216,3.2893394939956878E-4,3.2893394939956878E-4,2.4266277863403731,1.7665567240317539E-3,1.7665567240317539E-3,2.9192496187866364,0.29827064178750728,2.0171571428571431E-2,3.7555200000000004E-2,0,0.36604193294403142,4.3652394679574744,0.45732757470272772,1.622376E-2,0.4943507143201254,2.9231999999999998E-2,4.1999999999999996E-4,1.086228E-2,2.9130660000000003E-2,2.8636919999999996E-2,1.128228E-2,1.2327692982202638,1.302945511998328,1.302945511998328,17.225999999999999,0.92968053626394376,8.8627062177127218,11.591937309362885,null,92.968053626394379,0.36788147388530457,0.8896246472641568,0.38533505294403142,0.50399727432012542,0.93506403811302341]
[null,null,null,null,null,null,88,12,1,5.28,5.28,1.6133333333333333,0.30940454794092365,1.9886386637493167,6.2743193318746586,4.2856806681253419,0,5.3111163589129946,0.16642694616968806,0.2,0.37177654059197973,0.57407053391828289,3.2955697791322235E-4,3.2955697791322235E-4,2.4550538347190654,1.8081867994106362E-3,1.8081867994106362E-3,2.9542630514374077,0.30546845619808927,2.0403428571428572E-2,3.7555200000000004E-2,0,0.3739358403247422,4.4136477884879941,0.46752688321979902,1.641024E-2,0.50568801546079833,2.9568000000000001E-2,4.1999999999999996E-4,1.086228E-2,2.9130660000000003E-2,2.8636919999999996E-2,1.128228E-2,1.2546414341590051,1.3279929012882876,1.3279929012882876,17.423999999999999,0.92918123912061357,9.04936656746907,11.855245475598363,null,92.918123912061361,0.37177654059197973,0.90919185578554051,0.39345072032474221,0.51544545546079834,0.95621636069630789]
[null,null,null,null,null,null,89,12,1,5.34,5.34,1.6316666666666666,0.3097863343847348,1.9905166022723946,6.3352583011361974,4.3447416988638023,0,5.3708267236363936,0.17019010020242836,0.2,0.37571866359956124,0.57461264807419321,3.3017969532683663E-4,3.3017969532683663E-4,2.4834993228211149,1.8503306659358805E-3,1.8503306659358805E-3,2.989319045248418,0.31276099239997196,2.0635285714285717E-2,3.7555200000000004E-2,0,0.38194146617831565,4.4620344396969784,0.47783403218500631,1.6596719999999999E-2,0.51716573596606885,2.9904000000000003E-2,4.1999999999999996E-4,1.086228E-2,2.9130660000000003E-2,2.8636919999999996E-2,1.128228E-2,1.2767586105016921,1.3533984620539945,1.3533984620539945,17.622,0.92867615060835473,9.2385964421012599,12.121783287219584,null,92.867615060835476,0.37571866359956124,0.92901120214438448,0.40167810617831567,0.52703405596606889,0.9776797984544332]
[null,null,null,null,null,null,90,12,1,5.4,5.4,1.65,0.31016791955481787,1.9923918283439688,6.3961959141719849,4.4038040858280159,0,5.4305434442424199,0.17399573238884553,0.2,0.37970793362690097,0.57515397921280054,3.3080209980431856E-4,3.3080209980431856E-4,2.5119640779464603,1.892989058668023E-3,1.892989058668023E-3,3.0244174204793826,0.3201485256654707,2.0867142857142862E-2,3.7555200000000004E-2,0,0.39005955163743172,4.5103992469076566,0.48824883279612374,1.6783200000000002E-2,0.5287844444751727,3.0240000000000003E-2,4.1999999999999996E-4,1.086228E-2,2.9130660000000003E-2,2.8636919999999996E-2,1.128228E-2,1.299120913707583,1.3791653160688515,1.3791653160688515,17.82,0.92816535024496349,9.4304128876609301,12.391563822928971,null,92.816535024496346,0.37970793362690097,0.94908399611260452,0.41001795163743171,0.53876364447517266,0.99945738244195059]
[null,null,null,null,null,null,91,12,1,5.46,5.46,1.6683333333333332,0.31054930361029504,1.9942643441084378,6.4571321720542185,4.4628678279457814,0,5.4902663131687142,0.17784384271813961,0.2,0.38374444256861157,0.57569452795313958,3.3142418951518819E-4,3.3142418951518819E-4,2.5404479318248265,1.9361627082939113E-3,1.9361627082939113E-3,3.059558002516412,0.32763133097667757,2.1099000000000003E-2,3.7555200000000004E-2,0,0.39829084651124169,4.5587420434537602,0.49877109645007117,1.6969680000000001E-2,0.54054472005884346,3.0575999999999999E-2,4.1999999999999996E-4,1.086228E-2,2.9130660000000003E-2,2.8636919999999996E-2,1.128228E-2,1.3217284301448886,1.4052966463203282,1.4052966463203282,18.018000000000001,0.92764891192728838,9.6248331497585582,12.6646004013534,null,92.76489119272884,0.38374444256861157,0.9694115665700852,0.41847100651124169,0.55063480005884347,1.0215522037517166]
[null,null,null,null,null,null,92,12,1,5.52,5.52,1.6866666666666663,0.31093048671012058,1.9961341517079387,6.5180670758539687,4.5219329241460304,0,5.5499951317667442,0.18173443117954394,0.2,0.38782828350046011,0.5762342949135919,3.3204596263456445E-4,3.3204596263456445E-4,2.5689507203896857,1.9798523411372056E-3,1.9798523411372056E-3,3.0947406216069471,0.33520968302584542,2.1330857142857141E-2,3.7555200000000004E-2,0,0.40663610941225348,4.6070626702499293,0.50940063474264985,1.715616E-2,0.55244715230696828,3.0911999999999995E-2,4.1999999999999996E-4,1.086228E-2,2.9130660000000003E-2,2.8636919999999996E-2,1.128228E-2,1.3445812460908966,1.4317956981997735,1.4317956981997735,18.215999999999998,0.92712690419867494,9.8218746764818299,12.940906583060272,null,92.712690419867499,0.38782828350046011,0.98999526171922181,0.42703802941225349,0.56264811230696832,1.0439674146993134]
[null,null,null,null,null,null,93,12,1,5.58,5.58,1.7049999999999996,0.31131146901308149,1.998001253282353,6.5790006266411769,4.5809993733588232,0,5.6097297098294456,0.18566749776232463,0.2,0.39195955068483868,0.57677328071188816,3.3266741734315453E-4,3.3266741734315453E-4,2.5974722835665061,2.0240586791688596E-3,2.0240586791688596E-3,3.1299651126114481,0.34288385621576783,2.1562714285714293E-2,3.7555200000000004E-2,0,0.41509610788529377,4.6553609753893799,0.5201372594682806,1.7342639999999999E-2,0.56449234141824345,3.1247999999999998E-2,4.1999999999999996E-4,1.086228E-2,2.9130660000000003E-2,2.8636919999999996E-2,1.128228E-2,1.3676794477320877,1.4586657807241186,1.4586657807241186,18.413999999999998,0.92659939049853191,10.021555121361756,13.220496172619598,null,92.659939049853193,0.39195955068483868,1.0108364493035371,0.43571978788529375,0.57480418141824341,1.06670623003928]
[null,null,null,null,null,null,94,12,1,5.64,5.64,1.7233333333333332,0.31169225067779743,1.999865650969308,6.6399328254846539,4.6400671745153454,0,5.6694698651485247,0.1896430424557807,0.2,0.39613833957631245,0.57731148596510806,3.3328855182724118E-4,3.3328855182724118E-4,2.6260124650742309,2.0687824400175713E-3,2.0687824400175713E-3,3.1652313147706339,0.35065412466016233,2.1794571428571427E-2,3.7555200000000004E-2,0,0.42367161853859836,4.7036368137668312,0.53098078261974213,1.7529119999999999E-2,0.57668089829185354,3.1584000000000001E-2,4.1999999999999996E-4,1.086228E-2,2.9130660000000003E-2,2.8636919999999996E-2,1.128228E-2,1.3910231211642567,1.4859102677904188,1.4859102677904188,18.611999999999998,0.92606642939530937,10.223892346387762,13.503383220712632,null,92.606642939530943,0.39613833957631245,1.031936516830452,0.44451705853859835,0.58710361829185354,1.0897719282141063]
[null,null,null,null,null,null,95,12,1,5.7,5.7,1.7416666666666665,0.31207283186272117,2.0017273469041807,6.7008636734520906,4.6991363265479098,0,5.7292154230992809,0.19366106524924417,0.2,0.40036474682724671,0.57784891128968208,3.3390936427867083E-4,3.3390936427867083E-4,2.654571112239053,2.1140243369802245E-3,2.1140243369802245E-3,3.2005390714871358,0.35852076218405088,2.2026428571428575E-2,3.7555200000000004E-2,0,0.43236342717706622,4.751890046724875,0.54193101638791041,1.7715600000000001E-2,0.58901344462120409,3.1920000000000004E-2,4.1999999999999996E-4,1.086228E-2,2.9130660000000003E-2,2.8636919999999996E-2,1.128228E-2,1.4146123523926339,1.5135325994641953,1.5135325994641953,18.809999999999999,0.92552807480407728,10.428904425072524,13.789582026287695,null,92.552807480407722,0.40036474682724671,1.0532968717982703,0.45343062717706623,0.59954704462120412,1.1131678526369486]
[null,null,null,null,null,null,96,12,1,5.76,5.76,{"$f":"Vout*K105/(Vin*Efficiency)","v":1.7599999999999998},0.31245321272613846,{"$f":"(Vin-(Rdson1+Rdcr)*K105-Vout)*M105/(Fsw*Lf)","v":2.0035863432200989},6.7617931716100497,4.7582068283899499,{"$f":"IF(MIN(Vin, -P105/(Coss_Q1+Coss_Q2)*0.00000002)<0, 0, MIN(Vin, -P105/(Coss_Q1+Coss_Q2)*0.00000002))","v":0},5.7889662162509499,{"$f":"R105^2*Rdcr","v":0.19772156613207956},0.2,{"$f":"(T105+S105*(1+Ltc*(Ta-25)))/(1-S105*Ltc*ThetaCa)","v":0.40463887029351159},0.57838555730139107,3.3452985289484071E-4,3.3452985289484071E-4,2.6831480758195707,2.1597850790322794E-3,2.1597850790322794E-3,3.2358882301205227,{"$f":"Rdson1*AB105^2","v":0.36648404232413856},2.2258285714285717E-2,3.7555200000000004E-2,0,{"$f":"(AF105+AE105+AD105+AC105*(1+RdsonTopTc*Ta-RdsonTopTc*25))/(1-AC105*RdsonTopTc*ThetaJA_Q1)","v":0.44117232893772423},4.8001205417220838,{"$f":"Rdson2*AH105^2","v":0.5529877731614955},1.7902080000000001E-2,{"$f":"(AJ105+AI105*(1+RdsonBotTc*Ta-RdsonBotTc*25))/(1-AI105*RdsonBotTc*ThetaJA_Q2)","v":0.60149061298973117},3.2256E-2,4.1999999999999996E-4,1.086228E-2,2.9130660000000003E-2,2.8636919999999996E-2,1.128228E-2,1.4384472273319995,1.5415362833025859,1.5415362833025859,19.007999999999999,0.92498437618978513,10.636609645567658,14.079107138763815,null,92.498437618978514,0.40463887029351159,1.0749189419274554,0.46246128893772426,0.61213509298973112,1.1368974130090743]
[null,null,null,null,null,null,97,12,1,5.82,5.82,1.7783333333333331,0.31283339342616862,2.0054426420479459,6.8227213210239732,4.8172786789760274,0,5.8487220840008032,0.20182454509368433,0.2,0.40896080904026733,0.578921424615368,3.3515001587868719E-4,3.3515001587868719E-4,2.7117432098425618,2.2060653708381719E-3,2.2060653708381719E-3,3.2712786417947832,0.37454423832919526,2.2490142857142861E-2,3.7555200000000004E-2,0,0.45009912842745159,4.8483281720213594,0.56415086552678351,1.808856E-2,0.61411304696882896,3.2592000000000003E-2,4.1999999999999996E-4,1.086228E-2,2.9130660000000003E-2,2.8636919999999996E-2,1.128228E-2,1.4625278318068062,1.5699248957133531,1.5699248957133531,19.206,0.92443537875720416,10.847026513831386,14.371973360283066,null,92.443537875720409,0.40896080904026733,1.0968041753962805,0.47160984842745157,0.62486840696882895,1.1609640866730859]
[null,null,null,null,null,null,98,12,1,5.88,5.88,1.7966666666666666,0.31321337412076455,2.0072962455163643,6.8836481227581823,4.8763518772418175,0,5.9084828722302882,0.20597000212348821,0.2,0.41333066334782881,0.57945651384609909,3.3576985143867442E-4,3.3576985143867442E-4,2.740356371448589,2.2528659127616629E-3,2.2528659127616629E-3,3.3067101612173539,0.38270162316043349,2.2722000000000003E-2,3.7555200000000004E-2,0,0.45914463986300402,4.8965128163970508,0.57542010626737394,1.8275039999999999E-2,0.62688140121791236,3.2927999999999999E-2,4.1999999999999996E-4,1.086228E-2,2.9130660000000003E-2,2.8636919999999996E-2,1.128228E-2,1.4868542515512957,1.5987020833508114,1.5987020833508114,19.404,0.92388112362846253,11.060173756849093,14.668195748011986,null,92.388112362846257,0.41333066334782881,1.1189540410809165,0.48087711986300402,0.63774764121791239,1.1853714200029826]
[null,null,null,null,null,null,99,12,1,5.94,5.94,1.8149999999999999,0.31359315496771301,2.0091471557517555,6.9445735778758779,4.9354264221241229,0,5.9682484329817225,0.21015793721095388,0.2,0.41774853471761236,0.57999082560742354,3.3638935778878079E-4,3.3638935778878079E-4,2.7689874207467855,2.3001874008761803E-3,2.3001874008761803E-3,3.3421826465089164,0.39095646949188712,2.2953857142857144E-2,3.7555200000000004E-2,0,0.46830968721338961,4.9446743588595838,0.58679530836392246,1.8461520000000002E-2,0.63979634158665599,3.3263999999999995E-2,4.1999999999999996E-4,1.086228E-2,2.9130660000000003E-2,2.8636919999999996E-2,1.128228E-2,1.5114265722096207,1.6278715645498063,1.6278715645498063,19.602,0.92332164800902194,11.276070325907961,14.967789616493087,null,92.332164800902191,0.41774853471761236,1.1413700288000457,0.49026392721338963,0.65077346158665594,1.2101230298321939]
[null,null,null,null,null,null,100,12,1,6,6,1.833333333333333,0.31397273612463483,2.0109953748782861,7.005497687439143,4.994502312560857,0,6.0280186241540834,0.21438835034557613,0.2,0.42221452587816227,0.58052436051253542,3.3700853314848822E-4,3.3700853314848822E-4,2.7976362206781684,2.3480305269751272E-3,2.3480305269751272E-3,3.3776959590432107,0.39930904971078929,2.3185714285714289E-2,3.7555200000000004E-2,0,0.47759510434464297,4.9928126883963566,0.59827628499387975,1.8648000000000001E-2,0.65285854521943587,3.3599999999999998E-2,4.1999999999999996E-4,1.086228E-2,2.9130660000000003E-2,2.8636919999999996E-2,1.128228E-2,1.5362448793359595,1.6574371307988907,1.6574371307988907,19.799999999999997,0.92275698534286321,11.494735399926789,15.270770540047025,null,92.27569853428632,0.42221452587816227,1.164053649564079,0.499771104344643,0.66394654521943586,1.2352226049207284]

{"sheet":"Efficiency Plot Management","index":9,"n_rows":3,"n_cols":1,"rows_kept":3,"cut":false,"hidden":true,"merged":[]}
[]
[{"$f":"\"EFF_Ch1\"","v":"EFF_Ch1"}]
[{"$f":"\"EFF_Ch2\"","v":"EFF_Ch2"}]

{"sheet":"Bode Plot Management","index":10,"n_rows":6,"n_cols":14,"rows_kept":6,"cut":false,"hidden":true,"merged":[]}
[null,null,null,null,null,null,null,null,null,"Single or dual output (MODE)",null,null,null,"3.3V or 5V fixed (FB1/2)"]
[{"$f":"CHOOSE(BODE_PLOT_TYPE, \"BODE_PLOT_Ch1\", \"BODE_PLOT_Ch2\")","v":"BODE_PLOT_Ch1"},null,null,null,null,null,null,null,null,"With/without dither (DITH)",null,null,null,"With/without VOUT connected to VCCX"]
[null,null,null,null,null,null,null,null,null,"FPWM or DEM (DEMB)"]
[null,null,null,null,null,null,null,null,null,"Shunt or inductor DCR current sensing"]
[]
[null,null,null,null,null,{"$f":"INDIRECT(A2)","v":0}]

{"sheet":"Standard Value Calculator","index":11,"n_rows":159,"n_cols":16,"rows_kept":159,"cut":false,"hidden":true,"merged":[]}
[]
["Capacitors","Css","Cc1ea","Cc2ea","Cout","Cin","Cres","Cdither","Cc3ea","Cc4ea"]
["Inputs",{"$f":"Css","v":{"$error":"#NAME?"}},{"$f":"Cc1ea","v":{"$error":"#REF!"}},{"$f":"Cc2ea","v":{"$error":"#REF!"}},{"$f":"Cout","v":1.2E-4},{"$f":"Cin","v":6.5799999999999997E-6},{"$f":"Cres","v":{"$error":"#NAME?"}},{"$f":"Cdither_init","v":{"$error":"#NAME?"}},{"$f":"Cc3ea","v":{"$error":"#NAME?"}},{"$f":"Cc4ea","v":{"$error":"#NAME?"}},null,null,"Resistors","inputs","Standard Result"]
["Standard Result",{"$f":"SUM(B6:B158)/1000000000000","v":{"$error":"#NAME?"}},{"$f":"IF(C3=\"OPEN\",\"OPEN\",SUM(C6:C158)/1000000000000)","v":{"$error":"#REF!"}},{"$f":"SUM(D6:D158)/1000000000000","v":{"$error":"#REF!"}},{"$f":"SUM(E6:E158)/1000000000000","v":1.2E-4},{"$f":"SUM(F6:F158)/1000000000000","v":6.8000000000000001E-6},{"$f":"SUM(G6:G158)/1000000000000","v":{"$error":"#NAME?"}},{"$f":"IF(H3=\"OPEN\",\"OPEN\",SUM(H6:H158)/1000000000000)","v":{"$error":"#NAME?"}},{"$error":"#NAME?"},{"$error":"#NAME?"},null,null,"Rt",{"$f":"Rfadj","v":86.6},{"$f":"IF(N4>(INT(0.5+100*POWER(10,IF(96*(LOG(N4)-INT(LOG(N4)))-ROUND(96*(LOG(N4)-INT(LOG(N4))),0)<0,ROUND(96*(LOG(N4)-INT(LOG(N4))),0)-1,ROUND(96*(LOG(N4)-INT(LOG(N4))),0))/96))*POWER(10,INT(LOG(N4))-2)+INT(0.5+100*POWER(10,(IF(96*(LOG(N4)-INT(LOG(N4)))-ROUND(96*(LOG(N4)-INT(LOG(N4))),0)<0,ROUND(96*(LOG(N4)-INT(LOG(N4))),0)-1,ROUND(96*(LOG(N4)-INT(LOG(N4))),0))+1)/96))*POWER(10,INT(LOG(N4))-2))/2,INT(0.5+100*POWER(10,(IF(96*(LOG(N4)-INT(LOG(N4)))-ROUND(96*(LOG(N4)-INT(LOG(N4))),0)<0,ROUND(96*(LOG(N4)-INT(LOG(N4))),0)-1,ROUND(96*(LOG(N4)-INT(LOG(N4))),0))+1)/96))*POWER(10,INT(LOG(N4))-2),INT(0.5+100*POWER(10,IF(96*(LOG(N4)-INT(LOG(N4)))-ROUND(96*(LOG(N4)-INT(LOG(N4))),0)<0,ROUND(96*(LOG(N4)-INT(LOG(N4))),0)-1,ROUND(96*(LOG(N4)-INT(LOG(N4))),0))/96))*POWER(10,INT(LOG(N4))-2))","v":86.600000000000009},"kΩ"]
["(pF)"]
[0.47,{"$f":"IF(IF((B$3*10^12-$A7)*(B$3*10^12-$A6)*-1<0,0,1)*IF(ABS(B$3*10^12-$A7)>(B$3*10^12-$A6),$A6,$A7)=B7,0,IF((B$3*10^12-$A7)*(B$3*10^12-$A6)*-1<0,0,1)*IF(ABS(B$3*10^12-$A7)>(B$3*10^12-$A6),$A6,$A7))","v":{"$error":"#NAME?"}},{"$error":"#REF!"},{"$error":"#REF!"},0,0,{"$error":"#NAME?"},{"$error":"#NAME?"},{"$error":"#NAME?"},{"$error":"#NAME?"}]
[0.56000000000000005,{"$f":"IF(IF((B$3*10^12-$A8)*(B$3*10^12-$A7)*-1<0,0,1)*IF(ABS(B$3*10^12-$A8)>(B$3*10^12-$A7),$A7,$A8)=B8,0,IF((B$3*10^12-$A8)*(B$3*10^12-$A7)*-1<0,0,1)*IF(ABS(B$3*10^12-$A8)>(B$3*10^12-$A7),$A7,$A8))","v":{"$error":"#NAME?"}},{"$f":"IF(IF((C$3*10^12-$A8)*(C$3*10^12-$A7)*-1<0,0,1)*IF(ABS(C$3*10^12-$A8)>(C$3*10^12-$A7),$A7,$A8)=C8,0,IF((C$3*10^12-$A8)*(C$3*10^12-$A7)*-1<0,0,1)*IF(ABS(C$3*10^12-$A8)>(C$3*10^12-$A7),$A7,$A8))","v":{"$error":"#REF!"}},{"$f":"IF(IF((D$3*10^12-$A8)*(D$3*10^12-$A7)*-1<0,0,1)*IF(ABS(D$3*10^12-$A8)>(D$3*10^12-$A7),$A7,$A8)=D8,0,IF((D$3*10^12-$A8)*(D$3*10^12-$A7)*-1<0,0,1)*IF(ABS(D$3*10^12-$A8)>(D$3*10^12-$A7),$A7,$A8))","v":{"$error":"#REF!"}},{"$f":"IF(IF((E$3*10^12-$A8)*(E$3*10^12-$A7)*-1<0,0,1)*IF(ABS(E$3*10^12-$A8)>(E$3*10^12-$A7),$A7,$A8)=E8,0,IF((E$3*10^12-$A8)*(E$3*10^12-$A7)*-1<0,0,1)*IF(ABS(E$3*10^12-$A8)>(E$3*10^12-$A7),$A7,$A8))","v":0},{"$f":"IF(IF((F$3*10^12-$A8)*(F$3*10^12-$A7)*-1<0,0,1)*IF(ABS(F$3*10^12-$A8)>(F$3*10^12-$A7),$A7,$A8)=F8,0,IF((F$3*10^12-$A8)*(F$3*10^12-$A7)*-1<0,0,1)*IF(ABS(F$3*10^12-$A8)>(F$3*10^12-$A7),$A7,$A8))","v":0},{"$f":"IF(IF((G$3*10^12-$A8)*(G$3*10^12-$A7)*-1<0,0,1)*IF(ABS(G$3*10^12-$A8)>(G$3*10^12-$A7),$A7,$A8)=G8,0,IF((G$3*10^12-$A8)*(G$3*10^12-$A7)*-1<0,0,1)*IF(ABS(G$3*10^12-$A8)>(G$3*10^12-$A7),$A7,$A8))","v":{"$error":"#NAME?"}},{"$error":"#NAME?"},{"$error":"#NAME?"},{"$error":"#NAME?"},null,null,"Renb",{"$f":"Renb","v":33333.333333333328},33200,"Ω"]
[0.68,{"$error":"#NAME?"},{"$error":"#REF!"},{"$error":"#REF!"},0,0,{"$error":"#NAME?"},{"$error":"#NAME?"},{"$error":"#NAME?"},{"$error":"#NAME?"},null,null,"Rc1ea",{"$f":"Rcea2","v":{"$error":"#REF!"}},{"$f":"IF(N8>(INT(0.5+100*POWER(10,IF(96*(LOG(N8)-INT(LOG(N8)))-ROUND(96*(LOG(N8)-INT(LOG(N8))),0)<0,ROUND(96*(LOG(N8)-INT(LOG(N8))),0)-1,ROUND(96*(LOG(N8)-INT(LOG(N8))),0))/96))*POWER(10,INT(LOG(N8))-2)+INT(0.5+100*POWER(10,(IF(96*(LOG(N8)-INT(LOG(N8)))-ROUND(96*(LOG(N8)-INT(LOG(N8))),0)<0,ROUND(96*(LOG(N8)-INT(LOG(N8))),0)-1,ROUND(96*(LOG(N8)-INT(LOG(N8))),0))+1)/96))*POWER(10,INT(LOG(N8))-2))/2,INT(0.5+100*POWER(10,(IF(96*(LOG(N8)-INT(LOG(N8)))-ROUND(96*(LOG(N8)-INT(LOG(N8))),0)<0,ROUND(96*(LOG(N8)-INT(LOG(N8))),0)-1,ROUND(96*(LOG(N8)-INT(LOG(N8))),0))+1)/96))*POWER(10,INT(LOG(N8))-2),INT(0.5+100*POWER(10,IF(96*(LOG(N8)-INT(LOG(N8)))-ROUND(96*(LOG(N8)-INT(LOG(N8))),0)<0,ROUND(96*(LOG(N8)-INT(LOG(N8))),0)-1,ROUND(96*(LOG(N8)-INT(LOG(N8))),0))/96))*POWER(10,INT(LOG(N8))-2))","v":{"$error":"#REF!"}},"Ω"]
[0.82,{"$error":"#NAME?"},{"$error":"#REF!"},{"$error":"#REF!"},0,0,{"$error":"#NAME?"},{"$error":"#NAME?"},{"$error":"#NAME?"},{"$error":"#NAME?"}]
[1,{"$error":"#NAME?"},{"$error":"#REF!"},{"$error":"#REF!"},0,0,{"$error":"#NAME?"},{"$error":"#NAME?"},{"$error":"#NAME?"},{"$error":"#NAME?"},null,null,"Rfb1",{"$f":"Rfb1_","v":100000},{"$f":"IF(N10>(INT(0.5+100*POWER(10,IF(96*(LOG(N10)-INT(LOG(N10)))-ROUND(96*(LOG(N10)-INT(LOG(N10))),0)<0,ROUND(96*(LOG(N10)-INT(LOG(N10))),0)-1,ROUND(96*(LOG(N10)-INT(LOG(N10))),0))/96))*POWER(10,INT(LOG(N10))-2)+INT(0.5+100*POWER(10,(IF(96*(LOG(N10)-INT(LOG(N10)))-ROUND(96*(LOG(N10)-INT(LOG(N10))),0)<0,ROUND(96*(LOG(N10)-INT(LOG(N10))),0)-1,ROUND(96*(LOG(N10)-INT(LOG(N10))),0))+1)/96))*POWER(10,INT(LOG(N10))-2))/2,INT(0.5+100*POWER(10,(IF(96*(LOG(N10)-INT(LOG(N10)))-ROUND(96*(LOG(N10)-INT(LOG(N10))),0)<0,ROUND(96*(LOG(N10)-INT(LOG(N10))),0)-1,ROUND(96*(LOG(N10)-INT(LOG(N10))),0))+1)/96))*POWER(10,INT(LOG(N10))-2),INT(0.5+100*POWER(10,IF(96*(LOG(N10)-INT(LOG(N10)))-ROUND(96*(LOG(N10)-INT(LOG(N10))),0)<0,ROUND(96*(LOG(N10)-INT(LOG(N10))),0)-1,ROUND(96*(LOG(N10)-INT(LOG(N10))),0))/96))*POWER(10,INT(LOG(N10))-2))","v":100000},"Ω"]
[1.2,{"$error":"#NAME?"},{"$error":"#REF!"},{"$error":"#REF!"},0,0,{"$error":"#NAME?"},{"$error":"#NAME?"},{"$error":"#NAME?"},{"$error":"#NAME?"},null,null,"Rfb2",{"$f":"Rfb2_","v":43478.260869565223},{"$f":"IF(N11=\"OPEN\",\"OPEN\",IF(N11>(INT(0.5+100*POWER(10,IF(96*(LOG(N11)-INT(LOG(N11)))-ROUND(96*(LOG(N11)-INT(LOG(N11))),0)<0,ROUND(96*(LOG(N11)-INT(LOG(N11))),0)-1,ROUND(96*(LOG(N11)-INT(LOG(N11))),0))/96))*POWER(10,INT(LOG(N11))-2)+INT(0.5+100*POWER(10,(IF(96*(LOG(N11)-INT(LOG(N11)))-ROUND(96*(LOG(N11)-INT(LOG(N11))),0)<0,ROUND(96*(LOG(N11)-INT(LOG(N11))),0)-1,ROUND(96*(LOG(N11)-INT(LOG(N11))),0))+1)/96))*POWER(10,INT(LOG(N11))-2))/2,INT(0.5+100*POWER(10,(IF(96*(LOG(N11)-INT(LOG(N11)))-ROUND(96*(LOG(N11)-INT(LOG(N11))),0)<0,ROUND(96*(LOG(N11)-INT(LOG(N11))),0)-1,ROUND(96*(LOG(N11)-INT(LOG(N11))),0))+1)/96))*POWER(10,INT(LOG(N11))-2),INT(0.5+100*POWER(10,IF(96*(LOG(N11)-INT(LOG(N11)))-ROUND(96*(LOG(N11)-INT(LOG(N11))),0)<0,ROUND(96*(LOG(N11)-INT(LOG(N11))),0)-1,ROUND(96*(LOG(N11)-INT(LOG(N11))),0))/96))*POWER(10,INT(LOG(N11))-2)))","v":43200},"Ω"]
[1.5,{"$error":"#NAME?"},{"$error":"#REF!"},{"$error":"#REF!"},0,0,{"$error":"#NAME?"},{"$error":"#NAME?"},{"$error":"#NAME?"},{"$error":"#NAME?"},null,null,"Rt1",{"$f":"'Variable Management'!B38*1000","v":86031.85840707965},{"$f":"IF(N12>(INT(0.5+100*POWER(10,IF(96*(LOG(N12)-INT(LOG(N12)))-ROUND(96*(LOG(N12)-INT(LOG(N12))),0)<0,ROUND(96*(LOG(N12)-INT(LOG(N12))),0)-1,ROUND(96*(LOG(N12)-INT(LOG(N12))),0))/96))*POWER(10,INT(LOG(N12))-2)+INT(0.5+100*POWER(10,(IF(96*(LOG(N12)-INT(LOG(N12)))-ROUND(96*(LOG(N12)-INT(LOG(N12))),0)<0,ROUND(96*(LOG(N12)-INT(LOG(N12))),0)-1,ROUND(96*(LOG(N12)-INT(LOG(N12))),0))+1)/96))*POWER(10,INT(LOG(N12))-2))/2,INT(0.5+100*POWER(10,(IF(96*(LOG(N12)-INT(LOG(N12)))-ROUND(96*(LOG(N12)-INT(LOG(N12))),0)<0,ROUND(96*(LOG(N12)-INT(LOG(N12))),0)-1,ROUND(96*(LOG(N12)-INT(LOG(N12))),0))+1)/96))*POWER(10,INT(LOG(N12))-2),INT(0.5+100*POWER(10,IF(96*(LOG(N12)-INT(LOG(N12)))-ROUND(96*(LOG(N12)-INT(LOG(N12))),0)<0,ROUND(96*(LOG(N12)-INT(LOG(N12))),0)-1,ROUND(96*(LOG(N12)-INT(LOG(N12))),0))/96))*POWER(10,INT(LOG(N12))-2))","v":86600},"Ω"]
[1.8,{"$error":"#NAME?"},{"$error":"#REF!"},{"$error":"#REF!"},0,0,{"$error":"#NAME?"},{"$error":"#NAME?"},{"$error":"#NAME?"},{"$error":"#NAME?"},null,null,"Rt2",{"$f":"'Variable Management'!#REF!*1000","v":{"$error":"#REF!"}},{"$f":"IF(N13=\"OPEN\",\"OPEN\",IF(N13>(INT(0.5+100*POWER(10,IF(96*(LOG(N13)-INT(LOG(N13)))-ROUND(96*(LOG(N13)-INT(LOG(N13))),0)<0,ROUND(96*(LOG(N13)-INT(LOG(N13))),0)-1,ROUND(96*(LOG(N13)-INT(LOG(N13))),0))/96))*POWER(10,INT(LOG(N13))-2)+INT(0.5+100*POWER(10,(IF(96*(LOG(N13)-INT(LOG(N13)))-ROUND(96*(LOG(N13)-INT(LOG(N13))),0)<0,ROUND(96*(LOG(N13)-INT(LOG(N13))),0)-1,ROUND(96*(LOG(N13)-INT(LOG(N13))),0))+1)/96))*POWER(10,INT(LOG(N13))-2))/2,INT(0.5+100*POWER(10,(IF(96*(LOG(N13)-INT(LOG(N13)))-ROUND(96*(LOG(N13)-INT(LOG(N13))),0)<0,ROUND(96*(LOG(N13)-INT(LOG(N13))),0)-1,ROUND(96*(LOG(N13)-INT(LOG(N13))),0))+1)/96))*POWER(10,INT(LOG(N13))-2),INT(0.5+100*POWER(10,IF(96*(LOG(N13)-INT(LOG(N13)))-ROUND(96*(LOG(N13)-INT(LOG(N13))),0)<0,ROUND(96*(LOG(N13)-INT(LOG(N13))),0)-1,ROUND(96*(LOG(N13)-INT(LOG(N13))),0))/96))*POWER(10,INT(LOG(N13))-2)))","v":{"$error":"#REF!"}},"Ω"]
[2.2000000000000002,{"$f":"IF(IF((B$3*10^12-$A15)*(B$3*10^12-$A14)*-1<0,0,1)*IF(ABS(B$3*10^12-$A15)>(B$3*10^12-$A14),$A14,$A15)=B15,0,IF((B$3*10^12-$A15)*(B$3*10^12-$A14)*-1<0,0,1)*IF(ABS(B$3*10^12-$A15)>(B$3*10^12-$A14),$A14,$A15))","v":{"$error":"#NAME?"}},{"$error":"#REF!"},{"$error":"#REF!"},0,0,{"$error":"#NAME?"},{"$error":"#NAME?"},{"$error":"#NAME?"},{"$error":"#NAME?"}]
[2.7,{"$error":"#NAME?"},{"$error":"#REF!"},{"$error":"#REF!"},0,0,{"$error":"#NAME?"},{"$error":"#NAME?"},{"$error":"#NAME?"},{"$error":"#NAME?"}]
[3.3,{"$error":"#NAME?"},{"$error":"#REF!"},{"$error":"#REF!"},0,0,{"$error":"#NAME?"},{"$error":"#NAME?"},{"$error":"#NAME?"},{"$error":"#NAME?"},null,null,"Rs",{"$f":"Rs_ideal*1000","v":{"$error":"#NAME?"}},{"$f":"IF(N16=0,0,IF(N16>(INT(0.5+100*POWER(10,IF(96*(LOG(N16)-INT(LOG(N16)))-ROUND(96*(LOG(N16)-INT(LOG(N16))),0)<0,ROUND(96*(LOG(N16)-INT(LOG(N16))),0)-1,ROUND(96*(LOG(N16)-INT(LOG(N16))),0))/96))*POWER(10,INT(LOG(N16))-2)+INT(0.5+100*POWER(10,(IF(96*(LOG(N16)-INT(LOG(N16)))-ROUND(96*(LOG(N16)-INT(LOG(N16))),0)<0,ROUND(96*(LOG(N16)-INT(LOG(N16))),0)-1,ROUND(96*(LOG(N16)-INT(LOG(N16))),0))+1)/96))*POWER(10,INT(LOG(N16))-2))/2,INT(0.5+100*POWER(10,(IF(96*(LOG(N16)-INT(LOG(N16)))-ROUND(96*(LOG(N16)-INT(LOG(N16))),0)<0,ROUND(96*(LOG(N16)-INT(LOG(N16))),0)-1,ROUND(96*(LOG(N16)-INT(LOG(N16))),0))+1)/96))*POWER(10,INT(LOG(N16))-2),INT(0.5+100*POWER(10,IF(96*(LOG(N16)-INT(LOG(N16)))-ROUND(96*(LOG(N16)-INT(LOG(N16))),0)<0,ROUND(96*(LOG(N16)-INT(LOG(N16))),0)-1,ROUND(96*(LOG(N16)-INT(LOG(N16))),0))/96))*POWER(10,INT(LOG(N16))-2)))","v":{"$error":"#NAME?"}},"mΩ"]
[3.9,{"$error":"#NAME?"},{"$error":"#REF!"},{"$error":"#REF!"},0,0,{"$error":"#NAME?"},{"$error":"#NAME?"},{"$error":"#NAME?"},{"$error":"#NAME?"},null,null,"Cres",{"$f":"Cres","v":{"$error":"#NAME?"}},{"$f":"G4*1000000000000","v":{"$error":"#NAME?"}},"pF"]
[4.7,{"$error":"#NAME?"},{"$error":"#REF!"},{"$error":"#REF!"},0,0,{"$error":"#NAME?"},{"$error":"#NAME?"},{"$error":"#NAME?"},{"$error":"#NAME?"}]
[5.6,{"$error":"#NAME?"},{"$error":"#REF!"},{"$error":"#REF!"},0,0,{"$error":"#NAME?"},{"$error":"#NAME?"},{"$error":"#NAME?"},{"$error":"#NAME?"}]
[6.8,{"$error":"#NAME?"},{"$error":"#REF!"},{"$error":"#REF!"},0,0,{"$error":"#NAME?"},{"$error":"#NAME?"},{"$error":"#NAME?"},{"$error":"#NAME?"}]
[8.1999999999999993,{"$error":"#NAME?"},{"$error":"#REF!"},{"$error":"#REF!"},0,0,{"$error":"#NAME?"},{"$error":"#NAME?"},{"$error":"#NAME?"},{"$error":"#NAME?"}]
[10,{"$error":"#NAME?"},{"$error":"#REF!"},{"$error":"#REF!"},0,0,{"$error":"#NAME?"},{"$error":"#NAME?"},{"$error":"#NAME?"},{"$error":"#NAME?"},null,null,"Cdither",{"$f":"Cdither_init","v":{"$error":"#NAME?"}},{"$f":"H4","v":{"$error":"#NAME?"}}]
[12,{"$error":"#NAME?"},{"$error":"#REF!"},{"$error":"#REF!"},0,0,{"$error":"#NAME?"},{"$error":"#NAME?"},{"$error":"#NAME?"},{"$error":"#NAME?"}]
[15,{"$error":"#NAME?"},{"$error":"#REF!"},{"$error":"#REF!"},0,0,{"$error":"#NAME?"},{"$error":"#NAME?"},{"$error":"#NAME?"},{"$error":"#NAME?"}]
[18,{"$error":"#NAME?"},{"$error":"#REF!"},{"$error":"#REF!"},0,0,{"$error":"#NAME?"},{"$error":"#NAME?"},{"$error":"#NAME?"},{"$error":"#NAME?"}]
[22,{"$error":"#NAME?"},{"$error":"#REF!"},{"$error":"#REF!"},0,0,{"$error":"#NAME?"},{"$error":"#NAME?"},{"$error":"#NAME?"},{"$error":"#NAME?"}]
[27,{"$error":"#NAME?"},{"$error":"#REF!"},{"$error":"#REF!"},0,0,{"$error":"#NAME?"},{"$error":"#NAME?"},{"$error":"#NAME?"},{"$error":"#NAME?"}]
[33,{"$error":"#NAME?"},{"$error":"#REF!"},{"$error":"#REF!"},0,0,{"$error":"#NAME?"},{"$error":"#NAME?"},{"$error":"#NAME?"},{"$error":"#NAME?"}]
[39,{"$error":"#NAME?"},{"$error":"#REF!"},{"$error":"#REF!"},0,0,{"$error":"#NAME?"},{"$error":"#NAME?"},{"$error":"#NAME?"},{"$error":"#NAME?"}]
[47,{"$error":"#NAME?"},{"$error":"#REF!"},{"$error":"#REF!"},0,0,{"$error":"#NAME?"},{"$error":"#NAME?"},{"$error":"#NAME?"},{"$error":"#NAME?"},null,null,"Rc1",{"$f":"O7/1000&\" kΩ\"","v":"33.2 kΩ"},{"$f":"O7/1000","v":33.200000000000003},"kΩ"]
[56,{"$error":"#NAME?"},{"$error":"#REF!"},{"$error":"#REF!"},0,0,{"$error":"#NAME?"},{"$error":"#NAME?"},{"$error":"#NAME?"},{"$error":"#NAME?"},null,null,"Cc1",{"$f":"C4*1000000000&\" nF\"","v":{"$error":"#REF!"}},{"$f":"C4*1000000000","v":{"$error":"#REF!"}},"nF"]
[68,{"$error":"#NAME?"},{"$error":"#REF!"},{"$error":"#REF!"},0,0,{"$error":"#NAME?"},{"$error":"#NAME?"},{"$error":"#NAME?"},{"$error":"#NAME?"},null,null,"Cc2",{"$f":"D4*1000000000000&\" pF\"","v":{"$error":"#REF!"}},{"$f":"D4*1000000000000","v":{"$error":"#REF!"}},"pF"]
[82,{"$error":"#NAME?"},{"$error":"#REF!"},{"$error":"#REF!"},0,0,{"$error":"#NAME?"},{"$error":"#NAME?"},{"$error":"#NAME?"},{"$error":"#NAME?"}]
[{"$f":"A22*10","v":100},{"$error":"#NAME?"},{"$error":"#REF!"},{"$error":"#REF!"},0,0,{"$error":"#NAME?"},{"$error":"#NAME?"},{"$error":"#NAME?"},{"$error":"#NAME?"},null,null,"Rc2",{"$f":"O8/1000&\" kΩ\"","v":{"$error":"#REF!"}},{"$f":"O8/1000","v":{"$error":"#REF!"}},"kΩ"]
[{"$f":"A23*10","v":120},{"$error":"#NAME?"},{"$error":"#REF!"},{"$error":"#REF!"},0,0,{"$error":"#NAME?"},{"$error":"#NAME?"},{"$error":"#NAME?"},{"$error":"#NAME?"},null,null,"Cc3",{"$f":"I4*1000000000&\" nF\"","v":{"$error":"#NAME?"}},{"$f":"I4*1000000000","v":{"$error":"#NAME?"}},"nF"]
[150,{"$error":"#NAME?"},{"$error":"#REF!"},{"$error":"#REF!"},0,0,{"$error":"#NAME?"},{"$error":"#NAME?"},{"$error":"#NAME?"},{"$error":"#NAME?"},null,null,"Cc4",{"$f":"J4*1000000000000&\" pF\"","v":{"$error":"#NAME?"}},{"$f":"J4*1000000000000","v":{"$error":"#NAME?"}},"pF"]
[180,{"$error":"#NAME?"},{"$error":"#REF!"},{"$error":"#REF!"},0,0,{"$error":"#NAME?"},{"$error":"#NAME?"},{"$error":"#NAME?"},{"$error":"#NAME?"}]
[220,{"$error":"#NAME?"},{"$error":"#REF!"},{"$error":"#REF!"},0,0,{"$error":"#NAME?"},{"$error":"#NAME?"},{"$error":"#NAME?"},{"$error":"#NAME?"}]
[270,{"$error":"#NAME?"},{"$f":"IF(IF((C$3*10^12-$A40)*(C$3*10^12-$A39)*-1<0,0,1)*IF(ABS(C$3*10^12-$A40)>(C$3*10^12-$A39),$A39,$A40)=C40,0,IF((C$3*10^12-$A40)*(C$3*10^12-$A39)*-1<0,0,1)*IF(ABS(C$3*10^12-$A40)>(C$3*10^12-$A39),$A39,$A40))","v":{"$error":"#REF!"}},{"$error":"#REF!"},0,0,{"$error":"#NAME?"},{"$error":"#NAME?"},{"$error":"#NAME?"},{"$error":"#NAME?"}]
[330,{"$error":"#NAME?"},{"$error":"#REF!"},{"$error":"#REF!"},0,0,{"$error":"#NAME?"},{"$error":"#NAME?"},{"$error":"#NAME?"},{"$error":"#NAME?"}]
[390,{"$error":"#NAME?"},{"$error":"#REF!"},{"$error":"#REF!"},0,0,{"$error":"#NAME?"},{"$error":"#NAME?"},{"$error":"#NAME?"},{"$error":"#NAME?"}]
[470,{"$error":"#NAME?"},{"$error":"#REF!"},{"$error":"#REF!"},0,0,{"$error":"#NAME?"},{"$error":"#NAME?"},{"$error":"#NAME?"},{"$error":"#NAME?"}]
[560,{"$error":"#NAME?"},{"$error":"#REF!"},{"$error":"#REF!"},0,0,{"$error":"#NAME?"},{"$error":"#NAME?"},{"$error":"#NAME?"},{"$error":"#NAME?"}]
[680,{"$error":"#NAME?"},{"$error":"#REF!"},{"$error":"#REF!"},0,0,{"$error":"#NAME?"},{"$error":"#NAME?"},{"$error":"#NAME?"},{"$error":"#NAME?"}]
[{"$f":"A33*10","v":820},{"$error":"#NAME?"},{"$error":"#REF!"},{"$error":"#REF!"},0,0,{"$error":"#NAME?"},{"$error":"#NAME?"},{"$error":"#NAME?"},{"$error":"#NAME?"}]
[1000,{"$error":"#NAME?"},{"$error":"#REF!"},{"$error":"#REF!"},0,0,{"$error":"#NAME?"},{"$error":"#NAME?"},{"$error":"#NAME?"},{"$error":"#NAME?"}]
[1200,{"$error":"#NAME?"},{"$error":"#REF!"},{"$error":"#REF!"},0,0,{"$error":"#NAME?"},{"$error":"#NAME?"},{"$error":"#NAME?"},{"$error":"#NAME?"}]
[1500,{"$error":"#NAME?"},{"$error":"#REF!"},{"$error":"#REF!"},0,0,{"$error":"#NAME?"},{"$error":"#NAME?"},{"$error":"#NAME?"},{"$error":"#NAME?"}]
[1800,{"$error":"#NAME?"},{"$error":"#REF!"},{"$error":"#REF!"},0,0,{"$error":"#NAME?"},{"$error":"#NAME?"},{"$error":"#NAME?"},{"$error":"#NAME?"}]
[2200,{"$error":"#NAME?"},{"$error":"#REF!"},{"$error":"#REF!"},0,0,{"$error":"#NAME?"},{"$error":"#NAME?"},{"$error":"#NAME?"},{"$error":"#NAME?"}]
[2700,{"$error":"#NAME?"},{"$error":"#REF!"},{"$error":"#REF!"},0,0,{"$error":"#NAME?"},{"$error":"#NAME?"},{"$error":"#NAME?"},{"$error":"#NAME?"}]
[3300,{"$error":"#NAME?"},{"$error":"#REF!"},{"$error":"#REF!"},0,0,{"$error":"#NAME?"},{"$error":"#NAME?"},{"$error":"#NAME?"},{"$error":"#NAME?"}]
[3900,{"$error":"#NAME?"},{"$error":"#REF!"},{"$error":"#REF!"},0,0,{"$error":"#NAME?"},{"$error":"#NAME?"},{"$error":"#NAME?"},{"$error":"#NAME?"}]
[4700,{"$error":"#NAME?"},{"$error":"#REF!"},{"$error":"#REF!"},0,0,{"$error":"#NAME?"},{"$error":"#NAME?"},{"$error":"#NAME?"},{"$error":"#NAME?"}]
[5600,{"$error":"#NAME?"},{"$error":"#REF!"},{"$error":"#REF!"},0,0,{"$error":"#NAME?"},{"$error":"#NAME?"},{"$error":"#NAME?"},{"$error":"#NAME?"}]
[6800,{"$error":"#NAME?"},{"$error":"#REF!"},{"$error":"#REF!"},0,0,{"$error":"#NAME?"},{"$error":"#NAME?"},{"$error":"#NAME?"},{"$error":"#NAME?"}]
[8200,{"$error":"#NAME?"},{"$error":"#REF!"},{"$error":"#REF!"},0,0,{"$error":"#NAME?"},{"$error":"#NAME?"},{"$error":"#NAME?"},{"$error":"#NAME?"}]
[10000,{"$error":"#NAME?"},{"$error":"#REF!"},{"$error":"#REF!"},0,0,{"$error":"#NAME?"},{"$error":"#NAME?"},{"$error":"#NAME?"},{"$error":"#NAME?"}]
[12000,{"$error":"#NAME?"},{"$error":"#REF!"},{"$error":"#REF!"},0,0,{"$error":"#NAME?"},{"$error":"#NAME?"},{"$error":"#NAME?"},{"$error":"#NAME?"}]
[15000,{"$error":"#NAME?"},{"$error":"#REF!"},{"$error":"#REF!"},0,0,{"$error":"#NAME?"},{"$error":"#NAME?"},{"$error":"#NAME?"},{"$error":"#NAME?"}]
[18000,{"$error":"#NAME?"},{"$error":"#REF!"},{"$error":"#REF!"},0,0,{"$error":"#NAME?"},{"$error":"#NAME?"},{"$error":"#NAME?"},{"$error":"#NAME?"}]
[22000,{"$error":"#NAME?"},{"$error":"#REF!"},{"$error":"#REF!"},0,0,{"$error":"#NAME?"},{"$error":"#NAME?"},{"$error":"#NAME?"},{"$error":"#NAME?"}]
[27000,{"$error":"#NAME?"},{"$error":"#REF!"},{"$error":"#REF!"},0,0,{"$error":"#NAME?"},{"$error":"#NAME?"},{"$error":"#NAME?"},{"$error":"#NAME?"}]
[33000,{"$error":"#NAME?"},{"$error":"#REF!"},{"$error":"#REF!"},0,0,{"$error":"#NAME?"},{"$error":"#NAME?"},{"$error":"#NAME?"},{"$error":"#NAME?"}]
[39000,{"$error":"#NAME?"},{"$error":"#REF!"},{"$error":"#REF!"},0,0,{"$error":"#NAME?"},{"$error":"#NAME?"},{"$error":"#NAME?"},{"$error":"#NAME?"}]
[47000,{"$error":"#NAME?"},{"$error":"#REF!"},{"$error":"#REF!"},0,0,{"$error":"#NAME?"},{"$error":"#NAME?"},{"$error":"#NAME?"},{"$error":"#NAME?"}]
[56000,{"$error":"#NAME?"},{"$error":"#REF!"},{"$error":"#REF!"},0,0,{"$error":"#NAME?"},{"$error":"#NAME?"},{"$error":"#NAME?"},{"$error":"#NAME?"}]
[68000,{"$error":"#NAME?"},{"$error":"#REF!"},{"$error":"#REF!"},0,0,{"$error":"#NAME?"},{"$error":"#NAME?"},{"$error":"#NAME?"},{"$error":"#NAME?"}]
[82000,{"$error":"#NAME?"},{"$error":"#REF!"},{"$error":"#REF!"},0,0,{"$error":"#NAME?"},{"$error":"#NAME?"},{"$error":"#NAME?"},{"$f":"IF(IF((J$3*10^12-$A70)*(J$3*10^12-$A69)*-1<0,0,1)*IF(ABS(J$3*10^12-$A70)>(J$3*10^12-$A69),$A69,$A70)=J70,0,IF((J$3*10^12-$A70)*(J$3*10^12-$A69)*-1<0,0,1)*IF(ABS(J$3*10^12-$A70)>(J$3*10^12-$A69),$A69,$A70))","v":{"$error":"#NAME?"}}]
[100000,{"$error":"#NAME?"},{"$error":"#REF!"},{"$f":"IF(IF((D$3*10^12-$A71)*(D$3*10^12-$A70)*-1<0,0,1)*IF(ABS(D$3*10^12-$A71)>(D$3*10^12-$A70),$A70,$A71)=D71,0,IF((D$3*10^12-$A71)*(D$3*10^12-$A70)*-1<0,0,1)*IF(ABS(D$3*10^12-$A71)>(D$3*10^12-$A70),$A70,$A71))","v":{"$error":"#REF!"}},0,0,{"$error":"#NAME?"},{"$error":"#NAME?"},{"$error":"#NAME?"},{"$error":"#NAME?"}]
[120000,{"$f":"IF(IF((B$3*10^12-$A72)*(B$3*10^12-$A71)*-1<0,0,1)*IF(ABS(B$3*10^12-$A72)>(B$3*10^12-$A71),$A71,$A72)=B72,0,IF((B$3*10^12-$A72)*(B$3*10^12-$A71)*-1<0,0,1)*IF(ABS(B$3*10^12-$A72)>(B$3*10^12-$A71),$A71,$A72))","v":{"$error":"#NAME?"}},{"$f":"IF(IF((C$3*10^12-$A72)*(C$3*10^12-$A71)*-1<0,0,1)*IF(ABS(C$3*10^12-$A72)>(C$3*10^12-$A71),$A71,$A72)=C72,0,IF((C$3*10^12-$A72)*(C$3*10^12-$A71)*-1<0,0,1)*IF(ABS(C$3*10^12-$A72)>(C$3*10^12-$A71),$A71,$A72))","v":{"$error":"#REF!"}},{"$error":"#REF!"},0,{"$f":"IF(IF((F$3*10^12-$A72)*(F$3*10^12-$A71)*-1<0,0,1)*IF(ABS(F$3*10^12-$A72)>(F$3*10^12-$A71),$A71,$A72)=F72,0,IF((F$3*10^12-$A72)*(F$3*10^12-$A71)*-1<0,0,1)*IF(ABS(F$3*10^12-$A72)>(F$3*10^12-$A71),$A71,$A72))","v":0},{"$f":"IF(IF((G$3*10^12-$A72)*(G$3*10^12-$A71)*-1<0,0,1)*IF(ABS(G$3*10^12-$A72)>(G$3*10^12-$A71),$A71,$A72)=G72,0,IF((G$3*10^12-$A72)*(G$3*10^12-$A71)*-1<0,0,1)*IF(ABS(G$3*10^12-$A72)>(G$3*10^12-$A71),$A71,$A72))","v":{"$error":"#NAME?"}},{"$f":"IF(IF((H$3*10^12-$A72)*(H$3*10^12-$A71)*-1<0,0,1)*IF(ABS(H$3*10^12-$A72)>(H$3*10^12-$A71),$A71,$A72)=H72,0,IF((H$3*10^12-$A72)*(H$3*10^12-$A71)*-1<0,0,1)*IF(ABS(H$3*10^12-$A72)>(H$3*10^12-$A71),$A71,$A72))","v":{"$error":"#NAME?"}},{"$f":"IF(IF((I$3*10^12-$A72)*(I$3*10^12-$A71)*-1<0,0,1)*IF(ABS(I$3*10^12-$A72)>(I$3*10^12-$A71),$A71,$A72)=I72,0,IF((I$3*10^12-$A72)*(I$3*10^12-$A71)*-1<0,0,1)*IF(ABS(I$3*10^12-$A72)>(I$3*10^12-$A71),$A71,$A72))","v":{"$error":"#NAME?"}},{"$error":"#NAME?"}]
[150000,{"$error":"#NAME?"},{"$error":"#REF!"},{"$error":"#REF!"},0,0,{"$error":"#NAME?"},{"$error":"#NAME?"},{"$error":"#NAME?"},{"$error":"#NAME?"}]
[180000,{"$error":"#NAME?"},{"$error":"#REF!"},{"$error":"#REF!"},0,0,{"$error":"#NAME?"},{"$error":"#NAME?"},{"$error":"#NAME?"},{"$error":"#NAME?"}]
[220000,{"$error":"#NAME?"},{"$error":"#REF!"},{"$error":"#REF!"},0,0,{"$error":"#NAME?"},{"$error":"#NAME?"},{"$error":"#NAME?"},{"$error":"#NAME?"}]
[270000,{"$error":"#NAME?"},{"$error":"#REF!"},{"$error":"#REF!"},0,0,{"$error":"#NAME?"},{"$error":"#NAME?"},{"$error":"#NAME?"},{"$error":"#NAME?"}]
[330000,{"$error":"#NAME?"},{"$error":"#REF!"},{"$error":"#REF!"},0,0,{"$error":"#NAME?"},{"$error":"#NAME?"},{"$error":"#NAME?"},{"$error":"#NAME?"}]
[390000,{"$error":"#NAME?"},{"$error":"#REF!"},{"$error":"#REF!"},0,0,{"$error":"#NAME?"},{"$error":"#NAME?"},{"$error":"#NAME?"},{"$error":"#NAME?"}]
[470000,{"$error":"#NAME?"},{"$error":"#REF!"},{"$error":"#REF!"},0,0,{"$error":"#NAME?"},{"$error":"#NAME?"},{"$error":"#NAME?"},{"$error":"#NAME?"}]
[560000,{"$error":"#NAME?"},{"$error":"#REF!"},{"$error":"#REF!"},0,0,{"$error":"#NAME?"},{"$error":"#NAME?"},{"$error":"#NAME?"},{"$error":"#NAME?"}]
[680000,{"$error":"#NAME?"},{"$error":"#REF!"},{"$error":"#REF!"},0,0,{"$error":"#NAME?"},{"$error":"#NAME?"},{"$error":"#NAME?"},{"$error":"#NAME?"}]
[820000,{"$error":"#NAME?"},{"$error":"#REF!"},{"$error":"#REF!"},0,0,{"$error":"#NAME?"},{"$error":"#NAME?"},{"$error":"#NAME?"},{"$error":"#NAME?"}]
[1000000,{"$error":"#NAME?"},{"$error":"#REF!"},{"$error":"#REF!"},0,0,{"$error":"#NAME?"},{"$error":"#NAME?"},{"$error":"#NAME?"},{"$error":"#NAME?"}]
[1200000,{"$error":"#NAME?"},{"$error":"#REF!"},{"$error":"#REF!"},0,0,{"$error":"#NAME?"},{"$error":"#NAME?"},{"$error":"#NAME?"},{"$error":"#NAME?"}]
[1500000,{"$error":"#NAME?"},{"$error":"#REF!"},{"$error":"#REF!"},0,0,{"$error":"#NAME?"},{"$error":"#NAME?"},{"$error":"#NAME?"},{"$error":"#NAME?"}]
[1800000,{"$error":"#NAME?"},{"$error":"#REF!"},{"$error":"#REF!"},0,0,{"$error":"#NAME?"},{"$error":"#NAME?"},{"$error":"#NAME?"},{"$error":"#NAME?"}]
[2200000,{"$error":"#NAME?"},{"$error":"#REF!"},{"$error":"#REF!"},0,0,{"$error":"#NAME?"},{"$error":"#NAME?"},{"$error":"#NAME?"},{"$error":"#NAME?"}]
[2700000,{"$error":"#NAME?"},{"$error":"#REF!"},{"$error":"#REF!"},0,0,{"$error":"#NAME?"},{"$error":"#NAME?"},{"$error":"#NAME?"},{"$error":"#NAME?"}]
[3300000,{"$error":"#NAME?"},{"$error":"#REF!"},{"$error":"#REF!"},0,0,{"$error":"#NAME?"},{"$error":"#NAME?"},{"$error":"#NAME?"},{"$error":"#NAME?"}]
[3900000,{"$error":"#NAME?"},{"$error":"#REF!"},{"$error":"#REF!"},0,0,{"$error":"#NAME?"},{"$error":"#NAME?"},{"$error":"#NAME?"},{"$error":"#NAME?"}]
[4700000,{"$error":"#NAME?"},{"$error":"#REF!"},{"$error":"#REF!"},0,0,{"$error":"#NAME?"},{"$error":"#NAME?"},{"$error":"#NAME?"},{"$error":"#NAME?"}]
[5600000,{"$error":"#NAME?"},{"$error":"#REF!"},{"$error":"#REF!"},0,6800000,{"$error":"#NAME?"},{"$error":"#NAME?"},{"$error":"#NAME?"},{"$error":"#NAME?"}]
[6800000,{"$error":"#NAME?"},{"$error":"#REF!"},{"$error":"#REF!"},0,0,{"$error":"#NAME?"},{"$error":"#NAME?"},{"$error":"#NAME?"},{"$error":"#NAME?"}]
[8200000,{"$error":"#NAME?"},{"$error":"#REF!"},{"$error":"#REF!"},0,0,{"$error":"#NAME?"},{"$error":"#NAME?"},{"$error":"#NAME?"},{"$error":"#NAME?"}]
[10000000,{"$error":"#NAME?"},{"$error":"#REF!"},{"$error":"#REF!"},0,0,{"$error":"#NAME?"},{"$error":"#NAME?"},{"$error":"#NAME?"},{"$error":"#NAME?"}]
[12000000,{"$error":"#NAME?"},{"$error":"#REF!"},{"$error":"#REF!"},0,0,{"$error":"#NAME?"},{"$error":"#NAME?"},{"$error":"#NAME?"},{"$error":"#NAME?"}]
[15000000,{"$error":"#NAME?"},{"$error":"#REF!"},{"$error":"#REF!"},0,0,{"$error":"#NAME?"},{"$error":"#NAME?"},{"$error":"#NAME?"},{"$error":"#NAME?"}]
[18000000,{"$error":"#NAME?"},{"$error":"#REF!"},{"$error":"#REF!"},0,0,{"$error":"#NAME?"},{"$error":"#NAME?"},{"$error":"#NAME?"},{"$error":"#NAME?"}]
[22000000,{"$error":"#NAME?"},{"$error":"#REF!"},{"$error":"#REF!"},0,0,{"$error":"#NAME?"},{"$error":"#NAME?"},{"$error":"#NAME?"},{"$error":"#NAME?"}]
[{"$f":"A87*10","v":27000000},{"$error":"#NAME?"},{"$error":"#REF!"},{"$error":"#REF!"},0,0,{"$error":"#NAME?"},{"$error":"#NAME?"},{"$error":"#NAME?"},{"$error":"#NAME?"}]
[33000000,{"$error":"#NAME?"},{"$error":"#REF!"},{"$error":"#REF!"},0,0,{"$error":"#NAME?"},{"$error":"#NAME?"},{"$error":"#NAME?"},{"$error":"#NAME?"}]
[39000000,{"$error":"#NAME?"},{"$error":"#REF!"},{"$error":"#REF!"},0,0,{"$error":"#NAME?"},{"$error":"#NAME?"},{"$error":"#NAME?"},{"$error":"#NAME?"}]
[47000000,{"$error":"#NAME?"},{"$error":"#REF!"},{"$error":"#REF!"},0,0,{"$error":"#NAME?"},{"$error":"#NAME?"},{"$error":"#NAME?"},{"$error":"#NAME?"}]
[56000000,{"$error":"#NAME?"},{"$error":"#REF!"},{"$error":"#REF!"},0,{"$f":"IF(IF((F$3*10^12-$A104)*(F$3*10^12-$A103)*-1<0,0,1)*IF(ABS(F$3*10^12-$A104)>(F$3*10^12-$A103),$A103,$A104)=F104,0,IF((F$3*10^12-$A104)*(F$3*10^12-$A103)*-1<0,0,1)*IF(ABS(F$3*10^12-$A104)>(F$3*10^12-$A103),$A103,$A104))","v":0},{"$f":"IF(IF((G$3*10^12-$A104)*(G$3*10^12-$A103)*-1<0,0,1)*IF(ABS(G$3*10^12-$A104)>(G$3*10^12-$A103),$A103,$A104)=G104,0,IF((G$3*10^12-$A104)*(G$3*10^12-$A103)*-1<0,0,1)*IF(ABS(G$3*10^12-$A104)>(G$3*10^12-$A103),$A103,$A104))","v":{"$error":"#NAME?"}},{"$f":"IF(IF((H$3*10^12-$A104)*(H$3*10^12-$A103)*-1<0,0,1)*IF(ABS(H$3*10^12-$A104)>(H$3*10^12-$A103),$A103,$A104)=H104,0,IF((H$3*10^12-$A104)*(H$3*10^12-$A103)*-1<0,0,1)*IF(ABS(H$3*10^12-$A104)>(H$3*10^12-$A103),$A103,$A104))","v":{"$error":"#NAME?"}},{"$f":"IF(IF((I$3*10^12-$A104)*(I$3*10^12-$A103)*-1<0,0,1)*IF(ABS(I$3*10^12-$A104)>(I$3*10^12-$A103),$A103,$A104)=I104,0,IF((I$3*10^12-$A104)*(I$3*10^12-$A103)*-1<0,0,1)*IF(ABS(I$3*10^12-$A104)>(I$3*10^12-$A103),$A103,$A104))","v":{"$error":"#NAME?"}},{"$error":"#NAME?"}]
[68000000,{"$error":"#NAME?"},{"$error":"#REF!"},{"$error":"#REF!"},0,0,{"$error":"#NAME?"},{"$error":"#NAME?"},{"$error":"#NAME?"},{"$error":"#NAME?"}]
[82000000,{"$error":"#NAME?"},{"$error":"#REF!"},{"$error":"#REF!"},0,0,{"$error":"#NAME?"},{"$error":"#NAME?"},{"$error":"#NAME?"},{"$error":"#NAME?"}]
[100000000,{"$error":"#NAME?"},{"$error":"#REF!"},{"$error":"#REF!"},0,0,{"$error":"#NAME?"},{"$error":"#NAME?"},{"$error":"#NAME?"},{"$error":"#NAME?"}]
[120000000,{"$error":"#NAME?"},{"$error":"#REF!"},{"$error":"#REF!"},120000000,0,{"$error":"#NAME?"},{"$error":"#NAME?"},{"$error":"#NAME?"},{"$error":"#NAME?"}]
[150000000,{"$error":"#NAME?"},{"$error":"#REF!"},{"$error":"#REF!"},0,0,{"$error":"#NAME?"},{"$error":"#NAME?"},{"$error":"#NAME?"},{"$error":"#NAME?"}]
[180000000,{"$error":"#NAME?"},{"$error":"#REF!"},{"$error":"#REF!"},0,0,{"$error":"#NAME?"},{"$error":"#NAME?"},{"$error":"#NAME?"},{"$error":"#NAME?"}]
[220000000,{"$error":"#NAME?"},{"$error":"#REF!"},{"$error":"#REF!"},0,0,{"$error":"#NAME?"},{"$error":"#NAME?"},{"$error":"#NAME?"},{"$error":"#NAME?"}]
[270000000,{"$error":"#NAME?"},{"$error":"#REF!"},{"$error":"#REF!"},0,0,{"$error":"#NAME?"},{"$error":"#NAME?"},{"$error":"#NAME?"},{"$error":"#NAME?"}]
[330000000,{"$error":"#NAME?"},{"$error":"#REF!"},{"$error":"#REF!"},0,0,{"$error":"#NAME?"},{"$error":"#NAME?"},{"$error":"#NAME?"},{"$error":"#NAME?"}]
[390000000,{"$error":"#NAME?"},{"$error":"#REF!"},{"$error":"#REF!"},0,0,{"$error":"#NAME?"},{"$error":"#NAME?"},{"$error":"#NAME?"},{"$error":"#NAME?"}]
[470000000,{"$error":"#NAME?"},{"$error":"#REF!"},{"$error":"#REF!"},0,0,{"$error":"#NAME?"},{"$error":"#NAME?"},{"$error":"#NAME?"},{"$error":"#NAME?"}]
[560000000,{"$error":"#NAME?"},{"$error":"#REF!"},{"$error":"#REF!"},0,0,{"$error":"#NAME?"},{"$error":"#NAME?"},{"$error":"#NAME?"},{"$error":"#NAME?"}]
[680000000,{"$error":"#NAME?"},{"$error":"#REF!"},{"$error":"#REF!"},0,0,{"$error":"#NAME?"},{"$error":"#NAME?"},{"$error":"#NAME?"},{"$error":"#NAME?"}]
[820000000,{"$error":"#NAME?"},{"$error":"#REF!"},{"$error":"#REF!"},0,0,{"$error":"#NAME?"},{"$error":"#NAME?"},{"$error":"#NAME?"},{"$error":"#NAME?"}]
[1000000000,{"$error":"#NAME?"},{"$error":"#REF!"},{"$error":"#REF!"},0,0,{"$error":"#NAME?"},{"$error":"#NAME?"},{"$error":"#NAME?"},{"$error":"#NAME?"}]
[1200000000,{"$error":"#NAME?"},{"$error":"#REF!"},{"$error":"#REF!"},0,0,{"$error":"#NAME?"},{"$error":"#NAME?"},{"$error":"#NAME?"},{"$error":"#NAME?"}]
[1500000000,{"$error":"#NAME?"},{"$error":"#REF!"},{"$error":"#REF!"},0,0,{"$error":"#NAME?"},{"$error":"#NAME?"},{"$error":"#NAME?"},{"$error":"#NAME?"}]
[1800000000,{"$error":"#NAME?"},{"$error":"#REF!"},{"$error":"#REF!"},0,0,{"$error":"#NAME?"},{"$error":"#NAME?"},{"$error":"#NAME?"},{"$error":"#NAME?"}]
[2200000000,{"$error":"#NAME?"},{"$error":"#REF!"},{"$error":"#REF!"},0,0,{"$error":"#NAME?"},{"$error":"#NAME?"},{"$error":"#NAME?"},{"$error":"#NAME?"}]
[2700000000,{"$error":"#NAME?"},{"$error":"#REF!"},{"$error":"#REF!"},0,0,{"$error":"#NAME?"},{"$error":"#NAME?"},{"$error":"#NAME?"},{"$error":"#NAME?"}]
[3300000000,{"$error":"#NAME?"},{"$error":"#REF!"},{"$error":"#REF!"},0,0,{"$error":"#NAME?"},{"$error":"#NAME?"},{"$error":"#NAME?"},{"$error":"#NAME?"}]
[3900000000,{"$error":"#NAME?"},{"$error":"#REF!"},{"$error":"#REF!"},0,0,{"$error":"#NAME?"},{"$error":"#NAME?"},{"$error":"#NAME?"},{"$error":"#NAME?"}]
[4700000000,{"$error":"#NAME?"},{"$error":"#REF!"},{"$error":"#REF!"},0,0,{"$error":"#NAME?"},{"$error":"#NAME?"},{"$error":"#NAME?"},{"$error":"#NAME?"}]
[5600000000,{"$error":"#NAME?"},{"$error":"#REF!"},{"$error":"#REF!"},0,0,{"$error":"#NAME?"},{"$error":"#NAME?"},{"$error":"#NAME?"},{"$error":"#NAME?"}]
[6800000000,{"$error":"#NAME?"},{"$error":"#REF!"},{"$error":"#REF!"},0,0,{"$error":"#NAME?"},{"$error":"#NAME?"},{"$error":"#NAME?"},{"$error":"#NAME?"}]
[8200000000,{"$error":"#NAME?"},{"$error":"#REF!"},{"$error":"#REF!"},0,0,{"$error":"#NAME?"},{"$error":"#NAME?"},{"$error":"#NAME?"},{"$error":"#NAME?"}]
[10000000000,{"$error":"#NAME?"},{"$error":"#REF!"},{"$error":"#REF!"},0,0,{"$error":"#NAME?"},{"$error":"#NAME?"},{"$error":"#NAME?"},{"$error":"#NAME?"}]
[12000000000,{"$error":"#NAME?"},{"$error":"#REF!"},{"$error":"#REF!"},0,0,{"$error":"#NAME?"},{"$error":"#NAME?"},{"$error":"#NAME?"},{"$error":"#NAME?"}]
[15000000000,{"$error":"#NAME?"},{"$error":"#REF!"},{"$error":"#REF!"},0,0,{"$error":"#NAME?"},{"$error":"#NAME?"},{"$error":"#NAME?"},{"$error":"#NAME?"}]
[18000000000,{"$error":"#NAME?"},{"$error":"#REF!"},{"$error":"#REF!"},0,0,{"$error":"#NAME?"},{"$error":"#NAME?"},{"$error":"#NAME?"},{"$f":"IF(IF((J$3*10^12-$A134)*(J$3*10^12-$A133)*-1<0,0,1)*IF(ABS(J$3*10^12-$A134)>(J$3*10^12-$A133),$A133,$A134)=J134,0,IF((J$3*10^12-$A134)*(J$3*10^12-$A133)*-1<0,0,1)*IF(ABS(J$3*10^12-$A134)>(J$3*10^12-$A133),$A133,$A134))","v":{"$error":"#NAME?"}}]
[22000000000,{"$error":"#NAME?"},{"$error":"#REF!"},{"$error":"#REF!"},{"$f":"IF(IF((E$3*10^12-$A135)*(E$3*10^12-$A134)*-1<0,0,1)*IF(ABS(E$3*10^12-$A135)>(E$3*10^12-$A134),$A134,$A135)=E135,0,IF((E$3*10^12-$A135)*(E$3*10^12-$A134)*-1<0,0,1)*IF(ABS(E$3*10^12-$A135)>(E$3*10^12-$A134),$A134,$A135))","v":0},0,{"$error":"#NAME?"},{"$error":"#NAME?"},{"$error":"#NAME?"},{"$f":"IF(IF((J$3*10^12-$A135)*(J$3*10^12-$A134)*-1<0,0,1)*IF(ABS(J$3*10^12-$A135)>(J$3*10^12-$A134),$A134,$A135)=J135,0,IF((J$3*10^12-$A135)*(J$3*10^12-$A134)*-1<0,0,1)*IF(ABS(J$3*10^12-$A135)>(J$3*10^12-$A134),$A134,$A135))","v":{"$error":"#NAME?"}}]
[27000000000,{"$f":"IF(IF((B$3*10^12-$A136)*(B$3*10^12-$A135)*-1<0,0,1)*IF(ABS(B$3*10^12-$A136)>(B$3*10^12-$A135),$A135,$A136)=B136,0,IF((B$3*10^12-$A136)*(B$3*10^12-$A135)*-1<0,0,1)*IF(ABS(B$3*10^12-$A136)>(B$3*10^12-$A135),$A135,$A136))","v":{"$error":"#NAME?"}},{"$f":"IF(IF((C$3*10^12-$A136)*(C$3*10^12-$A135)*-1<0,0,1)*IF(ABS(C$3*10^12-$A136)>(C$3*10^12-$A135),$A135,$A136)=C136,0,IF((C$3*10^12-$A136)*(C$3*10^12-$A135)*-1<0,0,1)*IF(ABS(C$3*10^12-$A136)>(C$3*10^12-$A135),$A135,$A136))","v":{"$error":"#REF!"}},{"$error":"#REF!"},0,0,{"$error":"#NAME?"},{"$error":"#NAME?"},{"$error":"#NAME?"},{"$error":"#NAME?"}]
[33000000000,{"$error":"#NAME?"},{"$error":"#REF!"},{"$error":"#REF!"},0,0,{"$error":"#NAME?"},{"$error":"#NAME?"},{"$error":"#NAME?"},{"$error":"#NAME?"}]
[39000000000,{"$error":"#NAME?"},{"$error":"#REF!"},{"$error":"#REF!"},0,0,{"$error":"#NAME?"},{"$error":"#NAME?"},{"$error":"#NAME?"},{"$error":"#NAME?"}]
[47000000000,{"$error":"#NAME?"},{"$error":"#REF!"},{"$error":"#REF!"},0,0,{"$error":"#NAME?"},{"$error":"#NAME?"},{"$error":"#NAME?"},{"$error":"#NAME?"}]
[56000000000,{"$error":"#NAME?"},{"$error":"#REF!"},{"$error":"#REF!"},0,0,{"$error":"#NAME?"},{"$error":"#NAME?"},{"$error":"#NAME?"},{"$error":"#NAME?"}]
[68000000000,{"$error":"#NAME?"},{"$error":"#REF!"},{"$error":"#REF!"},0,0,{"$error":"#NAME?"},{"$error":"#NAME?"},{"$error":"#NAME?"},{"$error":"#NAME?"}]
[82000000000,{"$error":"#NAME?"},{"$error":"#REF!"},{"$error":"#REF!"},0,0,{"$error":"#NAME?"},{"$error":"#NAME?"},{"$error":"#NAME?"},{"$error":"#NAME?"}]
[100000000000,{"$error":"#NAME?"},{"$error":"#REF!"},{"$error":"#REF!"},0,0,{"$error":"#NAME?"},{"$error":"#NAME?"},{"$error":"#NAME?"},{"$error":"#NAME?"}]
[120000000000,{"$error":"#NAME?"},{"$error":"#REF!"},{"$error":"#REF!"},0,0,{"$error":"#NAME?"},{"$error":"#NAME?"},{"$error":"#NAME?"},{"$error":"#NAME?"}]
[150000000000,{"$error":"#NAME?"},{"$error":"#REF!"},{"$error":"#REF!"},0,0,{"$error":"#NAME?"},{"$error":"#NAME?"},{"$error":"#NAME?"},{"$error":"#NAME?"}]
[180000000000,{"$error":"#NAME?"},{"$error":"#REF!"},{"$error":"#REF!"},0,0,{"$error":"#NAME?"},{"$error":"#NAME?"},{"$error":"#NAME?"},{"$error":"#NAME?"}]
[220000000000,{"$error":"#NAME?"},{"$error":"#REF!"},{"$error":"#REF!"},0,0,{"$error":"#NAME?"},{"$error":"#NAME?"},{"$error":"#NAME?"},{"$error":"#NAME?"}]
[270000000000,{"$error":"#NAME?"},{"$error":"#REF!"},{"$error":"#REF!"},0,0,{"$error":"#NAME?"},{"$error":"#NAME?"},{"$error":"#NAME?"},{"$error":"#NAME?"}]
[330000000000,{"$error":"#NAME?"},{"$error":"#REF!"},{"$error":"#REF!"},0,0,{"$error":"#NAME?"},{"$error":"#NAME?"},{"$error":"#NAME?"},{"$error":"#NAME?"}]
[390000000000,{"$error":"#NAME?"},{"$error":"#REF!"},{"$error":"#REF!"},0,0,{"$error":"#NAME?"},{"$error":"#NAME?"},{"$error":"#NAME?"},{"$error":"#NAME?"}]
[470000000000,{"$error":"#NAME?"},{"$error":"#REF!"},{"$error":"#REF!"},0,0,{"$error":"#NAME?"},{"$error":"#NAME?"},{"$error":"#NAME?"},{"$error":"#NAME?"}]
[560000000000,{"$error":"#NAME?"},{"$error":"#REF!"},{"$error":"#REF!"},0,0,{"$error":"#NAME?"},{"$error":"#NAME?"},{"$error":"#NAME?"},{"$error":"#NAME?"}]
[680000000000,{"$error":"#NAME?"},{"$error":"#REF!"},{"$error":"#REF!"},0,0,{"$error":"#NAME?"},{"$error":"#NAME?"},{"$error":"#NAME?"},{"$error":"#NAME?"}]
[820000000000,{"$error":"#NAME?"},{"$error":"#REF!"},{"$error":"#REF!"},0,0,{"$error":"#NAME?"},{"$error":"#NAME?"},{"$error":"#NAME?"},{"$error":"#NAME?"}]
[1000000000000,{"$error":"#NAME?"},{"$error":"#REF!"},{"$error":"#REF!"},0,0,{"$error":"#NAME?"},{"$error":"#NAME?"},{"$error":"#NAME?"},{"$error":"#NAME?"}]
[1200000000000,{"$error":"#NAME?"},{"$error":"#REF!"},{"$error":"#REF!"},0,0,{"$error":"#NAME?"},{"$error":"#NAME?"},{"$error":"#NAME?"},{"$error":"#NAME?"}]
[1500000000000,{"$error":"#NAME?"},{"$error":"#REF!"},{"$error":"#REF!"},0,0,{"$error":"#NAME?"},{"$error":"#NAME?"},{"$error":"#NAME?"},{"$error":"#NAME?"}]
[1800000000000,{"$error":"#NAME?"},{"$error":"#REF!"},{"$error":"#REF!"},0,0,{"$error":"#NAME?"},{"$error":"#NAME?"},{"$error":"#NAME?"},{"$error":"#NAME?"}]
[2200000000000,{"$error":"#NAME?"},{"$error":"#REF!"},{"$error":"#REF!"},0,0,{"$error":"#NAME?"},{"$error":"#NAME?"},{"$error":"#NAME?"},{"$error":"#NAME?"}]
[2700000000000,{"$error":"#NAME?"},{"$error":"#REF!"},{"$error":"#REF!"},2700000000000,2700000000000,{"$error":"#NAME?"},{"$error":"#NAME?"},{"$error":"#NAME?"},{"$error":"#NAME?"}]

{"sheet":"Snubber","index":12,"n_rows":6,"n_cols":5,"rows_kept":6,"cut":false,"hidden":true,"merged":[]}
[null,null,"UNITS","STD UNITS"]
["Frequency of Ringing",85,"MHz",{"$f":"B2*1000000","v":85000000},"Hz"]
["SW capacitance",3000,"pF",{"$f":"B3*0.000000000001","v":3E-9},"F"]
["Lpar",{"$f":"1000000000*1/((D2*2*3.14159)^2*D3)","v":1.1686430773614742},"nH",{"$f":"B4/1000000000","v":1.1686430773614743E-9},"H"]
["Csnub",{"$f":"4*B3","v":12000},"pF",{"$f":"B5*0.000000000001","v":1.2E-8},"F"]
["Rsnub",{"$f":"SQRT(D4/D3)","v":0.62413755891936573},"Ω",{"$f":"B6","v":0.62413755891936573},"Ω"]

{"sheet":"Parallel Output Caps","index":13,"n_rows":17,"n_cols":5,"rows_kept":17,"cut":false,"hidden":true,"merged":[]}
[]
[]
[]
["Fsw",{"$f":"Fsw","v":400000}]
[]
["C1",20,"uF",{"$f":"B6/1000000","v":2.0000000000000002E-5},"F"]
["R1",0.5,"mOhms",{"$f":"B7/1000","v":5.0000000000000001E-4},"Ohms"]
[]
["C2",68,"uF",{"$f":"B9/1000000","v":6.7999999999999999E-5},"F"]
["R2",20,"mOhms",{"$f":"B10/1000","v":0.02},"Ohms"]
[]
[]
["I1 ",{"$f":"(D6/(D6+D9))*SQRT((D10*D9*B4)^2+1)/SQRT((((D7+D10)*D6*D9/(D9+D6))*B4)^2+1)","v":0.25667257397349275},"%"]
["I2 ",{"$f":"1-B13","v":0.74332742602650725},"%"]
[]
["I1 ",{"$f":"B13*(Iripple1/(2*SQRT(3)))","v":{"$error":"#NAME?"}},"A"]
["I2 ",{"$f":"B14*(Iripple1/(2*SQRT(3)))","v":{"$error":"#NAME?"}},"A"]