{"text_format":"1","workbook":"xlsx","n_sheets":15,"sheets":["Design Regulator","Input Filters","Design Input Filter","BOM & Schematic","EVM","Variable Management","Schematic Management","Stability Calculations","Bode Plot Management","Efficiency Calculations","Efficiency Plot Management","Input Filter Calculations","Standard Value Calculator","Snubber","Parallel Output Caps"],"not_rendered":{"charts":9,"images":31,"macros":1,"external_links":0,"defined_names":304,"comments":3,"pivot_tables":0},"unopened":[],"bounds":{"document_bytes":16777216,"sheet_cells":100000,"rows_first":2000,"rows_last":500,"rows_between":2000,"halvings":0,"cell_chars":16384,"cell_head_chars":4096},"cells_cut":0,"cells_raw":0,"read":"whole","date_system":"1900"}

{"sheet":"Design Regulator","index":0,"n_rows":103,"n_cols":16,"rows_kept":103,"cut":false,"hidden":false,"merged":[[69,5,69,7],[2,13,2,14],[0,0,0,15],[80,5,80,6],[34,10,35,15]]}
["                      LM25139/-Q1 Synchronous Buck Controller Design Tool"]
[null,null,null,null,null,null,null,null,null,null,null,null,null,"http://www.ti.com/product/lm5175"]
["About",null,"xx",null,null,"= Input Box",null,null,null,null,null,null,null,"TERMS OF USE",null,"                "]
[]
["Step 1: Operating Specifications"]
[null,null,null,"Input Voltage – Min, VIN(min) ",9,"V"]
[null,null,null,"Input Voltage – Nom, VIN(nom)",24,"V"]
[null,null,null,"Input Voltage – Max, VIN(max)",42,"V"]
[null,null,null,"Output Voltage, VOUT ",5,"V"]
[null,null,null,"Full Load Output Current, IOUT ",10,"A"]
[null,null,null,"Switching Frequency, FSW",2200,"kHz"]
[null,null,null,"Frequency Set Resistor, RT ",{"$f":"'Variable Management'!C443","v":10},"kΩ"]
[null,null,null,"Ambient Temperature, TA",25,"°C"]
[]
["Step 2: Current Sense Resistor"]
[null,null,null,"Required IOCP Setpoint at VIN(nom)",18,"A"]
[null,null,null,"Recommended Shunt Resistance",{"$f":"Rs_ideal*1000","v":3.1028359503790215},"mΩ"]
[null,null,null,"Shunt Resistance, RS",4,"mΩ"]
[null,null,null,"Min Inductor Sat Current, ILO(SAT)",{"$f":"'Variable Management'!B95","v":15},"A"]
[null,null,null,"Max Power Loss in Shunt",{"$f":"'Variable Management'!B105","v":0.81315636835198069},"W"]
[null,null,null,"VIN(min)",{"$f":"'Variable Management'!B97","v":14.251396053191993},"A"]
[null,null,"IOUT(typ) at OCP Inception:","VIN(nom)",{"$f":"'Variable Management'!B98","v":13.662851352914483},"A"]
[null,null,null,"VIN(max)",{"$f":"'Variable Management'!B99","v":13.510983300854292},"A"]
[]
["Step 3: Buck Inductance"]
[null,null,null,"Inductance for Ideal Slope Comp",{"$f":"Lopt*1000000","v":0.40012804097311144},"µH"]
[null,null,null,"Inductance, LO ",0.68,"µH"]
[null,null,null,"Inductor DCR ",2.2000000000000002,"mΩ"]
[null,null,null,"DIL as a % at VIN(nom)",{"$f":"'Variable Management'!B68*100","v":26.742972941710342},"%"]
[null,null,null,"Estimate Core Loss at VIN(nom)",0.2,"W"]
[]
["Step 4: Output Capacitors"]
[null,null,null,"Output Voltage Ripple Spec",50,"mVPK=PK"]
[null,null,null,"Minimum Output Capacitance",{"$f":"'Variable Management'!B121","v":3.0389741979216294},"µF"]
[null,null,null,"Output Capacitance (derated), COUT ",540,"µF",null,null,null,null,{"$f":"CHOOSE(SCH_MODE, \"\", \"** For Single-Output Operation in 2-Phase Mode, tie MODE to VDDA and use FB1 to set VOUT **\", \"** For Single-Output Operation in 3-Phase Mode, tie both MODE pins to VDDA. Use FB1 of master IC to set VOUT. Connect FB2 of master IC to AGND. Connect FB2 of slave IC to VDDA to configure it as a slave **\", \"** For Single-Output Operation in 4-Phase Mode, tie both MODE pins to VDDA. Use FB1 of master IC to set VOUT. Connect FB2 of master IC to AGND. Connect FB2 of slave IC to VDDA to configure it as a slave **\")","v":""}]
[null,null,null,"Maximum Permitted ESR",{"$f":"'Variable Management'!B125","v":18.696204165141808},"mΩ"]
[null,null,null,"Output Capacitor ESR",1,"mΩ",null,null,null,null,{"$f":"CHOOSE(SCH_MODE,  \"\", \"** Tie VCCX to GND if not used **\", \"** Slave controller (CNTRL2) not shown **\",\"** Slave controller (CNTRL2) not shown **\")","v":""},null,null,null,null,{"$f":"IF(SCH_MODE=1,  \"** Tie VCCX to GND if not used **\", \"\")","v":"** Tie VCCX to GND if not used **"}]
[null,null,null,"Resulting Output Voltage Ripple (max) ",{"$f":"'Variable Management'!B127*1000","v":2.6890601294661418},"mVPK-PK",null,null,null,null,{"$f":"IF(OR(SCH_MODE=3, SCH_MODE=4),\"** Tie VCCX to GND if not used **\", \"\")","v":""}]
[null,null,null,"Output Capacitor RMS Current (max) ",{"$f":"'Variable Management'!B114","v":0.85968419207962232},"ARMS"]
[]
["Step 5: Input Capacitors"]
[null,null,null,"Input Voltage Ripple Spec",400,"mVPK-PK"]
[null,null,null,"Minimum Input Capacitance",{"$f":"'Variable Management'!B148","v":2.8409090909090908},"µF"]
[null,null,null,"Input Capacitance (derated), CIN ",30,"µF"]
[null,null,null,"Maximum Permitted ESR",{"$f":"'Variable Management'!B155","v":31.518903802110273},"mΩ",null,null,null,null,null,null,null,null,null," "]
[null,null,null,"Input Capacitor ESR",1,"mΩ"]
[null,null,null,"Resulting Input Voltage Ripple (max)",{"$f":"'Variable Management'!B162*1000","v":49.36780457793359},"mVPK-PK"]
[null,null,null,"Input Capacitor RMS Current (max)",{"$f":"'Variable Management'!B138","v":5},"ARMS"]
[null,null,null,"AEF Filter Inductor",0.68,"µH"]
["Step 6: Precision Enable, DRSS, FPWM / PFM"]
[]
[]
[null,null,null,"Input Voltage UVLO Turn On",5,"V"]
[null,null,null,"Input Voltage UVLO Turn Off",4,"V"]
[null,null,null,"Upper Enable Resistor, RUV1",{"$f":"IF(UVLO_TYPE=1,'Variable Management'!B188,0)","v":100},"kΩ"]
[null,null,null,"Lower Enable Resistor, RUV2",{"$f":"IF(UVLO_TYPE=1,'Variable Management'!B189,\"DNP\")","v":24.900000000000002},"kΩ"]
[null,null,null,{"$f":"IF(DEMB=1, \"* Tie SYNC to VCC\", \"* Tie SYNC to GND\")","v":"* Tie SYNC to GND"}]
[]
[]
["Step 7: Compensation Design"]
[null,null,null,"Load Pole Frequency",{"$f":"Fp_dominant","v":716.0637176033531},"Hz"]
[null,null,null,"ESR Zero Frequency",{"$f":"Fesr/1000","v":294.73137643288214},"kHz"]
[null,null,null,"Desired Crossover Frequency",52,{"$f":"\"     kHz \"","v":"     kHz "}]
[null,null,null,"Error Amp Pole Frequency",{"$f":"Fp1_u","v":23.309105203291317},"Hz"]
[null,null,null,{"$f":"CHOOSE(VOUT_setting, \"Upper Feedback Resistor\",\"\",\"\",\"\")","v":""},39,"kΩ"]
[null,null,null,{"$f":"CHOOSE(VOUT_setting, \"Lower Feedback Resistor\", \"* Connect \"&'Variable Management'!D419&\" from FB to VCC\",\"* Tie FB to VCC\",\"* Connect \"&'Variable Management'!D419&\" from FB to VCC\")","v":"* Connect 24.9kΩ from FB to VCC"},{"$f":"IF(Vout=Vref,\"OPEN\",Rfb2_u/1000)","v":471},{"$f":"IF(Vout=Vref,\"\",\"kΩ\")","v":"kΩ"}]
[null,null,null,{"$f":"CHOOSE(VOUT_setting, \"Actual Output Voltage Setpoint\",\"\",\"\",\"\")","v":""},{"$f":"0.8/E66*(E65+E66)","v":0.86624203821656054},"V"]
[]
["Compensation Components"]
[null,"Calculated /","Std Values",{"$f":"C70","v":"Std Values"},null,"Actual P/Z Frequencies"]
["RC1",{"$f":"Rcea1/1000","v":40.827842302911556},{"$f":"'Standard Value Calculator'!S32","v":41.2},{"$f":"C71","v":41.2},"kΩ",{"$f":"Fp1_u","v":23.309105203291317},"Hz   (FPEA)"]
["CC1",{"$f":"Cc1ea*1000000000","v":0.749653132126336},{"$f":"'Standard Value Calculator'!S33","v":0.68},{"$f":"C72","v":0.68},"nF",{"$f":"Fz1_u/1000","v":5.6808589118273956},"kHz (FZCOMP)"]
["CC2",{"$f":"IF(Cc2ea<0, \"N/A\", Cc2ea*1000000000000)","v":"N/A"},{"$f":"'Standard Value Calculator'!S34","v":0},{"$f":"C73","v":0},"pF",{"$f":"Fp2_u/1000","v":55.163283318623115},"kHz (FPCOMP)"]
[]
[]
["Efficiency / Power Loss Analyzer"]
[]
["Step 8: Efficiency"]
[null,null,null,null,null,"Power MOSFETs","(Q1, Q2) "]
[null,null,null,null,"'852, '824"]
[null,null,null,null,"High-side","  Low-side"]
[null,null,null,"On-State Resistance, RDS(on) ",4,4,"mΩ"]
[null,null,null,"Total Gate Charge, QG ",20,20,"nC"]
[null,null,null,"Gate-Drain Charge, QGD ",4.7,4.7,"nC"]
[null,null,null,"Gate-Source Charge, QGS ",3.9,3.9,"nC"]
[null,null,null,"Output Charge, QOSS ",null,30,"nC"]
[null,null,null,"Output Capacitance, COSS ",337,337,"pF"]
[null,null,null,"Gate Resistance, RG ",1.2,1.2,"Ω"]
[null,null,null,"Transconductance, gFS ",55,55,"S"]
[null,null,null,"Gate-Source Threshold Voltage, VTH ",1.6,1.6,"V"]
[null,null,null,"Body Diode Forward Voltage, VBD ",0.8,0.8,"V"]
[null,null,null,"Body Diode Rev Recovery Charge, QRR ",null,18,"nC"]
[null,null,null,"Thermal Resistance, θJA ",50,50,"°C/W"]
[]
["External Schottky Diode (if applicable)"]
[null,null,null,"Schottky Fwd Voltage, VFWDsch ",null,0,"V"]
[null,null,null,"Schottky Rev Recovery Charge, QRRsch ",null,0,"nC"]
[]
[]
[]
["Step 9: IC Power Loss"]
[null,null,null,"IC Power Dissipation",{"$f":"'Variable Management'!B362","v":2.1120000000000001},"W"]
[null,null,null,"IC Junction Temperature (estimate)",{"$f":"'Variable Management'!B364","v":97.019200000000012},"°C"]

{"sheet":"Input Filters","index":1,"n_rows":17,"n_cols":17,"rows_kept":17,"cut":false,"hidden":true,"merged":[[0,0,0,16],[2,14,2,15]]}
["                           LM(2)5149-Q1 Synchronous Buck Controller Design Tool"]
[null,null,null,null,null,null,null,null,null,null,null,null,null,null,"http://www.ti.com/product/lm5175"]
["About",null,"xx",null,null,"= Input Box",null,null,null,null,null,null,null,null,"TERMS OF USE",null,"                "]
[]
[]
[]
[null,null,null,null,"AEF",null,null,null,null,null,null,null,"Passive"]
[]
[null,"Design tab - LAEF",{"$f":"'Design Regulator'!E49 & \" µH\"","v":"0.68 µH"},null,null,"LAEF",1,"µH",null,"Suggested LIN Inductor","0.1-10","µH",null,"Chosen LIN",0.68,"µH"]
[null,"Design tab - CINJ",{"$f":"'Design Regulator'!#REF! & \" µF\"","v":{"$error":"#REF!"}},null,null,"CINJ",1,"µF",null,"Suggested CF","0.1-10","µF",null,"Chosen CF",0.47,"µF"]
[null,"Design tab - CDAMP",{"$f":"'Design Regulator'!#REF! & \" µF\"","v":{"$error":"#REF!"}},null,null,"CDAMP",1,"µF",null,"Suggested CDAMP","1-10","µF",null,"Chosen CDAMP",1,"µF"]
[null,"Design tab - RDAMP",{"$f":"'Design Regulator'!#REF! & \" Ω\"","v":{"$error":"#REF!"}},null,null,"RDAMP",10,"Ω",null,"Suggested RDAMP",{"$f":"Rdamp_PassiveStd","v":{"$error":"#VALUE!"}},"Ω",null,"Chosen RDAMP",0.35,"Ω"]
[]
[null,null,"VIN Ripple at Fsw",null,null,{"$f":"VinRipple_dBuV","v":93.868876285168795},"dBµV","VIN Ripple",{"$f":"VinRipple_dBuV","v":93.868876285168795},"dBµV"]
[]
[null,null,null,"AEF Attenuation at Fsw",{"$f":"-'Input Filter Calculations'!AM97","v":{"$error":"#VALUE!"}},"dB",null,null,null,null,null,"Passive Attenuation at Fsw",{"$f":"-'Input Filter Calculations'!AA97","v":36.936729013371945},"dB"]
[null,null,null,"AEF EMI at Fsw",{"$f":"VinRipple_dBuV-E16","v":{"$error":"#VALUE!"}},"dB-µV",null,null,null,null,null,"Passive EMI at Fsw",{"$f":"VinRipple_dBuV-M16","v":56.93214727179685},"dB-µV"]

{"sheet":"Design Input Filter","index":2,"n_rows":14,"n_cols":17,"rows_kept":14,"cut":false,"hidden":true,"merged":[[0,0,0,16],[2,14,2,15]]}
["                           LM5149-Q1 Synchronous Buck Controller Design Tool"]
[null,null,null,null,null,null,null,null,null,null,null,null,null,null,"http://www.ti.com/product/lm5175"]
["About",null,"xx",null,null,"= Input Box",null,null,null,null,null,null,null,null,"TERMS OF USE",null,"                "]
[]
[]
[]
[null,"Choose Filter"]
[null,"Suggested Inductor",{"$f":"CHOOSE(INFILTER_TYPE,\"\",\"0.01-1\",\"0.1-10\")","v":""},"µH",null,"Chosen Inductor",1,"µH"]
[null,{"$f":"CHOOSE(INFILTER_TYPE,\"\",\"Suggested Cinj\",\"Suggested Cf\")","v":""},{"$f":"CHOOSE(INFILTER_TYPE,\"\",'Standard Value Calculator'!S24,'Standard Value Calculator'!S23)","v":""},"µF",null,{"$f":"CHOOSE(INFILTER_TYPE,\"\",\"Chosen Cinj\",\"Chosen Cf\")","v":""},6.8000000000000005E-2,"µF"]
[null,"Suggested Cdamp",{"$f":"CHOOSE(INFILTER_TYPE,\"\",CHOOSE(OSC,\"DNP\",'Standard Value Calculator'!S25),'Standard Value Calculator'!S28)","v":""},"µF",null,"Chosen Cdamp",3.3000000000000002E-2,"µF"]
[null,"Suggested Rdamp",{"$f":"CHOOSE(INFILTER_TYPE,\"\",'Standard Value Calculator'!S26,Rdamp_PassiveStd)","v":""},"Ω",null,"Chosen Rdamp",43.2,"Ω"]
[null,null,null,null,null,"Filter Attenuation",{"$f":"-'Variable Management'!B303","v":0},"dB"]
[null,null,null,null,null,"VIN Ripple",{"$f":"VinRipple_dBuV","v":93.868876285168795},"dB-µV"]
[null,null,null,null,null,"Fsw Conducted EMC",{"$f":"'Variable Management'!B304","v":93.868876285168795},"dB-µV"]

{"sheet":"BOM & Schematic","index":3,"n_rows":61,"n_cols":10,"rows_kept":61,"cut":false,"hidden":false,"merged":[[54,3,54,6],[53,3,53,6],[47,3,47,6],[55,0,56,0],[55,9,56,9],[55,3,56,6],[55,2,56,2],[55,1,56,1],[55,7,56,7],[55,8,56,8],[37,3,37,6],[52,3,52,6],[50,3,50,6],[51,3,51,6],[46,3,46,6],[49,3,49,6],[48,3,48,6],[45,3,45,6],[38,3,38,5],[39,3,39,5],[42,3,42,5],[44,3,44,5],[40,3,40,5],[43,3,43,5],[41,3,41,5]]}
[]
[]
[]
[]
[]
[]
[]
[]
[]
[]
[]
[]
[]
[]
[]
[]
[]
[]
[]
[]
[]
[]
[]
[]
[]
[]
[]
[]
[]
[]
[]
[]
[null,null,null,null,null,null,null,null,{"$f":"IF(OR(SCH_MODE=3, SCH_MODE=4),\"** Tie VCCX to GND if not used **\", \"\")","v":""}]
["   ** Tie SYNC to GND for PFM, VCC for FPWM **"]
[]
[{"$f":"\"Vin = \"&VIN_min&\"V to \"&VIN_max&\"V, Vout = \"& Vout &\"V, Iout = \" &Iout & \"A, Fsw = \" & Fsw/1000 &\"kHz, Current Limit = \"&ROUNDUP(Ilimit_DC,0)&\"A\"","v":"Vin = 9V to 42V, Vout = 5V, Iout = 10A, Fsw = 2200kHz, Current Limit = 18A"}]
["High-Efficiency Synchronous Buck Regulator BOM"]
["Count","Ref Des","Value","Description",null,null,null,"Size","Part Number","MFR"]
[1,"CBOOT",0.1,{"$f":"C39","v":0.1},null,null,null,"0603","Std","Std"]
[1,"CCOMP",{"$f":"'Design Regulator'!D72","v":0.68},0.68,null,null,null,"0603","Std","Std"]
[1,"CHF",{"$f":"'Design Regulator'!D73","v":0},0,null,null,null,"0603","Std","Std"]
[{"$f":"ROUNDUP('Design Regulator'!E44/10,0)","v":3},"CIN",10,{"$f":"C42","v":10},null,null,null,1210,"Std","Std"]
[{"$f":"ROUNDUP('Design Regulator'!E35/47,0)","v":12},"COUT",47,{"$f":"C43","v":47},null,null,null,1210,"Std","Std"]
[2,"CVCC, CVCCX",2.2000000000000002,2.2000000000000002,null,null,null,"0603","Std","Std"]
[1,"CVDDA",0.47,0.47,null,null,null,"0603","Std","Std"]
[1,"LO",{"$f":"'Design Regulator'!E27","v":0.68},{"$f":"\"Inductor, \"&Lf*1000000&\"µH, \"&Rdcr*1000&\"mΩ, >\"&ROUNDUP(Ilimit_DC*1.1,0)&\"A\"","v":"Inductor, 0.68µH, 2.2mΩ, >20A"},null,null,null,"-","-","Various"]
[2,"Q1, Q2","See description",{"$f":"'Design Regulator'!E82","v":4},null,null,null,"Std",{"$f":"'Design Regulator'!E80","v":"'852, '824"},"-"]
[1,"RCOMP",{"$f":"'Design Regulator'!D71","v":41.2},{"$f":"C48","v":41.2},null,null,null,"0603","Std","Std"]
[1,"RS",{"$f":"Rs*1000","v":4},4,null,null,null,"0508","Std","Std"]
[1,"RT",{"$f":"'Design Regulator'!E12","v":10},10,null,null,null,"0603","Std","Std"]
[1,"RFB1",{"$f":"'Design Regulator'!E65","v":39},{"$f":"C51","v":39},null,null,null,"0603","Std","Std"]
[1,"RFB2",{"$f":"'Design Regulator'!E66","v":471},{"$f":"C52","v":471},null,null,null,"0603","Std","Std"]
[1,"RPG",100,100,null,null,null,"0603","Std","Std"]
[1,"RCS",100,100,null,null,null,"0603","Std","Std"]
[1,"RVIN",2.2000000000000002,2.2000000000000002,null,null,null,"0603","Std","Std"]
[1,"U1",{"$f":"'Variable Management'!P29","v":"LM25139-Q1"},{"$f":"CHOOSE(VARIANT, \"IC, LM25139, Synchronous Buck PWM Controller, 3.5V–42V Input\",  \"IC, LM25139-Q1, Synchronous Buck PWM Controller, 3.5V–42V Input\")","v":"IC, LM25139-Q1, Synchronous Buck PWM Controller, 3.5V–42V Input"},null,null,null,"VQFN-24",{"$f":"CHOOSE(VARIANT, \"LM25139RGTR\", \"LM25139QRGTRQ1\")","v":"LM25139QRGTRQ1"},"TI"]
[]
[]
["NOTES:"]
["** Inductor saturation current should be higher than the peak inductor current at the OCP setpoint for all input voltages and operating temperatures **"]
["** Effective input and output capacitances should be appropriately derated for applied voltage and temperature, particularly with ceramics **"]

{"sheet":"EVM","index":4,"n_rows":6,"n_cols":2,"rows_kept":6,"cut":false,"hidden":true,"merged":[[0,0,0,16]]}
[" LM25139-Q1 Quickstart Design Tool"]
[]
[]
[]
[]
[null,"LM25139-Q1EVM-440 PCB Layout"]

{"sheet":"Variable Management","index":5,"n_rows":452,"n_cols":27,"rows_kept":452,"cut":false,"hidden":true,"merged":[[4,4,4,7],[0,0,0,8]]}
["EXCEL Variables Names/Calculations"]
[null,"Input from user ="]
[null,"Output ="]
[null,"Constant"]
["Variable Name","Value","STD Units",null,"Notes",null,null,null,"Iteration"]
["Step 1: Operational Specs"]
["VIN_min",{"$f":"'Design Regulator'!E6","v":9},"V","Minimum input voltage",null,null,null,null,1]
["VIN_nom",{"$f":"'Design Regulator'!E7","v":24},"V","Nominal input voltage",null,null,null,null,null,null,{"$f":"CHOOSE(SCH_MODE, \"Efficiency vs. IOUT (Ch1)\", \"Efficiency vs. IOUT - 2 Ph\", \"Efficiency vs. IOUT - 3 Ph\", \"Efficiency vs. IOUT - 4 Ph\")","v":"Efficiency vs. IOUT (Ch1)"},1,null,"DRSS Enabled",1,null,null,null,null,"Dual  Outputs",1,null,"FPWM",1,null,{"$f":"CHOOSE(SCH_MODE, \"Bode Plot (Ch1)\", \"Bode Plot - 2 Ph\", \"Bode Plot - 3 Ph\", \"Bode Plot - 4 Ph\")","v":"Bode Plot (Ch1)"},1]
["VIN_max",{"$f":"'Design Regulator'!E8","v":42},"V","Maximum input voltage",null,null,null,null,null,null,{"$f":"IF(MODE=1, \"Efficiency vs. IOUT (Ch2)\", \"N/A - Do Not Use\")","v":"Efficiency vs. IOUT (Ch2)"},2,null,"DRSS Disabled",2,null,null,null,null,"Single Output – 2  Phases",2,null,"PFM",2,null,{"$f":"IF(MODE=1, \"AEF Gain\", \"N/A - Do Not Use\")","v":"AEF Gain"},2]
[null,null,null,null,null,null,null,null,null,null,"PLOT_TYPE",1,null,"DRSS Yes/No",1,"1 = Yes, 2 = No",null,null,null,"Single Output – 3  Phases",3,null,"FPWM/PFM",2,null,"BODE_PLOT_TYPE",1]
["Vout",{"$f":"'Design Regulator'!E9","v":5},"V","Output voltage - channel 1",null,null,null,null,null,null,null,null,null,null,null,null,null,null,null,"Single Output – 4  Phases",4]
["Iout",{"$f":"'Design Regulator'!E10","v":10},"A","Output current - channel 1",null,null,null,null,1,null,null,null,null,null,null,null,null,null,null,"Single/Dual Yes/No",1]
[null,null,null,null,null,null,null,null,1,null,"Adjustable",1,null,"3.3V",1,null,null,null,null,"MODE (Single/Dual), DUAL = 1, SINGLE = 2",{"$f":"IF(U12=1, 1, 2)","v":1},null,"VCCX Connected",1]
["Rout",{"$f":"Vout/Iout","v":0.5},"W","Load resistance - Channel 1",null,null,null,null,null,null,"5V",2,null,"5V",2,null,null,null,null,"SINGLE OUTPUT (1 = YES)",{"$f":"IF(U12=1, 2, 1)","v":2},null,"No External VCC",2]
[null,null,null,null,null,null,null,null,null,null,"3.3V",3,null,"Adjustable",3,null,null,null,null,"Number of Phases",{"$f":"SCH_MODE","v":1},null,"Ext_VCC",2]
["Pout",{"$f":"Vout*Iout","v":50},"W","Output power",null,null,null,null,null,null,"12V",4,null,"Output Setting",{"$f":"IF(Vout2=3.3, 1, IF(Vout2=5, 2, 3))","v":3}]
[null,null,null,null,null,null,null,null,null,null,"Output Voltage Setting",{"$f":"IF(Vout=3.3, 3, IF(Vout=5, 2,  IF(Vout=12,1,1)))","v":2}]
["Efficiency",0.9,null,"Estimate of efficiency"]
["Pin",{"$f":"Pout/Efficiency","v":55.555555555555557},"W","Calculate input power assuming finite efficiency",null,null,null,null,null,null,null,null,null,null,null,null,null,null,null,null,null,null,null,null,null,"Internal Compensation",1]
[null,null,null,null,null,null,null,null,null,null,null,null,null,null,null,null,null,null,null,null,null,null,null,null,null,"External Compensation",2]
["Iin_Vinmin",{"$f":"Pin/VIN_min","v":6.1728395061728394},"A",null,null,null,null,null,null,null,null,{"$f":"Vout","v":5},null,null,null,null,null,null,null,null,null,null,null,null,null,"COMP_TYPE",2]
["Iin_Vinnom",{"$f":"Pin/VIN_nom","v":2.3148148148148149},"A","Input currents at min, nom, max Vin",null,null,null,{"$f":"AND(OSC=1, OR(Fsw/1000>2530, Fsw/1000<1800))","v":false}]
["Iin_Vinmax",{"$f":"Pin/VIN_max","v":1.3227513227513228},"A",null,null,null,null,{"$f":"AND(OSC=2, OR(Fsw/1000>500, Fsw/1000<300))","v":false}]
[null,null,null,null,null,null,null,{"$f":"OR(H22,H23)","v":false}]
["OSC setting",{"$f":"CHOOSE(OSC, 2200, 440)","v":{"$error":"#VALUE!"}},"kHz",null,null,null,null,null,null,null,"SetVout_IntComp_nAEF",1,null,null,null,null,null,null,null,null,null,null,"No Input Filter",1,null,"UVLO Divider",1]
["Fsw",{"$f":"'Design Regulator'!E11*1000","v":2200000},"Hz","Nominal switching frequency - determines RT resistor (SYNCIN must be 80-120% of this)",null,null,null,null,null,null,"SetVout_IntComp_AEF",2,null,null,null,null,null,null,null,null,null,null,"AEF Input Filter",2,null,"No UVLO Divider",2]
["RT resistor to AGND",{"$f":"(23759/(Fsw*10^-3))-0.72","v":10.079545454545453},"kΩ",null,null,null,null,null,null,null,"SetVout_ExtComp_nAEF",3,null,null,null,"LM25139",1,null,null,null,null,null,"Passive LC Filter",3,null,"UVLO_TYPE",1]
[null,null,"kΩ",null,null,null,null,null,1,null,"SetVout_ExtComp_AEF",4,null,null,null,"LM25139-Q1",2,null,null,null,null,null,"INFILTER_TYPE",1]
["Tsw",{"$f":"1/Fsw","v":4.5454545454545452E-7},"sec","Switching period",null,null,null,null,null,null,"AdjVout_IntComp_nAEF",5,null,null,"VARIANT",{"$f":"CHOOSE(VARIANT, \"LM25139\", \"LM25139-Q1\")","v":"LM25139-Q1"},2]
["Vref",0.8,"V","Reference voltage",null,null,null,null,null,null,"AdjVout_IntComp_AEF",6,null,null,"VIN-MAX",{"$f":"CHOOSE(VARIANT, 42, 42)","v":42},"V"]
["Rt",{"$f":"'Standard Value Calculator'!S12/1000","v":10},"kΩ","Frequency set resistor",null,{"$f":"IF(OR((Fsw=440000),(Fsw=2200000)),\"N/A\",Rfadj/1000)","v":"N/A"},null,null,null,null,"AdjVout_ExtComp_nAEF",7,null,null,"VOUT-MAX",{"$f":"CHOOSE(VARIANT, 36, 36)","v":36},"V"]
[null,null,null,null,null,null,null,null,null,null,"AdjVout_ExtComp_AEF",8]
["Step 2: Buck Inductor","Channel 1",null,null,null,null,null,null,null,null,"Schematic setting",{"$f":"(IF(OR(Vout=3.3,Vout=5),CHOOSE(COMP_TYPE,IF(INFILTER_TYPE=1,1,2),IF(INFILTER_TYPE=1,3,4)),CHOOSE(COMP_TYPE,IF(INFILTER_TYPE=1,5,6),IF(INFILTER_TYPE=1,7,8))))","v":3}]
["Don1",{"$f":"Vout/VIN_nom","v":0.20833333333333334},null,null,null,"Ideal Duty Cycle at VIN(nom)"]
["Doff1",{"$f":"1-34:34","v":0.79166666666666663},null,null,null,"Ideal 1- Duty Cycle at VIN(nom)"]
[]
["D_Vinmin",{"$f":"Vout/VIN_min","v":0.55555555555555558}]
["D_Vinnom",{"$f":"Vout/VIN_nom","v":0.20833333333333334}]
["D_Vinmax",{"$f":"Vout/VIN_max","v":0.11904761904761904}]
[]
["L_Vinnom",{"$f":"(VIN_nom-Vout)*D1_Vinnom/(Fsw*(Iout/Number_of_Phases)*0.3)","v":5.9974747474747481E-7},"H",null,null,"Calculated inductance for 35% ripple at VIN(nom)"]
["L_slopecomp",{"$f":"1000*Vout*Rs/22.72/Fsw","v":4.0012804097311143E-7},"H",null,null,"Calculated inductance based on one times inductor downslope"]
[]
["Lopt",{"$f":"B42","v":4.0012804097311143E-7},"H",null,null,"Slope comp"]
[]
["Lo",{"$f":"'Design Regulator'!E27/1000000","v":6.8000000000000005E-7},"H",null,null,"Chosen inductance"]
["Rdcr",{"$f":"'Design Regulator'!E28/1000","v":2.2000000000000001E-3},"W",null,null,"Chosen inductor DCR"]
[]
["Don2",{"$f":"(Vout+Iout*(Rdcr+Rs))/(Vin+Iout*Rs)","v":0.21056572379367722}]
["Doff2",{"$f":"1-_Don2","v":0.78943427620632278}]
[]
["D_Vinmin_2",{"$f":"CHOOSE(MODE, (Vout+Iout*(Rdcr+Rs))/(VIN_min+Iout*Rs), (Vout+Iout/Number_of_Phases*(Rdcr+Rs))/(VIN_min+Iout/Number_of_Phases*Rs))","v":0.55995575221238947},null,null,null,"Duty cycles adjusted for DCR/shunt voltage drops"]
["D_Vinnom_2",{"$f":"CHOOSE(MODE, (Vout+Iout*(Rdcr+Rs))/(VIN_nom+Iout*Rs), (Vout+Iout/Number_of_Phases*(Rdcr+Rs))/(VIN_nom+Iout/Number_of_Phases*Rs))","v":0.21056572379367722},null,null,null,"need to include RDS(on) later"]
["D_Vinmax_2",{"$f":"CHOOSE(MODE, (Vout+Iout*(Rdcr+Rs))/(VIN_max+Iout*Rs), (Vout+Iout/Number_of_Phases*(Rdcr+Rs))/(VIN_max+Iout/Number_of_Phases*Rs))","v":0.12040913415794482}]
[]
["Iripple_Vinmin",{"$f":"(VIN_min-Vout)*D1_Vinmin_2/(Fsw*Lf)","v":1.4972078936160145},"A"]
["Iripple_Vinnom",{"$f":"(VIN_nom-Vout)*D1_Vinnom_2/(Fsw*Lf)","v":2.6742972941710339},"A"]
["Iripple_Vinmax",{"$f":"(VIN_max-Vout)*D1_Vinmax_2/(Fsw*Lf)","v":2.9780333982914153},"A"]
[]
["Ishunt_rms_Vinmin",{"$f":"SQRT((Iout/Number_of_Phases)^2+(Iripple_Vinmin^2)/12)","v":10.009335773319767},"A"]
["Ishunt_rms_Vinnom",{"$f":"SQRT((Iout/Number_of_Phases)^2+(Iripple_Vinnom^2)/12)","v":10.029755173223366},"A"]
["Ishunt_rms_Vinmax",{"$f":"SQRT((Iout/Number_of_Phases)^2+(Iripple_Vinmax^2)/12)","v":10.036884821004554},"A"]
["Max shunt power loss at full load",{"$f":"B61^2*Rs","v":0.40238395533920351},"W",null,null,"Note this is power loss at full load - not loss near OCP!"]
[]
["Max inductor ripple current",{"$f":"MAX(B56:B58)","v":2.9780333982914153},"A",null,null,"Ripple current at Vin(max)"]
[]
[null,{"$f":"B56/(Iout/Number_of_Phases)","v":0.14972078936160144}]
["% ripple current",{"$f":"B57/(Iout/Number_of_Phases)","v":0.26742972941710341}]
[null,{"$f":"B58/(Iout/Number_of_Phases)","v":0.29780333982914153}]
[]
["Inductor copper temerature",100,"°C"]
["DCR at hot",{"$f":"Rdcr*(1+0.0039*(B71-25))","v":2.8435000000000001E-3},"W"]
["Core loss",{"$f":"'Design Regulator'!E30","v":0.2},"W"]
[]
["Step 3: Sense Resistors, Slope Comp, Current Limit"]
[]
["Ilimit_DC",{"$f":"'Design Regulator'!E16","v":18},"A",null,null,"Chosen OCP level - based on output current"]
[]
["Ilimit_inductor_Vinmin",{"$f":"CHOOSE(MODE, Ilimit_DC+Iripple_Vinmin/2, Ilimit_DC/Number_of_Phases+Iripple_Vinmin/2)","v":18.748603946808007},"A",null,null,"Peak inductor current at current limit inception"]
["Ilimit_inductor_Vinnom",{"$f":"CHOOSE(MODE, Ilimit_DC+Iripple_Vinnom/2, Ilimit_DC/Number_of_Phases+Iripple_Vinnom/2)","v":19.337148647085517},"A"]
["Ilimit_inductor_Vinmax",{"$f":"CHOOSE(MODE, Ilimit_DC+Iripple_Vinmax/2, Ilimit_DC/Number_of_Phases+Iripple_Vinmax/2)","v":19.489016699145708},"A"]
[]
[]
["CS threshold_min",5.1999999999999998E-2,"V"]
["CS threshold",0.06,"V"]
["CS threshold_max",6.8000000000000005E-2,"V"]
[]
["Shunt required to get OCP at VIN(min)",{"$f":"Buck_CS_threshold/B79","v":3.2002382774859958E-3},"W"]
["Shunt required to get OCP at VIN(nom)",{"$f":"Buck_CS_threshold/B80","v":3.1028359503790215E-3},"W"]
["Shunt required to get OCP at VIN(max)",{"$f":"Buck_CS_threshold/B81","v":3.0786571188391497E-3},"W"]
[]
["Rs_ideal",{"$f":"B89","v":3.1028359503790215E-3},"W",null,null,"Ideal Rs for the required OCP -- based on 60mV CL threshold"]
["Rs",{"$f":"'Design Regulator'!E18/1000","v":4.0000000000000001E-3},"W",null,null,"Selected (starndard value) current limit sense resistor"]
[]
["Current limit - peak",{"$f":"Buck_CS_threshold/Rs","v":15},"A",null,null,"Peak inductor current limit = min sat current"]
[]
["Iout_OCP_Vinmin",{"$f":"Number_of_Phases*(Buck_CS_threshold/Rs-Iripple_Vinmin/2)","v":14.251396053191993},"A",null,null,"Current limit setpoints (i.e. IOUT) after standard components are selected"]
["Iout_OCP_Vinnom",{"$f":"Number_of_Phases*(Buck_CS_threshold/Rs-Iripple_Vinnom/2)","v":13.662851352914483},"A"]
["Iout_OCP_Vinmax",{"$f":"Number_of_Phases*(Buck_CS_threshold/Rs-Iripple_Vinmax/2)","v":13.510983300854292},"A"]
[]
["Irms_OCP_Vinmin",{"$f":"SQRT((Iout_OCP_Vinmin/Number_of_Phases)^2+(Iripple_Vinmin^2)/12)","v":14.257948382849307},"A"]
["Irms_OCP_Vinnom",{"$f":"SQRT((Iout_OCP_Vinnom/Number_of_Phases)^2+(Iripple_Vinnom^2)/12)","v":13.684644530518066},"A"]
["Irms_OCP_Vinmax",{"$f":"SQRT((Iout_OCP_Vinmax/Number_of_Phases)^2+(Iripple_Vinmax^2)/12)","v":13.538305900890078},"A"]
[]
["Pshunt_Vinmin",{"$f":"B101^2*Rs","v":0.81315636835198069},"W",null,null,"Max power dissipations in shunt"]
["Pshunt_Vinnom",{"$f":"B102^2*Rs","v":0.74907798370655199},"W"]
["Pshunt_Vinmax",{"$f":"B103^2*Rs","v":0.73314290666430049},"W"]
[]
[]
["Step 4: Output Capacitor"]
["Icoutrms_VINmin",{"$f":"Iripple_Vinmin/SQRT(12)","v":0.43220669020601932},"A",null,null,"Output Cap RMS current"]
["Icoutrms_VINnom",{"$f":"Iripple_Vinnom/SQRT(12)","v":0.77200313134136711},"A"]
["Icoutrms_VINmax",{"$f":"Iripple_Vinmax/SQRT(12)","v":0.85968419207962232},"A"]
["Max Cout rms current",{"$f":"MAX(B111:B113)","v":0.85968419207962232},"A"]
[]
["Vripple1",{"$f":"'Design Regulator'!E33/1000","v":0.05},"V",null,null,"Output voltage ripple spec(pk-pk)"]
[]
["Output Ripple Spec (pk-pk)",{"$f":"Vo1_ripple*1000","v":50},"mV",null,null,"Vout ripple spec at Vin(nom)"]
[]
["Coutmin",{"$f":"Iripple_Vinnom/(Fsw*8*Vo1_ripple)","v":3.0389741979216294E-6},"F",null,null,"Minimum output capacitnace",null,{"$f":"Vo2_ripple","v":0},1]
["Reported Coutmin",{"$f":"IF(Cout_min*1000000<2, 2.2,Cout_min*1000000)","v":3.0389741979216294},"uF"]
["Cout",{"$f":"'Design Regulator'!E35/1000000","v":5.4000000000000001E-4},"F",null,null,"Chosen output capacitance",null,null,1]
["Resrmax",{"$f":"SQRT((Vo1_ripple/Iripple_Vinnom)^2-(1/(Fsw*Cout*8))^2)","v":1.8696204165141807E-2},"W",null,null,"Max ESR before ripple exceeds Vripple1",null,null,1]
[]
["Reported Cout ESR max",{"$f":"IF(OR(CoutEsrMax>0.3, CoutEsrMax<0, (ISERROR(CoutEsrMax))), \"N/A\", CoutEsrMax*1000)","v":18.696204165141808},"mΩ"]
["CoutEsr",{"$f":"'Design Regulator'!E37/1000","v":1E-3},"W",null,null,"Chosen ESR",null,null,1,null,{"$f":"ISERROR(CoutEsrMax)","v":false},{"$f":"ISERROR(B125)","v":false}]
["Vripple",{"$f":"Iripple_Vinnom*SQRT(Cout_ESR^2+(1/(8*Fsw*Cout))^2)","v":2.6890601294661419E-3},"Vp-p",null,null,null,null,null,null,null,null,{"$f":"OR(CoutEsrMax>0.3,CoutEsrMax<0)","v":false}]
[null,null,null,null,null,null,null,null,null,null,{"$f":"OR(TRUE, FALSE, TRUE)","v":true}]
["Step 5: Input Capacitor"]
[null,null,null,null,null,null,null,null,null,null,"Two channels operating at full load"]
["Icinrms_VINmin",{"$f":"SQRT(D1_Vinmin_2*(Iout^2*(1-D1_Vinmin_2)+Iripple_Vinmin^2/12))","v":4.9744479071525936},"A",{"$f":"D1_Vinmax","v":0.11904761904761904},null,"Calculate input cap rms current with one output unloaded",null,null,null,null,{"$f":"SQRT(Iout^2*D1_Vinmin*(1-D1_Vinmin)+Iout2^2*D2_Vinmin*(1-D2_Vinmin)-2*Iout*Iout2*D1_Vinmin*D2_Vinmin)","v":{"$error":"#NAME?"}},"A",{"$f":"SQRT(Iout^2*D1_Vinmin*(1-D1_Vinmin)+Iout2^2*D2_Vinmin*(1-D2_Vinmin)-2*Iout*Iout2*(0.5-D2_Vinmin*(1-D1_Vinmin)))","v":{"$error":"#NAME?"}},"A"]
["Icinrms_VINnom",{"$f":"SQRT(D1_Vinnom_2*(Iout^2*(1-D1_Vinnom_2)+Iripple_Vinnom^2/12))","v":4.0924656133026946},"A",{"$f":"D1_Vinmin","v":0.55555555555555558},null,null,null,null,null,null,{"$f":"SQRT(Iout^2*D1_Vinnom*(1-D1_Vinnom)+Iout2^2*D2_Vinnom*(1-D2_Vinnom)-2*Iout*Iout2*D1_Vinnom*D2_Vinnom)","v":{"$error":"#NAME?"}},"A"]
["Icinrms_VINmax",{"$f":"SQRT(D1_Vinmax_2*(Iout^2*(1-D1_Vinmax_2)+Iripple_Vinmax^2/12))","v":3.2680371264059818},"A",null,null,null,null,null,null,null,{"$f":"SQRT(Iout^2*D1_Vinmax*(1-D1_Vinmax)+Iout2^2*D2_Vinmax*(1-D2_Vinmax)-2*Iout*Iout2*D1_Vinmax*D2_Vinmax)","v":{"$error":"#NAME?"}},"A"]
["Icinrms - multiphase",{"$f":"Iout*SQRT((D1_Vinmin-F136/Number_of_Phases)*((F136+1)/Number_of_Phases-D1_Vinmin))","v":4.9690399499995328},"A",null,null,null,null,null,null,null,{"$f":"MAX(K131:K133)","v":{"$error":"#NAME?"}},"A"]
["Max Cin rms current",{"$f":"MAX(B131:B133)","v":4.9744479071525936},"A",null,null,{"$f":"Number_of_Phases*D1_Vinnom","v":0.20833333333333334},"N*D"]
[null,null,null,null,null,{"$f":"FLOOR(Number_of_Phases*D1_Vinnom,1)","v":0},"floor(N*D)"]
["Icinrms - multiphase - max",{"$f":"Iout/2/Number_of_Phases","v":5},"A"]
["Final result",{"$f":"IF(D1_Vinmin<0.5, B135, B137)","v":5},"A","…report this"]
[]
["Vinripple1",{"$f":"'Design Regulator'!E42/1000","v":0.4},"Vp-p",null,null,"Input voltage ripple spec (pk-pk)"]
[]
["Cinmin_Vinmin",{"$f":"Iout/Number_of_Phases*D1_Vinmin*(1-D1_Vinmin)/(Vinripple1*Fsw)","v":2.8058361391694725E-6},"F"]
["Cinmin_Vinnom",{"$f":"Iout/Number_of_Phases*D1_Vinnom*(1-D1_Vinnom)/(Vinripple1*Fsw)","v":1.8742108585858586E-6},"F"]
["Cinmin_Vinmax",{"$f":"Iout/Number_of_Phases*D1_Vinmax*(1-D1_Vinmax)/(Vinripple1*Fsw)","v":1.1917645846217275E-6},"F",null,null,"Calculate cap at Vinmax and 50% duty cycle (Vin = 2*Vout)"]
[]
["Cinmin_50%D",{"$f":"Iout*0.5*(1-0.5)/(Vinripple1*Fsw)","v":2.8409090909090907E-6},"F",null,null,"Buck 50% typically worst case"]
["Cinmin",{"$f":"IF(VIN_min>2*Vout, B142,B146)","v":2.8409090909090907E-6},"F",{"$f":"(VIN_min+VIN_max)/2","v":25.5}]
["Reported Cinmin",{"$f":"IF(Cinmin*1000000<2.2, 2.2,Cinmin*1000000)","v":2.8409090909090908},"uF",{"$f":"2*Vout","v":10},null,"…report this"]
[]
["Cin",{"$f":"'Design Regulator'!E44/1000000","v":3.0000000000000001E-5},"F",null,null,"Input capacitance"]
["CinEsrMax_Vinmin",{"$f":"-(Iout/Number_of_Phases*D1_Vinmin*(1-D1_Vinmin)/(Cin*Fsw)-Vinripple1)/(Iout/Number_of_Phases+Iripple_Vinmin/2)","v":3.3733576311128083E-2},"W"]
["CinEsrMax_Vinmax",{"$f":"-(Iout/Number_of_Phases*D1_Vinmax*(1-D1_Vinmax)/(Cin*Fsw)-Vinripple1)/(Iout/Number_of_Phases+Iripple_Vinmax/2)","v":3.3432783291797143E-2},"W"]
["CinEsrMax_50%D",{"$f":"-(Iout/Number_of_Phases*0.5*(1-0.5)/(Cin*Fsw)-Vinripple1)/(Iout/Number_of_Phases+Iripple_Vinmax/2)","v":3.1518903802110275E-2},"W",null,null,"Calculate ESR at Vinmax and 50% duty cycle (Vin = 2*Vout)"]
["CinEsrMax",{"$f":"IF(VIN_min>2*Vout, B151,B153)","v":3.1518903802110275E-2},"W"]
["Reported Cin ESR max",{"$f":"IF(OR(CinEsrMax>0.3, CinEsrMax<0), \"N/A\",CinEsrMax*1000)","v":31.518903802110273},"mΩ",null,null,"…report this"]
["RCinEsr",{"$f":"'Design Regulator'!E46/1000","v":1E-3},"W",null,null,"Input capacitance series resistance (ESR)"]
[]
["Vinripple2_Vinmin",{"$f":"Iout/Number_of_Phases*D1_Vinmin_2*(1-D1_Vinmin_2)/(Cin*Fsw)+(Iout/Number_of_Phases +Iripple_Vinmin/2)*RCinEsr","v":4.8082741488724157E-2},"Vp-p"]
["Vinripple2_Vinnom",{"$f":"Iout/Number_of_Phases*D1_Vinnom_2*(1-D1_Vinnom_2)/(Cin*Fsw)+(Iout/Number_of_Phases +Iripple_Vinnom/2)*RCinEsr","v":3.6523178913285832E-2},"Vp-p"]
["Vinripple2_Vinmax",{"$f":"Iout/Number_of_Phases*D1_Vinmax_2*(1-D1_Vinmax_2)/(Cin*Fsw)+(Iout/Number_of_Phases +Iripple_Vinmax/2)*RCinEsr","v":2.753610375509705E-2},"Vp-p"]
["Vinripple2_50%D",{"$f":"Iout/Number_of_Phases*0.5*(1-0.5)/(Cin*Fsw)+(Iout/Number_of_Phases +Iripple_Vinmax/2)*RCinEsr","v":4.9367804577933591E-2},"Vp-p",null,null,"Calculate ripple at Vinmax and 50% duty cycle (Vin = 2*Vout)"]
["Vinripple2",{"$f":"IF(D1_Vinmin<0.5, B158,B161)","v":4.9367804577933591E-2},"Vp-p",null,null,"…report highest of these"]
[]
[null,{"$f":"Iout*D1_Vinmin_2*(1-D1_Vinmin_2)/(Cin*Fsw)","v":3.7334137541916147E-2},"Vp-p"]
[]
["Step 6a: Soft Start"]
["Tss",{"$f":"'Design Regulator'!E51/1000","v":0},"s","Soft-start time"]
["Iss",{"$f":"Cout*Vout/Tss","v":{"$error":"#DIV/0!"}},"A","Load cap current during soft start"]
["Css",{"$f":"0.000022*Tss/1.2","v":0},"F"]
["Css_u",{"$f":"'Standard Value Calculator'!B4","v":0},"F"]
[]
["Step 6b: Other Components - Dither, Hiccup, DEMB, MODE"]
["Tres",{"$f":"'Design Regulator'!E54/1000","v":4.0000000000000001E-3},"s","Hiccup time"]
["Cres",{"$f":"0.00002*Tres/1.2","v":6.6666666666666668E-8},"F"]
["Cres_u",{"$f":"'Standard Value Calculator'!G4","v":6.8E-8},"F"]
[]
["RPG1/2",100,"kΩ"]
["RFB1/2",null,"W",null,"Tie to VDDA or AGND for 3.3V/5V output, respectively. "]
["R_MODE",null,"W",null,"Tie to VDDA or AGND for Single/Dual operation, respectively. "]
["R_DEMB",null,"W",null,"Tie to VDDA or AGND for FPWM/DEM, respectively. "]
[]
["Enable Hysteresis Current",1.0000000000000001E-5,"A",null,"10 µA Hysteresis Current"]
["Turn ON Voltage",{"$f":"'Design Regulator'!E53","v":5}]
["Hysteresis Voltage",{"$f":"'Design Regulator'!E53-'Design Regulator'!E54","v":1}]
[]
["Upper FB resistor",{"$f":"B184/B182","v":99999.999999999985},"W"]
["Lower FB resister",{"$f":"B186/(B183-1)","v":24999.999999999996},"W"]
["Standard upper FB resistor",{"$f":"'Standard Value Calculator'!S40","v":100},"kΩ"]
["Standard lower FB resistor",{"$f":"'Standard Value Calculator'!S41","v":24.900000000000002},"kΩ"]
[]
["Dither Modulation Frequency",{"$f":"'Design Regulator'!E57*1000","v":0},"Hz"]
["Cdither_calculated",{"$f":"10*10^-6/Fdither/0.12","v":{"$error":"#DIV/0!"}},"F"]
["Cdither_stdvalue",{"$f":"'Standard Value Calculator'!S21","v":{"$error":"#DIV/0!"}},"F"]
[]
[]
["Step 7: Compensation"]
["Pi",3.1415926500000002,null,"p"]
["CS Amp Gain",10]
["Ri",{"$f":"Rs*CSAmp_gain","v":0.04},"W",null,null,"Current Sense effective resistance = shunt resistor Rs * CS amp gain"]
["gm",1.1000000000000001E-3,"S",null,null,"Error Amp Transconductance"]
[]
["Se_ext",{"$f":"B206/Ri*1000","v":12500000},"A/s",null,null,"Slope Comp Slope - referred to inductor current"]
["Sn",{"$f":"(Vin-Vout)/Lf","v":27941176.470588233},"A/s",null,null,"On-time Slope"]
["Sf",{"$f":"Vout/Lf","v":7352941.176470588},"A/s",null,null,"Off-time Slope"]
[]
["Se_int",{"$f":"Fsw*0.001*(5/22)","v":500},"mV/μs",null,null,"Slope Comp Slope - referred to IC"]
["Sn_int",{"$f":"Sn*Ri/1000","v":1117.6470588235295},"mV/μs",null,null,"etc"]
["Sf_int",{"$f":"Sf*Ri/1000","v":294.11764705882354},"mV/μs",null,null,"etc"]
[]
["mc_buck",{"$f":"1+Se_ext/Sn","v":1.4473684210526316},null,null,null,"mc = 1 + Se/Sn for peak current-mode buck"]
["k_buck",{"$f":"mc_buck*(1-D1_Vinnom_2)","v":1.1426022418775725},null,null,null,"mc*(1-d)"]
[]
["mc",{"$f":"1+Se_ext/Sn","v":1.4473684210526316}]
["k",{"$f":"mc_buck*(1-D1_Vinnom_2)","v":1.1426022418775725}]
["Q",{"$f":"1/Pi/(k-0.5)","v":0.49534512300714412},null,null,null,"1/(Pi*(k-0.5))",null,"Q = 2/Pi = 0.636 gives ideal one-cycle damping"]
[]
["Error Amp (EA)"]
["GBW",2.5,"MHz",null,null,"EA gain-bandwidth product"]
["Cbw",{"$f":"gm/(2*Pi*GBW*1000000)","v":7.0028175040452818E-11},"F",null,null,"EA effective bandwidth limiting capacitance = gm/(2*Pi*GBW)"]
["RoEA",10000000,"W",null,null,"EA output resistance"]
["AEA",{"$f":"gm*RoEA","v":11000},"V/V",null,null,"EA DC gain = gm*RoEA"]
["Afb",{"$f":"IF(VOUT_setting=1,Vref/Vout,SQRT((1+(Fcross*zterm1)^2)/((1+Afbr-pterm4*(Fcross)^2)^2+(Fcross*pterm3)^2)))","v":0.15714039802456359},"V/V",null,null,"Feedback gain from Vout to FB"]
["Acs",{"$f":"1/Ri","v":25},null,null,null,"Acs = 1/Ri"]
["Am_buck",{"$f":"(Ro/Number_of_Phases)/Ri/((1+Ro/Number_of_Phases*(k-0.5)/(Fsw*Lf)))","v":10.289984298441365}]
["Am",{"$f":"(Ro*Number_of_Phases)/Ri/((1+Ro*Number_of_Phases*(k-0.5)/(Fsw*Lf)))","v":10.289984298441365},null,null,null,"Buck modulator gain"]
[]
["Scaling factor to calculate Rcomp - buck",{"$f":"2*Pi*Ri/gm","v":228.47946545454548},null,null,null,"2*Pi*Ri/gm -- scaling factor to calculate Rcomp given desired buck crossover frequency"]
["DC Gain is Adc = AEA*Afb*Am"]
[]
["Ro",{"$f":"Rout","v":0.5},"W",null,null,"Output Resistance"]
[]
["Fp_load_buck",{"$f":"1/(2*Pi*Ro*Cout)+(k-0.5)/(2*Pi*Fsw*Lf*Cout/Number_of_Phases)","v":716.0637176033531},"Hz",null,null,"Buck dominant pole frequency -- note slope comp influence"]
["Fp_dominant",{"$f":"Fload_u","v":716.0637176033531},"Hz"]
[null,{"$f":"Cbw","v":7.0028175040452818E-11}]
["Fp_EA",{"$f":"1/(2*Pi*(RoEA+Rcea1_u)*Cc1ea_u)","v":23.309105203291317},"Hz",null,null,"Error Amp LF pole -- related to amplifier ouptut resistance and comp cap"]
["Fp_HF",{"$f":"1/(2*Pi*Rcea1_u*(Cc2ea_u+Cbw))","v":55163.283318623115},"Hz",null,null,"Error Amp HF pole cancels zero related to Output Cap ESR"]
["Fesr",{"$f":"1/(2*Pi*Cout*Cout_ESR)","v":294731.37643288216},"Hz",null,null,"Cout ESR zero frequency"]
["F_mod",{"$f":"Fsw/2","v":1100000},"Hz",null,null,"Zero-order sample-and-hold effects of current-mode control modeled as pole at Fsw/2"]
[null,null,null,"Internal Comp Crossover"]
["Desired Crossover Frequency",{"$f":"CHOOSE(COMP_TYPE,Fcross_Ch2,'Design Regulator'!E63*1000)","v":52000},"Hz",{"$f":"Fsw/50","v":44000}]
["Rcea1",{"$f":"Fcross*Cout/Number_of_Phases*2*Pi*Ri/(gm*Afb)","v":40827.842302911558},"W",null,null,"This component will largely determine the crossover frequency",null,null,null,null,{"$f":"Fcross/Fp_dominant/(gm*Afb*Am)","v":40827.842302911551}]
["Cc1ea, Cc3ea",{"$f":"10/(Rcea1*Fcross*2*Pi)","v":7.4965313212633598E-10},"F",null,null,"This along with Rcea1 will set a zero at Fcrossover/5 to optimize phase margin"]
["Cc2ea, Cc4ea",{"$f":"MAX(1/(Rcea1*2*Pi*Fesr)-Cbw, 1/(Rcea1*2*Pi*(Fsw/2))-Cbw)","v":-5.6801906652483391E-11},"F",null,null,"This along with Rcea1 places a pole at the output cap ESR zero"]
[]
[{"$f":"CHOOSE(COMP_TYPE,\"Internal Compensation\",\"External Compensation\")","v":"External Compensation"}]
["Chosen Compensation Components from the standard value sheet",null,null,"Internal Values"]
["Rcea1_u",{"$f":"CHOOSE(COMP_TYPE,D247,'Design Regulator'!D71*1000)","v":41200},"W",400000,null,null,{"$f":"1/(Rcea1*2*Pi*(Fsw/2))-Cbw","v":-6.6484360234037412E-11}]
["Cc1ea_u",{"$f":"CHOOSE(COMP_TYPE,Cc3ea_u,'Design Regulator'!D72*0.000000001)","v":6.8000000000000013E-10},"F",{"$f":"50*0.000000000001","v":5.0000000000000002E-11}]
["Cc2ea_u",{"$f":"CHOOSE(COMP_TYPE,Cc4ea_u,'Design Regulator'!D73*0.000000000001)","v":0},"F",{"$f":"0.000000000001","v":9.9999999999999998E-13}]
[]
["Resulting Pole/Zero Locations",null,null,null,null,{"$f":"Cout","v":5.4000000000000001E-4},{"$f":"Cout_ESR","v":1E-3}]
["Fz1",{"$f":"1/(2*Pi*Rcea1_u*Cc1ea_u)","v":5680.8589118273958},"Hz",null,null,"This zero is set at or close to the dominant load pole"]
["Fp2",{"$f":"1/(2*Pi*Rcea1_u*(Cc1ea_u*(Cc2ea_u+Cbw)/(Cc1ea_u+Cc2ea_u+Cbw)))","v":60844.142230450503},"Hz",null,null,"This pole cancels the zero from the Output Cap ESR"]
[null,null,null,"Internal Values"]
["Rfb1",{"$f":"IF(VOUT_setting=1,'Design Regulator'!E65*1000,2500000)","v":2500000},"W",null,null,"Upper Feedback Resistance - chosen by user"]
["Rfb2",{"$f":"IF(Vout=Vref,100000000,Vref*B255/((Vout-Vref)))","v":476190.47619047615},"W",null,null,"Lower Feedback Resistance"]
["Rfb2_u",{"$f":"IF(Vout=Vref,\"N/A\",CHOOSE(VOUT_setting,'Standard Value Calculator'!S11,471000,792000,177000))","v":471000},"W",null,null,"Std Value Lower Feedback Resistance"]
[]
["Rff",20000,"W"]
["Cff",3.67E-13,"F"]
["Cfb",2.1999999999999999E-12,"F"]
[]
["wff",{"$f":"1/(2*Pi*Rff*Cff)","v":21683234.778440922},"Hz"]
["wfbt",{"$f":"1/(2*Pi*Rfb1_*Cfb)","v":28937.262413410252},"Hz"]
["wfbb",{"$f":"1/(2*Pi*Rfb2_u*Cfb)","v":153594.8111115194},"Hz"]
["w1",{"$f":"1/(2*Pi*Rff*Cfb)","v":3617157.8016762817},"Hz"]
["wfft",{"$f":"1/(2*Pi*Cff*Rfb1_)","v":173465.8782275274},"Hz"]
["Cfb*(Rff+RFBT)/(Rff*RFBT))",{"$f":"2*Pi*Cfb*(Rff+Rfb1_)/(Rff*Rfb1_)","v":6.96679586064E-16},"Hz"]
[]
[]
[]
[]
["Other Input Variables"]
["Rfets",0,"W","Series resistance due to FETs"]
["Diode loss eq res",{"$f":"0.00000002*Fsw*0.6*4/Iripple1","v":{"$error":"#NAME?"}}]
["Fet loss eq res",{"$f":"_Don2*RdsonTop+Doff2*RdsonBot","v":{"$error":"#NAME?"}}]
["cap loss eq res",{"$f":"B278*Vin^2*Fsw/2/(((Iripple1/SQRT(3))^2))","v":{"$error":"#NAME?"}}]
["Sw cap",5.0000000000000001E-9]
[]
["Step 8: AEF"]
[]
["VinRipple_dBuV",{"$f":"20*LOG10(Vinripple2*1000000)","v":93.868876285168795},"dBuV"]
["CISPR 25 limit",{"$f":"CHOOSE(OSC,35,50)","v":{"$error":"#VALUE!"}},"dBuV","Chooses CISPR conducted limit 35 at 2.1MHz and 50 at 440kHz"]
["Attenuation required",{"$f":"VinRipple_dBuV-B283+3","v":{"$error":"#VALUE!"}},"dBuV","Margin of attenuation req"]
["Filter Frequency Required",{"$f":"Fsw/(POWER(10,Attn_req/40))","v":{"$error":"#VALUE!"}},"Hz","assume 40db/decade drop and set frequency based on attenuation"]
[]
["Lfilter",{"$f":"'Design Regulator'!E49","v":0.68},"uH","user input"]
[]
["Gop_AEF",{"$f":"CHOOSE(OSC,20,100)","v":{"$error":"#VALUE!"}}]
["n",3,null,null,null,"n should be 2 or 3"]
[]
["Passive Cf",{"$f":"1000000/(LinfilterPssv*POWER(2*Pi*Fx_infilter,2))","v":{"$error":"#VALUE!"}},"uF",{"$f":"'Design Input Filter'!G9*0.000001","v":6.8E-8}]
["Cinj_AEF",{"$f":"1000000/(L_infilter*Gop_AEF*0.000001*POWER(2*Pi*Fx_infilter,2))","v":{"$error":"#VALUE!"}},"uF",{"$f":"'Design Regulator'!#REF!*0.000001","v":{"$error":"#REF!"}}]
[]
["Cdamp_AEF",{"$f":"CHOOSE(OSC,0,Cinj_AEF/nAEF)","v":{"$error":"#VALUE!"}},"uF",{"$f":"'Design Regulator'!#REF!*0.000001","v":{"$error":"#REF!"}}]
["Rdamp_AEF",{"$f":"CHOOSE(OSC,SQRT(L_infilter*Gop_AEF/(Cinj_AEF)),1.09*SQRT(L_infilter*Gop_AEF/Cinj_AEF))","v":{"$error":"#VALUE!"}},"Ω",{"$f":"'Design Regulator'!#REF!","v":{"$error":"#REF!"}}]
["Ccomp_AEF",{"$f":"CHOOSE(OSC,5,1)","v":{"$error":"#VALUE!"}},"nF",{"$f":"B297*0.000000001","v":{"$error":"#VALUE!"}},null,"AEF Comp network & sense is specifically defined at 2.2MHz at 440kHz"]
["Rcomp_AEF",{"$f":"CHOOSE(OSC,200,1000)","v":{"$error":"#VALUE!"}},"Ω"]
["Csen_AEF",{"$f":"Gop_AEF*B297","v":{"$error":"#VALUE!"}},"nF",{"$f":"B299*0.000000001","v":{"$error":"#VALUE!"}}]
[]
["Rd_AEF",{"$f":"SQRT(L_infilter*0.000001/Cin)","v":0.15055453054181619},null,{"$f":"'Standard Value Calculator'!S14","v":0.15}]
[]
["Attenuation at Fsw",{"$f":"'Input Filter Calculations'!W97","v":0},"dBuV"]
["Conducted EMC at Fsw",{"$f":"VinRipple_dBuV+B303","v":93.868876285168795},"dBuV"]
[]
[]
["Step 8: Efficiency"]
["VAR",0]
["Design"]
["Ta",{"$f":"'Design Regulator'!E13","v":25},"°C","Ambient Temperature"]
["Components"]
["LTc",{"$f":"4000/1000000","v":4.0000000000000001E-3},"%/°C","Inductor DCR Temp Co"]
["θCA",20,"°C/W","Inductor Core to Ambient Thermal Resistance"]
["RCinEsr",{"$f":"RCinEsr","v":1E-3},"W","Input Capacitor ESR"]
[]
["Controller Characteristics"]
["VCC",5,"V","with 170mA current limit"]
["Top Driver"]
["RdsonDRT",1,"W","Drain-Source Resistance of Pullup High-side FET Driver"]
["RdsonDRT2",0.5,"W","Drain-Source Resistance of Pulldown High-side FET Driver"]
["Bottom Driver"]
["RdsonDRB",1,"W","Drain-Source Resistance of Pullup Low-side FET Driver"]
["RdsonDRB2",0.5,"W","Drain-Source Resistance of Pulldown Low-side FET Driver"]
["Deadtime"]
["Deadtime",1.4E-8,"s","Total Deadtime",null,null,"14ns for LM513-Q1"]
["IQ"]
["IQ ",2.2000000000000001E-6,"A","Quiescent Current of LM5143-Q1 Controller (One channel disabled)"]
[]
["High- & low-side MOSFETs - Ch1","Q1: high-side",null,"Q2: low-side"]
["Rdson",{"$f":"'Design Regulator'!E82/1000","v":4.0000000000000001E-3},"W",{"$f":"'Design Regulator'!F82/1000","v":4.0000000000000001E-3},"W","Drain-Source Resistances of Channel 1 FETs"]
["RdsonTopTc",{"$f":"4000/1000000","v":4.0000000000000001E-3},"%/°C",4.0000000000000001E-3,"%/°C","Drain-Source Resistance Temp Co"]
["Qg",{"$f":"'Design Regulator'!E83/1000000000","v":2E-8},"C",{"$f":"'Design Regulator'!F83/1000000000","v":2E-8},"C","Gate Charge at VCC = 5V"]
["Qgd",{"$f":"'Design Regulator'!E84/1000000000","v":4.6999999999999999E-9},"C",{"$f":"'Design Regulator'!F84/1000000000","v":4.6999999999999999E-9},"C","Gate to Drain Charge"]
["Qgs",{"$f":"'Design Regulator'!E85/1000000000","v":3.9000000000000002E-9},"C",{"$f":"'Design Regulator'!F85/1000000000","v":3.9000000000000002E-9},"C","Gate to Source Charge"]
["Qoss",{"$f":"'Design Regulator'!E86/1000000000","v":0},"C",{"$f":"'Design Regulator'!F86/1000000000","v":2.9999999999999997E-8},"C","Output Charge"]
["Coss",{"$f":"'Design Regulator'!E87/1000000000000","v":3.3700000000000003E-10},"F",{"$f":"'Design Regulator'!F87/1000000000000","v":3.3700000000000003E-10},"F","Output Capacitance"]
["Rgate",{"$f":"'Design Regulator'!E88","v":1.2},"W",{"$f":"'Design Regulator'!F88","v":1.2},"W","Gate Resistance"]
["Gfs",{"$f":"'Design Regulator'!E89","v":55},"S",{"$f":"'Design Regulator'!F89","v":55},"S","Transconductance"]
["Vth",{"$f":"'Design Regulator'!E90","v":1.6},"V",{"$f":"'Design Regulator'!F90","v":1.6},"V","Threshold Voltage"]
["Vsp",{"$f":"Vth_Q1+(Iout/Number_of_Phases)/Gfs_Q1","v":1.781818181818182},"V",{"$f":"Vth_Q2+(Iout/Number_of_Phases)/Gfs_Q2","v":1.781818181818182},"V","Switch Point Voltage of FETs"]
[]
["Vsd - Buck",{"$f":"'Design Regulator'!E91","v":0.8},"V",{"$f":"'Design Regulator'!F91","v":0.8},"V","Diode Forward Voltage of MOSFET Body diode"]
["QrrTop",null,"C",{"$f":"'Design Regulator'!F92/1000000000","v":1.7999999999999999E-8},"C","Reverse Recovery Charge of Body Diode"]
["TrrTop",4.0000000000000001E-8,"s",4.0000000000000001E-8,"s","Reverse Recovery Time of Body Diode"]
["θJA-MOSFET",{"$f":"'Design Regulator'!E93","v":50},"°C/W",{"$f":"'Design Regulator'!F93","v":50},"°C/W","Junction-to-Ambient Resistance"]
[]
[]
[]
["Anti-parallel Schottky Diode (optional)"]
["VfdSky",{"$f":"'Design Regulator'!F96","v":0},"V",{"$f":"'Design Regulator'!#REF!","v":{"$error":"#REF!"}},"V","Diode Forward Voltage"]
["QrrSky",{"$f":"'Design Regulator'!F97/1000000000","v":0},"C",{"$f":"'Design Regulator'!#REF!/1000000000","v":{"$error":"#REF!"}},"C","Diode Reverse Recovery Charge"]
["Ireverse",0,"A",0,"A","Reverse Leakage Current"]
[]
["Controller"]
["θJACtrl",34.1,"°C/W",null,null,"Junction-to-ambient thermal resistance of controller"]
["Outputs"]
["Top FET"]
["Tr",{"$f":"(Qgd_Q1+Qgs_Q1/2)*(RdsonDRT+Rgate1)/(VCC-Vsp_Q1)","v":4.5460451977401138E-9},"s"]
["Tf",{"$f":"(Qgd_Q1+Qgs_Q1/2)*(RdsonDRT2+Rgate1)/(Vsp_Q1)","v":6.3446428571428562E-9},"s"]
[]
["IC Power Disipation","Value","Units"]
["Power Dis",{"$f":"CHOOSE(Ext_VCC, (Qg_Q1+Qg_Q2)*Fsw*VCC, (Qg_Q1+Qg_Q2)*Fsw*Vin)","v":2.1120000000000001},"W"]
["Temp rise",{"$f":"B362*ThetaJaCtrl","v":72.019200000000012},"°C"]
["Junction temperature",{"$f":"B363 + Ta","v":97.019200000000012},"°C"]
[]
["Current (switching)",{"$f":"(Qg_Q1+Qg_Q2)*Fsw+Iq","v":8.8002200000000003E-2},"A"]
["Qrr Current",{"$f":"Qrr_Q2*Fsw","v":3.9599999999999996E-2},"A"]
["Diode Current",{"$f":"C368/Vin","v":{"$error":"#NAME?"}},{"$f":"Deadtime*Fsw*(Ipp/2)*(Vsd_Q1+Vsd_Q2)","v":{"$error":"#NAME?"}}]
["Total Application Switching IQ",{"$f":"SUM(B366:B368)","v":{"$error":"#NAME?"}},"A"]
[]
["Low-side MOSFET/Diode"]
["Part Power"]
["Power Dis"]
[]
["SCHEMATIC LABELS"]
[{"$f":"\"RC1 = \"&'Design Regulator'!D71&\"kΩ\"","v":"RC1 = 41.2kΩ"},{"$f":"'Design Regulator'!D71&\"kΩ\"","v":"41.2kΩ"},null,{"$f":"'Design Regulator'!D74&\"kΩ\"","v":"kΩ"}]
[{"$f":"\"RC2 = \"&'Design Regulator'!D74&\"kΩ\"","v":"RC2 = kΩ"},{"$f":"'Design Regulator'!D74&\"kΩ\"","v":"kΩ"}]
[]
[{"$f":"\"Lo = \"&'Design Regulator'!E27&\"µH\"","v":"Lo = 0.68µH"},{"$f":"'Design Regulator'!E27&\"µH\"","v":"0.68µH"},null,{"$f":"IF(MODE = 1, 'Design Regulator'!I27&\"µH\", 'Design Regulator'!E27&\"µH\")","v":"µH"}]
[{"$f":"\"Rdcr = \"&Rdcr*1000&\"mΩ\"","v":"Rdcr = 2.2mΩ"},{"$f":"Rdcr*1000&\"mΩ\"","v":"2.2mΩ"},null,{"$f":"IF(MODE=1, Rdcr2*1000&\"mΩ\", Rdcr*1000&\"mΩ\")","v":"0mΩ"}]
[{"$f":"\"Rs = \"&'Design Regulator'!E18&\"mΩ\"","v":"Rs = 4mΩ"},{"$f":"'Design Regulator'!E18&\"mΩ\"","v":"4mΩ"},null,{"$f":"IF(MODE = 1, 'Design Regulator'!I18&\"mΩ\", 'Design Regulator'!E18&\"mΩ\")","v":"mΩ"}]
[]
["IC",{"$f":"IF(VIN_max>42,\"LM5148(-Q1)\",\"LM25148(-Q1)\")","v":"LM25148(-Q1)"}]
[]
[{"$f":"IF((INFILTER_TYPE=1),\"AEF IS DISABLED!\",\"AEF\")","v":"AEF IS DISABLED!"},{"$f":"IF((INFILTER_TYPE=1),\"\",\"0.1µF\")","v":""},{"$f":"IF((INFILTER_TYPE=1),\"\",\"0.47Ω\")","v":""},{"$f":"IF((INFILTER_TYPE=1),\"\",\"3Ω\")","v":""},{"$f":"IF((INFILTER_TYPE=1),\"\",\"50kΩ\")","v":""}]
[{"$f":"\"LAEF =\"&L_infilter&\" uF\"","v":"LAEF =0.68 uF"},{"$f":"IF((INFILTER_TYPE=1),\"\",L_infilter&\"µH\")","v":""}]
[null,{"$f":"IF((INFILTER_TYPE=1),\"\",CinjSel*1000000&\"µF\")","v":""}]
[null,{"$f":"IF((INFILTER_TYPE=1),\"\",IF(OSC=1,\"DNP\",CdampSel*1000000&\"µF\"))","v":""}]
[null,{"$f":"IF((INFILTER_TYPE=1),\"\",RdampSel&\"Ω\")","v":""}]
[{"$f":"\"Rcomp =\"&Rcomp_AEF&\"Ω\"","v":{"$error":"#VALUE!"}},{"$f":"IF((INFILTER_TYPE=1),\"\",Rcomp_AEF&\"Ω\")","v":""}]
[{"$f":"\"Ccomp =\"&Ccomp_AEF*1000000000000&\"pF\"","v":{"$error":"#VALUE!"}},{"$f":"IF((INFILTER_TYPE=1),\"\",Ccomp_AEF*1000000000000&\"pF\")","v":""}]
[{"$f":"\"Csen =\"&Csen_AEF*1000000&\"µF\"","v":{"$error":"#VALUE!"}},{"$f":"IF((INFILTER_TYPE=1),\"\",Csen_AEF*1000000&\"µF\")","v":""}]
[null,"CDAMP"]
[]
[{"$f":"\"VOUT = \"&'Design Regulator'!E9&\"V\"","v":"VOUT = 5V"},{"$f":"'Design Regulator'!E9&\"V\"","v":"5V"},null,{"$f":"IF(MODE=1, 'Design Regulator'!I10&\"V\", \"\")","v":"V"}]
[]
[{"$f":"\"COUT = \"&'Design Regulator'!$E$35&\"µF\"","v":"COUT = 540µF"},{"$f":"ROUND('Design Regulator'!$E$35/Number_of_Phases, 0)&\"µF\"","v":"540µF"},null,{"$f":"IF(MODE=1, 'Design Regulator'!$I$35&\"µF\", ROUND('Design Regulator'!$E$35/Number_of_Phases, 0)&\"µF\")","v":"µF"}]
["Capacitance per component (Cout)",{"$f":"\"22µF\"","v":"22µF"}]
["# of output caps",{"$f":"ROUNDUP(Cout*1000000/22,0)&\" x\"","v":"25 x"}]
[]
["CIN",{"$f":"Cin*1000000&\"µF\"","v":"30µF"}]
["Capacitance per component (Cin)",{"$f":"\"10µF\"","v":"10µF"}]
["# of input caps",{"$f":"ROUNDUP(Cin*1000000/10,0)&\" x\"","v":"3 x"}]
["Cd",{"$f":"CHOOSE(INFILTER_TYPE,\"\",4*Cin*1000000&\"µF\")","v":""},null,null,{"$f":"COMP_TYPE","v":2}]
["Rd",{"$f":"CHOOSE(INFILTER_TYPE,\"\",D301&\"Ω\")","v":""}]
[]
[{"$f":"\"RC1 = \"&Rcea1_u/1000&\"kΩ\"","v":"RC1 = 41.2kΩ"},{"$f":"IF(COMP_TYPE=1,\"\",ROUND(Rcea1_u/1000,2)&\"kΩ\")","v":"41.2kΩ"},{"$f":"IF(OR(Vout=3.3,Vout=5,Vout=12),\"\",IF(COMP_TYPE=1,\"100kΩ\",\"\"))","v":""},{"$f":"IF(OR(Vout=3.3,Vout=5,Vout=12), IF(COMP_TYPE=1,\"\",ROUND(Rcea1_u/1000,2)&\"kΩ\"), \"\")","v":"41.2kΩ"},{"$f":"IF(OR(Vout=3.3,Vout=5,Vout=12),IF(COMP_TYPE=1,\"100kΩ\",\"\"),\"\")","v":""}]
[{"$f":"\"CC1 = \"&Cc1ea_u*10^9&\"nF\"","v":"CC1 = 0.68nF"},{"$f":"IF(COMP_TYPE=1,\"\",Cc1ea_u*10^9&\"nF\")","v":"0.68nF"}]
[{"$f":"\"CC2 = \"&IF(Cc2ea_u>0, Cc2ea_u*10^12&\"pF\", \"OPEN\")","v":"CC2 = OPEN"},{"$f":"IF(COMP_TYPE=1,\"\",IF(Cc2ea_u>0, ROUND(Cc2ea_u*10^12,1)&\"pF\", \"N/A\"))","v":"N/A"}]
[]
[{"$f":"\"gm = \"&$B$200*1000&\"mS\"","v":"gm = 1.1mS"},{"$f":"$B$200*1000&\"mS\"","v":"1.1mS"}]
[{"$f":"\"RoEA = \"&RoEA/1000000&\"MΩ\"","v":"RoEA = 10MΩ"},{"$f":"RoEA/1000000&\"MΩ\"","v":"10MΩ"}]
[{"$f":"\"GBW = \"&GBW&\"MHz\"","v":"GBW = 2.5MHz"},{"$f":"GBW&\"MHz\"","v":"2.5MHz"}]
[]
[]
["Cd",{"$f":"IF(DITHER=1, ROUND(Cdither*1000000000,1)&\"nF\", \"\")","v":{"$error":"#DIV/0!"}},{"$f":"IF(DITHER=1, \"Cd\", \"\")","v":"Cd"}]
[{"$f":"\"RFB1 = \"&'Design Regulator'!E65&\"kΩ\"","v":"RFB1 = 39kΩ"},{"$f":"IF(VOUT_setting=1, 'Design Regulator'!E65&\"kΩ\", \"\")","v":""},null,{"$f":"'Design Regulator'!I65&\"kΩ\"","v":"kΩ"}]
[{"$f":"\"RFB2 = \"&IF(Vout=Vref,\"OPEN\",'Design Regulator'!E66&\"kΩ\")","v":"RFB2 = 471kΩ"},{"$f":"IF(VOUT_setting=1, IF(Vout=Vref,\"OPEN\",Rfb2_u/1000&\"kΩ\"), \"\")","v":""},null,{"$f":"IF(Vout2=Vref,\"OPEN\",Rfb4_u/1000&\"kΩ\")","v":"0kΩ"}]
[{"$f":"\"RFBSET = \"&CHOOSE(VOUT_setting,\"\",\"24.9kΩ\",\"0Ω\",\"48.7kΩ\")","v":"RFBSET = 24.9kΩ"},null,null,{"$f":"CHOOSE(VOUT_setting,\"\",\"24.9kΩ\",\"0Ω\",\"48.7kΩ\")","v":"24.9kΩ"}]
[]
["RENT",{"$f":"IF((UVLO_TYPE=1),B188&\"kΩ\",\"0Ω\")","v":"100kΩ"}]
["RENB",{"$f":"IF((UVLO_TYPE=1),B189&\"kΩ\",\"N/A\")","v":"24.9kΩ"}]
[]
[{"$f":"\"Crossover frequency = \"&ROUND('Stability Calculations'!U4,0)&\"kHz\"","v":"Crossover frequency = 42kHz"},{"$f":"ROUND('Stability Calculations'!U4,0)&\"kHz\"","v":"42kHz"},null,{"$f":"'Stability Calculations'!U4","v":42.172499999999999}]
[{"$f":"CHOOSE(BODE_PLOT_TYPE, \"Phase margin = \"&ROUND('Stability Calculations'!U5,0)&\"°\", \"°\")","v":"Phase margin = 48°"},{"$f":"ROUND('Stability Calculations'!U5,0)&\"°\"","v":"48°"}]
[{"$f":"IF(loopPM<45,CHOOSE(COMP_TYPE,\"Phase margin is LOW, increase Cout\",\"Phase margin is LOW, recompensate\"),\"\")","v":""}]
[]
["Full-load/high line efficiency",{"$f":"IF(PLOT_TYPE=1, ROUND('Efficiency Calculations'!AZ109,1)&\"%\", ROUND(#REF!,1)&\"%\")","v":"83.5%"}]
["Half-load/mid-line efficiency",{"$f":"IF(PLOT_TYPE=1, ROUND('Efficiency Calculations'!AZ59,1)&\"%\", ROUND(#REF!,1)&\"%\")","v":"79.1%"}]
[null,{"$f":"IF(VOUT_setting=1, \"\", IF(OSC=1, \"Tie OSC to VDDA\", \"Tie OSC to AGND\"))","v":"Tie OSC to AGND"}]
[]
[]
[{"$f":"\"Rs = \"&Rs&\"Ω\"","v":"Rs = 0.004Ω"},{"$f":"'Standard Value Calculator'!S6&\"Ω\"","v":"Ω"}]
["Rset",{"$f":"'Standard Value Calculator'!S16&\"mΩ\"","v":"3.09mΩ"}]
["Rs",{"$f":"'Standard Value Calculator'!S6&\"mΩ\"","v":"mΩ"}]
[{"$f":"\"Rshunt = \"&ROUND(Rshunt,1)&\"mΩ\"","v":{"$error":"#NAME?"}},{"$f":"IF(Rshunt=\"0\", \"N/A\",ROUND(Rshunt,1)&\"mΩ\")","v":{"$error":"#NAME?"}}]
[]
["Rpgood","20kΩ"]
["RDAMP"]
[]
["VCCX",{"$f":"IF((Ext_VCC=1),\"5V\",\"GND\")","v":"GND"}]
["RCNFG",{"$f":" 'Design Regulator'!E57&\"kΩ\"","v":"kΩ"}]
["Rt",{"$f":" Rfadj&\"kΩ\"","v":"10kΩ"},{"$f":"Rfadj","v":10},{"$f":"Fsw","v":2200000},null,{"$f":"OR((Fsw=440000),(Fsw=2200000))","v":true},null,{"$f":"OR(OR(AND(OSC=1, OR(Fsw/1000>2530, Fsw/1000<1800)), AND(OSC=2, OR(Fsw/1000>500, Fsw/1000<300))), OR((Fsw=440000),(Fsw=2200000)))","v":true}]
["Css",{"$f":"'Standard Value Calculator'!B4*1000000000&\"nF\"","v":"0nF"},{"$f":"IF(MODE=1,\"Css\",\"\")","v":"Css"}]
["Cres",{"$f":"IF(Cres_u = 0, \"N/A\", Cres_u*1000000000 &\"nF\")","v":"68nF"},{"$f":"IF(Cres_u = 0, \"N/A\", Cres_u*1000000 &\"µF\")","v":"0.068µF"},{"$f":"Cres_u","v":6.8E-8}]
[]
["Blank out",{"$f":"IF(B76=\"y\",\"\",\"|\")","v":"|"}]
["OUTPUT CURRENT",{"$f":"'Design Regulator'!$E$10&\"A\"","v":"10A"}]
["VIN",{"$f":"VIN_nom&\"V\"","v":"24V"}]
["VIN range",{"$f":"VIN_min&\"V\"&\"...\"&VIN_max&\"V\"","v":"9V...42V"}]
[null,{"$f":"IF(INFILTER_TYPE=1,B450,\"\")","v":"9V...42V"},{"$f":"IF(INFILTER_TYPE=1,\"\",B450)","v":""}]
[{"$f":"CHOOSE(Ext_VCC, \"\", \"Tie VCCX to PGND\")","v":"Tie VCCX to PGND"}]

{"sheet":"Schematic Management","index":6,"n_rows":17,"n_cols":14,"rows_kept":17,"cut":false,"hidden":true,"merged":[]}
[null,null,null,null,null,null,null,null,null,null,null,null,null,"3.3V or 5V fixed (FB1/2)"]
[{"$f":"IF(MODE=1, CHOOSE(SCH_SETTING, \"SCH_SetVout_IntComp_nAEF\",\"SCH_SetVout_IntComp_AEF\",\"SCH_SetVout_ExtComp_nAEF\",\"SCH_SetVout_ExtComp_AEF\",\"SCH_AdjVout_IntComp_nAEF\",\"SCH_AdjVout_IntComp_AEF\",\"SCH_AdjVout_ExtComp_nAEF\",\"SCH_AdjVout_ExtComp_AEF\"))","v":"SCH_SetVout_ExtComp_nAEF"},null,null,null,null,null,null,null,null,null,null,null,null,"With/without VOUT connected to VCCX"]
[]
[]
[]
[]
[]
[]
[]
[]
[]
[]
[]
[]
[]
[]
[null," "]

{"sheet":"Stability Calculations","index":7,"n_rows":687,"n_cols":35,"rows_kept":687,"cut":false,"hidden":true,"merged":[[9,27,9,28],[9,30,9,31],[10,2,10,3],[10,4,10,5],[10,8,10,9],[10,10,10,11],[10,12,10,13],[10,18,10,19],[10,14,10,15],[10,16,10,17],[9,1,10,1],[1,0,1,3],[1,9,1,11],[9,0,11,0],[9,18,9,19],[1,19,1,21],[10,6,10,7],[1,4,1,6],[9,2,9,7],[9,8,9,13],[9,20,9,22],[9,14,9,17],[1,12,1,14],[1,15,1,18]]}
[]
["Divider Network & EA Poles/Zeros",null,null,null,"Modulator",null,null,null,null,"Power Stage Poles/Zeros",null,null,"Complex Pole Pair",null,null,"Feedback natural frequencies",null,null,null,"Total System"]
[null,"Afb1",{"$f":"Afb","v":0.15714039802456359},"V/V","Acs",{"$f":"Acs","v":25},"A/V","gm",{"$f":"gm","v":1.1000000000000001E-3},"z_ESR",{"$f":"Fesr","v":294731.37643288216},"Hz","p3",{"$f":"Fsw/2","v":1100000},"Hz","zterm1",{"$f":"((1/wffHz)+(1/wfftHz))","v":5.8109410928520001E-6},null,null,"Adc",{"$f":"IF(VOUT_setting=1,Am*Afb*AEA,Am*AEA)","v":113189.82728285501},"V/V"]
[null,"EA zero, z1",{"$f":"Fz1_u","v":5680.8589118273958},"Hz","Am",{"$f":"Am","v":10.289984298441365},"V/V",null,null,"p_dom",{"$f":"Fp_dominant","v":716.0637176033531},"Hz","pterm1",{"$f":"Q*pole3","v":544879.63530785858},null,"pterm3",{"$f":"((1/wfbtHz)+(1/wffHz)+(1/wfftHz)+(Afbr/wffHz))","v":4.0613251007724614E-5},null,null,"Crossover",{"$f":"AI7","v":42.172499999999999},"kHz"]
[null,"EA pole, p1",{"$f":"Fp1_u","v":23.309105203291317},"Hz","Q",{"$f":"Q","v":0.49534512300714412},null,null,null,null,null,null,"pterm2",{"$f":"pole3^2","v":1210000000000},null,"pterm4",{"$f":"1/(wffHz*wfbtHz)","v":1.5937437150456741E-12},null,null,"Phase Margin",{"$f":"AI9","v":48.217326152150036},"°"]
[null,"Aea",{"$f":"AEA","v":11000},"V/V","mc",{"$f":"mc","v":1.4473684210526316},null,null,null,null,null,null,null,null,null,"Afbr",{"$f":"Rfb1_/Rfb2_u","v":5.3078556263269636},null,null,"radconv",{"$f":"180/Pi","v":57.295779578552292},null,null,null,null,null,null,null,null,null,null,null,null,"XOVER SEARCH"]
[null,"EA pole, p2",{"$f":"Fp2_u","v":55163.283318623115},"Hz","k",{"$f":"k","v":1.1426022418775725},null,null,null,null,null,null,null,null,null,null,null,null,null,null,null,null,null,null,null,null,null,null,null,null,null,null,null,"xover",{"$f":"SUM(AH12:AH613)/1000","v":42.172499999999999}]
[]
[null,null,null,null,null,null,null,null,null,null,null,null,null,null,null,null,null,null,null,null,null,null,null,null,null,null,null,null,null,null,null,null,null,"phase margin",{"$f":"SUM(AI13:AI613)","v":48.217326152150036}]
["Freq (Hz)",null,"Power Stage",null,null,null,null,null,"Error Amplifier",null,null,null,null,null,"Feedback Gain",null,null,null,"Sampling Double Pole",null,"System Response",null,null,null,null,null,null,"ERROR AMP Response",null,null,"PLANT Response"]
[null,null,"p_dom",null,"z_ESR",null,"z_RHP",null,"p1",null,"z1",null,"p2",null,"z1",null,"p1p2",null,"p3"]
[null,null,"Gain(V/V)","Phase(rad)","Gain(V/V)","Phase(rad)","Gain(V/V)","Phase(rad)","Gain(V/V)","Phase(rad)","Gain(V/V)","Phase(rad)","Gain(V/V)","Phase(rad)","Gain(V/V)","Phase(rad)","Gain(V/V)","Phase(rad)","Gain(V/V)","Phase(rad)","Gain (dB)","Phase (°)","Phase Margin (°)",null,null,"Fsquare",null,"Gain(dB)","Phase(Deg)",null,"Gain(dB)","Phase(Deg)"]
[1,{"$f":"A13/1000","v":1E-3},{"$f":"SQRT(1+(A13/pole1)^2)","v":1.0000009751388399},{"$f":"ATAN(A13/pole1)","v":1.3965228586847774E-3},{"$f":"SQRT(1+(A13/Zero1)^2)","v":1.0000000000057558},{"$f":"ATAN(A13/Zero1)","v":3.3929200619869806E-6},{"$f":"IF(VIN_nom>Vout, 1, SQRT(1+(A13/z_RHP)^2))","v":1},{"$f":"IF(VIN_nom>Vout, 0, -ATAN(A13/z_RHP))","v":0},{"$f":"SQRT(1+(A13/Pole2)^2)","v":1.0009198544260218},{"$f":"ATAN(A13/Pole2)","v":4.2875397815351678E-2},{"$f":"SQRT(1+(A13/Zero2)^2)","v":1.0000000154932309},{"$f":"ATAN(A13/Zero2)","v":1.7602971754662069E-4},{"$f":"SQRT(1+(A13/pole4)^2)","v":1.0000000001643121},{"$f":"ATAN(A13/pole4)","v":1.8127999998014236E-5},{"$f":"IF(VOUT_setting=1,1,SQRT(1+(A13*zterm1)^2))","v":1.0000000000168834},{"$f":"IF(VOUT_setting=1,0,ATAN(((A13*zterm1))))","v":5.8109410927865939E-6},{"$f":"IF(VOUT_setting=1,1,SQRT((1+Afbr-pterm4*(A13)^2)^2+(A13*$Q$4)^2))","v":6.3078556264561154},{"$f":"IF(VOUT_setting=1,0,ATAN(A13*$Q$4/(1+Afbr-$Q$5*(A13)^2)))","v":6.438519429275934E-6},{"$f":"SQRT((1-(Z13/pterm2))^2+(A13/pterm1)^2)","v":1.0000000000008575},{"$f":"IF((ATAN((A13/pterm1)/(1-A13^2/pterm2))>0),ATAN((A13/pterm1)/(1-A13^2/pterm2)),PI()+ATAN((A13/pterm1)/(1-A13^2/pterm2)))","v":1.83526770905046E-6},{"$f":"20*LOG10(((E13*K13*G13*O13)/(C13*I13*S13*M13*Q13))*Adc)","v":85.070518632706808},{"$f":"((F13+L13+H13+P13)-(D13+J13+T13+N13+R13))*radconv","v":-2.5274938171391672},{"$f":"IF(V13>0,V13,V13+180)","v":177.47250618286083},null,{"$f":"IF(U13<0,A13,1000000000)","v":1000000000},{"$f":"A13^2","v":1},null,{"$f":"20*LOG10((K13/(I13*M13))*AEA)","v":80.819867754735682},{"$f":"(L13-(J13+N13))*radconv","v":-2.4475322405673925},null,{"$f":"20*LOG10((E13*G13/(C13*S13))*Acs*Am)","v":48.207085944938427},{"$f":"(F13+H13-(D13+T13))*radconv","v":-7.9925618981738875E-2},null,{"$f":"SUM((U14<0)*(U13>0))*A13","v":0},{"$f":"IF(AH13>0,W11,0)","v":0}]
[1.0965,{"$f":"A14/1000","v":1.0965E-3},1.000001172421257,1.5312871131506554E-3,1.0000000000069205,3.7203368479658362E-6,1,0,1.0011058494506526,4.7007048951340849E-2,1.0000000186277014,1.930165848865331E-4,1.0000000001975544,1.9877351997382095E-5,1.0000000000202993,6.3716969082259915E-6,{"$f":"IF(VOUT_setting=1,1,SQRT((1+Afbr-pterm4*(A14)^2)^2+(A14*$Q$4)^2))","v":6.3078556264822438},7.059836554181686E-6,1.0000000000010312,2.0123710429737086E-6,85.068903048452071,-2.7710632252019676,177.22893677479803,null,1000000000,1.2023122500000001,null,80.818253884050108,-2.6833853680302266,null,48.207084231375568,-8.763842967426709E-2,null,0,0]
[1.2022999999999999,1.2022999999999999E-3,1.000001409587548,1.6790389466928616E-3,1.0000000000083205,4.0793077905199729E-6,1,0,1.0013294007354969,5.1535029815235903E-2,1.0000000223958569,2.1164052843238512E-4,1.0000000002375176,2.1795294396548826E-5,1.0000000000244056,6.9864944758222864E-6,{"$f":"IF(VOUT_setting=1,1,SQRT((1+Afbr-$Q$5*(A15)^2)^2+(A15*$Q$4)^2))","v":6.3078556265136552},7.7410319097716704E-6,1.0000000000012399,2.2065423665910762E-6,85.066961640481452,-3.0380001538336074,176.96199984616641,null,1000000000,1.4455252899999997,null,80.816314536074302,-2.9418623781845206,null,48.20708217138835,-9.6094543838587052E-2,null,0,0]
[1.3183,1.3183000000000001E-3,1.0000016947076997,1.8410352014370608E-3,1.0000000000100033,4.4728865177047713E-6,1,0,1.0015980870154058,5.6497109281081564E-2,1.0000000269259166,2.320599748729976E-4,1.0000000002855605,2.3898142395450426E-5,1.0000000000293421,7.6605636425569403E-6,6.3078556265514161,8.487900163529501E-6,1.0000000000014906,2.4194334208406922E-6,85.064628834570556,-3.3305324215167524,176.66946757848325,null,1000000000,1.7379148900000001,null,80.813984206678413,-3.2251191257239293,null,48.207079694882459,-0.10536589290188064,null,0,0]
[1.4454,1.4454000000000001E-3,1.0000020372406107,2.0185327106859389E-3,1.0000000000120253,4.904126657575485E-6,1,0,1.0019207816973121,6.1930803745380431E-2,1.0000000323681659,2.5443335087952144E-4,1.0000000003432779,2.6202211194003577E-5,1.0000000000352727,8.3991342554107729E-6,6.3078556265967825,9.3062359829379334E-6,1.0000000000017919,2.6526959466606789E-6,85.061827938568712,-3.6508733803319617,176.34912661966803,null,1000000000,2.0891811599999999,null,80.811186285870079,-3.535296999445515,null,48.207076719699884,-0.11552440778581026,null,0,0]
[1.5849,1.5849E-3,1.000002449457257,2.2133469032790975E-3,1.0000000000144584,5.3774390062119681E-6,1,0,1.0023089866940631,6.7890390789548741E-2,1.0000000389175705,2.7898949498287608E-4,1.000000000412737,2.8731067192094418E-5,1.0000000000424099,9.2097605378007458E-6,6.3078556266513788,1.0204409443250137E-5,1.0000000000021543,2.908715792072771E-6,85.058459624736912,-4.0022250925278637,175.99777490747215,null,1000000000,2.51190801,null,80.807821552493749,-3.8754941144633852,null,48.207073139257616,-0.12667398888003267,null,0,0]
[1.7378,1.7378000000000001E-3,1.0000029448665078,2.4268742369706739E-3,1.0000000000173825,5.8962164836752726E-6,1,0,1.0027753396895625,7.4416881092209022E-2,1.000000046788764,3.059044367702226E-4,1.0000000004962144,3.1502838389578564E-5,1.0000000000509872,1.0098253430814951E-5,6.307855626716993,1.1188859063889125E-5,1.0000000000025902,3.1893282247859805E-6,85.054414970008381,-4.3870082076589973,175.61299179234101,null,1000000000,3.0199488400000001,null,80.803781200817951,-4.2480511624857238,null,48.207068836220756,-0.13889455807331394,null,0,0]
[1.9055,1.9055000000000001E-3,1.0000035406565697,2.661069755879728E-3,1.0000000000208995,6.4652091780509215E-6,1,0,1.0033358992724979,8.1567788671955757E-2,1.0000000562548397,3.3542461767012118E-4,1.0000000005966061,3.4542903986261006E-5,1.000000000061303,1.1072748251976958E-5,6.3078556267959014,1.2268598772047427E-5,1.000000000003114,3.4971026195929254E-6,85.04955574997831,-4.808617311496568,175.19138268850344,null,1000000000,3.63093025,null,80.79892715573088,-4.6562507881118638,null,48.207063661296807,-0.15229800619689779,null,0,0]
[2.0893000000000002,2.0893000000000001E-3,1.0000042566442038,2.9177488255830871E-3,1.0000000000251257,7.08882788541786E-6,1,0,1.0040091352495308,8.9395599547928709E-2,1.0000000676306546,3.6777887608679277E-4,1.0000000007172514,3.7874830381889494E-5,1.0000000000736995,1.214079922469917E-5,6.3078556268907295,1.3451998642972121E-5,1.0000000000037439,3.834424824515303E-6,85.043723372194236,-5.2701518137144756,174.72984818628552,null,1000000000,4.3651744900000002,null,80.793100996903775,-5.103088457505871,null,48.207057442362718,-0.16698823001575114,null,0,0]
[2.2909000000000002,2.2909000000000002E-3,1.0000051177353018,3.1992853814029605E-3,1.0000000000302085,7.7728405698792647E-6,1,0,1.0048182137337995,9.796884154777101E-2,1.0000000813119254,4.0326646223257226E-4,1.0000000008623469,4.1529435176124819E-5,1.0000000000886085,1.3312284948828261E-5,6.3078556270047761,1.4750004159678206E-5,1.0000000000045013,4.2044147946584072E-6,85.036719324761151,-5.775658615447667,174.22434138455233,null,1000000000,5.2482228100000006,null,80.786104428767857,-5.5924751459195772,null,48.207049963093098,-0.18310109428508914,null,0,0]
[2.5118999999999998,2.5118999999999996E-3,1.000006152760671,3.5079136603074746E-3,1.0000000000363181,8.5226759035314497E-6,1,0,1.0057898599179933,0.10735047133135892,1.0000000977567305,4.4216902325577601E-4,1.0000000010367509,4.5535723168527201E-5,1.000000000106529,1.4596502930098304E-5,6.3078556271418593,1.6172916953233318E-5,1.0000000000054114,4.6100089583565979E-6,85.028315391686988,-6.3288583193490329,173.67114168065098,null,1000000000,6.309641609999999,null,80.77770948574711,-6.1280035289199244,null,48.207040973072786,-0.2007644685587146,null,0,0]
[2.7542,2.7542000000000001E-3,1.0000073970066337,3.8462867905080709E-3,1.0000000000436624,9.3447804344883906E-6,1,0,1.0069566755107213,0.11761448919935406,1.0000001175257198,4.8482101508857332E-4,1.0000000012464094,4.9928137558512744E-5,1.0000000001280718,1.6004493956566494E-5,6.3078556273066519,1.7732970210527565E-5,1.0000000000065059,5.0546943242569138E-6,85.01823410462633,-6.9341255526701211,173.06587444732989,null,1000000000,7.5856176399999997,null,80.767639005981863,-6.7138963219589645,null,48.20703016581718,-0.22013019631670294,null,0,0]
[3.02,3.0200000000000001E-3,1.0000088936210629,4.217476769239943E-3,1.0000000000524967,1.0246618586881393E-5,1,0,1.0083583676838199,0.12884534399989492,1.0000001413044546,5.3160970240248378E-4,1.0000000014985928,5.4746559945304805E-5,1.0000000001539844,1.7549042098611521E-5,6.3078556275048712,1.9444328674271385E-5,1.0000000000078222,5.5425084813190532E-6,85.006138885608792,-7.5964548696555525,172.40354513034444,null,1000000000,9.1204000000000001,null,80.755556786268784,-7.3549721840413618,null,48.207017166560604,-0.24137409369231508,null,0,0]
[3.3113000000000001,3.3113000000000001E-3,1.0000106920603888,4.6242761861747458E-3,1.0000000000631122,1.1234976200827891E-5,1,0,1.0100401711759894,0.14111612564534357,1.0000001698787353,5.8288714371924238E-4,1.0000000018016351,6.0027246327901883E-5,1.0000000001851228,1.9241769238386101E-5,6.3078556277430646,2.1319869383279458E-5,1.000000000009404,6.0771219649608457E-6,84.991648705025085,-8.3201758166853601,171.67982418331465,null,1000000000,10.964707690000001,null,80.741082226556671,-8.0554007645234957,null,48.207001545746536,-0.26465598579402011,null,0,0]
[3.6307999999999998,3.6308E-3,1.0000128548948526,5.0704550381781566E-3,1.0000000000758791,1.231901416048643E-5,1,0,1.0120590398256044,0.15452566258021244,1.0000002042427301,6.3912861804480076E-4,1.0000000021660798,6.581914230495367E-5,1.0000000002225704,2.1098364916796457E-5,6.3078556280295217,2.337697633995167E-5,1.0000000000113061,6.6634899979963571E-6,84.974286183040249,-9.1111422804557591,170.88885771954423,null,1000000000,13.182708639999998,null,80.723738490466914,-8.8208200890733117,null,48.206982759920621,-0.2901916365646004,null,0,0]
[3.9811000000000001,3.9811000000000004E-3,1.0000154550168807,5.5596434841345159E-3,1.000000000091227,1.35075540580067E-5,1,0,1.0144807762093742,0.16916361646201791,1.0000002455546244,7.0079180104142815E-4,1.0000000026042097,7.2169380674703883E-5,1.0000000002675895,2.3133937580626164E-5,6.3078556283738951,2.5632389694727125E-5,1.0000000000135931,7.3063842764686406E-6,84.953504485307832,-9.97467582739006,170.02532417260994,null,1000000000,15.849157210000001,null,80.70297937675754,-9.6563438698830701,null,48.206960175980768,-0.31818880674537353,null,0,0]
[4.3651999999999997,4.3651999999999996E-3,1.0000185810787843,6.0960300319315179E-3,1.0000000001096794,1.4810774653559442E-5,1,0,1.0173847462595584,0.18513005721533191,1.0000002952230254,7.684047797373709E-4,1.0000000031309639,7.9132345434826319E-5,1.0000000003217151,2.536592005307715E-5,6.3078556287879293,2.8105425005791586E-5,1.0000000000163425,8.0113106035042102E-6,84.928649758100377,-10.916722724601305,169.0832772753987,null,1000000000,19.054971039999998,null,80.678151801680315,-10.567678550109061,null,48.20693302395054,-0.34888721242031906,null,0,0]
[4.7862999999999998,4.7862999999999994E-3,1.0000223388930121,6.6840821606000541E-3,1.0000000001318612,1.6239533291323026E-5,1,0,1.0208646641442793,0.20252520602807253,1.0000003549292185,8.4253084643653488E-4,1.0000000037641734,8.6766046182265059E-5,1.0000000003867788,2.7812907345545897E-5,6.3078556292856378,3.0816685535184606E-5,1.0000000000196478,8.7841418357711953E-6,84.898958639378108,-11.943252069782956,168.05674793021706,null,1000000000,22.908667689999998,null,80.64849332220615,-11.560537430276737,null,48.206900384822632,-0.38254253569316515,null,0,0]
[5.2481,5.2481000000000003E-3,1.0000268574662063,7.3289651544128564E-3,1.0000000001585336,1.7806383775500262E-5,1,0,1.0250334552221811,0.22145945417786228,1.0000004267230558,9.2382130738784349E-4,1.0000000045255772,9.5137556512965113E-5,1.0000000004650151,3.0496399939942391E-5,6.3078556298841084,3.3789993804616493E-5,1.000000000023622,9.6316684637919725E-6,84.863522636630847,-13.06085109499845,166.93914890500156,null,1000000000,27.542553609999999,null,80.613096566268965,-12.641211990630843,null,48.206861138157102,-0.41945039533951239,null,0,0]
[5.7544000000000004,5.7544000000000007E-3,1.0000322893832372,8.0359833778124445E-3,1.0000000001905975,1.952421920229196E-5,1,0,1.0300225807625523,0.2420339015995957,1.0000005130290774,1.0129450706659615E-3,1.0000000054408891,1.0431576282161969E-4,1.0000000005590659,3.3438479412244672E-5,6.3078556306035516,3.7049816187685387E-5,1.0000000000283997,1.0560864504859484E-5,84.821302089420371,-14.275581736319477,165.72441826368052,null,1000000000,33.113119360000006,null,80.570923198631817,-13.815460452046588,null,48.206813958757522,-0.4599143699170235,null,0,0]
[6.3095999999999997,6.3095999999999994E-3,1.0000388205686255,8.811278318520268E-3,1.0000000002291505,2.1407968419924771E-5,1,0,1.0359895899475458,0.26435717041861601,1.0000006168016393,1.1106766605926952E-3,1.0000000065414412,1.1438042830119144E-4,1.0000000006721506,3.6664713903029506E-5,6.3078556314685947,4.0624482169570969E-5,1.0000000000341442,1.1579805136891621E-5,84.771073338335171,-15.593979423070358,164.40602057692965,null,1000000000,39.811052159999996,null,80.520751174609131,-15.089466596994493,null,48.206757231903936,-0.50428594806608751,null,0,0]
[6.9183000000000003,6.9183000000000005E-3,1.000046671881915,9.6612697681894236E-3,1.0000000002754965,2.3473238860623406E-5,1,0,1.0431175642933788,0.28852464814726037,1.0000007415503045,1.2178258054287802E-3,1.0000000078644538,1.2541494174245335E-4,1.0000000008080936,4.0201833741020095E-5,6.3078556325084953,4.4543608939242479E-5,1.0000000000410498,1.26969325913475E-5,84.71144888233853,-17.021835422782974,162.97816457721703,null,1000000000,47.862874890000008,null,80.461194911246835,-16.468654111169798,null,48.206689039520747,-0.55293254621843679,null,0,0]
[7.5857999999999999,7.5858000000000002E-3,1.0000561121951184,1.0593353711511887E-2,1.0000000003312226,2.5738013000636263E-5,1,0,1.0516242492590284,0.31463310230092684,1.000000891547693,1.33532545148664E-3,1.0000000094552401,1.375153815331727E-4,1.0000000009715513,4.4080636913605635E-5,6.3078556337588676,4.8841320649137473E-5,1.0000000000493534,1.3921973787081737E-5,84.640821505084446,-18.565069632965081,161.43493036703492,null,1000000000,57.544361639999998,null,80.390649527187634,-17.958519415804975,null,48.206607046627816,-0.60627745007415257,null,0,0]
[8.3176000000000005,8.3176000000000014E-3,1.0000674602707467,1.1615203705338556E-2,1.000000000398211,2.8220951900199276E-5,1,0,1.0617599255653991,0.34275451436669369,1.0000010718594141,1.4641437475511924E-3,1.0000000113675231,1.5078145165732559E-4,1.0000000011680434,4.8333083596269033E-5,6.307855635261939,5.3553029155412697E-5,1.0000000000593348,1.5265022696489725E-5,84.557409739219906,-20.22819590014284,159.77180409985715,null,1000000000,69.182469760000004,null,80.307336323233699,-19.563136988095497,null,48.206508485080242,-0.66475983119717064,null,0,0]
[9.1201000000000008,9.1201000000000008E-3,1.0000811051171083,1.2735747782332616E-2,1.0000000004787584,3.0943770247569812E-5,1,0,1.0738204755308367,0.37295594060098702,1.0000012886676262,1.605407264354727E-3,1.0000000136668676,1.6532917129364545E-4,1.0000000014043073,5.2996363811304073E-5,6.3078556370692445,5.871994098148064E-5,1.0000000000713367,1.673782503290357E-5,84.459186068955589,-22.015509562004649,157.98449043799536,null,1000000000,83.176224010000013,null,80.209231161636978,-21.286290968189864,null,48.206389976849152,-0.72889065699884126,null,0,0]
[10,0.01,1.0000975091775075,1.3964329901606882E-2,1.0000000005755953,3.3929200606980341E-5,1,0,1.0881431424315822,0.40526807009508603,1.0000015493219048,1.7602953754719719E-3,1.0000000164312191,1.8127999801423246E-4,1.0000000016883517,5.8109410863113912E-5,6.3078556392420495,6.4385194206290929E-5,1.0000000000857656,1.8352677089966268E-5,84.343958865204229,-23.929243372221102,156.07075662777891,null,1000000000,100,null,80.094146428829148,-23.129679097375366,null,48.206247506430373,-0.79920469894662372,null,0,0]
[10.965,1.0964999999999999E-2,1.0001172353223606,1.5311686391279337E-2,1.0000000006920453,3.7203368462665729E-5,1,0,1.1051208895099569,0.43970240686545037,1.0000018627684133,1.9301634758701447E-3,1.0000000197554559,1.987735173820924E-4,1.000000002029926,6.3716968996895023E-5,6.3078556418549301,7.0598365427822487E-5,1.0000000001031171,2.0123710429027381E-5,84.209315062736977,-25.970601537597496,154.0293984624025,null,1000000000,120.23122499999999,null,79.959673946854281,-25.093890846495711,null,48.206076186569042,-0.87631641612868716,null,0,0]
[12.023,1.2022999999999999E-2,1.0001409489208513,1.6788827674592895E-2,1.0000000008320375,4.0793077882798423E-5,1,0,1.1251919292862598,0.47621310701817093,1.0000022395832229,2.1164021560173864E-3,1.0000000237517426,2.1795294054882528E-4,1.0000000024405551,6.9864944645686754E-5,6.3078556449960477,7.7410318947438453E-5,1.0000000001239766,2.2065423664975169E-5,84.0527759502327,-28.137516356720607,151.8624836432794,null,1000000000,144.55252899999999,null,79.803340781187131,-27.176228084340092,null,48.205870240490547,-0.96085595427768544,null,0,0]
[13.183,1.3183E-2,1.0001694565558219,1.8408293222246207E-2,1.0000000010003356,4.4728865147516753E-5,1,0,1.1488571674895085,0.51472076249070431,1.0000026925880685,2.3205956247811391E-3,1.0000000285560602,2.3898141945042153E-4,1.0000000029342118,7.6605636277216478E-5,6.307855648772283,8.4879001437187756E-5,1.0000000001490537,2.4194334207173552E-5,83.871743674967092,-30.426074641322799,149.5739253586772,null,1000000000,173.79148899999998,null,79.622556081336285,-29.37205964349555,null,48.205622665987768,-1.0535409689206698,null,0,0]
[14.454000000000001,1.4454E-2,1.0002037035210225,2.0182613694062112E-2,1.0000000012025227,4.9041266536832515E-5,1,0,1.1766585229773801,0.55506869700865535,1.0000032368114034,2.5443280733593318E-3,1.0000000343277931,2.6202210600357294E-4,1.0000000035272727,8.3991342358575899E-5,6.3078556533089181,9.3062359568270406E-5,1.0000000001791802,2.6526959464981186E-5,83.663762805432498,-32.82793555688702,147.17206444311299,null,1000000000,208.91811600000003,null,79.414872621272323,-31.672327215125712,null,48.205325257612806,-1.1550886107587011,null,0,0]
[15.849,1.5848999999999999E-2,1.0002449160337588,2.2129891895371658E-2,1.0000000014458426,5.3774390010805143E-5,1,0,1.2092685726371737,0.59714170170665282,1.0000038917495446,2.7898877838506467E-3,1.0000000412737102,2.8731066409441535E-4,1.0000000042409845,9.2097605120221667E-5,6.3078556587684709,1.0204409408825993E-4,1.0000000002154357,2.9087157918584542E-5,83.425964120400607,-35.337417036879657,144.66258296312034,null,1000000000,251.19080099999999,null,79.177431822820282,-34.070312211114114,null,48.204967372351533,-1.266534933926045,null,0,0]
[17.378,1.7378000000000001E-2,1.0002944437358434,2.4264027134712336E-2,1.0000000017382684,5.896216476910796E-5,1,0,1.2473324292071277,0.64064416941317781,1.0000046788655679,3.0590349212475413E-3,1.0000000496214401,3.15028373578559E-4,1.0000000050987361,1.0098253396832654E-4,6.3078556653298632,1.1188859018509915E-4,1.0000000002590081,3.1893282245034603E-5,83.156351861218084,-37.938287413329824,142.06171258667018,null,1000000000,301.99488400000001,null,78.908249639232451,-36.548987124664798,null,48.204537298341521,-1.3886754176719527,null,0,0]
[19.055,1.9054999999999999E-2,1.0003540036244964,2.660448172378161E-2,1.0000000020899464,6.4652091691330395E-5,1,0,1.2916240462670225,0.68531598246002279,1.0000056254683058,3.3542337230749574E-3,1.0000000596606089,3.4542902626099605E-4,1.0000000061302876,1.1072748207176732E-4,6.3078556732207396,1.2268598712222192E-4,1.0000000003114096,3.4971026192204663E-5,82.852764672452381,-40.616630754715281,139.38336924528471,null,1000000000,363.09302500000001,null,78.605179612716384,-39.093321661984909,null,48.204020137997617,-1.5226239208609198,null,0,{"$f":"IF(AH45>0,W43,0)","v":0}]
[20.893000000000001,2.0893000000000002E-2,1.0004255747693813,2.9169295361206882E-2,1.0000000025125739,7.0888278736624645E-5,1,0,1.3429200893765254,0.73079209319495508,1.0000067630428253,3.6777723447379272E-3,1.0000000717251363,3.7874828588948514E-4,1.0000000073699502,1.2140799165644294E-4,6.3078556827035666,1.345199856411154E-4,1.0000000003743825,3.8344248240243348E-5,82.513872052907416,-43.352446677943533,136.64755332205647,null,1000000000,436.51744900000006,null,78.266908409182193,-41.682282534146871,null,48.203398724277108,-1.6694128818794789,null,0,0]
[22.909000000000002,2.2909000000000002E-2,1.0005116439499695,3.1982054204265864E-2,1.0000000030208525,7.7728405543820651E-5,1,0,1.4021284766804984,0.77674148638499341,1.0000081311598017,4.0326429808911299E-3,1.0000000862346956,4.1529432812481353E-4,1.0000000088608465,1.3312284870975905E-4,6.3078556941082118,1.4750004055715888E-4,1.0000000004501177,4.204414794011161E-5,82.138383792728447,-46.127966105577876,133.87203389442212,null,1000000000,524.82228100000009,null,77.892167385242487,-44.296750182363986,null,48.202651490792206,-1.8303921707988422,null,0,0]
[25.119,2.5118999999999999E-2,1.0006150887928091,3.5064902101198538E-2,1.0000000036318002,8.5226758831026973E-5,1,0,1.4701442893082521,0.82275359680230431,1.0000097756257491,4.4216617043937954E-3,1.000000103675099,4.5535720052719829E-4,1.0000000106528948,1.45965028274716E-4,6.3078557078165263,1.6172916816187876E-4,1.0000000005411511,4.6100089575033835E-5,81.726056891115206,-48.920788548651629,131.07921145134839,null,1000000000,630.96416099999999,null,77.480738487007827,-46.913056221250955,null,48.201753490724371,-2.0068291087164525,null,0,0]
[27.542000000000002,2.7542000000000001E-2,1.0007394300207628,3.8444106894092694E-2,1.000000004366246,9.3447804075593273E-5,1,0,1.54795821505634,0.86844765796771262,1.0000117525036145,4.8481725453166291E-3,1.0000001246409385,4.9928133451273757E-4,1.0000000128071913,1.6004493821284569E-4,6.3078557242958668,1.7732970029875063E-4,1.0000000006505863,5.0546943231322123E-5,81.277009156432229,-51.710429854552828,128.28957014544716,null,1000000000,758.56176400000004,null,77.032770034106221,-49.509212474202705,null,48.200674212923012,-2.2002270364315741,null,0,0]
[30.2,3.0199999999999998E-2,1.0008889709264492,4.215003838386408E-2,1.0000000052496596,1.0246618551379162E-4,1,0,1.6366611646268701,0.91347311335957526,1.0000141303466135,5.316047446445195E-3,1.0000001498592803,5.4746554530480534E-4,1.0000000153984439,1.7549041920261082E-4,6.3078557441177123,1.9444328436106143E-4,1.0000000007822178,5.5425084798362897E-5,80.791740871874907,-54.478344507590293,125.52165549240971,null,1000000000,912.04,null,76.548799586910647,-52.064934536474119,null,48.199376380348539,-2.4123240519316709,null,0,0]
[33.113,3.3112999999999997E-2,1.0010686407583664,4.6210171272000319E-2,1.0000000063112344,1.1234976154029555E-4,1,0,1.7372722120963633,0.95744024808415984,1.0000169877306719,5.8288060852387273E-3,1.0000001801634992,6.002723919018841E-4,1.0000000185122839,1.92417690032881E-4,6.3078557679371032,2.131986906933477E-4,1.0000000009403964,6.0771219630062954E-5,80.272024449136836,-57.203595718204653,122.79640428179535,null,1000000000,1096.470769,null,76.030642228390789,-54.557712499851981,null,48.197817321883043,-2.6446925547194082,null,0,0]
[36.308,3.6308E-2,1.0012846725558799,5.0661597729418119E-2,1.0000000075879054,1.2319014098792591E-4,1,0,1.8510402505813923,1.000077884482895,1.0000204240665109,6.3912000278934355E-3,1.0000002166079518,6.5819132895368366E-4,1.0000000222570498,2.1098364606868806E-4,6.3078557965827757,2.3376975926081117E-4,1.0000000011306249,6.6634899954196912E-5,79.719219970904305,-59.872525736077108,120.12747426392289,null,1000000000,1318.2708640000001,null,75.479711970681649,-56.971764827980458,null,48.195943108277987,-2.8994553599777455,null,0,0]
[39.811,3.9810999999999999E-2,1.001544321167011,5.5539829720572309E-2,1.0000000091227008,1.3507553976677955E-4,1,0,1.979172688230467,1.0411112239544156,1.0000245551639819,7.0078044392011792E-3,1.0000002604209424,7.2169368270390201E-4,1.0000000267589531,2.3133937172059804E-4,6.3078558310201869,2.5632389149136611E-4,1.0000000013593149,7.3063842730719154E-5,79.13564684681765,-62.471187928651581,117.52881207134843,null,1000000000,1584.9157210000001,null,74.898390937181688,-59.291111588138349,null,48.193691026008423,-3.1786448329755683,null,0,0]
[43.652000000000001,4.3652000000000003E-2,1.00185640202701,6.0885707879476378E-2,1.0000000109679523,1.4810774546346491E-4,1,0,2.1230101724114774,1.0803390580821133,1.0000295218711266,7.6838980811618001E-3,1.0000003130963571,7.9132329082637549E-4,1.0000000321714946,2.5365919514477858E-4,6.3078558724235476,2.8105424286557957E-4,1.0000000016342638,8.0113105990264237E-5,78.523615716372476,-64.990121008944399,115.0098789910556,null,1000000000,1905.497104,null,74.289065901680473,-61.50395309605782,null,48.190984941063981,-3.4845982922708236,null,0,0]
[47.863,4.7863000000000003E-2,1.0022314246245811,6.6742537117217587E-2,1.000000013186122,1.623953314999296E-4,1,0,2.2839584606207772,1.1176056684498312,1.0000354922983048,8.4251111071554884E-3,1.0000003764172696,8.676602462651357E-4,1.00000003867789,2.7812906635554503E-4,6.307855922194368,3.0816684587077752E-4,1.000000001964779,8.7841418298684957E-5,77.88569375003658,-67.422593105138901,112.5774068948611,null,1000000000,2290.8667689999997,null,73.654394691628255,-63.601077996540816,null,48.187734196800669,-3.8197940706039462,null,0,0]
[52.481000000000002,5.2481E-2,1.002682185626949,7.3160156052041458E-2,1.0000000158533651,1.7806383589188138E-4,1,0,2.4636067933970964,1.1528231673936227,1.0000426714042538,9.2379529047426079E-3,1.0000004525576334,9.5137528096524084E-4,1.0000000465015195,3.0496399003977325E-4,6.3078559820413993,3.3789992554749375E-4,1.0000000023622078,9.6316684560105817E-5,77.224185942499005,-69.766087665468419,110.23391233453158,null,1000000000,2754.255361,null,72.996792543757323,-65.577116167040984,null,48.183828551587958,-4.1870844083263759,null,0,0]
[57.544000000000004,5.7544000000000005E-2,1.0032237940299589,8.01892397022681E-2,1.0000000190597567,1.952421895668823E-4,1,0,2.6635787369767856,1.1859305413411501,1.0000513016049752,1.012910774539757E-2,1.0000005440887745,1.043157253619906E-3,1.0000000559065938,3.3438478178419946E-4,6.3078560539857298,3.7049814540063053E-4,1.0000000028399714,1.0560864494601757E-4,76.54168668476305,-72.019666797576207,107.98033320242379,null,1000000000,3311.3119360000005,null,72.318983779627715,-67.428228275517199,null,48.179138075357187,-4.5893693787374055,null,0,0]
[63.095999999999997,6.3095999999999999E-2,1.0038746258516227,8.7888070548931899E-2,1.0000000229150554,2.1407968096152019E-4,1,0,2.8857309382491638,1.2169241406087712,1.00006167828084,1.110631449505727E-2,1.0000006541439106,1.1438037891918218E-3,1.00000006721506,3.6664712276511757E-4,6.3078561404901015,4.0624479997555042E-4,1.0000000034144247,1.1579805123369138E-4,75.840336875649541,-74.186060681634714,105.81393931836529,null,1000000000,3981.1052159999995,null,71.623267023568346,-69.153807506687102,null,48.173505043195092,-5.0299843951623497,null,0,0]
[69.183000000000007,6.9183000000000008E-2,1.0046564558143567,9.6316753514958692E-2,1.0000000275496468,2.3473238433814988E-4,1,0,3.1320002065349728,1.2458216576105845,1.0000741523086556,1.2177662075131608E-2,1.0000007864450795,1.2541487664539334E-3,1.0000000808093685,4.0201831596888249E-4,6.3078562444800745,4.4543606076016107E-4,1.0000000041049952,1.2696932573521698E-4,75.122363102475674,-76.269308642083089,103.73069135791691,null,1000000000,4786.2874890000012,null,70.91205528658675,-70.754451877885302,null,48.166743032117893,-5.5123691106624007,null,0,0]
[75.858000000000004,7.5858000000000009E-2,1.0055957208945909,0.10554384375029434,1.0000000331222652,2.5738012437985421E-4,1,0,3.4046080777325152,1.2726806044062329,1.0000891508351146,1.3352468864766391E-2,1.0000009455235728,1.3751529571736695E-3,1.0000000971551228,4.4080634087050432E-4,6.3078563695172942,4.8841316874618027E-4,1.0000000049353353,1.3921973763582427E-4,74.389468386599717,-78.276152118006721,101.72384788199328,null,1000000000,5754.4361640000006,null,70.187277305981183,-72.232977731774113,null,48.158626327045795,-6.0404467159162261,null,0,0]
[83.176000000000002,8.3176E-2,1.0067236508785113,0.11563903206738525,1.0000000398211055,2.8220951158498223E-4,1,0,3.7058621066715598,1.2975666132342525,1.0001071802550554,1.4640401833621948E-2,1.0000011367516792,1.5078133853271118E-3,1.0000001168043418,4.8333079870230088E-4,6.3078565198244414,5.3553024179742517E-4,1.0000000059334864,1.5265022665512319E-4,73.643443622431349,-80.213844866893055,99.786155133106945,null,1000000000,6918.2469760000004,null,69.450989627513607,-73.592648767328996,null,48.148889277646319,-6.6182052917783496,null,0,0]
[91.201000000000008,9.1201000000000004E-2,1.0080782118594036,0.12668230230246233,1.0000000478758446,3.0943769269806815E-4,1,0,4.0384454146276649,1.3205733106028528,1.0001288585433818,1.6052707422714613E-2,1.0000013666858352,1.6532902216478511E-3,1.0000001404307193,5.299635889937502E-4,6.3078567005549511,5.8719934422199038E-4,1.0000000071336712,1.6737824992066948E-4,72.885451546669913,-82.091752717528749,97.908247282471251,null,1000000000,8317.6224010000005,null,68.704676668365892,-74.83825148760819,null,48.137210204681608,-7.2502218627049837,null,0,0]
[100,0.1,1.0097043063716713,0.13875498431789285,1.0000000575595311,3.3929199318034138E-4,1,0,4.4051730774270226,1.3417941773511244,1.000154920310347,1.7601154095029721E-2,1.00000164312057,1.8127980142363046E-3,1.0000001688351676,5.8109404387912688E-4,6.3078569178354229,6.4385185559450223E-4,1.000000008576575,1.835267703613297E-4,72.116700712036874,-83.919283320159792,96.080716679840208,null,1000000000,10000,null,67.949925421034834,-75.974537255382089,null,48.123210669855958,-7.941150307030826,null,0,0]
[109.65,0.10965000000000001,1.0116562849526674,0.15194851561409067,1.000000069204529,3.7203366763402361E-4,1,0,4.8092845666614288,1.3613369376144506,1.0001862596685007,1.9299262293762182E-2,1.0000019755436613,1.9877325820985042E-3,1.000000202992587,6.3716960460408483E-4,6.3078571791233724,7.0598354028387014E-4,1.0000000103117213,2.0123710358057044E-4,71.337844526556282,-85.70714900288894,94.29285099711106,null,1000000000,12023.122500000001,null,67.187844720994065,-77.006983519171911,null,48.106435247520892,-8.696222735626371,null,0,0]
[120.23,0.12023,1.0139979146083402,0.16635237822900492,1.0000000832037568,4.0793075642667914E-4,1,0,5.2541115112922308,1.3793009631271531,1.0002239334999572,2.1160894094088941E-2,1.0000023751714693,2.1795259888349769E-3,1.0000002440554956,6.9864933392079062E-4,6.3078574932350184,7.7410303919619615E-4,1.000000012397656,2.2065423571415317E-4,70.549710475106693,-87.465453892752137,92.534546107247863,null,1000000000,14455.252900000001,null,66.419792199607471,-77.940571672760271,null,48.086353793320349,-9.5205590411260452,null,0,0]
[131.83000000000001,0.13183,1.0168058726801361,0.18206501543404727,1.0000001000335639,4.4728862194421017E-4,1,0,5.7434553301302573,1.3957931991500363,1.0002692229288643,2.3201833630821452E-2,1.0000028556019736,2.3898096904369217E-3,1.0000002934211336,7.660562144192922E-4,6.3078578708585749,8.487898162647347E-4,1.0000000149053574,2.419433408383645E-4,69.752600699883004,-89.205150200997238,90.794849799002762,null,1000000000,17379.148900000004,null,65.646702072077289,-78.78061833947099,null,48.062334236828299,-10.419791575311157,null,0,0]
[144.54,0.14454,1.020169031933901,0.19917717792162384,1.0000001202522841,4.9041262644598793E-4,1,0,6.2811247376191277,1.4109088141186188,1.0003236292962074,2.5437847407743571E-2,1.0000034327734668,2.620215123597384E-3,1.000000352727219,8.3991322805399232E-4,6.3078583245218036,9.3062333457391414E-4,1.0000000179180188,2.652695930242064E-4,68.947102940679557,-90.936075633247683,89.063924366752317,null,1000000000,20891.811599999997,null,64.869886076178815,-79.531766389320097,null,48.033652583089406,-11.399111937658871,null,0,0]
[158.49,0.15849000000000002,1.024201740448677,0.21782336595222856,1.0000001445842408,5.3774384879352291E-4,1,0,6.8726303608440018,1.4247732471603305,1.0003891000123386,2.78917152047852E-2,1.0000041273625946,2.8730988144540369E-3,1.0000004240983558,9.2097579341657071E-4,6.3078588704769052,1.020440596641364E-3,1.0000000215435674,2.9087157704267563E-4,68.131686592022859,-92.671946525488053,87.328053474511947,null,1000000000,25119.080100000003,null,64.088737149014193,-80.200032788655733,null,47.999385293453194,-12.466214823390926,null,0,0]
[173.78,0.17377999999999999,1.0290274130848296,0.23808493519982513,1.0000001738268289,5.896215800463274E-4,1,0,7.5222216728288087,1.437462160279211,1.0004677782431253,3.0580908057568121E-2,1.0000049621318248,3.1502734186203995E-3,1.0000005098734819,1.0098249998605005E-3,6.3078595266156308,1.1188854480592174E-3,1.0000000259008177,3.1893281962513845E-4,67.307070974493143,-94.420856839926657,85.579143160073343,null,1000000000,30199.488400000002,null,63.304950172391969,-80.788855491894338,null,47.958556811012429,-13.625752644631602,null,0,0]
[190.55,0.19055000000000002,1.0348010711030011,0.26008037239968268,1.0000002089946267,6.4652082773451476E-4,1,0,8.2358525781803298,1.4490756444251938,1.0005623902714817,3.352989200381562E-2,1.000005966043287,3.4542766610933429E-3,1.0000006130285815,1.1072743727157327E-3,6.3078603157028335,1.2268592729703918E-3,1.0000000311409456,3.4971025819746215E-4,66.47203645552375,-96.194066295105728,83.805933704894272,null,1000000000,36309.302500000005,null,62.518514086847937,-81.302712888268587,null,47.909958568162629,-14.884501696751233,null,0,0]
[208.93,0.20893,1.0416972042127604,0.28389460110175768,1.0000002512573725,7.0888266981232971E-4,1,0,9.0190596319741392,1.4596915791600458,1.0006760780287132,3.6761320625972517E-2,1.000007172488167,3.7874649296394036E-3,1.0000007369947574,1.214079326016184E-3,6.307861263984802,1.3451990678061867E-3,1.0000000374382465,3.8344247749275113E-4,65.626266463208239,-97.999732950956982,82.000267049043018,null,1000000000,43651.744900000005,null,61.730436591070386,-81.744904204390807,null,47.852266300647926,-16.247316138742189,null,0,0]
[229.09,0.22909000000000002,1.049930934846226,0.30963910949388174,1.0000003020852071,7.7728390046626961E-4,1,0,9.8790903686441442,1.4693987691510479,1.0008127889730056,4.0304809464152644E-2,1.0000086234327583,4.1529196450579902E-3,1.0000008860842604,1.3312277085748749E-3,6.307862404448171,1.4749993659497426E-3,1.0000000450117765,4.2044147292865611E-4,64.767941873435561,-99.847803390430329,80.152196609569671,null,1000000000,52482.2281,null,60.940496566236831,-82.118997279851527,null,47.783882011146432,-17.720568601388194,null,0,0]
[251.19,0.25119000000000002,1.0597431726527464,0.33738092972631828,1.0000003631799568,8.5226738402282805E-4,1,0,10.822773357072879,1.4782665885902848,1.0009770900006185,4.4188122295732921E-2,1.0000103674566947,4.553540847585847E-3,1.0000010652889217,1.459649256481409E-3,6.3078637752780482,1.6172903111664886E-3,1.0000000541151144,4.6100088721819766E-4,63.896122646177467,-101.74466000763674,78.255339992363261,null,1000000000,63096.416100000002,null,60.149475128392623,-82.427542375866182,null,47.703084552806672,-19.30808546464878,null,0,0]
[275.42,0.27542,1.0714199362659518,0.3671870672948882,1.0000004366245117,9.3447777146544379E-4,1,0,11.858223456995614,1.4863663899270676,1.0011745674631587,4.8444172825205342E-2,1.0000124640169452,4.9927722733517583E-3,1.0000012807183143,1.6004480293112884E-3,6.3078654232097096,1.7732951964658577E-3,1.0000000650586185,5.0546942106620321E-4,63.009014765886555,-103.69653149896259,76.303468501037415,null,1000000000,75856.176400000011,null,59.357549020155034,-82.672939181831381,null,47.607903178751073,-21.01368890394113,null,0,0]
[302,0.30199999999999999,1.085298674200178,0.39911480153013773,1.0000005249658246,1.0246615001158269E-3,1,0,12.994844238380782,1.4937665758354643,1.0014120477053072,5.3110980773219144E-2,1.0000149858168719,5.4746013057789126E-3,1.0000015398432076,1.7549024085250272E-3,6.3078674053909243,1.9444304619635059E-3,1.0000000782217944,5.5425083315599726E-4,62.104233147619219,-105.7086572796875,74.2913427203125,null,1000000000,91204,null,58.564558213686823,-82.85715697299085,null,47.496112845675107,-22.840641149122888,null,0,0]
[331.13,0.33112999999999998,1.1017451388503245,0.43314325547034149,1.0000006311232521,1.1234971474199545E-3,1,0,14.241189342615284,1.5005196395099891,1.0016973470029256,5.8222841785320084E-2,1.0000180161892602,6.0026525434271061E-3,1.0000018512267039,1.9241745493540233E-3,6.3078697873252541,2.1319837674950363E-3,1.0000000940396376,6.0771217675514031E-4,61.180540210038117,-107.78108084683241,72.21891915316759,null,1000000000,109647.0769,null,57.77150247676844,-82.981446066299299,null,47.365476220280712,-24.787728189376111,null,0,0]
[363.08,0.36307999999999996,{"$f":"SQRT(1+(A77/pole1)^2)","v":1.1212045083451825},{"$f":"ATAN(A77/pole1)","v":0.46927156963819022},{"$f":"SQRT(1+(A77/Zero1)^2)","v":1.0000007587902615},{"$f":"ATAN(A77/Zero1)","v":1.2319007929414258E-3},{"$f":"IF(VIN_nom>Vout, 1, SQRT(1+(A77/z_RHP)^2))","v":1},{"$f":"IF(VIN_nom>Vout, 0, -ATAN(A77/z_RHP))","v":0},{"$f":"SQRT(1+(A77/Pole2)^2)","v":15.608811643659564},{"$f":"ATAN(A77/Pole2)","v":1.506686042624116},{"$f":"SQRT(1+(A77/Zero2)^2)","v":1.002040346002316},{"$f":"ATAN(A77/Zero2)","v":6.3826058240593675E-2},{"$f":"SQRT(1+(A77/pole4)^2)","v":1.0000216605629415},{"$f":"ATAN(A77/pole4)","v":6.5818191961293125E-3},{"$f":"IF(VOUT_setting=1,1,SQRT(1+(A77*zterm1)^2))","v":1.0000022257025347},{"$f":"IF(VOUT_setting=1,0,ATAN(((A77*zterm1))))","v":2.10983336141863E-3},6.3078726518854564,{"$f":"IF(VOUT_setting=1,0,ATAN(A77*$Q$4/(1+Afbr-$Q$5*(A77)^2)))","v":2.3376934539159401E-3},{"$f":"SQRT((1-(Z77/pterm2))^2+(A77/pterm1)^2)","v":1.0000001130624891},{"$f":"IF((ATAN((A77/pterm1)/(1-A77^2/pterm2))>0),ATAN((A77/pterm1)/(1-A77^2/pterm2)),PI()+ATAN((A77/pterm1)/(1-A77^2/pterm2)))","v":6.6634897377532056E-4},{"$f":"20*LOG10(((E77*K77*G77*O77)/(C77*I77*S77*M77*Q77))*Adc)","v":60.23493706838952},{"$f":"((F77+L77+H77+P77)-(D77+J77+T77+N77+R77))*radconv","v":-109.91483019557329},{"$f":"IF(V77>0,V77,V77+180)","v":70.085169804426712},null,{"$f":"IF(U77<0,A77,1000000000)","v":1000000000},{"$f":"A77^2","v":131827.0864},null,{"$f":"20*LOG10((K77/(I77*M77))*AEA)","v":56.977972931327621},{"$f":"(L77-(J77+N77))*radconv","v":-83.046898089839004},null,{"$f":"20*LOG10((E77*G77/(C77*S77))*Acs*Am)","v":47.213403315900962},{"$f":"(F77+H77-(D77+T77))*radconv","v":-26.854876684099807},null,{"$f":"SUM((U78<0)*(U77>0))*A77","v":0},{"$f":"IF(AH77>0,W75,0)","v":0}]
[398.11,{"$f":"A78/1000","v":0.39811000000000002},1.1441602711984336,0.50741520537568185,1.0000009122696671,1.350754584381222E-3,1,0,17.10884136882861,1.5123136836653928,1.0024525390720453,6.9964806629476017E-2,1.0000260417585387,7.216812787778068E-3,1.0000026758917606,2.3133896315555083E-3,6.307876095616459,2.5632334590297897E-3,1.000000135931485,7.3063839333995569E-4,59.265415796852345,-112.10553096705448,67.894469032945523,null,1000000000,158491.57210000002,null,56.184491922109487,-83.053996248770517,null,47.037363885286013,-29.037219721415916,null,0,0]
[436.52,0.43651999999999996,1.1711639630088408,0.5474561329108204,1.0000010967946278,1.4810763825065332E-3,1,0,18.754125391930732,1.5174494256768063,1.0029478856747289,7.668979271274802E-2,1.0000313091504693,7.913069392518849E-3,1.0000032171443269,2.536586565475619E-3,{"$f":"IF(VOUT_setting=1,1,SQRT((1+Afbr-$Q$5*(A79)^2)^2+(A79*$Q$4)^2))","v":6.3078802359377715},2.8105352363531799E-3,1.0000001634263873,8.011310151247778E-4,58.26952029452984,-114.34649585864059,65.653504141359406,null,1000000000,190549.71039999998,null,55.391212794569213,-83.002831835688127,null,46.834748510441564,-31.327967920290032,null,0,0]
[478.63,0.47863,1.2028228674670836,0.58921420301155336,1.0000013186113386,1.6239519017008624E-3,1,0,20.558371165637688,1.5221351389576345,1.0035430163332795,8.405459010679317E-2,1.000037641025616,8.6763869148717629E-3,1.0000038677815972,2.7812835636744212E-3,6.3078852129987251,3.0816589776925104E-3,1.0000001964779055,8.7841412395985399E-4,57.245100998139769,-116.6270476710078,63.372952328992199,null,1000000000,229086.67689999999,null,54.598472571010262,-82.893066495374029,null,46.60307063962869,-33.716770932121392,null,0,0]
[524.80999999999995,0.52481,1.2398211715257783,0.63247325485718842,1.0000015853352595,1.7806364958011054E-3,1,0,22.537432046425167,1.5264111273449805,1.0042581654811866,9.2120683940617093E-2,1.0000452547495733,9.5134686606717454E-3,1.0000046501412374,3.0496305407992988E-3,6.3078911976712968,3.3789867568883602E-3,1.0000002362207749,9.6316676778715048E-4,56.189760971966614,-118.93395205576819,61.066047944231812,null,1000000000,275425.53609999997,null,53.806279460948829,-82.723870700329755,null,46.339925168881848,-36.191210634278569,null,0,0]
[575.44000000000005,0.57544000000000006,1.2828866242916908,0.67694171334441144,1.0000019059738614,1.9524194396371591E-3,1,0,24.707593343089588,1.5303118812478194,1.0051171992262884,0.10095021199545998,1.0000544074121767,1.0431197964361393E-2,1.0000055906439036,3.3438354796774517E-3,6.3078983920601557,3.704964977916923E-3,1.0000002839971491,1.0560863468829268E-3,55.102003900880987,-121.24929304694902,58.75070695305098,null,1000000000,331131.19360000006,null,53.015106334966916,-82.494054758821051,null,46.043342961298102,-38.73454709199752,null,0,0]
[630.96,0.63096000000000008,1.3328264864090582,0.72230294562876485,1.0000022915029345,2.1407935718966023E-3,1,0,27.087715016162583,1.533870831814816,1.0061491125022326,0.11061435084975904,1.0000654122730797,1.1437544110581658E-2,1.0000067214836448,3.6664549626048686E-3,6.3079070424333414,4.0624262798086095E-3,1.0000003414424707,1.1579803771121068E-3,53.9802766697224,-123.55319942221921,56.446800577780792,null,1000000000,398110.52160000004,null,52.225085093530751,-82.201912623399764,null,45.711639060724124,-41.328599313509493,null,0,0]
[691.83,0.69183000000000006,1.390488914355831,0.76818711655863303,1.0000027549609192,2.3473195753113932E-3,1,0,29.697517225746516,1.5371171116041629,1.0073882129485101,0.12118588882378174,1.0000786414466474,1.2540836755360349E-2,1.0000080809045389,4.0201617185782468E-3,6.3079174413382537,4.4543319756745227E-3,1.0000004104995306,1.2696930790941656E-3,52.824019268095668,-125.82243263586246,54.177567364137545,null,1000000000,478628.74890000006,null,51.436705101716782,-81.845420257280466,null,45.343764162336996,-43.952136255231828,null,0,0]
[758.58,0.75858000000000003,1.4568031398068917,0.81422174097131716,1.0000033122210821,2.5737956173125182E-3,1,0,32.559723836300414,1.5400787050979421,1.0088760884321049,0.13274733729581992,1.0000945479323273,1.3750671511025075E-2,1.0000097154655712,4.4080351434824683E-3,6.3079299449266646,4.8840939428007671E-3,1.0000004935335254,1.3921971413651975E-3,51.632823338930649,-128.03304824048729,51.96695175951271,null,1000000000,575443.61640000006,null,50.650174833208069,-81.422003287525669,null,44.939101521391109,-46.583768792929455,null,0,0]
[831.76,0.83175999999999994,1.532726630490858,0.86000713017028452,1.0000039821027042,2.8220876988747433E-3,1,0,35.697918641937889,1.5427798241312707,1.0106617632876909,0.1453814949406928,1.0001136687722474,1.5077002761399892E-2,1.0000116803666523,4.8332707271557512E-3,6.3079449754483239,5.3552526621181299E-3,1.0000005933486287,1.5265019567772718E-3,50.407498380835946,-130.15933001266819,49.840669987331808,null,1000000000,691824.69759999996,null,49.86612524043781,-80.928875279662989,null,44.497829786029456,-49.200547371115618,null,0,0]
[912.01,0.91200999999999999,1.6193110024220994,0.90517671445267334,1.0000047875731284,3.0943671494068543E-3,1,0,39.139546965859488,1.5452439403581193,1.0128047043378001,0.15918258148675729,1.0001366593390062,1.653141117237767E-2,1.0000140429743098,5.2995867714745876E-3,6.3079630482203184,5.871927850743996E-3,1.0000007133671061,1.6737820908406908E-3,49.148928543887308,-132.17685090174913,47.823149098250866,null,1000000000,831762.24009999994,null,49.084865085437805,-80.362646190897195,null,44.020524468735317,-51.781411982530351,null,0,0]
[1000,1,1.7176375143055658,0.94937050407144397,1.0000057559367082,3.3929070424303697E-3,1,0,42.913342729374826,1.5474914416067362,1.0153750351961832,0.17424461273377229,1.0001642986949695,1.8126014623840062E-2,1.0000168833756682,5.810875688090673E-3,6.3079847758641723,6.4384320896621414E-3,1.0000008576574748,1.8352671652806256E-3,47.859149829716188,-134.06142503442658,45.938574965573423,null,1000000000,1000000,null,48.307109462707338,-79.719791752576413,null,43.508506624573059,-54.305676948592598,null,0,0]
[1096.5,1.0965,1.8288914370249678,0.99228356603527124,1.000006920429185,3.7203196838476813E-3,1,0,47.052330487583518,1.5495417941047673,1.0184573643342023,0.19067181136806521,1.0001975350512178,1.987473471273811E-2,1.0000202990547198,6.3716106832546185E-3,6.3080109040760908,7.0597214118508613E-3,1.0000010311720817,2.0123703261027788E-3,46.540286856654596,-135.79148145575184,44.208518544248165,null,1000000000,1202312.25,null,47.533372386627455,-78.996253426076493,null,42.963387037554142,-56.755802189044061,null,0,0]
[1202.3,1.2022999999999999,1.9542714967491865,1.0336344642775372,1.000008320341411,4.0792851631853621E-3,1,0,51.590394234870431,1.5514116594526113,1.0221505342231501,0.20856291456434092,1.0002374892284245,2.1791844208463376E-2,1.0000244052547229,6.9863808064263141E-3,6.3080423143978699,7.7408801191097059E-3,1.0000012397655529,2.2065414215437828E-3,45.195689215629145,-137.34696814055644,42.653031859443558,null,1000000000,1445525.2899999998,null,46.764711409850207,-78.188146396832209,null,42.387457958806571,-59.11559211741254,null,0,{"$f":"IF(AH90>0,W90,0)","v":0}]
[1318.3,1.3183,2.0950938574873708,1.0732104111342391,1.0000100033068673,4.4728566888391922E-3,1,0,56.566137511060148,1.5531169847168997,1.0265728585304614,0.22802398668259757,1.0002855198442946,2.3893594379711381E-2,1.0000293416871948,7.6604137965430794E-3,6.3080800755354893,8.4877000639618696E-3,1.000001490535662,2.419432175013845E-3,43.828648532289506,-138.71141306443158,41.288586935568418,null,1000000000,1737914.89,null,46.002039120334615,-77.291238453375684,null,41.783098684054124,-61.372774599429519,null,0,0]
[1445.4,1.4454,2.2526618413990258,1.1108285088605339,1.0000120251568347,4.9040873426842747E-3,1,0,62.018165056321166,1.5546713199298778,1.0318606169602769,0.24914686163757682,1.0003432190362314,2.619621724160117E-2,1.0000352721060612,8.398936757048418E-3,6.3081254400990083,9.3059722503494174E-3,1.0000017918017781,2.6526943046385944E-3,42.443678566077104,-139.87073366527784,40.129266334722161,null,1000000000,2089181.1600000001,null,45.246915542190735,-76.301974285591228,null,41.15326325104445,-63.516790073992517,null,0,0]
[1584.9,1.5849000000000002,2.4287693414175582,1.1464434375857526,1.0000144583206114,5.3773871742969024E-3,1,0,68.002241196003808,1.5560903990582093,1.0381883944398882,0.27207142315697824,1.0004126519704011,2.8723165528087805E-2,1.000042408945325,9.2095001616366492E-3,6.3081800330638389,1.0204061746419251E-2,1.0000021543565807,2.9087136272600341E-3,41.042291494283049,-140.81649448393861,39.183505516061388,null,1000000000,2511908.0100000002,null,44.499329062160712,-75.214584378810969,null,40.499475842623205,-65.544925923788639,null,0,0]
[1737.8,1.7378,2.624831744703966,1.1799437849699357,1.0000173825333354,5.8961481571219295E-3,1,0,74.561262660429406,1.5573841346444857,1.0457425736162522,0.29686487634043568,1.0004960913603094,3.1492423159471726E-2,1.0000509860613906,1.0097910196628722E-2,6.3082456432585916,1.1188400722481241E-2,1.0000025900815355,3.1893253710486812E-3,39.630440729145718,-141.54000651586148,38.459993484138522,null,1000000000,3019948.84,null,43.761776479224039,-74.026816514048647,null,39.825193503853399,-67.450709497011076,null,0,0]
[1905.5,1.9055,2.8427672566694326,1.2113351317472874,1.0000208992464694,6.4651191007920571E-3,1,0,81.755285877745891,1.5585643967565612,1.0547557454586813,0.32363153929216415,1.0005964282450508,3.4529174822735369E-2,1.0000613009980246,1.1072295758167122E-2,6.3083245466613107,1.2267994531233554E-2,1.0000031140942178,3.4970988573977554E-3,38.211270397735426,-142.03766094930748,37.96233905069252,null,1000000000,3630930.25,null,43.035395902561227,-72.73481678526457,null,39.132422801978485,-69.234335670698968,null,0,0]
[2089.3000000000002,2.0893000000000002,3.0843648497653668,1.2406136327931354,1.0000251254247519,7.088709147750524E-3,1,0,89.640078449935274,1.5596403711090971,1.06548642126155,0.35242485606508561,1.0007169943484666,3.7856735455324746E-2,1.0000736967873063,1.214020276413354E-2,6.3084193671753566,1.3451202157650194E-2,1.0000037438241436,3.834419865257403E-3,36.789936054440517,-142.30796816150848,37.692031838491516,null,1000000000,4365174.4900000012,null,42.322542029352128,-71.337385223982025,null,38.423965227448832,-70.895468205247923,null,0,0]
[2290.9,2.2909000000000002,3.3519392588033332,1.2678488388282201,1.0000302080689998,7.7726840383429184E-3,1,0,98.288568262966095,1.5606220280884737,1.0782503685102942,0.38331913603092049,1.0008619754931403,4.1505584686969431E-2,1.0000886045399076,1.3311498645794839E-2,6.3085334024040014,1.4748954171667545E-2,1.0000045011769358,4.2044082568459254E-3,35.369498191336241,-142.35288243276264,37.647117567237359,null,1000000000,5248222.8100000005,null,41.624702031234548,-69.832581832025241,null,37.701394896435545,-72.437940465773025,null,0,0]
[2511.9,2.5119000000000002,3.647678604045435,1.2930937606222188,1.0000363173428055,8.5224695616885077E-3,1,0,107.76939414257025,1.5615171213329988,1.0933953862215815,0.41632265603403251,1.0010362141737665,4.5504289491757076E-2,1.0001065232753052,1.4595466430222533E-2,6.3086704693394164,1.6171532871751607E-2,1.0000054115104089,4.6100003400718504E-3,33.954893542491973,-142.17696246326324,37.823037536736763,null,1000000000,6309641.6100000003,null,40.944493833709302,-68.222013398945961,null,36.967031538384944,-73.864647108882281,null,0,0]
[2754.2,2.7542,3.9741751323782428,1.316437886872444,1.0000436615075234,9.3445084382725932E-3,1,0,118.16406541586193,1.56233341606658,1.1113286883295592,0.4514308807543907,1.0012456336604942,4.9886712273120679E-2,1.0001280637132675,1.6003127683794718E-2,6.3088352393066547,1.7731145779579367E-2,1.000006505860356,5.054682963692503E-3,32.549988520368281,-141.78787911100204,38.212120888997958,null,1000000000,7585617.6399999987,null,40.284183022967717,-66.508324866801473,null,36.222477106335887,-75.180546100276715,null,0,0]
[3020,3.02,4.3344343601058748,1.3379883938976502,1.0000524952183623,1.0246260001429999E-2,1,0,129.56696213918818,1.5630782332954447,1.1325232575685367,0.48861447781269374,1.001497471705163,5.4691962944275682E-2,1.0001539725855424,1.7547240913621379E-2,6.3090334238806891,1.9441923505999464E-2,1.0000078221772855,5.5424935040049939E-3,31.158027988960839,-141.19599659603648,38.80400340396352,null,1000000000,9120400,null,39.645913621606184,-64.695857152856775,null,35.468833819047319,-76.39158212699553,null,0,0]
[3311.3,3.3113000000000001,4.7311980615941343,1.3578271182997683,1.0000631103536635,1.1234503526634378E-2,1,0,142.06388488712363,1.5637571819826719,1.1574789411777342,0.5277415247360342,1.0018000151279527,5.9955303741784996E-2,1.0001851057096953,1.9239395040826026E-2,6.3092715688491641,2.1316699081878859E-2,1.0000094039606364,6.0771022221838469E-3,29.784182621846021,-140.41579730728702,39.584202692712978,null,1000000000,10964707.690000001,null,39.032821256912186,-62.794510605286803,null,34.708138300759849,-77.502265947546448,null,0,0]
[3630.8,3.6308000000000002,5.1681674656841619,1.376075972090663,1.0000758761763537,1.2318391047744475E-2,1,0,155.77066505836152,1.5643765887235606,1.186796318516405,0.56869483154170675,1.0021637388701865,6.5724342350483009E-2,1.0002225457378444,2.1095235173355899E-2,6.3095579548011536,2.3372797186778087E-2,1.0000113062443807,6.6634639712975811E-3,28.430967961221732,-139.46392673817704,40.536073261822963,null,1000000000,13182708.640000001,null,38.446890336218637,-60.814089922135707,null,33.940923681902476,-78.519342124943819,null,0,0]
[3981.1,3.9811000000000001,5.6489178272380043,1.3928333845497358,1.0000912228475221,1.3506732646250614E-2,1,0,170.79884454636726,1.5649414528000691,1.2211098677838386,0.61125725376718942,1.0026008276103981,7.2044474768719363E-2,1.0002675537415853,2.312981197638236E-2,6.3099022266353773,2.5626880829702426E-2,1.0000135931419634,7.3063499664694827E-3,27.102223155560424,-138.36121433963672,41.638785660363283,null,1000000000,15849157.209999999,null,37.890688776256134,-58.769924001537191,null,33.168463517405208,-79.44821883148721,null,0,0]
[4365.2,4.3651999999999997,6.1775806611534705,1.4082052317881775,1.000109673508796,1.4809691838021919E-2,1,0,187.2771259968128,1.5654566210151895,1.261128914084874,0.65517658394719536,1.0031260778786273,7.8967789734444044E-2,1.000321663216595,2.5360481760722194E-2,6.3103161124035392,2.8098163425804422E-2,1.0000163426293003,8.0112653738678499E-3,25.800745756111766,-137.13127845600155,42.868721543998447,null,1000000000,19054971.039999999,null,37.366238228142265,-56.67972543303437,null,32.391536530922224,-80.294695417728391,null,0,0]
[4786.3,4.7862999999999998,6.7585712284604735,1.4222908078650773,1.0001318525282386,1.6238105942141808E-2,1,0,205.34279266244604,1.5659264020230574,1.3076156022048941,0.70014193826084858,1.0037571154457074,8.6549289689828626E-2,1.0003867041376604,2.7805739048864662E-2,6.310813606994631,3.0807114093782152E-2,1.0000196477768888,8.7840822133711301E-3,24.529115576101418,-135.8008474695111,44.199152530488902,null,1000000000,22908667.690000001,null,36.875293558991039,-54.564704823003296,null,31.610971035597576,-81.064176523501601,null,0,0]
[5248.1,5.2481,7.3970030239520197,1.4351912208652475,1.0001585210871462,1.7804502194627415E-2,1,0,225.15457873364073,1.5663549190593056,1.3614133441258209,0.74582138895335337,1.0045153830150504,9.4852070675843336E-2,1.0004649071356144,3.0486951028391877E-2,6.3114117685286821,3.3777377432206698E-2,1.0000236220577625,9.6315898651816566E-3,23.288763079875558,-134.39838561815267,45.601614381847327,null,1000000000,27542553.610000003,null,36.418906264277602,-52.447731611774422,null,30.82715010132517,-81.762126460425833,null,0,0]
[5370.3,5.3703000000000003,7.5661267379402464,1.4382404552045911,1.000165988619043,1.8218982524279111E-2,1,0,230.39711469100357,1.566455981035294,1.3761007775926413,0.75730362583444355,1.0047276085369163,9.7046979674570696E-2,1.000486804236792,3.1196372764211971E-2,6.3115792539815896,3.4563262953844452E-2,1.0000247349251798,9.8558539600339893E-3,22.983866365568105,-134.0402420749781,45.959757925021904,null,1000000000,28840122.090000004,null,36.310351062947028,-51.921397345252828,null,30.630848976739593,-81.925936131554877,null,0,0]
[5432.85,5.4328500000000002,7.6527216928966002,1.4397490974976626,1.0001698774767596,1.8431138413796642E-2,1,0,233.08059039980523,1.5665059520958402,1.3836878441462015,0.76308628193416184,1.004838111848054,9.8170117006113292E-2,1.0004982074391298,3.1559489375389216E-2,6.311666473917505,3.4965514707075762E-2,1.0000253144750779,9.9706469781035059E-3,22.831248903169623,-133.8592370787029,46.140762921297096,null,1000000000,29515859.122500002,null,36.256572050221493,-51.657289715839667,null,30.532031558652161,-82.006796486219969,null,0,0]
[5495.4,5.4954000000000001,7.7393336756675328,1.4412239762247345,1.0001738113518925,1.8643292643963718E-2,1,0,235.7640666773847,1.5665547856111846,1.391320674469303,0.76880567986765846,1.0049498824199452,9.9293005923078034E-2,1.0005097425578142,3.1922597661524332E-2,6.3117547026303367,3.5367755347935681E-2,1.0000259007361141,1.008543992682643E-2,22.680889735946558,-133.67984252029308,46.320157479706921,null,1000000000,30199421.159999996,null,36.203958120847737,-51.396727102728846,null,30.434307594854317,-82.085722422150269,null,0,0]
[5559.4,5.5593999999999992,7.8279704851539682,1.4426992604944164,1.000177883014286,1.8860363180440883E-2,1,0,238.50975040778081,1.5666036138005501,1.3991770310592389,0.77459287983599179,1.0050655552219652,0.10044166505295335,1.0005216816113822,3.2294114609667503E-2,6.3118460206943094,3.5779308877495614E-2,1.0000265075338348,1.0202893870496452E-2,22.529324021104763,-133.49798523515329,46.502014764846706,null,1000000000,30906928.359999996,null,36.151296498002068,-51.133755938457547,null,30.335425520996516,-82.164542374137824,null,0,0]
[5623.4,5.6233999999999993,7.916623950403558,1.4441415062190632,1.0001820018042942,1.9077431939335646E-2,1,0,241.25543469388654,1.566651330580517,1.4070797242442576,0.78031526345318636,1.005182553819139,0.10159005830053353,1.0005337587584913,3.2665622640144568E-2,6.3119383947570178,3.6190850503879463E-2,1.0000271213574461,1.0320347739876621E-2,22.380005811215852,-133.31786969772051,46.682130302279489,null,1000000000,31622627.559999995,null,36.09978685025348,-50.874419564552881,null,30.237639230752968,-82.241469454522914,null,0,0]
[5688.9,5.6888999999999994,8.0073718998485006,1.4455844844066725,1.0001862659252243,1.9299586385379989E-2,1,0,244.06547151127566,1.5666990540764167,1.4152148050898643,0.7861053979918049,1.0053036668571436,0.10276508864871987,1.0005462619448378,3.3045828549785099E-2,6.3120340272021735,3.6612025169957527E-2,1.0000277568423712,1.0440554356506038E-2,22.229456512592453,-133.13536077684495,46.864639223155052,null,1000000000,32363583.209999997,null,36.048228771959252,-50.612727927027613,null,30.138671067025001,-82.318304834334171,null,0,0]
[5754.4,5.7543999999999995,8.0981361484389076,1.4469951195571347,1.0001905794075228,1.9521738926234697E-2,1,0,246.87550887187749,1.5667456911559747,1.4233967886888867,0.79182915677567878,1.0054261675787033,0.10393983428809155,1.0005589097630567,3.3426024902206232E-2,6.3121307656272627,3.7033187079458955E-2,1.0000283996863828,1.0560760893510112E-2,22.081144298086357,-132.95472314865808,47.045276851341924,null,1000000000,33113119.359999996,null,35.997809490813928,-50.354760780430816,null,30.040801455971362,-82.393287199215266,null,0,0]
[5821.4,5.8213999999999997,8.190995266055566,1.4484057119222611,1.0001950427411241,1.9748976935888871E-2,1,0,249.74989877600382,1.5667923104692429,1.4318138338988191,0.79761611953356559,1.0055529088474993,0.10514118466474141,1.000571996858318,3.3814918039090411E-2,6.3122308636447517,3.7463980567767084E-2,1.000029064865821,1.0683720168635216E-2,21.931691475868099,-132.77190497346575,47.228095026534248,null,1000000000,33888697.959999993,null,35.94737983569226,-50.094695634099907,null,29.941802420136867,-82.468133457054435,null,0,0]
[5888.4,5.8883999999999999,8.2838703164632843,1.4497846771182841,1.0001995577214475,1.9976212905735886E-2,1,0,252.62428921057463,1.566837868901974,1.4402782676604426,0.80333525264786554,1.0056811010062063,0.10634223050696567,1.000585235273987,3.4203800944151562E-2,6.312332118769528,3.7894760399364298E-2,1.0000297377452603,1.0806679358506037E-2,21.784462253951169,-132.59108273051294,47.408917269487063,null,1000000000,34673254.559999995,null,35.898073988134833,-49.838438607562097,null,29.843903454959367,-82.541167723571576,null,0,0]
[5957,5.9569999999999999,8.3789792332728137,1.4511648966827995,1.0002042340329467,2.0208873268270571E-2,1,0,255.56732233568204,1.5668834534954925,1.448993069380393,0.80912153763594519,1.0058138571665942,0.10757163901459209,1.0005989466086407,3.4601959881489203E-2,6.3124369907548381,3.8335813197497126E-2,1.0000304346714786,1.0932574797882365E-2,21.635962209775798,-132.40802595857249,47.591974041427505,null,1000000000,35485849,null,35.84872112015708,-49.57996062199377,null,29.744781558752983,-82.614131300006065,null,0,0]
[6025.6,6.0256000000000007,8.4741037537724964,1.4525141319590897,1.0002089644858372,2.0441531442681241E-2,1,0,258.5103559797551,1.5669280001655586,1.4577558039782328,0.81483844810039474,1.0059481331569939,0.10880072117163192,1.000612816564423,3.5000107843814632E-2,6.3125430756533278,3.8776851347298039E-2,1.000031139669848,1.105847014580238E-2,21.489675808281476,-132.22709052761761,47.772909472382395,null,1000000000,36307855.360000007,null,35.80047859324069,-49.325379336695107,null,29.646763255414065,-82.685319727622201,null,0,0]
[6095.8,6.0958000000000006,8.5714625338178916,1.4538638307749756,1.0002138613194664,2.0679613755298479E-2,1,0,261.5220323269304,1.5669725478651164,1.4667716437848095,0.82061778805860841,1.0060871137292924,0.11005812837396106,1.0006271742245345,3.540753056280966E-2,6.3126528904487422,3.9228160761427516E-2,1.0000318694680814,1.1187301732588273E-2,21.342210280285169,-132.04414222309927,47.955857776900729,null,1000000000,37158777.640000001,null,35.75222643122347,-49.068844069419505,null,29.547576358548106,-82.756392167968613,null,0,0]
[6166,6.1660000000000004,8.668836577637828,1.455183210549351,1.0002188148478488,2.091769372323176E-2,1,0,264.53370918127825,1.5670160812269183,1.4758358753735223,0.82632632609169698,1.0062276845577514,0.11131518624170589,1.0006416979772421,3.5814941522406281E-2,6.3127639752658906,3.9679454480682087E-2,1.0000326077193979,1.1316133221370706E-2,21.196945283643277,-131.86343518752651,48.136564812473495,null,1000000000,38019556,null,35.705069297735832,-48.816287320969785,null,29.449495269384627,-82.825727583920894,null,0,0]
[6237.8,6.2378,8.7684452324322706,1.4565023463035076,1.0002239399240456,2.1161197561672347E-2,1,0,267.61402874992888,1.5670595932167981,1.4851558343562508,0.83209269945434394,1.0063731036220578,0.11260052964526684,1.00065672456223,3.6231625896964166E-2,6.3128789056320045,4.014101767391743E-2,1.0000333715412268,1.1447900937826137E-2,21.050586869429981,-131.68093440617784,48.31906559382216,null,1000000000,38910148.840000004,null,35.657936269131788,-48.562036269530282,null,29.350297583318188,-82.894906487109026,null,0,0]
[6309.6,6.3096000000000005,8.8680688025833199,1.4577918460112484,1.0002291243070303,2.1404698890295067E-2,1,0,270.69434881372018,1.567102114932257,1.4945245594847347,0.8377869648668701,1.0065201848410552,0.11388549952078307,1.0006719248818745,3.6648297684899744E-2,6.3129951644296556,4.0602564068631171E-2,1.0000341442058531,1.1579668549371936E-2,20.906412955809945,-131.50078884200371,48.499211157996285,null,1000000000,39811052.160000004,null,35.611881267861783,-48.311838559181304,null,29.252206689319216,-82.962387507705202,null,0,0]
[6383.05,6.3830499999999999,8.9699966876003963,1.4590813387917256,1.0002344891955712,2.1653793374476697E-2,1,0,273.84545667194539,1.5671446239890681,1.5041580925130718,0.84353849832285654,1.0066723651898339,0.1151996078932019,1.0006876542735266,3.7074531625370263E-2,6.3131154694105973,4.1074699448594015E-2,1.0000349437766485,1.1714464136885844E-2,20.761127425275944,-131.31894231055674,48.681057689443264,null,1000000000,40743327.302500002,null,35.565849661215942,-48.060028419246009,null,29.152981757472659,-83.029721157434025,null,0,0]
[6456.5,6.4565000000000001,9.0719391526779933,1.4603418532599577,1.0002399161460558,2.1902885171115483E-2,1,0,276.9965650137562,1.5671861658812984,1.5138407490637118,0.84921664300767574,1.0068262834145414,0.11651331674592576,1.000703565459746,3.7500752089033612E-2,6.3132371644244181,4.1546816842437308E-2,1.0000357526013317,1.184925961205692E-2,20.618010591362435,-131.13956189491756,48.860438105082437,null,1000000000,41686392.25,null,35.520878971000592,-47.812344840926052,null,29.054864939308239,-83.095394619719983,null,0,0]
[6531.7,6.5316999999999998,9.1763250694312148,1.461603382636798,1.0002455366941176,2.2157908945504977E-2,1,0,280.22275130173097,1.5672277296062715,1.5238040171647367,0.854955123575731,1.0069856684998071,0.11785790721938284,1.0007200440758146,3.7937113443838315E-2,6.3133631989323078,4.2030163929996284E-2,1.0000365902840884,1.198726657032655E-2,20.473671893663195,-130.95845978618078,49.041540213819218,null,1000000000,42663104.890000001,null,35.475902337121894,-47.562974908598093,null,28.955533245155355,-83.16097035912388,null,0,0]
[6606.9,6.6068999999999996,9.2807252613783096,1.4628365316945116,1.0002512222945408,2.2412929837281922E-2,1,0,283.44893806278282,1.5672683471831983,1.53381681151768,0.86061886674412758,1.0071468735600293,0.11920206968901399,1.0007367132339233,3.8373460344882732E-2,6.3134906903277619,4.2513491728126268E-2,1.0000374376669443,1.2125273408094288E-2,20.331489032698503,-130.77993489060313,49.22006510939687,null,1000000000,43651127.609999992,null,35.431970711467706,-47.317808380744466,null,28.85731272893473,-83.224920184276044,null,0,0]
[6683.85,6.6838500000000005,9.3875692595842661,1.4640699829598331,1.0002571075457394,2.2673882372200357E-2,1,0,286.75020278136196,1.5673089638662805,1.5441128797328343,0.86633818744264546,1.0073137131536789,0.12057706462384221,1.0007539675395563,3.8819946460561812E-2,6.3136226566561824,4.3008046983114355E-2,1.000038314810805,1.22664917149679E-2,20.188170270878057,-130.59991596844148,49.400084031558521,null,1000000000,44673850.822500005,null,35.388065013666001,-47.071224013891772,null,28.757931460511585,-83.288731470156733,null,0,0]
[6760.8,6.7608000000000006,9.4944272185982346,1.465275671509968,1.0002630609098671,2.2934831818614509E-2,1,0,290.05146796222886,1.5673486559794354,1.5544587867969946,0.87198155930339638,1.0074824565529343,0.12195160156041635,1.000771421338442,3.9266417091498355E-2,6.3137561482803779,4.3502581573359303E-2,1.0000392021114812,1.2407709892727244E-2,20.046991516837387,-130.42257856518458,49.57742143481542,null,1000000000,45708416.640000001,null,35.345186741049581,-46.828911979585236,null,28.659663140392318,-83.350952239188146,null,0,0]
[6839.55,6.83955,9.6037987472214663,1.4664817822328582,1.000269224054197,2.3201882110904491E-2,1,0,293.42995618278007,1.5673883518603429,1.5650972732783963,0.87767950573720588,1.007657117294821,0.1233578120360744,1.000789489950028,3.9723315262704437E-2,6.3138943416469528,4.4008662582321063E-2,1.0000401206837009,1.2552231284443256E-2,19.904667293695283,-130.24385724843748,49.756142751562521,null,1000000000,46779444.202500001,null,35.302335888881764,-46.585288028560299,null,28.560223061586939,-83.41303690443489,null,0,0]
[6918.3,6.9183000000000003,9.7131839318858653,1.4676607293662292,1.0002754585327036,2.3468929093317329E-2,1,0,296.80844485518116,1.5674271440467806,1.5757858860769403,0.88330033385251927,1.0078337699130722,0.12476353233084404,1.0008077674747944,4.0180196840829498E-2,6.3140341322965936,4.4514721448103957E-2,1.000041049893462,1.2696752537784396E-2,19.764467187068551,-130.067918127372,49.932081872628004,null,1000000000,47862874.890000001,null,35.260494633583974,-46.346002768538099,null,28.461897885264612,-83.473565392357685,null,0,0]
[6998.9,6.9988999999999999,9.8251524652733515,1.4688401875888131,1.0002819133381238,2.3742246093287168E-2,1,0,300.26630164996084,1.567465943588114,1.5867764457730482,0.88897460934541939,1.0080166339888057,0.12620176277950793,1.0008266906969172,4.0647794129522206E-2,6.3141788608153737,4.5032645487313901E-2,1.0000420119475992,1.2844668748633423E-2,19.623114405878173,-129.89071022697595,50.109289773024045,null,1000000000,48984601.209999993,null,35.218682734035966,-46.105518315366716,null,28.362391866060889,-83.533958434728518,null,0,0]
[7079.5,7.0795000000000003,9.9371343586195398,1.4699930646783357,1.0002884428658181,2.4015559545441292E-2,1,0,303.72415888647038,1.5675038596747577,1.5978173917525305,0.89457064426623545,1.0082015823949371,0.12763946853203506,1.0008458327387155,4.1115373634041871E-2,6.3143252623195263,4.5550545794602257E-2,1.0000429851449402,1.2992584811153266E-2,19.483869712922644,-129.71638136730738,50.283618632692622,null,1000000000,50119320.25,null,35.177862328048136,-45.86943603566818,null,28.26400284236961,-83.592828685134762,null,0,0]
[7161.95,7.16195,10.051699913881627,1.4711458233841987,1.0002951995778719,2.4295142607849908E-2,1,0,307.26138425539801,1.5675417630371054,1.609162811902364,0.9002154868010489,1.0083929313403994,0.12910962494104306,1.0008656405430258,4.159366680922455E-2,6.3144767550604044,4.6080308553953585E-2,1.000043992209726,1.3143895814145165E-2,19.343551709493056,-129.54100892495336,50.45899107504664,null,1000000000,51293527.802499995,null,35.13709794138169,-45.632415842288751,null,28.164485712913184,-83.651527446210721,null,0,0]
[7244.4,7.2443999999999997,10.16627852531157,1.4722725993230665,1.0003020344786293,2.4574721871421071E-2,1,0,310.79861005570939,1.56757880363663,1.6205587879265062,0.90578111410694373,1.0085864589561371,0.1305792203380074,1.0008856773006323,4.2071940943887498E-2,6.3146299982198908,4.6610045905702814E-2,1.0000450109351171,1.3295206658305268E-2,19.205323064625489,-129.36860474546333,50.63139525453667,null,1000000000,52481331.359999992,null,35.097305488022059,-45.399852770913775,null,28.066086427944285,-83.708737712953038,null,0,0]
[7328.75,7.3287500000000003,10.283510572968398,1.4733993559138758,1.0003091077951753,2.4860739858167079E-2,1,0,314.41734907100317,1.5676158353593013,1.6322685885001496,0.91139439727018401,1.0087866995243029,0.13208209465315562,1.0009064127045164,4.2561216625781419E-2,6.3147885840121845,4.7151964072612323E-2,1.0000460652030552,1.3450004184028686E-2,19.066012926398216,-129.19527363841758,50.804726361582425,null,1000000000,53710576.5625,null,35.057569178775438,-45.166465452995347,null,27.966550789705291,-83.765777731607784,null,0,0]
[7413.1,7.4131,10.400755382043846,1.4745007106524095,1.0003162629421358,2.5146753776603147E-2,1,0,318.03608850766045,1.5676520243590717,1.6440290865539728,0.91692754390333153,1.0089892176622308,0.13358436906479698,1.0009273877061191,4.3050471918695099E-2,6.3149490015555108,4.7693855033479587E-2,1.000047131675206,1.3604801539644804E-2,18.928773385472084,-129.02499577376432,50.975004226235683,null,1000000000,54954051.610000007,null,35.018785066486437,-44.93758696363664,null,27.868133990348515,-83.821362554684214,null,0,0]
[7499.45,7.4994499999999995,10.520792924475019,1.4756027507739575,1.0003236725048192,2.5439545030669069E-2,1,0,321.74063131642612,1.5676882281815621,1.6561198218022786,0.92251030884224605,1.0091988954355038,0.13512163538966135,1.0009491082112008,4.355130644825983E-2,6.3151151199841875,4.824856611882633E-2,1.0000482360758858,1.3763269075177295E-2,18.790366539903104,-128.85381306810788,51.146186931892117,null,1000000000,56241750.302499995,null,34.980035283790862,-44.707871292993985,null,27.768516926815082,-83.876808620405896,null,0,0]
[7585.8,7.5857999999999999,10.640842956040739,1.4766799257373751,1.0003311678206941,2.5732331922161528E-2,1,0,325.44517453730197,1.5677236077876973,1.6682614246593452,0.92801198048212685,1.0094109571411529,0.13665825943260415,1.0009710797786449,4.4052119116553184E-2,6.3152831577602866,4.8803248034634747E-2,1.000049353266375,1.3921736428288768E-2,18.654013789515187,-128.68576779422895,51.314232205771049,null,1000000000,57544361.640000001,null,34.942218832733317,-44.482717901976059,null,27.670021086144921,-83.930830257013227,null,0,0]
[7674.15,7.67415,10.763686023167176,1.4777571792388013,1.0003389254931634,2.6031895644851578E-2,1,0,329.23552114000125,1.5677589827862199,1.680735744560157,0.93355863649717963,1.0096303963533095,0.13822980216037681,1.0009938200766386,4.4564508496257385E-2,6.3154570739371065,4.937074670657178E-2,1.0000505095703145,1.4083873940213777E-2,18.516571045994002,-128.51704308478728,51.482956915212725,null,1000000000,58892578.222499996,null,34.904460388370929,-44.256987525386222,null,27.570378657992837,-83.984678394300872,null,0,0]
[7762.5,7.7625000000000002,10.886541299379825,1.4788101201975823,1.0003467729330742,2.6331454694436443E-2,1,0,333.02586814532441,1.5677935525409137,1.6932610101596135,0.93902339994448614,1.0098523280093779,0.13980065802163483,1.0010168231664485,4.5076874461341961E-2,6.315632999074805,4.9938214137519102E-2,1.000051679263382,1.4246011256721947E-2,18.381163279726568,-128.35153178428124,51.648468215718765,null,1000000000,60256406.25,null,34.867615065483243,-44.03586375568176,null,27.471858566177396,-84.037133782056742,null,0,0]
[7852.9,7.8529,11.012259418436683,1.4798631738135459,1.0003548953721975,2.6637959570365896E-2,1,0,336.90416361616013,1.5678281192855446,1.706128463789067,0.94453174308409782,1.0100819873331939,0.14140724414825839,1.0010406319909084,4.5601104425844301E-2,6.3158150854812138,5.0518815903066637E-2,1.0000528899557695,1.4411910468203811E-2,18.244662389118488,-128.18546738607122,51.814532613928776,null,1000000000,61668038.409999996,null,34.830828179150302,-43.81429007447764,null,27.372188393416202,-84.089413198763722,null,0,0]
[7943.3,7.9432999999999998,{"$f":"SQRT(1+(A141/pole1)^2)","v":11.137989473545895},{"$f":"ATAN(A141/pole1)","v":1.4808924539734249},{"$f":"SQRT(1+(A141/Zero1)^2)","v":1.0003631117883693},{"$f":"ATAN(A141/Zero1)","v":2.6944459440174161E-2},{"$f":"IF(VIN_nom>Vout, 1, SQRT(1+(A141/z_RHP)^2))","v":1},{"$f":"IF(VIN_nom>Vout, 0, -ATAN(A141/z_RHP))","v":0},{"$f":"SQRT(1+(A141/Pole2)^2)","v":340.78245948038659},{"$f":"ATAN(A141/Pole2)","v":1.5678618992522633},{"$f":"SQRT(1+(A141/Zero2)^2)","v":1.7190469086176661},{"$f":"ATAN(A141/Zero2)","v":0.94995745963535183},{"$f":"SQRT(1+(A141/pole4)^2)","v":1.0103142526095932},{"$f":"ATAN(A141/pole4)","v":0.14301309572888266},{"$f":"IF(VOUT_setting=1,1,SQRT(1+(A141*zterm1)^2))","v":1.0010647159052775},{"$f":"IF(VOUT_setting=1,0,ATAN(((A141*zterm1))))","v":4.6125309310238762E-2},6.3159992748010136,{"$f":"IF(VOUT_setting=1,0,ATAN(A141*$Q$4/(1+Afbr-$Q$5*(A141)^2)))","v":5.109938420677225E-2},{"$f":"SQRT((1-(Z141/pterm2))^2+(A141/pterm1)^2)","v":1.0000541146658268},{"$f":"IF((ATAN((A141/pterm1)/(1-A141^2/pterm2))>0),ATAN((A141/pterm1)/(1-A141^2/pterm2)),PI()+ATAN((A141/pterm1)/(1-A141^2/pterm2)))","v":1.4577809470330721E-2},{"$f":"20*LOG10(((E141*K141*G141*O141)/(C141*I141*S141*M141*Q141))*Adc)","v":18.110177194422171},{"$f":"((F141+L141+H141+P141)-(D141+J141+T141+N141+R141))*radconv","v":-128.02268765311237},{"$f":"IF(V141>0,V141,V141+180)","v":51.977312346887629},null,{"$f":"IF(U141<0,A141,1000000000)","v":1000000000},{"$f":"A141^2","v":63096014.890000001},null,{"$f":"20*LOG10((K141/(I141*M141))*AEA)","v":34.794934004295882},{"$f":"(L141-(J141+N141))*radconv","v":-43.59736338262789},null,{"$f":"20*LOG10((E141*G141/(C141*S141))*Acs*Am)","v":27.273641707891962},{"$f":"(F141+H141-(D141+T141))*radconv","v":-84.140330771605491},null,{"$f":"SUM((U142<0)*(U141>0))*A141","v":0},0]
[8035.8,{"$f":"A142/1000","v":8.0358000000000001},11.26665218731236,1.4819218641326932,1.0003716163472482,2.7258074087230268E-2,1,0,344.75084889410664,1.5678956772228829,1.7323170418135307,0.95542528692071949,1.0105546090149264,0.14465548293633781,1.0010896440200747,4.6661665261073647E-2,6.3161899194202142,5.1693404129001239E-2,1.0000553823359029,1.4747562101738545E-2,17.974597082837136,-127.85948349021423,52.140516509785769,null,1000000000,64574081.640000001,null,34.759098631309328,-43.380117146292086,null,27.173942853792688,-84.191068942848531,null,0,0]
[8128.3,8.1282999999999994,11.395326570572117,1.4829280274362593,1.0003802192951452,2.7571683371160664E-2,1,0,348.71923869221808,1.5679286864137356,1.7456381780082295,0.96080982209766885,1.0107976900257101,0.14629708463334995,1.0011148601116537,4.7197994346713401E-2,{"$f":"IF(VOUT_setting=1,1,SQRT((1+Afbr-$Q$5*(A143)^2)^2+(A143*$Q$4)^2))","v":6.3163827653974307},5.2287388209216537E-2,1.0000566646824687,1.4917314508847793E-2,17.841013193569957,-127.69963039271046,52.300369607289539,null,1000000000,66069260.890000001,null,34.724135362308097,-43.167554141971593,null,27.075368644117802,-84.240475461804479,null,0,0]
[8222.9500000000007,8.2229500000000009,11.527003435662085,1.4839343236166684,1.0003891240467204,2.7892576336197374E-2,1,0,352.77986712405652,1.5679616941177432,1.7593205270309913,0.96623494453161107,1.011049239311862,0.1479760207335164,1.0011409603791253,4.7746761330911727E-2,6.316582372233003,5.2895140878805882E-2,1.0000579920270714,1.5091012277574657E-2,17.706333768963841,-127.53948341985263,52.46051658014737,null,1000000000,67616906.702500015,null,34.689231119396133,-42.954804677664598,null,26.975641496139161,-84.289698322425153,null,0,0]
[8270.2750000000015,8.2702750000000016,11.592846170857721,1.4844288989765773,1.0003936150516277,2.8053020668194206E-2,1,0,354.81018148163508,1.5679779146520061,1.7661808933405951,0.96891594560203709,1.0111760822949367,0.14881517435045213,1.0011541235667296,4.8021134051857775E-2,6.3166830398337277,5.319900284391265E-2,1.0000586614618738,1.5177861071992923E-2,17.63973869852359,-127.46069267863652,52.539307321363481,null,1000000000,68397448.575625017,null,34.672100103615982,-42.850203960107876,null,26.926201664769795,-84.313818689532411,null,0,0]
[8317.6,8.3176000000000005,11.658691709689641,1.4849178879651879,1.0003981318088195,2.821346355552181E-2,1,0,356.84049593150394,1.5679939506064089,1.7730538562543556,0.97157618071692697,1.0113036371478541,0.1496541168745899,1.0011673621196218,4.8295499537332663E-2,6.3167842835197447,5.3502855156392755E-2,1.0000593347383426,1.5264709805986832E-2,17.573630879449379,-127.38274893397822,52.61725106602178,null,1000000000,69182469.760000005,null,34.655178182735945,-42.746770373788884,null,26.87704012745623,-84.337619060452496,null,0,0]
[8366.0499999999993,8.3660499999999995,11.726105369981072,1.4854128119710159,1.000402782614882,2.837771895240827E-2,1,0,358.91907468572197,1.5680101798211088,1.7801030987844069,0.97427835416896236,1.0114349613814366,0.1505127827359509,1.0011809934474363,4.857637964338804E-2,6.3168885307104983,5.3813920525913488E-2,1.0000600279995355,1.5353623026960254E-2,17.506449303281734,-127.30382335116371,52.696176648836285,null,1000000000,69990792.602499992,null,34.638066809786018,-42.642075034730397,null,26.826995006730407,-84.361659328494468,null,0,0]
[8414.5,8.4145000000000003,11.793521869741799,1.4859020777274246,1.0004074604113957,2.8541972817645492E-2,1,0,360.99765353338614,1.5680262221442802,{"$f":"SQRT(1+(A148/Zero2)^2)","v":1.7871652365750779},{"$f":"ATAN(A148/Zero2)","v":0.9769591913236001},1.0115670311592104,0.15137122501598294,1.0011947037599029,4.8857252078884451E-2,6.316993381642332,5.4124975662602791E-2,1.0000607252872111,1.5442536183869171E-2,17.439764294034465,-127.22577247324706,52.774227526752938,null,1000000000,70803810.25,null,34.621166955507775,-42.538578657102256,null,26.77723507841079,-84.385375486811341,null,0,0]
[8462.9500000000007,8.4629500000000011,11.860941160553969,1.4863857814850552,1.0004121651979816,2.870622514239209E-2,1,0,363.07623247289155,1.5680420807857265,1.7942401173589497,0.97961890581243294,1.0116998461892002,0.1522294425372834,1.0012084930537772,4.9138116799822239E-2,6.3170988362851856,5.4436020507882925E-2,1.000061426601369,1.5531449276342665E-2,17.373568905337731,-127.14858969089315,52.851410309106853,null,1000000000,71621522.702500015,null,34.604474875110746,-42.436269117163818,null,26.727757140891693,-84.408773050643916,null,0,0]
[8511.4,8.5114000000000001,11.928363195092384,1.4868640173289669,1.0004168969742593,2.8870475917807198E-2,1,0,365.15481150266976,1.5680577588821667,1.8013275909881741,0.98225770910932375,1.0118334061779362,0.15308743412439046,1.0012223613257958,4.9418973762209037E-2,6.3172048946088317,5.4747055003187904E-2,1.0000621319420089,1.562036230400982E-2,17.307856320851588,-127.07226839024108,52.927731609758922,null,1000000000,72443929.959999993,null,34.587986900590558,-42.335134410726987,null,26.67855804581103,-84.43185741115434,null,0,0]
[8560.9500000000007,8.5609500000000001,11.997318756923471,1.4873475512597205,1.0004217640953283,2.9038454201287051E-2,1,0,367.28058230497982,1.5680736093856154,1.8085888479944261,0.98493501272490658,1.0119707687018569,0.15396467048692286,1.0012366261452808,4.9706199179445409E-2,6.3173139852248799,5.5065140403040724E-2,1.0000628574612178,1.57112939294912E-2,17.241144210241846,-126.99509845257859,53.004901547421412,null,1000000000,73289864.902500018,null,34.57133195154681,-42.232906321121447,null,26.628527127437348,-84.455147416335592,null,0,0]
[8610.5,8.6105,12.066277091727992,1.4878255585435101,1.0004266594447269,2.9206430845583227E-2,1,0,369.40635319850281,1.5680892774637327,1.8158629651498424,0.9875908853721771,1.0121089097697089,0.1548416680591152,1.0012509735628683,4.9993416388787675E-2,6.3174237071801143,5.5383214853751646E-2,1.0000635871918158,1.5802225486405436E-2,17.17492305871421,-126.91881556445391,53.081184435546092,null,1000000000,74140710.25,null,34.554882959674259,-42.131882001672217,null,26.578781361640516,-84.478120857960292,null,0,0]
[8660.0499999999993,8.66005,12.135238152233788,1.4882981331790366,1.0004315830220403,2.9374405841240549E-2,1,0,371.53212418167317,1.5681047662478242,1.8231497885237449,0.99022554632650062,1.0122478290627492,0.15571842558996674,1.0012654035750075,5.0280625343202469E-2,6.3175340604416439,5.5701278292713069E-2,1.0000643211338021,1.5893156974355786E-2,17.109185977942079,-126.84341265540313,53.156587344596872,null,1000000000,74996466.002499983,null,34.538636239019532,-42.03204899655983,null,26.529317546018511,-84.500783122276303,null,0,0]
[8709.6,8.7096,12.204201892235321,1.4887653670501548,1.0004365348268518,2.9542379178804409E-2,1,0,373.65789525296088,1.5681200787979388,1.830449166369829,0.99283921255264951,1.0123875262606146,0.15659494183063757,1.0012799161781274,5.0567825995664582E-2,6.317645044976393,5.6019330657330536E-2,1.000065059287176,1.5984088392945496E-2,17.043926209232563,-126.76888266221911,53.231117337780887,null,1000000000,75857132.160000011,null,34.522588179964451,-41.933394978393146,null,26.48013253146765,-84.523139474359681,null,0,{"$f":"IF(AH154>0,W154,0)","v":0}]
[8760.3250000000007,8.7603249999999999,12.274803726829978,1.4892382421684687,1.0004416332949475,2.9714334011394259E-2,1,0,375.83407571787438,1.5681355750309056,1.8379344858308371,0.99549333443727406,1.0125313416144668,0.15749199202744568,1.0012948584729369,5.0861828509372847E-2,6.3177593152045644,5.6344913594791823E-2,1.000065819307062,1.6077176034265468E-2,16.977606409147967,-126.69348215517707,53.306517844822935,null,1000000000,76743294.105625018,null,34.506361660083641,-41.833610055012663,null,26.430066735376933,-84.545714465699788,null,0,0]
[8811.0499999999993,8.8110499999999998,12.34540827480981,1.4897057085560004,1.000446761344264,2.9886287086270273E-2,1,0,378.01025627199897,1.5681508928422576,1.8454326472864149,0.99812590686198555,1.0126759715195277,0.15838878671315948,1.0013098873145609,5.1155822223018482E-2,6.317874246929482,5.6670484793750982E-2,1.0000665837404352,1.6170263602054809E-2,16.911772896341489,-126.61898150941713,53.381018490582875,null,1000000000,77634602.102499992,null,34.490335917346457,-41.735034962224546,null,26.380286607194488,-84.567979656089818,null,0,0]
[8861.7749999999996,8.8617749999999997,12.416015489885254,1.4901678582815534,1.0004519189743468,3.0058238393291005E-2,1,0,380.18643691380277,1.5681660352958344,1.8529434948364853,1.0007371551645563,1.012821415626846,0.15928532455507197,1.0013250026991032,5.1449807086177801E-2,6.3179898401150494,5.6996044187097535E-2,1.000067352587295,1.6263351095887894E-2,16.846418822755329,-126.54537318797695,53.454626812023051,null,1000000000,78531056.15062499,null,34.474507316112877,-41.637656888312051,null,26.330788934470959,-84.589940321240249,null,0,0]
[8912.5,8.9124999999999996,12.486625326812014,1.4906247813405984,1.0004571061847378,3.0230187922315611E-2,1,0,382.36261764178875,1.5681810053857255,{"$f":"SQRT(1+(A158/Zero2)^2)","v":1.860466874836844},{"$f":"ATAN(A158/Zero2)","v":1.0033273022103122},1.0129676735857074,0.16018160422289088,1.0013402046226441,5.1743783048436222E-2,6.3181060947249676,5.7321591707735722E-2,1.0000681258476405,1.6356438515339067E-2,16.781537469998518,-126.47264967290414,53.52735032709586,null,1000000000,79432656.25,null,34.458872296853173,-41.541463159361143,null,26.281570558313309,-84.61160161806842,null,0,0]
[8964.4,8.9643999999999995,12.558873446022256,1.4910869706967078,1.0004624441678616,3.0406118660080549E-2,1,0,384.58920776953107,1.5681961468974339,1.8681773406614326,1.0059558375024626,1.0131181614619946,0.16109837682183731,1.001355848250375,5.204455944010259E-2,6.3182257268163458,5.7654667891900512E-2,1.0000689215879024,1.6451682145538476E-2,16.715635596223329,-126.39914955019354,53.600850449806458,null,1000000000,80360467.359999999,null,34.443071831579594,-41.44425392611786,null,26.231497917957554,-84.63346008680972,null,0,0]
[9016.2999999999993,9.0162999999999993,12.631124217355582,1.4915438726490435,1.0004678131165921,3.0582047515047842E-2,1,0,386.8157979844313,1.5682111140939186,1.87590060793338,1.0085627468064111,1.0132695005823862,0.16201487633766273,1.0013715824643674,5.2345326406981536E-2,6.3183460512520657,5.7987731504885016E-2,1.0000697219484858,1.6546925696968594E-2,16.650214770668882,-126.32655984846626,53.67344015153374,null,1000000000,81293665.689999983,null,34.427466717628768,-41.348258136690838,null,26.181711139533398,-84.655015712993077,null,0,0]
[9068.2000000000007,9.0682000000000009,12.703377595559951,1.4919955772251647,1.000473213030431,3.0757974476357561E-2,1,0,389.04238828499297,1.5682259099681264,1.8836365191876006,1.0111482609175535,1.0134216905655207,0.16293110135338928,1.001387407260351,5.2646083895103397E-2,6.3184670679925805,5.832078247487063E-2,1.0000705269293897,1.6642169169173535E-2,16.585268199323867,-126.25487259218912,53.745127407810884,null,1000000000,82232251.24000001,null,34.412053377977706,-41.2534626577743,null,26.132207006017897,-84.676273655413766,null,0,0]
[9120.1,9.1201000000000008,12.775633536405403,1.4924421724245269,1.0004786439088771,3.0933899533150469E-2,1,0,391.26897866975361,1.5682405374448767,1.8913849192794909,1.0137126080027794,1.0135747310281231,0.16384705045473122,1.001403322634032,5.294683185050874E-2,6.3185887769981184,5.8653820730055276E-2,1.0000713365306133,1.673741256169739E-2,16.52078921751367,-126.18407983648062,53.81592016351938,null,1000000000,83176224.010000005,null,34.396828311248314,-41.159854502915614,null,26.082982354079739,-84.697238956665259,null,0,0]
[9173.2000000000007,9.1732000000000014,12.849562741959829,1.4928938952873785,1.0004842324030419,3.1113890238911188E-2,1,0,393.54705099877265,1.5682553318272754,1.899325239036316,1.0163145747763738,1.0137321897999982,0.16478389054039644,1.0014196997320586,5.3254523593721757E-2,6.3187140165022511,5.8994546057676109E-2,1.0000721696327366,1.6834858030644613E-2,16.455296505425025,-126.11256776532932,53.887432234670683,null,1000000000,84147598.24000001,null,34.381442498537652,-41.065297426906582,null,26.032905565141938,-84.718391276552069,null,0,0]
[9226.2999999999993,9.2262999999999984,12.923494539514337,1.4933404498731908,1.0004898533091855,3.1293878928071846E-2,1,0,395.82512341293733,1.5682699559189484,1.907278310546112,1.0188948592564457,1.0138905380167356,0.16572043881869022,1.0014361716355971,5.3562205244062994E-2,6.3188399805687983,5.9335257923725133E-2,1.0000730075713047,1.6932303415218005E-2,16.390279542986491,-126.0419753190518,53.958024680948199,null,1000000000,85124611.689999983,null,34.366246585214355,-40.971956178537241,null,25.983114799073327,-84.739247586685252,null,0,0]
[9279.4,9.279399999999999,12.997428884837593,1.493781924199739,1.0004955066267618,3.1473865589004738E-2,1,0,398.10319591078598,1.5682844126432613,1.9152439749535062,1.0214536974049846,1.0140497752616635,0.1666566937837646,1.001452738339969,5.3869876743776711E-2,6.3189666691544355,5.9675956251358291E-2,1.0000738503463162,1.7029748714929328E-2,16.325731593409671,-125.9722941018313,54.027705898168705,null,1000000000,86107264.359999999,null,34.351237055418849,-40.879817319399265,null,25.933606834907181,-84.759812930750073,null,0,0]
[9332.5,9.3324999999999996,13.071365734697476,1.494218404301368,1.0005011923552214,3.1653850210082927E-2,1,0,400.38126849089014,1.5682987048570476,1.9232220757854728,1.0239913224012942,1.014209901116033,0.16759265393277148,1.0014693998404696,5.4177538035118662E-2,6.3190940822155941,6.0016640963749979E-2,1.0000746979577706,1.7127193929290328E-2,16.261646048811283,-125.90351576000523,54.096484239994766,null,1000000000,87095556.25,null,34.336410468384983,-40.788867566880278,null,25.88437850548825,-84.780092238789621,null,0,0]
[9386.85,9.3868500000000008,13.14704564377079,1.4946600751712555,1.0005070454922518,3.1838069632686351E-2,1,0,402.71296809869631,1.5683131660653,1.9314007031740759,1.026566956728528,1.0143747162052974,0.16855034016866449,1.0014865517256277,5.4492431191981036E-2,6.319225244854886,6.0365331381142563E-2,1.0000755705309738,1.7226932962813329E-2,16.196523995478817,-125.83404467644027,54.165955323559729,null,1000000000,88112952.922499999,null,34.321420795250532,-40.696994535869749,null,25.834277653067758,-84.800557745845509,null,0,0]
[9441.2000000000007,9.4412000000000003,13.222728088122279,1.4950966901747493,1.0005129325828874,3.2022286893620584E-2,1,0,405.0446677897508,1.5683274607773763,1.939592035163382,1.0291208529167082,1.0145404613386719,0.16950771436863171,1.0015038029124819,5.4807313531817774E-2,6.3193571663870332,6.0714007371924845E-2,1.0000764481710025,1.7326671905885303E-2,16.13187276630606,-125.76550191068078,54.234498089319217,null,1000000000,89136257.440000013,null,34.306615718299881,-40.60633959061304,null,25.784463209290621,-84.820733691766975,null,0,0]
[9495.5499999999993,9.4955499999999997,13.298413024466463,1.4955283354669353,1.000518853626529,3.2206501980420681E-2,1,0,407.37636756262413,1.5683415918521921,1.9477959114682231,1.0316532521145678,1.014707136060409,0.17046477493101947,1.0015211533959008,5.5122184992747729E-2,6.319489846764518,6.1062668853778104E-2,1.0000773308778559,1.7426410757982694E-2,16.067685675736499,-125.69787865379392,54.302121346206079,null,1000000000,90165469.80249998,null,34.291991780565397,-40.516888986341328,null,25.734931945526402,-84.840625013561024,null,0,0]
[9549.9,9.5498999999999992,13.374100410496281,1.4959550952601119,1.0005248086225735,3.2390714880622631E-2,1,0,409.70806741591946,1.5683555620835827,1.9560121742490786,1.0341643925312345,1.014874739912504,0.17142152025752155,1.0015386031707236,5.543704551290269E-2,6.3196232859395503,6.1411315744404456E-2,1.0000782186515329,1.7526149518581981E-2,16.003956166817353,-125.63116615042367,54.368833849576333,null,1000000000,91200590.00999999,null,34.277545599670248,-40.428629143175691,null,25.685680687157344,-84.860236536921107,null,0,0]
[9605.5249999999996,9.6055250000000001,13.451565844988925,1.4963868935790801,1.0005309384730876,3.2579246965455652E-2,1,0,412.09446684164288,1.5683696963451179,1.9644338464006421,1.0367126747794526,1.0150472371941905,0.17240038185187373,1.001556565108124,5.5759280972081576E-2,6.319760641129621,6.1768126369380248E-2,1.0000791324980585,1.7628227961624512E-2,15.939198721848394,-125.5638226076877,54.436177392312302,null,1000000000,92266110.52562499,null,34.262941132327398,-40.339517796859191,null,25.635560718454606,-84.88002332942331,null,0,0]
[9661.15,9.6611499999999992,13.529033758801482,1.4968137469799832,1.0005371038863839,3.2767776733481281E-2,1,0,414.48086634874545,1.5683836678488667,1.9728681661227774,1.0392391847078601,1.0152207067326591,0.17337890986975429,1.0015746310391063,5.608150484005521E-2,6.3198987910340332,6.2124921536142338E-2,1.0000800516519199,1.7730306307716031E-2,15.874907081304773,-125.49741467181997,54.502585328180032,null,1000000000,93337819.32249999,null,34.248515922100616,-40.251625474721216,null,25.585727486127947,-84.89952692617841,null,0,0]
[9716.7749999999996,9.7167750000000002,13.606504109586322,1.4972357397694762,1.0005433048618053,3.2956304171340489E-2,1,0,416.86726593582955,1.5683974793899946,1.9813149718960119,1.0417441683159376,1.0153951480296102,0.17435710260869497,1.0015928009580428,5.6403717050540793E-2,6.3200377356006774,6.2481701156532524E-2,1.000080976113116,1.7832384556295315E-2,15.811074614745653,-125.43193314059077,54.568066859409228,null,1000000000,94415716.40062499,null,34.234266573756457,-40.164938144636714,null,25.53617775492441,-84.918752158335209,null,0,0]
[9772.4,9.7723999999999993,13.683976855953478,1.4976529543519992,1.0005495413986905,3.3144829265675205E-2,1,0,419.25366560152946,1.5684111337000268,1.9897741047064499,1.0442278685097899,1.0155705605842964,0.17533495836996046,1.0016110748592748,5.6725917537269945E-2,6.3201774747771529,6.2838465142416006E-2,1.0000819058816459,1.7934462706801116E-2,15.747694819909936,-125.36736887658694,54.632631123413063,null,1000000000,95499801.75999999,null,34.220189766051426,-40.079441948285528,null,25.486908343780573,-84.937703748053551,null,0,0]
[9829.2999999999993,9.8292999999999999,13.763227818526317,1.4980748722809976,1.000555957678197,3.3337673170722566E-2,1,0,421.69476484513262,1.5684249410898525,1.9984397231522513,1.046746727722512,1.0157509982133175,0.17633487748447385,1.0016298752017607,5.7055491094587144E-2,6.320321239047888,6.3203390371865911E-2,1.0000828624529277,1.8038880524093651E-2,15.683323981388629,-125.30226430133236,54.697735698667643,null,1000000000,96615138.48999998,null,34.205965430265849,-39.993204196389549,null,25.436796382112998,-84.95681142308068,null,0,0]
[9886.2000000000007,9.8862000000000005,13.842481203102178,1.4984919590074968,1.0005624111666729,3.353051459530864E-2,1,0,424.13586416820402,1.5684385895437702,2.0071179114701896,1.0492438210497332,1.0159324510676797,0.17733444041257754,1.0016487843359203,5.7385052244314977E-2,6.3204658346611247,6.3568299055385621E-2,1.000083824577632,1.8143298237577255E-2,15.619413438244575,-125.23810039667013,54.761899603329866,null,1000000000,97736950.440000013,null,34.191914834477103,-39.908184023536791,null,25.38697117346592,-84.975642426766484,null,0,0]
[9943.1,9.9431000000000012,13.921736968317266,1.4989042968965247,1.0005689018633976,3.3723353525138833E-2,1,0,426.5769635693793,1.5684520817903207,2.0158085073178911,1.0517193986606199,1.0161149186035012,0.17833364534824822,1.0016678022555925,5.7714600915570499E-2,6.3206112615598151,6.3933191098716549E-2,1.0000847922557574,1.8247715846651223E-2,15.555956627482789,-125.1748676004331,54.825132399566897,null,1000000000,98865237.610000014,null,34.178034652200829,-39.824367148946195,null,25.337429481278861,-84.994201479064017,null,0,0]
[10000,10,14.000995073743161,1.4993119664546166,1.0005754297676472,3.3916189945919682E-2,1,0,429.0180630473252,1.5684654204959445,2.0245113509103936,1.0541737074867863,1.0162984002742501,0.17933249048961544,1.0016869289545809,5.8044137037487016E-2,6.3207575196865911,6.4298066407626253E-2,1.000085765487303,1.8352133350714853E-2,15.492947113520358,-125.11255642614853,54.887443573851471,null,1000000000,100000000,null,34.164321630117669,-39.741739474014636,null,25.288168123238112,-85.012493193442523,null,0,0]
[10058.25,10.058249999999999,14.082136026784312,1.4997245546852127,1.0005821510932813,3.4113598957791466E-2,1,0,431.51707972637428,1.5684789193455841,2.0334331996192248,1.0566644695898566,1.0164872851395801,0.1803546594887081,1.0017066221252171,5.8381478605533478E-2,6.3209081088936969,6.467158125479168E-2,1.0000867675622007,1.8459028137825642E-2,15.428899399120459,-125.04971172395928,54.950288276040723,null,1000000000,101168393.0625,null,34.150453089628172,-39.658368714352072,null,25.238025121319136,-85.030946674688849,null,0,0]
[10116.5,10.1165,14.163279349547011,1.5001324154382036,1.0005889114113951,3.4311005309831652E-2,1,0,434.01609648314843,1.5684922627454552,2.0423675532742491,1.0591334551802454,1.0166772316654957,0.18137644760995014,1.0017264292849097,5.8718806871441265E-2,6.3210595691172466,6.5045078364267261E-2,1.0000877754571609,1.8565922813610049E-2,15.365307205143587,-124.98781302209697,55.012186977903028,null,1000000000,102343572.25,null,34.136753062520967,-39.576214927651037,null,25.188169333358545,-85.049129437438921,null,0,0]
[10174.75,10.17475,14.244425001533921,1.5005356293692245,1.0005957107211985,3.450840898670874E-2,1,0,436.51511331631275,1.568505453365368,2.0513142484822571,1.0615809188899403,1.0168682392570561,0.18239785293378308,1.0017463504268971,5.9056121759232312E-2,6.321211900294645,6.5418557635039093E-2,1.000088789172183,1.8672817377423597E-2,15.302164022293494,-124.92685039484424,55.073149605155763,null,1000000000,103525537.5625,null,34.123218284753449,-39.495263567559569,null,25.138597514048023,-85.06704610376174,null,0,0]
[10233,10.233000000000001,14.325572943164133,1.5009342753125208,1.0006025490218964,3.4705809973092493E-2,1,0,439.01413022456279,1.5685184938143435,2.0602731244644059,1.0640071119624883,1.0170603073164457,0.18341887354528136,1.0017663855443792,5.939342319294675E-2,6.3213651023629334,6.5792018966122662E-2,1.0000898087072652,1.8779711828621811E-2,15.239463468245306,-124.866814003052,55.133185996948001,null,1000000000,104714289,null,34.109845564785324,-39.415500278651514,null,25.089306472547982,-85.08470119136831,null,0,0]
[10292.5,10.2925,14.408464580578375,1.5013368399337641,1.000609574321357,3.4907444238489606E-2,1,0,441.56677418128714,1.5685316617130656,2.0694366621730644,1.0664636667982335,1.017257591230635,0.18446140529968694,1.0017869682633709,5.9737948885642718E-2,6.3215224910878058,6.6173475862610465E-2,1.0000908561295223,1.8888900035227009E-2,15.175867880331399,-124.8064354001967,55.193564599803295,null,1000000000,105935556.25,null,34.096349943419916,-39.335237188886794,null,25.039244301574847,-85.102469676165768,null,0,0]
[10352,10.352,14.491358526290435,1.5017347990921102,1.0006166403014056,3.5109075664352854E-2,1,0,444.11941821369624,1.5685446782427808,2.0786125780785989,1.0688985475791959,1.0174559803446217,0.1855035316293335,1.0018076698875304,6.0082460380486244E-2,6.3216807883479955,6.6554913828308193E-2,1.0000919096243053,1.8998088122972479E-2,15.112721052797898,-124.74700273839278,55.25299726160722,null,1000000000,107163904,null,34.083016901757638,-39.256184029054587,null,24.98946852694111,-85.119974443259323,null,0,0]
[10411.5,10.4115,14.574254740913618,1.5021282312460045,1.0006237469611803,3.5310704234347831E-2,1,0,446.67206232049239,1.5685575459986185,2.0878007089739246,1.0713120113965438,1.0176554740120389,0.18654525050843992,1.001828490409487,6.0426957596581121E-2,6.3218399940752645,6.6936332755685626E-2,1.0000929691916127,1.9107276091171386E-2,15.050016574348595,-124.68850581473076,55.31149418526924,null,1000000000,108399332.25,null,34.06984326083694,-39.178326101537266,null,24.939975916252514,-85.137219988883345,null,0,0]
[10471,10.471,14.657153185951195,1.5025172130845794,1.0006308942998143,3.5512329932141505E-2,1,0,449.22470650040759,1.5685702675167221,2.0970008942969911,1.073704311836702,1.0178560715834291,0.18758655991634587,1.0018494298218277,6.0771440453051433E-2,6.3220001082009896,6.7317732537245226E-2,1.0000940348314431,1.9216463939136893E-2,14.987748159037704,-124.6309345226486,55.369065477351398,null,1000000000,109641841,null,34.056825912840182,-39.101648906437916,null,24.890763291320997,-85.154210707897917,null,0,0]
[10532,10.532,14.742143783831539,1.5029114596403044,1.0006382640526057,3.5719035631896372E-2,1,0,451.8417031292164,1.5685831605257679,2.1064453658128892,1.0761352137990368,1.0180628715523503,0.18865369362647866,1.0018710205347281,6.1124592759438774E-2,6.3221652017833607,6.7708727450945083E-2,1.0000951336402275,1.9328404296387804E-2,14.924356191597038,-124.57286230374649,55.42713769625351,null,1000000000,110923024,null,34.043639468805488,-39.024249456267903,null,24.840597403132129,-85.171369717478555,null,0,0]
[10593,10.593,14.82713664681941,1.5033011864159138,1.0006456765592837,3.5925738278045544E-2,1,0,454.45869983226964,1.5685959050462415,2.1159021737494763,1.0785444005577209,1.0182708303934906,0.18972039267496493,1.0018927361921328,6.1477729800973269E-2,6.3223312499958135,6.8099702012609661E-2,1.0000962388315688,1.9440344525804718E-2,14.861409561628548,-124.51574177415489,55.48425822584511,null,1000000000,112211649,null,34.030610903537635,-38.948060783573375,null,24.790719200067272,-85.188269930368307,null,0,0]
[10654,10.654,14.912131736184332,1.5036864705765414,1.0006531318188983,3.6132437852993943E-2,1,0,457.07569660829211,1.5686085036286626,2.1253711534345872,1.0809321341956628,1.0184799473969759,0.19078665490132588,1.0019145767859177,6.1830851490573893E-2,6.3224982527631424,6.8490656106512865E-2,1.0000973504054655,1.955228462664757E-2,14.798901886375301,-124.45956236053794,55.540437639462056,null,1000000000,113507716,null,34.017737089228135,-38.873067894457485,null,24.741125427112319,-85.204915768769411,null,0,0]
[10715,10.715,14.997129014072836,1.5040673875433113,1.0006606298304939,3.6339134339148038E-2,1,0,459.69269345603755,1.5686209587654711,2.1348521429075409,1.0832986731275476,1.0186902218495624,0.19185247815082471,1.0019365423079123,6.2183957741182516E-2,6.3226662100097206,6.8881589616965527E-2,1.0000984683619165,1.9664224598176263E-2,14.736826908586178,-124.40431359681105,55.595686403188949,null,1000000000,114811225,null,34.005014968838346,-38.799256002198334,null,24.691812883988788,-85.22131155495957,null,0,0]
[10777.5,10.7775,15.084218620181773,1.5044532188053543,1.0006683565602428,3.655091030372655E-2,1,0,462.37404275840163,1.5686335739430757,2.1445785613073762,1.0857016891692948,1.0189068667278822,0.19294405262028169,1.0019591775310901,6.2545730828237542E-2,6.3228392872470245,6.9282114776692466E-2,1.0000996204290038,1.9778917057058747E-2,14.673667871034251,-124.34866068400585,55.65133931599415,null,1000000000,116154506.25,null,33.992134220275226,-38.724838731377616,null,24.64157613524312,-85.237855582761043,null,0,0]
[10840,10.84,15.171310446033754,1.5048346203482088,1.0006761281683316,3.6762682988347242E-2,1,0,465.05539213350062,1.5686460436511351,2.1543172516824596,1.0880829929690674,1.0191247251522015,0.19403516169734011,1.0019819438845161,6.2907487522712482E-2,6.3230133663202297,6.9682618082457404E-2,1.0001007791963972,1.9893609378616242E-2,14.610950164568344,-124.29396285415088,55.706037145849123,null,1000000000,117505600,null,33.979406440217538,-38.65163048057596,null,24.591627986489275,-85.254145986407877,null,0,0]
[10902.5,10.9025,15.258404453619272,1.505211667913622,1.0006839446537152,3.6974452374091728E-2,1,0,467.73674158008373,1.5686583703914039,2.1640680483545953,1.0904428508276462,1.0193437963444278,0.19512580308326088,1.0020048413592524,6.3269227731043279E-2,6.3231884471466051,7.0083099409947003E-2,1.0001019446640951,2.000830156205273E-2,14.548667449092413,-124.24020919992633,55.759790800073674,null,1000000000,118864506.25,null,33.966828559789796,-38.579616003514424,null,24.541965166434526,-85.270187106620867,null,0,0]
[10965,10.965,15.345500605790781,1.5055844355288139,1.0006918060153416,3.7186218442043409E-2,1,0,470.41809109692849,1.5686705566085961,2.1738307884140902,1.0927815252263235,1.0195640795228078,0.19621597448572584,1.0020278699463101,6.3630951359691629E-2,6.3233645296429559,7.0483558634889601E-2,1.000103116832096,2.0122993606572218E-2,14.486813509779877,-124.18738893171813,55.812611068281868,null,1000000000,120231225,null,33.954397580262167,-38.508780269854434,null,24.49258445890953,-85.285983185885556,null,0,0]
[11028.75,11.02875,15.434340852706651,1.5059603243262838,1.0006998708346091,3.7402216393748015E-2,1,0,473.15306767525504,1.5686828442608369,2.1838009212341887,1.095145418200429,1.019790016138358,0.19732746276871005,1.0020514941676477,6.3999892283545551E-2,6.3235451656228729,7.0892004145452422E-2,1.000104319346107,2.023997934804429E-2,14.424157899039765,-124.13446276521205,55.865537234787951,null,1000000000,121633326.5625,null,33.941866279747252,-38.437726797343132,null,24.442503490345654,-85.301847045798382,null,0,0]
[11092.5,11.092499999999999,15.523183255415997,1.5063319105963988,1.0007079823408902,3.7618210853871355E-2,1,0,475.8880443242,1.5686949906763226,2.193783146153423,1.0974878116361602,1.0200172120497897,0.19843845728384829,1.0020752547791927,6.436881576139955E-2,6.3237268435639038,7.1300426399487915E-2,1.0001055288311096,2.0356964943314234E-2,14.361935710882967,-124.08248539053251,55.917514609467489,null,1000000000,123043556.25,null,33.929481727831352,-38.367868774559902,null,24.392709442464316,-85.317464580728327,null,0,0]
[11156.25,11.15625,15.612027777115301,1.5066992676897908,1.0007161405330502,3.7834201802344751E-2,1,0,478.62302104255292,1.5687069982762409,2.203777298854761,1.0998089721550024,1.0202456664158148,0.19954895561930758,1.0020991517712432,6.473772169407388E-2,6.3239095633762581,7.1708825265253129E-2,1.0001067452871018,2.0473950391537356E-2,14.300140733378072,-124.03144573384699,55.968554266153006,null,1000000000,124461914.0625,null,33.917240956085038,-38.299190925754893,null,24.343199071685213,-85.332839994458539,null,0,0]
[11220,11.22,15.700874381833192,1.5070624673014386,1.0007243454099468,3.8050189219101464E-2,1,0,481.3579978291308,1.5687188694267524,2.2137832177938321,1.1021091624819397,1.0204753783912406,0.20065895537030384,1.0021231851340424,6.5106609982417338E-2,6.3240933249696427,7.2117200611051105E-2,1.0001079687140819,2.0590935691868945E-2,14.23876687734861,-123.98133284696607,56.018667153033931,null,1000000000,125888400,null,33.905141064307884,-38.231678195682356,null,24.293969188953568,-85.347977395910021,null,0,0]
[11285.5,11.285500000000001,15.792162045576761,1.5074313805145005,1.0007328241421907,3.8272102002639828E-2,1,0,484.16805247969455,1.5687309267631135,2.2240758972611396,1.1044509258014978,1.0207127051602718,0.20179890388028901,1.0021480202632969,6.5485606134234986E-2,6.3242832159738995,7.2536761624785354E-2,1.0001092329859853,2.0711132198461366E-2,14.176140595713571,-123.93079821717176,56.069201782828245,null,1000000000,127362510.25,null,33.892852774564204,-38.163510113745275,null,24.243676745366365,-85.363286652665792,null,0,0]
[11351,11.351000000000001,15.883451833880256,1.5077960531356449,1.0007413521549697,3.8494011014959799E-2,1,0,486.97810719983397,1.5687428449483545,2.2343806608338519,1.106771101741435,1.0209513577100435,0.20293832093287809,1.0021729993320254,6.5864583447598338E-2,6.32447420654516,7.2956297527817113E-2,1.0001105046168466,2.0831328547123398E-2,14.113946225942989,-123.88121890971716,56.118781090282837,null,1000000000,128845201,null,33.880707211848232,-38.09654047451491,null,24.193673746708548,-85.378353148427905,null,0,0]
[11416.5,11.416499999999999,15.974743710320435,1.5081565577689728,1.0007499294470239,3.8715916234302865E-2,1,0,489.78816198835159,1.5687546263775214,2.2446973420879583,1.1090699627967724,1.0211913351110502,0.20407720394317272,1.0021981223294651,6.6243541815059745E-2,6.3246662965838238,7.33758081774568E-2,1.0001117836066638,2.095152473693887E-2,14.052177548717914,-123.83258345999347,56.167416540006528,null,1000000000,130336472.25,null,33.868701443780537,-38.030753654298842,null,24.143956905953775,-85.393181044299155,null,0,0]
[11482,11.481999999999999,16.066037639301111,1.5085129653727085,1.0007585560170864,3.8937817638912763E-2,1,0,492.59821684407723,1.5687662733910093,2.2550257774542652,1.1113477773800395,1.0214326364295025,0.20521555033423861,1.0022233892447927,6.6622481129204131E-2,6.3248594859897338,7.379529343106718E-2,1.0001130699554346,2.1071720766991636E-2,13.990828468495348,-123.78488054032547,56.215119459674526,null,1000000000,131836324,null,33.856832606236878,-37.966134260639258,null,24.09452299159598,-85.407774407080339,null,0,0]
[11548.75,11.54875,16.15907589448646,1.5088720313941848,1.000767397912641,3.9163949856001343E-2,1,0,495.46189876882647,1.5687780067557147,2.2655632466501161,1.1136476826486617,1.0216799038206377,0.20637506615516588,1.0022492864057733,6.7008632396264409E-2,6.3250574931499575,7.4222757853184301E-2,1.0001143884237953,2.1194210449098111E-2,13.92873410360165,-123.73721506738171,56.262784932618288,null,1000000000,133373626.5625,null,33.844875243106294,-37.901467030488298,null,24.044433469597621,-85.422409094861692,null,0,0]
[11615.5,11.615500000000001,16.252116209182365,1.5092269862898402,1.0007762909823108,3.939007806575371E-2,1,0,498.32558076100287,1.5687896052663159,2.2761125886909666,1.1159262806441599,1.0219285441710366,0.20753401930159618,1.0022753330072161,6.7394763650709386E-2,6.3252566418265959,7.4650195601782474E-2,1.0001157145346617,2.1316699963364816E-2,13.867063101313651,-123.69049473400369,56.309505265996307,null,1000000000,134919840.25,null,33.833054289568018,-37.837980651716698,null,23.994631170361806,-85.436808452471141,null,0,0]
[11682.25,11.68225,{"$f":"SQRT(1+(A205/pole1)^2)","v":16.345158548219242},{"$f":"ATAN(A205/pole1)","v":1.5095779001753411},{"$f":"SQRT(1+(A205/Zero1)^2)","v":1.0007852352247315},{"$f":"ATAN(A205/Zero1)","v":3.9616202245151333E-2},{"$f":"IF(VIN_nom>Vout, 1, SQRT(1+(A205/z_RHP)^2))","v":1},{"$f":"IF(VIN_nom>Vout, 0, -ATAN(A205/z_RHP))","v":0},{"$f":"SQRT(1+(A205/Pole2)^2)","v":501.18926281945073},{"$f":"ATAN(A205/Pole2)","v":1.5688010712343878},2.2866736392542446,1.1181838427648636,{"$f":"SQRT(1+(A205/pole4)^2)","v":1.0221785564788011},{"$f":"ATAN(A205/pole4)","v":0.20869240707192652},{"$f":"IF(VOUT_setting=1,1,SQRT(1+(A205*zterm1)^2))","v":1.0023015290374708},{"$f":"IF(VOUT_setting=1,0,ATAN(((A205*zterm1))))","v":6.7780874778961456E-2},6.3254569319118481,{"$f":"IF(VOUT_setting=1,0,ATAN(A205*$Q$4/(1+Afbr-$Q$5*(A205)^2)))","v":7.5077606526071206E-2},{"$f":"SQRT((1-(Z205/pterm2))^2+(A205/pterm1)^2)","v":1.0001170482880319},{"$f":"IF((ATAN((A205/pterm1)/(1-A205^2/pterm2))>0),ATAN((A205/pterm1)/(1-A205^2/pterm2)),PI()+ATAN((A205/pterm1)/(1-A205^2/pterm2)))","v":2.1439189308822156E-2},{"$f":"20*LOG10(((E205*K205*G205*O205)/(C205*I205*S205*M205*Q205))*Adc)","v":13.805809387738767},{"$f":"((F205+L205+H205+P205)-(D205+J205+T205+N205+R205))*radconv","v":-123.64470798432855},{"$f":"IF(V205>0,V205,V205+180)","v":56.355292015671452},null,{"$f":"IF(U205<0,A205,1000000000)","v":1000000000},{"$f":"A205^2","v":136474965.0625},null,{"$f":"20*LOG10((K205/(I205*M205))*AEA)","v":33.821366921595725},{"$f":"(L205-(J205+N205))*radconv","v":-37.775659551998608},null,{"$f":"20*LOG10((E205*G205/(C205*S205))*Acs*Am)","v":23.94511284392836},{"$f":"(F205+H205-(D205+T205))*radconv","v":-85.450976498503749},null,{"$f":"SUM((U206<0)*(U205>0))*A205","v":0},0]
[11749,{"$f":"A206/1000","v":11.749000000000001},16.438202877223009,1.509924841582899,1.0007942306385316,3.984232237117815E-2,1,0,504.05294494304042,1.5688124069189737,2.2972462368584012,1.1204206362788987,1.0224299397374865,0.20985022677325843,1.0023278744848216,6.8166965667478888E-2,6.3256583632973102,7.5504990475317807E-2,1.0001183896839034,2.1561678484500552E-2,13.744967009715673,-123.59984340590141,56.40015659409859,null,1000000000,138039001,null,33.809810381184263,-37.71448839314035,null,23.895875295046668,-85.464917160829174,null,0,0]
[11817.5,11.817500000000001,16.533688604331527,1.5102768190174665,1.0008035150870258,4.0074366501907786E-2,1,0,506.99170494168214,1.5688239066573282,2.3081078573598934,1.1226947558419169,1.0226893378440833,0.21103780787922813,1.0023550659688276,6.8563157627354057E-2,{"$f":"IF(VOUT_setting=1,1,SQRT((1+Afbr-$Q$5*(A207)^2)^2+(A207*$Q$4)^2))","v":6.3258662621161301},7.5943551044054411E-2,1.0001197741931307,2.1687378809351277E-2,13.682951047066151,-123.55474953715749,56.445250462842509,null,1000000000,139653306.25,null,33.798084053078313,-37.652893211675639,null,23.845635495384251,-85.478990931075586,null,0,0]
[11886,11.885999999999999,16.629176356244166,1.5106247542579707,1.000812853422262,4.0306406314839414E-2,1,0,509.93046500659761,1.5688352738483109,2.3189813026642634,1.1249475607775554,1.0229501775667624,0.21222478502136813,1.0023824147820224,6.8959328030158765E-2,6.3260753626298083,7.6382082883332675E-2,1.0001211667508381,2.1813078953335167E-2,13.621355945150981,-123.51060293304339,56.489397066956613,null,1000000000,141276996,null,33.786489822971596,-37.592477069419623,null,23.795684742134128,-85.492833337690641,null,0,0]
[11954.5,11.954499999999999,16.724666098279695,1.5109687164563506,1.0008222456427318,4.0538441785107057E-2,1,0,512.86922513664774,1.5688465107704233,2.3298664072130792,1.1271793268029304,1.0232124578030228,0.21341115531815505,1.0024099209115285,6.9355476753303835E-2,6.3262856647192045,7.6820585830442739E-2,1.0001225673570233,2.193877891540439E-2,13.56017564729736,-123.46739172276143,56.532608277238566,null,1000000000,142910070.25,null,33.775024915519637,-37.533224134394573,null,23.746019753864218,-85.50644834415327,null,0,0]
[12023,12.023,16.820157796543725,1.5113087731979924,1.0008316917469182,4.0770472887847548E-2,1,0,515.80798533071902,1.5688576196502408,2.3407630083515709,1.1293903253477278,1.0234761774454095,0.21459691589784405,1.0024375843443962,6.9751603674240811E-2,6.3264971682645115,7.7259059722740261E-2,1.0001239760116836,2.2064478694511117E-2,13.499404217876984,-123.42510418899542,56.574895811004581,null,1000000000,144552529,null,33.763686620987357,-37.475118817859553,null,23.696637304576974,-85.519839824185368,null,0,0]
[12093,12.093,16.917742540375603,1.5116523105014703,1.0008414003650521,4.1007580425737156E-2,1,0,518.81109800280649,1.5688688417756871,2.351909931878081,1.1316285633621517,1.0237471578438619,0.21580800916903425,1.0024660160402894,7.0156382256264249E-2,6.326714544356788,7.7707105047800235E-2,1.0001254238275652,2.2192930833418834E-2,13.437718370377713,-123.38283285421689,56.617167145783114,null,1000000000,146240649,null,33.75222809167888,-37.416910739481935,null,23.646462074629685,-85.533297566012365,null,0,0]
[12163,12.163,17.015329257902049,1.5119919073181596,1.0008511652493806,4.124468335023921E-2,1,0,521.81421073947911,1.5688799347313762,2.3630685265973552,1.1338456741259264,1.0240196390243044,0.21701845969573227,1.0024946119765972,7.0561137812163582E-2,6.3269331748444975,7.8155119688442437E-2,1.0001268800482643,2.2321382779051005E-2,13.376447335201334,-123.34150183550938,56.658498164490624,null,1000000000,147938569,null,33.740896261688903,-37.359868935971939,null,23.596575253484438,-85.54652978783065,null,0,0]
[12233,12.233000000000001,17.112917915357979,1.5123276309824809,1.0008609863982569,4.1481781634830329E-2,1,0,524.81732353962809,1.5688909007347127,2.3742386279504029,1.1360419338801204,1.0242936197890287,0.21822826444522406,1.0025233721392648,7.0965870211295065E-2,6.3271530595976255,7.8603103471316355E-2,1.0001283446737783,2.2449834530289484E-2,13.315585150609927,-123.30109911569855,56.698900884301452,null,1000000000,149646289,null,33.72968844028248,-37.303977533168386,null,23.546973570025152,-85.559540349073956,null,0,0]
[12303,12.303000000000001,17.210508479743471,1.5126595473051394,1.0008708638100243,4.1718875252990242E-2,1,0,527.82043640216966,1.5689017419526374,2.3854200742924094,1.1382176144990088,1.0245690989350198,0.219437420395592,1.0025522965141589,7.1370579323060263E-2,6.3273741984854315,7.9051056223144484E-2,1.0001298177041049,2.2578286086016145E-2,13.255125974132284,-123.26161283823491,56.73838716176509,null,1000000000,151363809,null,33.718602000769238,-37.249220904836179,null,23.4976538083572,-85.572333021873391,null,0,0]
[12374.5,12.374499999999999,17.310192205635886,1.5129947124044127,1.0008810109631425,4.1961044603616098E-2,1,0,530.88790174650615,1.5689126888591685,{"$f":"SQRT(1+(A215/Zero2)^2)","v":2.3968526702234718},{"$f":"ATAN(A215/Zero2)","v":1.1404189497075459},1.0248520268367547,0.22067181389756182,1.0025820102104872,7.1783936595957665E-2,6.3276013706610792,7.9508575746827015E-2,1.0001313309762607,2.2709489972076218E-2,13.193781345196467,-123.2222143743323,56.777785625667704,null,1000000000,153128250.25,null,33.707400640032766,-37.194446437495067,null,23.447564955659388,-85.585178714725174,null,0,0]
[12446,12.446,17.409877853811931,1.513326039357372,1.0008912168127306,4.2203209029757174E-2,1,0,533.95536715373044,1.5689235099901802,2.4082967706990162,1.142599374138783,1.025136515470161,0.22190552415819867,1.0026118952020528,7.2197269297480438E-2,6.3278298510178583,7.9966062530106782E-2,1.0001328530172888,2.2840693651797514E-2,13.132845227257324,-123.18374754915924,56.816252450840764,null,1000000000,154902916,null,33.696320576193706,-37.140823716189693,null,23.397763625192734,-85.597804768321623,null,0,0]
[12517.5,12.5175,17.509565391439697,1.5136535936460158,1.0009014813569934,4.2445368503161787E-2,1,0,537.02283262276501,1.5689342075009534,2.4197522124884956,1.1447591638954573,1.025422563536232,0.22313854799222263,1.002641951473539,7.2610577288601277E-2,6.3280596394140902,8.0423516388564917E-2,1.0001343838271866,2.2971897123988502E-2,13.072311760465281,-123.14620023497143,56.853799765028569,null,1000000000,156687806.25,null,33.685359205817228,-37.088336862383905,null,23.348246560419248,-85.610214936055314,null,0,0]
[12589,12.589,17.609254786430135,1.5139774392727985,1.0009118045941245,4.2687522995581685E-2,1,0,540.09029815255656,1.5689447834978043,2.4312188352775586,1.1468985906492406,1.0257101697302926,0.22437088222624624,1.0026721790095425,7.3023860430343326E-2,6.3282907357073075,8.0880937137863707E-2,1.0001359234059506,2.3103100387457668E-2,13.012175202240066,-123.1095604710117,56.890439528988296,null,1000000000,158482921,null,33.674513987825186,-37.036970249298797,null,23.299010559712915,-85.622412886547025,null,0,{"$f":"IF(AH218>0,W218,0)","v":0}]
[12662.25,12.66225,17.711386024967553,1.5143054306617147,1.000922441361257,4.2935599151333596E-2,1,0,543.23284157193029,1.568955494488286,2.4429775399117957,1.1490695437471266,1.0260064296655493,0.22563266005779459,1.0027033239676486,7.3447232979368879E-2,6.3285288443596599,8.1349518972650761E-2,1.0001375097601366,2.3237514701920241E-2,12.950972486011691,-123.07295273969294,56.927047260307063,null,1000000000,160332575.0625,null,33.663521186093121,-36.985492038190145,null,23.248857658357597,-85.634693065065008,null,0,0]
[12735.5,12.7355,17.813519147018326,1.5146296610333305,1.0009331397256258,4.3183670019282257E-2,1,0,546.37538505290956,1.5689660822676792,2.4547476480519763,1.1512196881773193,1.0263043221439208,0.22689370741522777,1.0027346486434421,7.3870579152593263E-2,6.3287683254101692,8.1818065666300607E-2,1.0001391053176811,2.3371928794787125E-2,12.890174508142673,-123.03727264228972,56.962727357710278,null,1000000000,162192960.25,null,33.65264508612573,-36.935157163359719,null,23.198993116472003,-85.646758043437089,null,0,0]
[12808.75,12.80875,17.915654120369997,1.5149501946421977,1.0009438996852558,4.3431735569065565E-2,1,0,549.51792859443754,1.5689765489498135,2.4665289964478476,1.1533493020927319,1.0266038457442483,0.22815402092545253,1.0027661530200802,7.4293898800749533E-2,6.3290091787030711,8.2286577020874094E-2,1.0001407100785811,2.3506342664777184E-2,12.829775457889243,-123.00250785005565,56.99749214994435,null,1000000000,164064076.5625,null,33.641883148178216,-36.88594961566902,null,23.149413662921816,-85.658611504844089,null,0,0]
[12882,12.882,18.017790913539919,1.5152670942889979,1.0009547212381606,4.3679795770325332E-2,1,0,552.66047219548147,1.5689868966004401,2.4783214247989389,1.1554586591046969,1.0269049990392543,0.22941359722862542,1.0027978370806268,7.4717191774627503E-2,6.3292514040817291,8.2755052838523399E-2,1.0001423240428335,2.3640756310609298E-2,12.769769641152864,-122.96864620916347,57.031353790836533,null,1000000000,165945924,null,33.63123289389398,-36.83785364419743,null,23.100116081828915,-85.670257049166025,null,0,0]
[12957.25,12.95725,18.122718287308622,1.5155889268346505,1.0009659023968125,4.3934623344897811E-2,1,0,555.88881909569409,1.5689974049511721,2.4904472031973044,1.1576047981886692,1.0272160704909092,0.23070679350254919,1.0028305733270324,7.5152014302433262E-2,6.3295016717489334,8.3236282591367367E-2,1.0001439916580779,2.3778839718829034E-2,12.708529062453604,-122.93478790678421,57.065212093215791,null,1000000000,167890327.5625,null,33.620405605914534,-36.789585705107037,null,23.049762691369509,-85.682007747740514,null,0,0]
[13032.5,13.032500000000001,18.227647516548444,1.515907054092114,1.0009771485538255,4.4189445209950759E-2,1,0,559.11716605658205,1.5690077919513039,2.5025843411892619,1.1597301301129839,1.027528858772339,0.23199920461747256,1.0028634991668477,7.5586808360406252E-2,6.3297533871130254,8.3717474417210447E-2,1.0001456689861008,2.3916922887742092E-2,12.64769166688626,-122.90185730185304,57.098142698146958,null,1000000000,169846056.25,null,33.609691072855483,-36.742457989275806,null,22.99970006928859,-85.693546462359762,null,0,0]
[13107.75,13.107749999999999,18.332578569399207,1.5162215396208401,1.0009884597070089,4.4444261332583876E-2,1,0,562.34551307710035,1.5690180596908039,2.5147326742965537,1.161834937086816,1.0278433623161718,0.23329082697468442,1.0028966145813989,7.6021573786966626E-2,6.3300065500013298,8.4198628101856757E-2,1.000147356026899,2.4055005815959579E-2,12.587251646458146,-122.86984177900977,57.130158220990225,null,1000000000,171813110.0625,null,33.599086799024505,-36.696454240864433,null,22.949924903135784,-85.704876836517556,null,0,0]
[13183,13.183,18.437511414725446,1.5165324455362641,1.000999835854159,4.4699071679901337E-2,1,0,565.57386015622808,1.5690282102119213,2.5268920410536508,1.1639194966223607,1.0281595795483636,0.23458165699039188,1.0029299195519077,7.6456310420599097E-2,6.3302611602402008,8.4679743431214344E-2,1.0001490527804686,2.4193088502092615E-2,12.527203310413848,-122.83872890739802,57.161271092601979,null,1000000000,173791489,null,33.588590349763365,-36.651558471271386,null,22.900433936663095,-85.716002430971415,null,0,0]
[13259.75,13.25975,18.544537759551474,1.5168459245036829,1.0010115057162849,4.4958955319991695E-2,1,0,568.86655972816538,1.5690384443918544,2.5393049886071979,1.1660250349347827,1.0284838637436522,0.23589739794617795,1.0029640836506934,7.689968307376821E-2,6.3305223364995431,8.5170409367725949E-2,1.0001507933614817,2.4333923416207871E-2,12.466355689335732,-122.80791296525319,57.192087034746805,null,1000000000,175820970.0625,null,33.577993276145371,-36.606892791331468,null,22.85024587381033,-85.727142463228589,null,0,0]
[13336.5,13.336499999999999,18.651565905817691,1.5171558058330621,1.0010232431846549,4.5218832883117871E-2,1,0,572.15925935899907,1.5690485607791289,2.5517290840866744,1.1681100791351318,1.028809927299509,0.23721230717431221,1.0029984448980123,7.7343025435498022E-2,6.3307850180183012,8.5661034955062512E-2,1.0001525440463384,2.4474758075572915E-2,12.405903925617823,-122.77801047357629,57.221989526423712,null,1000000000,177862232.25,null,33.56750343934975,-36.563346934013126,null,22.800346784726564,-85.738076699597912,null,0,0]
[13413.25,13.41325,18.758595822689472,1.5174621510449258,1.0010350482568906,4.5478704334391905E-2,1,0,575.45195904771822,1.5690585613957488,2.5641641654475911,1.170174909124075,1.0291377685246601,0.23852638092059728,1.003033003273603,7.7786337334630612E-2,6.3310492046091413,8.6151619966410076E-2,1.000154304835035,2.4615592478714195E-2,12.345842339355634,-122.74900881958509,57.250991180414914,null,1000000000,179915275.5625,null,33.557118441533845,-36.520904762942067,null,22.750733387187335,-85.748808666860299,null,0,0]
[13490,13.49,18.865627480031407,1.5177650202663728,1.0010469209306005,4.5738569638930728E-2,1,0,578.74465879333479,1.5690684482177031,2.5766100736317408,1.1722198000908695,1.0294673857207708,0.23983961544714652,1.0030677587570904,7.8229618600079417E-2,6.3313148960836862,8.6642164175069578E-2,1.0001560757275678,2.4756426624158175E-2,12.286165365089541,-122.72089557890409,57.279104421095909,null,1000000000,181980100,null,33.546835943762133,-36.479550409985968,null,22.701402454505054,-85.759341811958976,null,0,0]
[13568.5,13.5685,18.975101368367117,1.5180712607735425,1.0010591342453827,4.6004353816082144E-2,1,0,582.11243644116576,1.5690784447685875,2.5893508019465714,1.1742909730689683,1.0298063540151488,0.24118192141216063,1.0031035105901396,7.8682975388314425E-2,6.3315882022174481,8.7143850985832869E-2,1.000157897450787,2.4900471703501618E-2,12.22551986041077,-122.69304759375684,57.306952406243155,null,1000000000,184104192.25,null,33.536422646106573,-36.43836216643821,null,22.651235605071118,-85.769912964041694,null,0,0]
[13647,13.647,19.084577015833524,1.5183739879086897,1.0010714182744842,4.6270131489195551E-2,1,0,585.48021414649861,1.5690883263158901,2.602102529147206,1.1763418550097962,1.0301471765764394,0.24252334159319289,1.0031394685787178,7.9136299768157906E-2,6.3318630822419637,8.7645494632639084E-2,1.0001597297438485,2.5044516510144024E-2,12.165265284034222,-122.66610329789671,57.333896702103289,null,1000000000,186240609,null,33.526111808189043,-36.398279172785692,null,22.601357593034482,-85.780283171764751,null,0,0]
[13725.5,13.7255,19.194054392330379,1.5186732617336447,1.0010837730153013,4.6535902620963215E-2,1,0,588.84799190834678,1.5690980948328164,2.61486509432119,1.1783727256414855,1.0304898515648111,0.24386387204401111,1.0031756327006565,7.9589591556785869E-2,6.3321395359522938,8.814709487330287E-2,1.0001615726067483,2.5188561042508797E-2,12.105396033956893,-122.64004999097152,57.359950009028481,null,1000000000,188389350.25,null,33.515901107994381,-36.359285288740899,null,22.55176513822952,-85.790455878464769,null,0,0]
[13804,13.804,19.303533468439795,1.5189691409501926,1.001096198465216,4.6801667174082885E-2,1,0,592.21576972574599,1.5691077522476884,2.6276383395468623,1.1803838599202383,1.0308343771328854,0.2452035088364071,1.0032120029336631,8.0042850571454133E-2,6.3324175631423643,8.8648651465767378E-2,1.0001634260394816,2.5332605299019376E-2,12.045906621142803,-122.61487516657957,57.385124833420434,null,1000000000,190550416,null,33.505788280968368,-36.321364645888856,null,22.502455015995739,-85.800434449553222,null,0,0]
[13884.25,13.88425,19.415454887824129,1.5192681669805852,1.0011089740040093,4.7073349575583567E-2,1,0,595.65862544901893,1.5691175120728185,2.6407072170958958,1.182419708602938,1.0311884941975895,0.24657208230751762,1.0032493969992318,8.0506180018181162E-2,6.3327034146621139,8.9161343885598737E-2,1.0001653317166854,2.5479860446433925E-2,11.985478043601629,-122.59003437295576,57.409965627044244,null,1000000000,192772398.0625,null,33.495548879290503,-36.283691789236791,null,22.452334166060993,-85.810438222555163,null,0,0]
[13964.5,13.964499999999999,19.52737802337116,1.519563765241486,1.0011218234340955,4.7345025023032221E-2,1,0,599.10148122837882,1.5691271597243981,2.6537869317059464,1.1844354974048958,1.031544541343312,0.24793971358712236,1.0032870064204571,8.0969474827435259E-2,6.3329909101595705,8.9673990178275778E-2,1.0001672484402333,2.5627115302225979E-2,11.925435175625969,-122.56608584186306,57.433914158136943,null,1000000000,195007260.25,null,33.485407153935746,-36.247107868422226,null,22.402501734076449,-85.820245980560955,null,0,0]
[14044.75,14.044750000000001,19.639302845739977,1.5198559942855929,1.0011347467526297,4.7616693476593974E-2,1,0,602.5443370628642,1.5691366971252585,2.6668773239257417,1.1864315052149703,1.0319025165721907,0.24930639853708231,1.0033248311731209,8.1432734804237669E-2,6.3332800494108872,9.0186590085610238E-2,1.000169176210121,2.5774369864711232E-2,11.865772500533712,-122.54301682060579,57.456983179394214,null,1000000000,197255002.5625,null,33.475360861281203,-36.2115967773628,null,22.352954446788857,-85.829861080578922,null,0,0]
[14125,14.125,19.751229326254304,1.5201449113407088,1.0011477439567502,4.7888354896440152E-2,1,0,605.98719295153535,1.5691461261545334,2.6799782372904706,1.1884080061058515,1.0322624178783222,0.25067213303912356,1.0033628712328708,8.1895959753698774E-2,6.3335708321909738,9.0699143349557296E-2,1.0001711150263444,2.5921624132205379E-2,11.806484612905441,-122.52081475516083,57.479185244839172,null,1000000000,199515625,null,33.465407813602106,-36.177142684556813,null,22.303689086308459,-85.839286803706173,null,0,0]
[14207.25,14.20725,19.865946943088641,1.5204376505134096,1.0011611417463298,4.8166779353841685E-2,1,0,609.51585215749708,1.5691556796401409,2.6934164102577438,1.190413805174122,1.0326332852584914,0.25207091397620318,1.0034020827286843,8.2370692698712916E-2,6.333870567136624,9.1224421855229332E-2,1.0001731136246832,2.6072547980113291E-2,11.746102518501079,-122.49894607211907,57.501053927880932,null,1000000000,201845952.5625,null,33.455301242732496,-36.142910481917497,null,22.253485172417918,-85.848754276001571,null,0,0]
[14289.5,14.2895,19.980666242810674,1.52072702817783,1.0011746171440188,4.8445196337868805E-2,1,0,613.04451141844822,1.5691651231468007,2.706865311840692,1.1923996807759032,1.0330061716236176,0.25346868780483828,1.0034415203448956,8.2845388434456116E-2,6.3341720280695277,9.1749650815214162E-2,1.0001751238268048,2.622347151456066E-2,11.686102973683312,-122.47796201839941,57.52203798160059,null,1000000000,204189810.25,null,33.445288142174341,-36.109755805429586,null,22.203570741097657,-85.85802955829233,null,0,0]
[14371.75,14.37175,20.095387196598907,1.5210131018558253,1.001188170146684,4.8723605805660583E-2,1,0,616.57317073344495,1.569174458562745,2.7203247829170349,1.1943659128592738,1.0333810747881031,0.25486545015635309,1.0034811840548445,8.3320046751396024E-2,6.3344752147433026,9.2274829952162643E-2,1.000177145632704,2.6374394733734166E-2,11.626480504236474,-122.45784970626546,57.542150293734537,null,1000000000,206547198.0625,null,33.4353663290048,-36.077662473130744,null,22.15394250084146,-85.867115948689843,null,0,0]
[14454,14.454000000000001,20.210109776285851,1.5212959277653522,1.0012018007511736,4.9002007714363076E-2,1,0,620.10183010156447,1.5691836877332275,2.7337946673743327,1.1963127764689634,1.0337579925577072,0.25626119668417841,1.0035210738317224,8.3794667440100737E-2,6.3347801269102009,9.2799958988887196E-2,1.000179179042376,2.6525317635820524E-2,11.56722974662758,-122.43859645302101,57.561403546978994,null,1000000000,208918116,null,33.425533675194913,-36.046614582803926,null,22.104597215930735,-85.87601667059721,null,0,0]
[14622.5,14.6225,20.445139111212324,1.5218654222433436,1.0012299671654303,4.9572327048511666E-2,1,0,627.33075553453534,1.5692022706854516,2.7614213828493033,1.2002418345042718,1.0345364402860937,0.25911737761379577,1.003603499153529,8.4766872288575087E-2,6.3354101670541443,9.3875597634153166E-2,1.0001833809867562,2.6834502157766515E-2,11.446985470652917,-122.40178387505688,57.598216124943121,null,1000000000,213817506.25,null,33.40565992107156,-35.986207977375933,null,22.00437713034863,-85.893684378039183,null,0,0]
[14706.75,14.70675,20.56265622261165,1.5221452874835322,1.0012441724914722,4.9857474636295036E-2,1,0,630.9452183308623,1.5692114024787891,2.7752504878547053,1.2021770142330239,1.0349288253887383,0.26054385099952548,1.0036450674911068,8.5252914600667792E-2,6.335727901701417,9.4413336927599095E-2,1.0001855002213509,2.6989093911970918E-2,11.387426352239283,-122.38467717947371,57.615322820526288,null,1000000000,216288495.5625,null,33.395854722917889,-35.957584464094126,null,21.954699061346517,-85.902239176889296,null,0,0]
[14791,14.791,20.680174926267412,1.5224219719790337,1.0012584592255098,5.0142614109847411E-2,1,0,634.55968117920418,1.569220430242424,2.7890898828663584,1.2040929964498803,1.0353233147930347,0.26196924022508372,1.0036868729072423,8.5738916538440249E-2,6.3360474457031213,9.495102247194076E-2,1.0001876316308747,2.7143685325731307E-2,11.32823546139868,-122.36841977787547,57.631580222124526,null,1000000000,218773681,null,33.386134540276281,-35.929992808957238,null,21.905304626173919,-85.910612177898102,null,0,0]
[14877.25,14.87725,20.800485012659301,1.5227019859953541,1.0012731694365999,5.0434514019481638E-2,1,0,638.25994735286929,1.5692295663969262,2.8032683097045292,1.2060348577001929,1.035729346245613,0.26342733876250757,1.0037299162932123,8.62364135564197E-2,6.3363764493256367,9.5501416076549342E-2,1.0001898262495397,2.7301946210640485E-2,11.268015455363805,-122.35264309962621,57.647356900373794,null,1000000000,221332567.5625,null,33.376269577572742,-35.902798710285794,null,21.855028103163217,-85.918998847152352,null,0,0]
[14963.5,14.9635,20.920796711214397,1.5229787794137652,1.0012879649592172,5.0726405327473238E-2,1,0,641.9602135791954,1.569238597229625,2.8174572007638954,1.2079571674685583,1.0361375779834237,0.2648842914320152,1.0037732080842898,8.673386778435821E-2,6.3367073486441585,9.6051752720137981E-2,1.0001920336280214,2.7460206734617239E-2,11.208170441712198,-122.33773008443937,57.662269915560628,null,1000000000,223906332.25,null,33.366489502003475,-35.876653141124045,null,21.805042126928797,-85.927201461896615,null,0,0]
[15049.75,15.04975,21.041109994277967,1.5232524074377218,1.0013028457895805,5.1018287984466018E-2,1,0,645.66047985727698,1.56924752455131,2.8316563987418015,1.2098602055600718,1.036548007406801,0.2663400934057531,1.0038167482483362,8.7231278981607263E-2,6.3370401433617722,9.6602032084443928E-2,1.0001942537663133,2.7618466895570865E-2,11.148695060940506,-122.323667688985,57.676332311015003,null,1000000000,226494975.0625,null,33.356792263621514,-35.851539896955906,null,21.755343387657504,-85.935223187763938,null,0,0]
[15136,15.135999999999999,21.161424834823848,1.5235229240171468,1.0013178119238857,5.1310161941112611E-2,1,0,649.36074618622956,1.5692563501314967,2.8458657493618493,1.2117442467560331,1.0369606319062099,0.26779473988300079,1.0038605367530333,8.7728646907645189E-2,6.3373748331799238,9.7152253851408063E-2,1.0001964866644097,2.7776726691410673E-2,11.0895840622021,-122.31044308514694,57.689556914853057,null,1000000000,229098496,null,33.347175864909786,-35.82744306029732,null,21.705928631761672,-85.943067118564855,null,0,0]
[15224,15.224,21.284182423846278,1.5237957772664148,1.0013331696326264,5.160794895991469E-2,1,0,653.13609043425845,1.5692652517167551,2.8603737123762816,1.2136472158890914,1.0373838881135429,0.26927770507189436,1.0039054696363878,8.8236061510317057E-2,6.3377182666620886,9.7713579846313389E-2,1.0001987780184514,2.793819717710145E-2,11.029643918844643,-122.29780052784633,57.702199472153666,null,1000000000,231770176,null,33.33744564793934,-35.803888630157203,null,21.6558006237874,-85.950890096158162,null,0,0]
[15312,15.311999999999999,21.406941579278996,1.5240655011549165,1.0013486161339689,5.1905726817976928E-2,1,0,656.91143473344573,1.5692740509851804,2.8748919290715373,1.2155309717817671,1.0378094238569411,0.27075945738893675,1.0039506609716853,8.8743430562594594E-2,6.3380636722945018,9.8274845214622791E-2,1.0002010826553263,2.8099667278315057E-2,10.970072384620051,-122.28600379324601,57.71399620675399,null,1000000000,234457344,null,33.327795543611508,-35.781359682842073,null,21.605961570846336,-85.958534277429564,null,0,0]
[15400,15.4,21.529702274327697,1.5243321491731849,1.0013641514238041,5.2203495462915563E-2,1,0,660.68677908291454,1.5692827496907695,2.8894202448853052,1.217395790781957,1.0382372363335077,0.2722399918228382,1.0039961107240261,8.9250753809429068E-2,6.3384110497548027,9.8836049619184116E-2,1.0002034005750287,2.8261136992831042E-2,10.910864214503972,-122.27503992410058,57.724960075899418,null,1000000000,237160000,null,33.318223589378299,-35.759840198154627,null,21.556408190183603,-85.966002730035044,null,0,0]
[15488,15.488,21.652464482805375,1.5245957736004325,1.0013797754980001,5.2501254842356633E-2,1,0,664.46212348180779,1.5692913495476566,2.9039585082418875,1.2192419442361873,1.0386673227299794,0.27371930339189976,1.0040418188583171,8.9758030995912161E-2,6.3387603987188612,9.9397192723070724E-2,1.0002057317775512,2.8422606318429005E-2,10.852014269545549,-122.26489617973414,57.735103820265863,null,1000000000,239878144,null,33.308727873137094,-35.739314441866419,null,21.50713725467098,-85.973298452226402,null,0,0]
[15578.25,15.578250000000001,21.778367042907362,1.5248630514072627,1.0013958912654755,5.2806617709017255E-2,1,0,668.33399662317686,1.569300068369941,2.9188786651594985,1.2211161920476221,1.0391107645689801,0.27523516291668138,1.0040889640054727,9.0278230228929585E-2,6.3391207273191741,9.9972619211429053E-2,1.0002081363812654,2.8588203714814964E-2,10.792026445219067,-122.25533180255587,57.744668197444128,null,1000000000,242681873.0625,null,33.299066604136669,-35.719279857310596,null,21.456896597609415,-85.980604370955234,null,0,0]
[15668.5,15.6685,21.904271140914851,1.5251272566474476,1.0014121004065826,5.3111970718769767E-2,1,0,672.20586981476595,1.5693086867522394,2.9338089712176303,1.2229713700320963,1.0395565920677385,0.27674972572665479,1.0041363808408164,9.0798380473506662E-2,6.3394831288313558,0.10054798050726431,1.0002105549557043,2.8753800697410382E-2,10.732404780797891,-122.24660356243061,57.753396437569393,null,1000000000,245501892.25,null,33.289481604277803,-35.700257842283797,null,21.406946312413908,-85.987734785633606,null,0,0]
[15758.75,15.758749999999999,22.030176750460114,1.5253884419642547,1.0014284029167875,5.3417313815151669E-2,1,0,676.0777430557124,1.5693172064201995,2.9487492722528503,1.2248077551826746,1.0400048021582133,0.27826298654541182,1.0041840693258612,9.131848145514318E-2,6.3398476028999848,0.10112327624788613,1.000212987500861,2.891939726382026E-2,10.673144062962333,-122.23869839966314,57.761301600336864,null,1000000000,248338201.5625,null,33.279970966774869,-35.682232322808808,null,21.357283092243613,-85.994692715596386,null,0,0]
[15849,15.849,22.156083845774461,1.5256466588059909,1.0014447987915305,5.3722646941711548E-2,1,0,679.94961634517267,1.5693256290601627,2.9636994171081676,1.2266256194159719,1.0404553917612671,0.27977494012946391,1.0042320294219074,9.1838532899497519E-2,6.3402141491676849,0.10169850607085866,1.0002154340167277,2.9084993411649621E-2,10.614239184090193,-122.23160347659012,57.768396523409876,null,1000000000,251190801,null,33.270532834357184,-35.665187515401719,null,21.307903686438614,-86.001481111711669,null,0,0]
[15941.25,15.94125,22.284782635329911,1.5259075823738981,1.0014616544959769,5.4034736090909509E-2,1,0,683.90729297010694,1.5693341397900045,2.9789908862689924,1.2284649055084571,1.0409184227064485,0.2813190431760399,1.0042813330113678,9.2370057548028919E-2,6.3405909595601155,0.10228641486705733,1.0002179491875463,2.9254258845115774E-2,10.554391478859417,-122.22517555955245,57.774824440447546,null,1000000000,254123451.5625,null,33.260958596337495,-35.648762401569059,null,21.257719991658067,-86.008247734810155,null,0,0]
[16033.5,16.0335,22.413482924634717,1.5261655094647402,1.0014786077391362,5.4346814704279801E-2,1,0,687.86496964400828,1.5693425525857507,2.9942923303242095,1.2302853994537226,1.0413839332553403,0.28286176943463015,1.0043309203009323,9.2901529860279913E-2,6.3409699342506025,0.1028742540267498,1.000220478955121,2.9423523836183903E-2,10.494905093584268,-122.21956775947987,57.780432240520128,null,1000000000,257073122.25,null,33.251456340585371,-35.633329503109991,null,21.207826135927785,-86.014843250730152,null,0,0]
[16125.75,16.12575,22.542184688001274,1.5264204913679271,1.001495658516055,5.465888272157042E-2,1,0,691.82264636603622,1.5693508691281413,3.0096035971305755,1.2320873759053701,1.0418519200842025,0.28440311341227414,1.0043807912485807,9.3432949543782173E-2,6.3413510728511762,0.10346202316370012,1.000223023319444,2.9592788382296387E-2,10.435774898452125,-122.21476705805604,57.78523294194396,null,1000000000,260039813.0625,null,33.242024234658196,-35.618872865108131,null,21.158218821543201,-86.021270601443987,null,0,0]
[16218,16.218,22.670887900325013,1.5266725782097348,1.0015128068217514,5.497094008254174E-2,1,0,695.78032313536971,1.5693590910596746,3.0249245375285732,1.233871104439028,1.0423223798575991,0.28594306965212157,1.0044309458120615,9.3964316306244244E-2,6.3417343749717432,0.10404972189195619,1.0002255822805073,2.9762052480895657E-2,10.376995867559792,-122.2107606611514,57.789239338848603,null,1000000000,263023524,null,33.232660494035933,-35.60537682347146,null,21.108894806784868,-86.027532662280692,null,0,0]
[16312.5,16.3125,22.802731692140792,1.5269278628807326,1.0015304744994822,5.5290597486348222E-2,1,0,699.83452865460561,1.5693674171036018,3.0406290369258122,1.2356796941611725,1.0428068749145261,0.28751914121269778,1.0044826176895494,9.4508588055378553E-2,6.3421292688312061,0.10465168132683014,1.0002282187903557,2.9935444505451506E-2,10.317142170739897,-122.20746700523205,57.792532994767953,null,1000000000,266097656.25,null,33.223137439822153,-35.592531561315845,null,21.058658184727346,-86.033779007590439,null,0,0]
[16407,16.407,22.934576952930744,1.5271802124300313,1.0015482445108377,5.5610243579745908E-2,1,0,703.88873422179722,1.5693756472360825,3.0563433799814868,1.2374696917784771,1.0432939578957607,0.28909374503949731,1.0045345870960043,9.5052803650121392E-2,6.3425264321997599,0.10525356605757764,1.000230870617647,3.0108836054964973E-2,10.257646623036496,-122.20498039609484,57.79501960390516,null,1000000000,269189649,null,33.213682483606249,-35.580661958028983,null,21.008712138481588,-86.039857803635059,null,0,0]
[16501.5,16.5015,23.066423657505361,1.5274296771563081,1.0015661168503704,5.5929878298019764E-2,1,0,707.94293983612079,1.5693837831048951,3.0720674156377585,1.2392413712163424,1.0437836251783283,0.29066687538469066,1.0045868539852505,9.5596962776851493E-2,6.3429258646511517,0.10585537567024747,1.0002335377623723,3.0282227126686899E-2,10.198504143646147,-122.20328778375853,57.796712216241474,null,1000000000,272299502.25,null,33.20429385435785,-35.569752083925898,null,20.959053357907319,-86.045771935866824,null,0,0]
[16596,16.596,23.198271781247513,1.5276763062161984,1.0015840915126029,5.6249501576468644E-2,1,0,711.99714549677105,1.5693918263202877,3.0878009958214907,1.2409950012822928,1.0442758731268451,0.29223852654037236,1.0046394183108585,9.6141065122146471E-2,6.3433275657568036,0.10645710975120735,1.0002362202245232,3.0455617717868144E-2,10.139709754799258,-122.20237634618373,57.797623653816274,null,1000000000,275427216,null,33.194969827802581,-35.559786302691442,null,20.909678589140221,-86.051524224303108,null,0,0]
[16692.5,16.692499999999999,23.332911781006988,1.5279252785428079,1.0016025521791971,5.6575877495965009E-2,1,0,716.13715449881681,1.569399945782268,3.1038772606538418,1.2427673929315439,1.0447811984002631,0.29384190778499519,1.0046934020058464,9.6696623938740192E-2,6.3437401092084418,0.10707150056900129,1.0002389752654739,3.0632677452430264E-2,10.080025190961644,-122.20223867589759,57.79776132410241,null,1000000000,278639556.25,null,33.185513390824745,-35.550567930705292,null,20.859548619270512,-86.057234100630183,null,0,0]
[16789,16.789000000000001,23.467553210512584,1.5281713940046764,1.001621119533799,5.6902241349966104E-2,1,0,720.27716354753159,1.5694079719061622,3.1199631754197314,1.2445215138403705,1.0452892070290327,0.2954437346636562,1.0047476957616535,9.7252122885081019E-2,6.3441550174475108,0.1076858117533873,1.0002417462790485,3.0809736680102159E-2,10.020693433441021,-122.20288927906104,57.79711072093896,null,1000000000,281870521,null,33.176120828980324,-35.542301988547315,null,20.809708126170001,-86.062780952924058,null,0,0]
[16885.5,16.8855,23.602196045295845,1.5284147014641767,1.0016397935704746,5.7228593069620588E-2,1,0,724.41717264211536,1.5694159062922375,3.1360585916257575,1.2462576344469414,1.0457998951027478,0.29704400122742292,1.0048022995280175,9.7807561628071346E-2,6.3445722900101407,0.10830004286495126,1.0002445332652383,3.0986795397956606E-2,9.9617094973399816,-122.20431520884166,57.795684791158337,null,1000000000,285120110.25,null,33.166790448248946,-35.534972732091603,null,20.760153818562472,-86.06816758456965,null,0,0]
[16982,16.981999999999999,{"$f":"SQRT(1+(A269/pole1)^2)","v":23.736840261443241},{"$f":"ATAN(A269/pole1)","v":1.5286552486763656},{"$f":"SQRT(1+(A269/Zero1)^2)","v":1.001658574283258},{"$f":"ATAN(A269/Zero1)","v":5.7554932586092636E-2},{"$f":"IF(VIN_nom>Vout, 1, SQRT(1+(A269/z_RHP)^2))","v":1},{"$f":"IF(VIN_nom>Vout, 0, -ATAN(A269/z_RHP))","v":0},{"$f":"SQRT(1+(A269/Pole2)^2)","v":728.55718178178608},{"$f":"ATAN(A269/Pole2)","v":1.5694237505043869},3.1521633637246125,1.2479760201015728,{"$f":"SQRT(1+(A269/pole4)^2)","v":1.0463132586980308},{"$f":"ATAN(A269/pole4)","v":0.29864270157091222},{"$f":"IF(VOUT_setting=1,1,SQRT(1+(A269*zterm1)^2))","v":1.0048572132544009},{"$f":"IF(VOUT_setting=1,0,ATAN(((A269*zterm1))))","v":9.8362939834834268E-2},6.3449919264299419,{"$f":"IF(VOUT_setting=1,0,ATAN(A269*$Q$4/(1+Afbr-$Q$5*(A269)^2)))","v":0.10891419346463285},{"$f":"SQRT((1-(Z269/pterm2))^2+(A269/pterm1)^2)","v":1.0002473362240332},{"$f":"IF((ATAN((A269/pterm1)/(1-A269^2/pterm2))>0),ATAN((A269/pterm1)/(1-A269^2/pterm2)),PI()+ATAN((A269/pterm1)/(1-A269^2/pterm2)))","v":3.1163853603066418E-2},{"$f":"20*LOG10(((E269*K269*G269*O269)/(C269*I269*S269*M269*Q269))*Adc)","v":9.9030684986415469},{"$f":"((F269+L269+H269+P269)-(D269+J269+T269+N269+R269))*radconv","v":-122.20650374689265},{"$f":"IF(V269>0,V269,V269+180)","v":57.79349625310735},null,{"$f":"IF(U269<0,A269,1000000000)","v":1000000000},{"$f":"A269^2","v":288388324},null,{"$f":"20*LOG10((K269/(I269*M269))*AEA)","v":33.157520599629258},{"$f":"(L269-(J269+N269))*radconv","v":-35.5285647091359},null,{"$f":"20*LOG10((E269*G269/(C269*S269))*Acs*Am)","v":20.710882461031062},{"$f":"(F269+H269-(D269+T269))*radconv","v":-86.073396735506449},null,{"$f":"SUM((U270<0)*(U269>0))*A269","v":0},0]
[17081,{"$f":"A270/1000","v":17.081},23.874974080729849,1.5288992081648118,1.0016779523940655,5.7889713740553357E-2,1,0,732.80444509029962,1.5694317058280547,3.168694930976979,1.2497207663184997,1.046842698132876,0.30028118526852365,1.0049138716720338,9.8932642820378322E-2,6.3454248902782355,0.10954417057417698,1.0002502283969934,3.1345498272398471E-2,9.843259666540682,-122.20952838718161,57.790471612818394,null,1000000000,291760561,null,33.148071821831159,-35.52293212172308,null,20.660625350290516,-86.078600510285185,null,0,0]
[17180,17.18,24.013109304617082,1.5291403609173659,1.0016974427670058,5.8224481904628173E-2,1,0,737.05170844465567,1.5694395694665557,3.1852360440351695,1.2514473966122417,1.0473749451061554,0.30191800809250613,1.0049708562091741,9.9502281383419738E-2,{"$f":"IF(VOUT_setting=1,1,SQRT((1+Afbr-$Q$5*(A271)^2)^2+(A271*$Q$4)^2))","v":6.3458603410472847},0.11017406201117372,1.0002531373808548,3.1527142395833423E-2,9.7838016716008323,-122.21332926054755,57.786670739452447,null,1000000000,295152400,null,33.138683376727144,-35.518237086029472,null,20.610659316532811,-86.083644183959606,null,0,0]
[17279,17.279,24.151245909003723,1.5293787550663533,1.0017170453955258,5.855923700404278E-2,1,0,741.29897184406639,1.5694473429958158,3.2017865549521738,1.2531561815389216,1.0479099953399142,0.30355316380958625,1.0050281668103496,0.10007185516526641,6.3462982782252482,0.11080386730272061,1.0002560631756066,3.1708785970210811E-2,9.7246895544108085,-122.21789335372998,57.782106646270023,null,1000000000,298563841,null,33.129353622790546,-35.51446383348474,null,20.560981041433468,-86.088530518383337,null,0,0]
[17378,17.378,24.289383870336575,1.5296144376504215,1.0017367602730356,5.8893978964540405E-2,1,0,745.54623528776165,1.5694550279558499,3.2183463187410823,1.2548473865077743,1.0484478445424223,0.30518664623484043,1.0050858034197827,0.10064136380747594,6.3467387012975074,0.11143358597631529,1.0002590057812384,3.1890428992370261E-2,9.6659184561690399,-122.22320788642065,57.776792113579347,null,1000000000,301994884,null,33.120080962622474,-35.511596891126189,null,20.511587263147607,-86.093262212745884,null,0,0]
[17479.25,17.47925,24.430662710358128,1.5298527198611109,1.0017570393136859,5.9236315029268738E-2,1,0,749.89002749110807,1.5694627975309736,3.2352918634223116,1.2565591154716738,1.0490008082143962,0.30685551609751255,1.0051450871000802,0.10122374807748741,6.3471917047285116,0.11207752635272551,1.00026203265258,3.2076199690553524E-2,9.6061594227544482,-122.2294063400614,57.770593659938598,null,1000000000,305524180.5625,null,33.11065499513419,-35.509586409373036,null,20.461361826446311,-86.097944243035826,null,0,0]
[17580.5,17.580500000000001,24.571942921562936,1.5300882620037135,1.0017774357494709,5.9578637194020317E-2,1,0,754.23381973920118,1.5694704776128416,3.2522467887607607,1.2582530018559712,1.0495566904031837,0.30852262281468562,1.0052047116566027,0.10180606345576594,6.3476473072353601,0.11272137513087303,1.0002650771075929,3.2261969804446518E-2,9.5467471164700672,-122.23636341743556,57.763636582564445,null,1000000000,309073980.25,null,33.101285502045016,-35.508492083746141,null,20.411427239445644,-86.102470041921293,null,0,0]
[17681.75,17.681750000000001,24.713224480434707,1.5303211110454624,1.0017979495732199,5.9920945379416918E-2,1,0,758.57761203127211,1.5694780697388309,3.2692109488053056,1.2599293136230609,1.0501154864740048,0.31018795992712778,1.0052646770286955,0.10238830955968918,6.3481055082585343,0.1133651318066137,1.0002681391462667,3.2447739330668648E-2,9.4876766494945901,-122.24406617184324,57.755933828156756,null,1000000000,312644283.0625,null,33.091970909254414,-35.508298279129718,null,20.361780187944461,-86.106842304780827,null,0,0]
[17783,17.783000000000001,24.854507363991647,1.530551312886852,1.0018185807777218,6.0263239506099908E-2,1,0,762.92140436656996,1.5694855754113053,3.2861842005398949,1.2615883135988137,1.0506771917776698,0.311851521028574,1.0053249831553719,0.10297048600691368,6.3485663072354876,0.11400879587624997,1.0002712187685889,3.263350826583937E-2,9.4289432330925784,-122.25250189080327,57.747498109196727,null,1000000000,316235089,null,33.082709685350366,-35.508989655737757,null,20.312417414136505,-86.111063665872294,null,0,0]
[17886.5,17.886500000000002,24.998931212965847,1.5307839409387338,1.0018397917683117,6.0613125555512272E-2,1,0,767.36172546434398,1.5694931600485547,3.3035438867220912,1.2632665555240896,1.0512543814912005,0.31355020788964433,1.0053869815515546,0.10356552731491669,6.3490400307945025,0.1146666673520398,1.0002743850010629,3.2823404785150535E-2,9.3692481133180614,-122.26186965121936,57.738130348780643,null,1000000000,319926882.25,null,33.073296266271591,-35.510595631976564,null,20.262248179172275,-86.115225546605146,null,0,0]
[17990,17.989999999999998,25.143356399235987,1.5310138965395526,1.0018611253991749,6.096299674680733E-2,1,0,771.80204660575384,1.5695006574141388,{"$f":"SQRT(1+(A279/Zero2)^2)","v":3.3209127800315721},{"$f":"ATAN(A279/Zero2)","v":1.2649272471504474},1.0518346013039304,0.31524702556116646,1.0054493358853116,0.10416049502893822,6.3495164678564588,0.1153244409972429,1.00027756960734,3.3013300679706301E-2,9.3098953773877664,-122.27197717941266,57.728022820587341,null,1000000000,323640100,null,33.063935509336602,-35.513095069303269,null,20.212369287670199,-86.119235122682511,null,0,0]
[18093.5,18.093499999999999,25.287782899889123,1.5312412254544085,1.001882581662477,6.1312852995281594E-2,1,0,776.24236779005071,1.569508069005711,3.338290736756222,1.2665706533275538,1.0524178462041895,0.31694196737189456,1.0055120460904252,0.1047553887414877,6.349995617810678,0.11598211627529215,1.0002807725874074,3.3203195945895936E-2,9.2508802148043063,-122.28281162358789,57.717188376412111,null,1000000000,327374742.25,null,33.054625908806941,-35.516472496524749,null,20.162777434347706,-86.123095020897779,null,0,0]
[18197,18.196999999999999,25.432210692532575,1.5314659724099158,1.0019041605503396,6.1662694216253498E-2,1,0,780.68268901650299,1.5695153962868515,3.3556776160866577,1.2681970337937629,1.053004111165311,0.31863502670843646,1.0055751121003162,0.10535020804538542,6.35047748004318,0.11663969265011817,1.0002839939412529,3.3393090580108808E-2,9.1921979124677264,-122.29436036667747,57.705639633322534,null,1000000000,331130809,null,33.045366000137584,-35.520712736667029,null,20.113469370123546,-86.126807808542196,null,0,0]
[18303,18.303000000000001,25.580128395513682,1.5316935174467741,1.0019263877623503,6.2020970043444326E-2,1,0,785.23026442180742,1.5695228146601574,3.3734935726881972,1.2698453174049711,1.0536076622124304,0.32036702311978388,1.0056400701738848,0.10595931741387424,6.350973792155532,0.11731304943713648,1.0002873121504188,3.3587571382403633E-2,9.1324383558682385,-122.30691551086794,57.693084489132062,null,1000000000,334999809,null,33.035932440683617,-35.525934168293475,null,20.063261106831504,-86.130460415175705,null,0,{"$f":"IF(AH282>0,W282,0)","v":0}]
[18409,18.408999999999999,25.728047407721178,1.5319184460325532,1.0019487435774879,6.2379229928680328E-2,1,0,789.77783986982729,1.5695301476028261,3.3913185982163974,1.2714762784033382,1.0542143702594819,0.3220970311627695,1.0057054013059437,0.10656834787219167,6.3514729478424563,0.11798630134876383,1.0002906496316779,3.3782051514157092E-2,9.0730182297519999,-122.32019382342096,57.679806176579035,null,1000000000,338891281,null,33.026548020307409,-35.532029292596647,null,20.013343784878991,-86.13396398519248,null,0,0]
[18515,18.515000000000001,25.875967706702621,1.5321408030152239,1.0019712279871438,6.2737473781066241E-2,1,0,794.32541535982887,1.5695373965821475,3.4091525504184443,1.2730901798973797,1.0548242298589876,0.32382504392175432,1.0057711054237959,0.10717729898395824,6.3519749464336916,0.1186594478107787,1.0002940063850165,3.3976530971490781E-2,9.0139327726072001,-122.33418248384886,57.665817516151137,null,1000000000,342805225,null,33.017211292049431,-35.538982722401634,null,19.963714089139732,-86.13732109317759,null,0,0]
[18621,18.620999999999999,26.023889270515877,1.5323606322241119,1.0019938409826619,6.3095701509731469E-2,1,0,798.87299089109524,1.5695445630320026,3.426995289932135,1.2746872798756894,1.0554372355477961,0.32555105454470573,1.0058371824543482,0.10778617031314355,6.35247978725537,0.11933248824951813,1.0002973824104204,3.41710097505264E-2,8.955177319385049,-122.34886890839077,57.65113109160923,null,1000000000,346741641,null,33.007920848978557,-35.546779365613617,null,19.914368760919146,-86.140534255350758,null,0,0]
[18729.5,18.729500000000002,26.175300838004219,1.5325830728911032,1.0020171204651112,6.3462361212137844E-2,1,0,803.52782060425477,1.5695518144924063,3.4452678068954072,1.2763049107622115,1.0560679514639186,0.32731569235683577,1.0059052040378038,0.1084093187331603,6.3529994775645786,0.12002129188172585,1.0003008580182708,3.4370074586687289E-2,8.8953731239963361,-122.36461146235007,57.635388537649931,null,1000000000,350794170.25,null,32.99845779937781,-35.555617720096677,null,19.864150791059515,-86.14367668826111,null,0,0]
[18838,18.838000000000001,26.326713685745023,1.5328029549225273,1.0020405346518086,6.3829003828720823E-2,1,0,808.18265035917989,1.5695589824214116,3.46354924405582,1.2779054693186434,1.0567019519876122,0.32907821815548888,1.0059736161753738,0.10903238263956026,6.3535221443124295,0.12070998321613065,1.0003043538179368,3.4569138703955213E-2,8.8359050905707406,-122.3810591401358,57.618940859864196,null,1000000000,354870244,null,32.989040384288614,-35.565308451586247,null,19.814224027166055,-86.146673459908016,null,0,0]
[18946.5,18.9465,26.478127791775258,1.5330203221913015,1.0020640835333114,6.4195629262108381E-2,1,0,812.83748015515323,1.5695660682540808,3.4818394609065915,1.2794892163237077,1.0573392312103391,0.33083862479919129,1.0060424187873835,0.10965536156587653,6.354047786764534,0.12139856163935168,1.0003078698094034,3.4768202098171212E-2,8.7767685140885767,-122.3981991839307,57.6018008160693,null,1000000000,358969862.25,null,32.979667217310592,-35.575836291608837,null,19.764585149991387,-86.149527089365179,null,0,0]
[19055,19.055,26.629543134631227,1.5332352175734607,1.0020877671001238,6.4562237414956078E-2,1,0,817.49230999147369,1.569573073392792,3.5001383198110707,1.2810564074439634,1.0579797832072793,0.33259690521616997,1.0061116117937254,0.11027825504603328,6.354576404182569,0.12208702653863336,1.000311405992655,3.4967264765176406E-2,8.7179587848496602,-122.41601907383833,57.583980926161672,null,1000000000,363093025,null,32.970336950827388,-35.587186266717204,null,19.715230896820451,-86.152240038587607,null,0,0]
[19165.75,19.165749999999999,26.784099680775274,1.5334520635164057,1.0021120806946826,6.4936430118177332E-2,1,0,822.24366859801785,1.5695801420011326,3.5188254208639438,1.2826392837739233,1.058636987651983,0.33438944757618444,1.0061826422163169,0.11091397706608633,6.3551190510870104,0.12278965064450585,1.0003150363310924,3.5170454705531928E-2,8.6582618934118365,-122.43489688181029,57.565103118189711,null,1000000000,367325973.0625,null,32.960856083539724,-35.599604246785731,null,19.665143376576061,-86.154866659328619,null,0,0]
[19276.5,19.276499999999999,26.938657471913814,1.5336664212065099,1.0021365345983346,6.531060461186107E-2,1,0,826.99502724517356,1.5695871293865105,3.5375212451661446,1.2842054329686305,1.0592975894904366,0.33617975994329263,1.0062540792225587,0.11154960907935507,6.3556647960554189,0.12349215518115225,1.0003186877074135,3.5373643879447254E-2,8.5988961333182008,-122.45445740034815,57.545542599651853,null,1000000000,371583452.25,null,32.951417195611675,-35.612848198193689,null,19.615345712612765,-86.157351713099175,null,0,0]
[19387.25,19.387250000000002,27.093216486740008,1.5338783332082062,1.0021611288008083,6.5684760792570351E-2,1,0,831.74638593224483,1.5695940369408854,3.5562256551378209,1.2857551112192505,1.0599615823705484,0.33796783502097971,1.0063259227258636,0.11218515059143633,6.3562136382899208,0.12419453949893607,1.0003223601216014,3.5576832282499707E-2,8.5398568936729866,-122.4746880480144,57.5253119519856,null,1000000000,375865462.5625,null,32.942018971294836,-35.626903103962455,null,19.565834609101785,-86.159697644334742,null,0,0]
[19498,19.498000000000001,27.24777670443029,1.5340878411210479,1.0021858632917748,6.6058898556898935E-2,1,0,836.49774465855126,1.5696008660245917,3.5749385160159175,1.2872885696730083,1.0606289599235661,0.33975366558818026,1.006398172639176,0.11282060110836012,6.3567655769883888,0.1248968029489132,1.0003260535736402,3.5780019910266671E-2,8.4811396567383852,-122.49557647960879,57.504423520391214,null,1000000000,380172004,null,32.932660131985855,-35.641754238620798,null,19.516606826223867,-86.161906842185545,null,0,0]
[19611.75,19.611750000000001,27.40652488568346,1.5343005642424865,1.0022114138207869,6.6443151698482625E-2,1,0,841.37780840178846,1.56960779980328,3.594166930279278,1.2888469403108611,1.0613179321576613,0.34158552675997927,1.0064728026411973,0.11347316948757023,6.3573356891909043,0.12561796283241497,1.0003298689744036,3.5988710680116519E-2,8.4211624401824565,-122.51770276704886,57.48229723295114,null,1000000000,384620738.0625,null,32.923087474873022,-35.657821368225967,null,19.466337150652329,-86.164035996309579,null,0,0]
[19725.5,19.7255,27.565274292828391,1.5345108372131184,1.0022371123192344,6.6827385191421743E-2,1,0,846.25787218501034,1.5696146536127691,3.6134039801372571,1.290388721744202,1.0620104612446954,0.34341500497836441,1.0065478611814587,0.11412564082020456,6.3579090661546882,0.12633899382583863,1.0003337065681666,3.6197400622653204E-2,8.3615155383084563,-122.54049730140689,57.459502698593113,null,1000000000,389095350.25,null,32.913553746692671,-35.674697874165084,null,19.416359600883059,-86.166025845515946,null,0,0]
[19839.25,19.83925,27.724024904806498,1.5347187021036321,1.0022629587757355,6.7211598923779189E-2,1,0,851.13793600752899,1.569621428828587,3.6326495283979567,1.2919141702499952,1.0627065402310338,0.34524209266751432,1.0066233481640983,0.11477801457249559,6.3584857069966789,0.12705989522836592,1.0003375663549114,3.640608973308531E-2,8.3021943474394995,-122.5639474508844,57.436052549115601,null,1000000000,393595840.5625,null,32.904057677028369,-35.692368717599052,null,19.366670842902572,-86.16787880641651,null,0,0]
[19953,19.952999999999999,27.882776701038622,1.534924200027435,1.0022889531788435,6.75957927836527E-2,1,0,856.01799986867229,1.5696281267948944,3.6519034407015125,1.2934235370081788,1.0634061621456519,0.34706678233523403,1.0066992634927368,0.11543029021116769,6.3590656108291101,0.12778066633996421,1.0003414483346194,3.6614778006621509E-2,8.2431943572276012,-122.58804082388177,57.411959176118231,null,1000000000,398122209,null,32.894598031908274,-35.710819154721065,null,19.317267599577942,-86.169597240772973,null,0,0]
[20069,20.068999999999999,28.044669841465396,1.5351313667383892,1.0023156141101992,6.7987565500550282E-2,1,0,860.99459250462826,1.5696348790534911,3.6715466770560332,1.294946452532943,1.0641232642323597,0.3489250874451591,1.0067771214817707,0.11609536640914529,6.3596603448043689,0.1285155595554979,1.0003454299564973,3.6827593313216368E-2,8.1833535468851171,-122.61326060186727,57.386739398132733,null,1000000000,402764761,null,32.884987542905968,-35.730422438385595,null,19.267177851719957,-86.171213514645174,null,0,0]
[20185,20.184999999999999,28.206564171698052,1.5353361553509022,1.0023424288746332,6.8379317316088123E-2,1,0,865.97118517938839,1.5696415537038693,3.6911983380824824,1.296453155746877,1.0648440360969031,0.35078088325654838,1.0068554247258663,0.11676033945513904,6.360258470252429,0.12925031580686899,1.0003494346579462,3.7040407739416248E-2,8.1238375819447644,-122.63912401281878,57.360875987181217,null,1000000000,407434225,null,32.875412452676905,-35.750806400198734,null,19.217378316938568,-86.172694680630045,null,0,0]
[20301,20.300999999999998,28.368459671366491,1.5355386065622418,1.0023693974597994,6.8771048111704564E-2,1,0,870.94777789228726,1.5696481520763876,3.7108582899367888,1.2979438974303628,1.0655684702923482,0.35263416209178822,1.0069341731211492,0.11742520878519465,6.3608599862167177,0.12998493435422603,1.0003534624389463,3.725322128014024E-2,8.0646419636240925,-122.66561865261365,57.334381347386355,null,1000000000,412130601,null,32.86587156250593,-35.77195630783207,null,19.167865694352002,-86.174043077011248,null,0,0]
[20417,20.417000000000002,28.530356320562831,1.5357387601466992,1.0023965198532827,6.9162757768876551E-2,1,0,875.92437064267506,1.5696546754711707,3.7305264015404478,1.299418923362246,1.0662965593542115,0.3544849163632352,1.0070133665631869,0.11808997383590053,6.3614648917356051,0.1307194144585837,1.0003575132994778,3.746603393030757E-2,8.0057622840105758,-122.69273235425199,57.307267645748013,null,1000000000,416853889,null,32.856363708407429,-35.793857718946711,null,19.11863673921491,-86.175260989187578,null,0,0]
[20536,20.536000000000001,28.696441126180634,1.5359417433304399,1.0024245035013473,6.9564575758495742E-2,1,0,881.02966841627665,1.5696612909946661,3.7507115156849897,1.3009160182951665,1.0670472683363121,0.3563809037678235,1.0070950704617758,0.11877182213672263,6.3620889625290227,0.13147274510452076,1.0003616929061985,3.768434942518338E-2,7.945683628170304,-122.72117804891245,57.278821951087551,null,1000000000,421727296,null,32.846643105756343,-35.817091615654924,null,19.068426045205314,-86.176377150450392,null,0,0]
[20655,20.655000000000001,28.862527100546782,1.5361423904372618,1.002452648989512,6.9966371249597994E-2,1,0,886.13496622799244,1.5696678302900047,3.7709049462659818,1.3023970824450233,1.0678018077045692,0.35827421845233864,1.0071772424999981,0.11945355949525804,6.362716598399409,0.13222592848131343,1.0003658968016134,3.7902663972011828E-2,7.8859283497544759,-122.75025004268115,57.249749957318855,null,1000000000,426629025,null,32.836954895951187,-35.841086505444174,null,19.018507138902194,-86.17736069911598,null,0,0]
[20774,20.774000000000001,29.028614223600446,1.5363407415484385,1.0024809563041457,7.0368144114352396E-2,1,0,891.24026407716713,1.5696742946671611,3.7911065603902632,1.3038623655307924,1.0685601693447633,0.360164852519334,1.007259882563281,0.12013518530504019,6.3633477982920255,0.13297896379401478,1.0003701249857004,3.8120977565308106E-2,7.8264919728373652,-122.77993594297872,57.220064057021276,null,1000000000,431559076,null,32.827297929288385,-35.8658277030367,null,18.968876693186797,-86.178213938682006,null,0,0]
[20893,20.893000000000001,29.194702475737159,1.5365368358338889,1.0025094254315399,7.0769894224971611E-2,1,0,896.34556196316112,1.5696806854062646,3.8113162279289448,1.3053121122491596,1.0693223451246479,0.36205279817036418,1.0073429905364379,0.12081669896021549,6.3639825611465675,0.13373185024865566,1.0003743774584375,3.833929019958756E-2,7.7673701121072565,-122.81022359674621,57.189776403253788,null,1000000000,436517449,null,32.817671089937704,-35.891300814873141,null,18.919531437676696,-86.178939120426975,null,0,0]
[21014.75,21.014749999999999,29.36463005031024,1.5367351659729334,1.0025387199095834,7.118090479462158E-2,1,0,901.56883945960351,1.5696871489248569,3.8320011274409436,1.3067795325066498,1.0701060730816505,0.36398158246345286,1.0074285032056061,0.12151384517706472,6.3646356791983099,0.13450198045504708,1.0003787533396549,3.8562646875498895E-2,7.7072030115300869,-122.84182151954725,57.158178480452747,null,1000000000,441619717.5625,null,32.807851832006548,-35.918105359298828,null,18.869337650253406,-86.179550824224734,null,0,0]
[21136.5,21.136500000000002,29.534558766645205,1.5369312139127809,1.0025681837362665,7.159189127584939E-2,1,0,906.79211699327686,1.5696935379815065,3.8526941898717473,1.3082311926494101,1.0708937762211297,0.36590753645214147,1.0075145054147179,0.12221087271476121,6.3652925245262271,0.13527195316565768,1.0003831546450306,3.8786002535942624E-2,7.647356125239229,-122.87402433712768,57.125975662872321,null,1000000000,446751632.25,null,32.798061850970107,-35.945646460932089,null,18.81943563709449,-86.180033089623279,null,0,0]
[21258.25,21.25825,29.704488605147219,1.5371250188054162,1.0025978168966592,7.2002853531945521E-2,1,0,912.01539456354146,1.569699853855584,3.8733952843936663,1.3096673391962386,1.0716854457776486,0.36783065210528282,1.0076009970384212,0.12290778092648304,6.3659530959767459,0.13604176753340083,1.0003875813745418,3.9009357175045521E-2,7.5878250362661479,-122.90681977741802,57.093180222581978,null,1000000000,451913193.0625,null,32.788300055131067,-35.973909608437957,null,18.769822071949761,-86.180388167362466,null,0,0]
[21380,21.38,29.874419546667163,1.5373166189126934,1.0026276193757473,7.2413791426249291E-2,1,0,917.23867216977237,1.5697060977973181,3.8941042829106896,1.3110882136809858,1.0724810729675791,0.36975092149936101,1.0076879779506942,0.12360456916609341,6.3666173923902321,0.13681142271228169,1.0003920335281633,3.9232710786934508E-2,7.5286054170295822,-122.94019580748218,57.059804192517817,null,1000000000,457104400,null,32.778565385452545,-36.002880580594933,null,18.720493685291213,-86.180618257178608,null,0,0]
[21504.5,21.5045,30.048189885246,1.5375103056548811,1.002658270094273,7.2833985949566776E-2,1,0,922.57992938888208,1.5697124096577926,3.9152890842765973,1.312525635015257,1.0732987547635318,0.37171161297267863,1.0077774293831463,0.12431697120912182,6.3673005443492015,0.13759829679647662,1.0003966125357397,3.9461108278537993E-2,7.4683658726180351,-122.97491382708567,57.025086172914328,null,1000000000,462443520.25,null,32.768637818016927,-36.033223394108262,null,18.670342669923919,-86.180726529613366,null,0,0]
[21629,21.629000000000001,30.221961338106386,1.5377017650684903,1.002689097834748,7.3254154709251867E-2,1,0,927.92118664432394,1.5697186488541857,3.9364818882532528,1.3139475819952642,1.0741205563624701,0.37366931174168228,1.0078673921885049,0.12502924643478103,6.3679875889730635,0.13838500263355735,1.0004012181288691,3.9689504683578673E-2,7.4084431507950956,-123.01021425282347,56.989785747176526,null,1000000000,467813641,null,32.758736476291304,-36.064277190140693,null,18.620483122392599,-86.180708599412796,null,0,0]
[21753.5,21.753499999999999,30.395733886137386,1.5378910353403052,1.0027201025808452,7.3674297559333038E-2,1,0,933.26244393547393,1.5697248166341118,3.9576825662822728,1.3153542975051677,1.0749464683155683,0.37562400968134319,1.0079578662298458,0.12574139415439881,6.3686785250022107,0.13917153932247425,1.000405850307525,3.9917899995777009E-2,7.3488328992466503,-123.04608495818837,56.953915041811626,null,1000000000,473214762.25,null,32.74886032723083,-36.096027658408133,null,18.570911722360925,-86.180566662522224,null,0,0]
[21878,21.878,30.569507510662486,1.5380781537894488,1.0027512843161455,7.4094414353893287E-2,1,0,938.60370126172268,1.5697309142167875,3.9788909924979974,1.3167460194946308,1.0757764811558299,0.37757569878324698,1.0080488513695165,0.12645341368006682,6.3693733511704504,0.13995790596339414,1.0004105090716815,4.0146294208853663E-2,7.2895308536657124,-123.08251405476301,56.91748594523699,null,1000000000,478646884,null,32.739008369199468,-36.128460776406726,null,18.521625206085837,-86.180302865170518,null,0,0]
[22005.25,22.00525,30.747120601843616,1.5382672197002807,1.0027833376839268,7.4523783759684423E-2,1,0,944.0629382031168,1.5697370751851409,4.0005757564430784,1.3181532310444399,1.0766290554998104,0.37956738000674084,1.008142374234043,0.12718102735674416,6.3700875435579167,0.14076146548955776,1.0004152982130703,4.0379732131683395E-2,7.2292330669950715,-123.12031270618624,56.87968729381376,null,1000000000,484231027.5625,null,32.72896278522316,-36.162301419485274,null,18.471541084381027,-86.179909496863104,null,0,0]
[22132.5,22.1325,30.924734779483838,1.5384541138425136,1.0028155759110875,7.4953125638135262E-2,1,0,949.52217517993324,1.5697431653090486,4.0222683570774995,1.3195452667873011,1.0774858938411036,0.38155590145834439,1.0082364307317997,0.12790850566305659,6.3708057971402789,0.14156484547569928,1.000420115127334,4.0613168893035727E-2,7.1692485158425505,-123.15867031336055,56.841329686639455,null,1000000000,489847556.25,null,32.718940453056675,-36.196826471572159,null,18.421747851727183,-86.17939320603341,null,0,0]
[22259.75,22.25975,31.10235002497004,1.5386388734097376,1.0028479989797996,7.5382439833623208E-2,1,0,954.98141219156435,1.5697491858034758,4.0439686682888816,1.3209223655888502,1.0783469860153843,0.38354125496287816,1.0083310207134557,0.12863584786699517,6.3715281105443129,0.14236804496500821,1.0004249598144443,4.0846604486206604E-2,7.1095729175343001,-123.19757491819021,56.802425081809787,null,1000000000,495496470.0625,null,32.708940398603872,-36.232021847883644,null,18.372242198385475,-86.178756132249589,null,0,0]
[22387,22.387,31.279966320111747,1.5388215347513503,1.0028806068721356,7.5811726190586556E-2,1,0,960.44064923741655,1.5697551378557644,4.0656765666129635,1.3222847614425544,1.0792123218403871,0.38552343247108389,1.0084261440288891,0.12936305323740085,6.3722544823896623,0.14317106300202651,1.0004298322743723,4.1080038904492154E-2,7.0502020758902448,-123.23701479902286,56.762985200977141,null,1000000000,501177769,null,32.698961677898872,-36.267873748422758,null,18.323020870975139,-86.178000366707636,null,0,0]
[22517.5,22.517499999999998,31.462120055873953,1.5390067192305583,1.0029142395247002,7.6251947562188949E-2,1,0,966.03931673391367,1.5697611720540194,4.0879466442769825,1.3236669223366389,1.0801041555070592,0.38755292833305854,1.0085242506018433,0.13010868874769979,6.3730036197638702,0.14399440087820609,1.0004348580241005,4.1319434074725873E-2,6.98962711144525,-123.27800590771287,56.721994092287133,null,1000000000,507037806.25,null,32.688749297898518,-36.305309044149638,null,18.272834378849538,-86.177104162042482,null,0,0]
[22648,22.648,31.6442748581544,1.5391897717510485,1.0029480665238284,7.669213932390094E-2,1,0,971.63798426518042,1.5697671367130628,4.1102244467908866,1.3250341029352997,1.0810004306132108,0.38957906715259133,1.0086229177770987,0.13085417879082886,6.3737570225705573,0.14481754588400358,1.0004399129833519,4.1558827995013391E-2,6.9293639999135141,-123.31953575210463,56.680464247895372,null,1000000000,512931904,null,32.678557437475398,-36.343406318914006,null,18.222940167287664,-86.176087430045698,null,0,0]
[22778.5,22.778500000000001,31.826430708640821,1.5393707289066967,1.0029820878498559,7.7132301308136281E-2,1,0,977.23665183061928,1.5697730330280812,4.132509849223811,1.326386540438653,1.081901136120629,0.39160184065802334,1.0087221453901514,0.1315995225809761,6.3745146892975706,0.14564049699334086,1.0004449971520946,4.1798220658124684E-2,6.8694084843297754,-123.36159242827685,56.63840757172315,null,1000000000,518860062.25,null,32.668385171036235,-36.382151576698291,null,18.173334903641447,-86.174952276579617,null,0,0]
[22909,22.908999999999999,32.008587589437681,1.5395496264589292,1.0030163034830089,7.7572433347377512E-2,1,0,982.83531942964623,1.5697788621670286,4.1548027292831247,1.3277244671743058,1.0828062609733562,0.39362124071530596,1.008821933275627,0.1323447193332879,6.3752766184249223,0.14646325318166356,1.0004501105302968,4.2037612056829966E-2,6.8097563938908854,-123.40416427013903,56.595835729860966,null,1000000000,524822281,null,32.658231602262056,-36.421531106983316,null,18.124015312144628,-86.173700759806863,null,0,0]
[23042.25,23.042249999999999,32.194584070128428,1.5397302050339252,1.003051440606749,7.8021809127534633E-2,1,0,988.5519666481573,1.5697847460138274,4.1775729739379974,1.3290758515497512,1.0837350078507977,0.39567970604213437,1.0089244019047885,0.13310546693268829,6.3760590000202626,0.14730314495548602,1.0004553618008789,4.2282046789702439E-2,6.7491561044793711,-123.44815290439333,56.551847095606675,null,1000000000,530945285.0625,null,32.647882460480652,-36.46238098090722,null,18.07394783864266,-86.172304892964632,null,0,0]
[23175.5,23.1755,32.380581588579673,1.5399087090894501,1.0030867802710701,7.8471153334587235E-2,1,0,994.26861390049839,1.5697905622010906,4.2003507651176886,1.3304125816869521,1.0846683389410863,0.39773463754374194,1.0090274543169511,0.13386605958123152,6.3768458223223501,0.14814283135267098,1.0004606435248742,4.2526480189084823E-2,6.688863639619739,-123.49265479698273,56.507345203017266,null,1000000000,537103800.25,null,32.63755101333512,-36.503864130958689,null,18.024171477238966,-86.17079189751432,null,0,0]
[23308.75,23.30875,32.566580127010518,1.5400851741588357,1.0031223224545658,7.8920465790427496E-2,1,0,999.98526118608891,1.5697963118891913,4.2231359807140088,1.3317348899631787,1.0856062424206303,0.3997860270020997,1.0091310903332666,0.13462649644651623,6.3776370836878717,0.14898231128748174,1.0004659557022477,4.277091224728137E-2,6.628874823155865,-123.53765826045529,56.462341739544712,null,1000000000,543297826.5625,null,32.627236395174407,-36.545966838527015,null,17.974682916044515,-86.169163819129807,null,0,0]
[23442,23.442,32.7525796680439,1.5402596349687634,1.0031580671357103,7.9369746317024106E-2,1,0,1005.7019085043621,1.5698019962121204,4.245928501200499,1.3330430039701942,1.0865487064488384,0.40183386634672835,1.0092353097739493,0.13538677669720262,6.3784327824650546,0.14982158367586831,1.0004712983329653,4.3015342956596599E-2,6.5691855632836358,-123.58315184230457,56.416848157695426,null,1000000000,549527364,null,32.616937768277687,-36.58867566613317,null,17.925478899585684,-86.167422657262847,null,0,0]
[23578.5,23.578499999999998,32.943116805078311,1.5404363082141648,1.0031948935820496,7.9829951612343561E-2,1,0,1011.557986278341,1.5698077525594649,4.2692843888378524,1.3343685384014887,1.087518873764671,0.40392796365898626,1.0093426759059849,0.13616543710976478,6.3792524878698629,0.15068110978979976,1.0004768028482616,4.3265733983853541E-2,6.5083468820897146,-123.63025148880489,56.369748511195112,null,1000000000,555945662.25,null,32.606403689172907,-36.633040889961734,null,17.875366479706834,-86.165523816533451,null,0,0]
[23715,23.715,33.133654958554324,1.5406109495132236,1.0032319324783212,8.0290123023948667E-2,1,0,1017.4140640854525,1.5698134426415218,4.2926476961497064,1.3356796463199243,1.0884938016022281,0.40601831889713691,1.0094506538842385,0.13694393141220856,6.3800768462491337,0.15154041581218708,1.0004823393204727,4.3516123579280676E-2,6.4478141178408297,-123.67784185632982,56.32215814367018,null,1000000000,562401225,null,32.595884697307227,-36.678014490316613,null,17.825545914326494,-86.163510413210304,null,0,0]
[23851.5,23.851500000000001,33.324194111036768,1.540783593709631,1.0032691838009955,8.0750260360713366E-2,1,0,1023.270141925128,1.5698190675959804,4.3160183026443582,1.3369765575332728,1.0894734771814871,0.40810492386370084,1.0095592435123883,0.137722258714367,6.3809058557997824,0.1523995005832646,1.000487907749561,4.3766511734606481E-2,6.3875831333152524,-123.72591136479436,56.274088635205644,null,1000000000,568894052.25,null,32.585379977563576,-36.723582895686214,null,17.776013879824745,-86.161384454166679,null,0,0]
[23988,23.988,33.514734245486899,1.5409542748551777,1.003306647526411,8.1210363431597599E-2,1,0,1029.1262197968113,1.5698246285346349,4.3393960903885809,1.3382594970904564,1.0904578877062274,0.4101877705212118,1.0096684445930866,0.13850041812726438,6.3817395147094897,0.15325836294515768,1.0004935081354884,4.4016898441559767E-2,6.3276498749602714,-123.77444866912207,56.225551330877934,null,1000000000,575424144,null,32.57488874180185,-36.769732814905275,null,17.726767109266813,-86.159147900898347,null,0,0]
[24127.75,24.127749999999999,33.709812049733543,1.5411270208706023,1.0033452232692013,8.1681385638731382E-2,1,0,1035.1217281266038,1.5698302566908922,4.3633378113540244,1.3395587383517396,1.0914706285911564,0.41231630694066373,1.0097808789558167,0.13929693028530801,6.3825978374641581,0.15413744278841382,1.0004992749711108,4.4273245227626545E-2,6.2665939307182841,-123.82461465321916,56.175385346780843,null,1000000000,582148320.0625,null,32.564160888513605,-36.817570397093625,null,17.676639976145609,-86.15674552291479,null,0,0]
[24267.5,24.267499999999998,33.904890848345218,1.541297779031251,1.003384021598944,8.215237152387049E-2,1,0,1041.1172364888073,1.5698358200251357,4.3872868173606658,1.3408437973528826,1.092488305385068,0.41444088741435081,1.0098939538125786,0.14009326458222832,6.3834610297375294,0.15501628705536549,1.0005050753033611,4.4529590477984618E-2,6.2058417194339013,-123.87524763852467,56.124752361475331,null,1000000000,588911556.25,null,32.553445579952665,-36.865990189908509,null,17.626805098992889,-86.154231242349539,null,0,0]
[24407.25,24.407250000000001,34.099970624256251,1.5414665834435544,1.0034230424898192,8.2623320882284898E-2,1,0,1047.1127448828652,1.5698413196508298,4.4112429897552179,1.3421149008738613,1.0935109043071396,0.41656150383387619,1.010007668948254,0.14088942006794461,6.3843290895547709,0.15589489450966298,1.000510909132198,4.4785934183758834E-2,6.145389149777496,-123.9263361796974,56.073663820302599,null,1000000000,595713852.5625,null,32.542742052623225,-36.914978799034316,null,17.577259148318952,-86.15160702457878,null,0,0]
[24547,24.547000000000001,{"$f":"SQRT(1+(A333/pole1)^2)","v":34.295051360789216},{"$f":"ATAN(A333/pole1)","v":1.5416334674383627},{"$f":"SQRT(1+(A333/Zero1)^2)","v":1.0034622859158631},{"$f":"ATAN(A333/Zero1)","v":8.3094233509341212E-2},{"$f":"IF(VIN_nom>Vout, 1, SQRT(1+(A333/z_RHP)^2))","v":1},{"$f":"IF(VIN_nom>Vout, 0, -ATAN(A333/z_RHP))","v":0},{"$f":"SQRT(1+(A333/Pole2)^2)","v":1053.1082533082331},{"$f":"ATAN(A333/Pole2)","v":1.5698467566560821},4.4352062124128278,1.3433722709761147,{"$f":"SQRT(1+(A333/pole4)^2)","v":1.0945384115615204},{"$f":"ATAN(A333/pole4)","v":0.41867814826368227},{"$f":"IF(VOUT_setting=1,1,SQRT(1+(A333*zterm1)^2))","v":1.0101220241466031},{"$f":"IF(VOUT_setting=1,0,ATAN(((A333*zterm1))))","v":0.14168539579370953},6.3852020149309912,{"$f":"IF(VOUT_setting=1,0,ATAN(A333*$Q$4/(1+Afbr-$Q$5*(A333)^2)))","v":0.15677326391707108},{"$f":"SQRT((1-(Z333/pterm2))^2+(A333/pterm1)^2)","v":1.0005167764575793},{"$f":"IF((ATAN((A333/pterm1)/(1-A333^2/pterm2))>0),ATAN((A333/pterm1)/(1-A333^2/pterm2)),PI()+ATAN((A333/pterm1)/(1-A333^2/pterm2)))","v":4.504227633607432E-2},{"$f":"20*LOG10(((E333*K333*G333*O333)/(C333*I333*S333*M333*Q333))*Adc)","v":6.0852322132217296},{"$f":"((F333+L333+H333+P333)-(D333+J333+T333+N333+R333))*radconv","v":-123.97786906579987},{"$f":"IF(V333>0,V333,V333+180)","v":56.022130934200135},null,{"$f":"IF(U333<0,A333,1000000000)","v":1000000000},{"$f":"A333^2","v":602555209},null,{"$f":"20*LOG10((K333/(I333*M333))*AEA)","v":32.532049569002425},{"$f":"(L333-(J333+N333))*radconv","v":-36.964523108957792},null,{"$f":"20*LOG10((E333*G333/(C333*S333))*Acs*Am)","v":17.527998851455962},{"$f":"(F333+H333-(D333+T333))*radconv","v":-86.148874790535686},null,{"$f":"SUM((U334<0)*(U333>0))*A333","v":0},0]
[24690,{"$f":"A334/1000","v":24.69},34.494669836026851,1.5418022785075465,1.003502672310687,8.3576059356856053E-2,1,0,1059.2431921939542,1.5698522563907493,4.4597338988716153,1.3446448928632393,1.0955948808073641,0.42083989726328691,1.0102397011049447,0.14249969551529956,6.3861002754197376,0.15767181281947845,1.0005228149064311,4.5304578316465588E-2,6.0239782069939967,-124.0310489016403,55.968951098359696,null,1000000000,609596100,null,32.52111911190611,-37.015781451596993,null,17.477885306306806,-86.14596916124313,null,0,0]
[24833,24.832999999999998,34.69428928295352,1.5419691470155039,1.0035432916560423,8.4057846311517193E-2,1,0,1065.3781311113455,1.5698576927853962,4.4842687291453478,1.3459035909492809,1.0966564600635176,0.4229974711209864,1.0103580477808047,0.14331380501321347,{"$f":"IF(VOUT_setting=1,1,SQRT((1+Afbr-$Q$5*(A335)^2)^2+(A335*$Q$4)^2))","v":6.3870036261669227},0.1585701098664529,1.0005288884278332,4.5566878651504224E-2,5.9630255086480455,-124.08467096771751,55.915329032282486,null,1000000000,616677889,null,32.510198735419188,-37.067594722147795,null,17.428064099384915,-86.142954365515322,null,0,0]
[24976,24.975999999999999,34.89390968489284,1.5421341062917613,1.0035841439236437,8.4539594154397227E-2,1,0,1071.5130700598627,1.5698630669279812,4.5088105866141692,1.3471485885784424,1.0977231345047098,0.42515086189143902,1.0104770639388725,0.14412772327533677,6.3879120650133654,0.15946815374256776,1.0005349970217399,4.5829177331682833E-2,5.9023700789881248,-124.13872397871378,55.861276021286216,null,1000000000,623800576,null,32.499287728400013,-37.119949731030843,null,17.378531900829959,-86.139832324992355,null,0,0]
[25119,25.119,35.09353102554779,1.5422971889079173,1.0036252290850483,8.5021302666676998E-2,1,0,1077.6480090389744,1.569868379881687,4.5333593571505144,1.3483801044291406,1.0987948892922199,0.42730006181525942,1.0105967493426165,0.14494144929104386,6.3888255897889579,0.16036594313475566,1.0005411406881055,4.6091474347494388E-2,5.8420079605890507,-124.19319688249377,55.806803117506234,null,1000000000,630964161,null,32.488385404635935,-37.172833565231649,null,17.329285437615145,-86.136604917882082,null,0,0]
[25265.25,25.265250000000002,35.297690169215535,1.5424620699991363,1.0036674888638253,8.551391819018031E-2,1,0,1083.9223784805336,1.5698737513764802,4.5584730884169824,1.3496258875483398,1.0998962415170972,0.42949376450035726,1.0107198468550997,0.14577346917822231,6.3897651348447893,0.1612838722400958,1.0005474602603728,4.6359730927675494E-2,5.7805733212448551,-124.24933084270501,55.750669157294993,null,1000000000,638332857.5625,null,32.477243592412137,-37.227453119719257,null,17.27921193382749,-86.133197087978175,null,0,0]
[25411.5,25.4115,35.501850261441682,1.5426250547350586,1.0037099921821022,8.6006492112403243E-2,1,0,1090.1967479530069,1.5698790610425386,4.5835938167914261,1.3508580173474218,1.1010028762029407,0.43168306785583854,1.0108436438748736,0.14660528584781171,6.3907099950091766,0.1622015323921302,1.0005538165173198,4.6627985746863894E-2,5.7194373570484789,-124.30588133813681,55.694118661863186,null,1000000000,645744332.25,null,32.466109487127582,-37.282599346281238,null,17.229430552624073,-86.129682887599515,null,0,0]
[25557.75,25.557749999999999,35.706011285955213,1.5427861756360814,1.0037527390089414,8.64990241996203E-2,1,0,1096.4711174558645,1.5698843099412749,4.6087214278565733,1.3520767133757352,1.1021147774373756,0.43386796417861279,1.0109681401449662,0.14743689822357928,6.3916601679253446,0.163118922193937,1.0005602094588966,4.6896238794890806E-2,5.6585960864917375,-124.36283726671414,55.637162733285862,null,1000000000,653198585.0625,null,32.454982430403795,-37.338259285126426,null,17.179937968908487,-86.126064192836509,null,0,0]
[25704,25.704000000000001,35.910173226855065,1.5429454644834342,1.0037957293132329,8.6991514218226845E-2,1,0,1102.7454869885867,1.5698894991099455,4.6338558096459028,1.3532821905808015,1.1032319292966011,0.43604844596487419,1.0110933354070806,0.14826830523095119,6.3926156512246761,0.1640360402512199,1.0005666390850532,4.7164490061587822E-2,5.5980456086584498,-124.4201877577587,55.579812242241303,null,1000000000,660695616,null,32.443861787717275,-37.394420250163002,null,17.130730914312736,-86.122342837421357,null,0,0]
[25853.75,25.853750000000002,36.119222027860133,1.543106699466539,1.0038400007000379,8.7495746488075635E-2,1,0,1109.1700124037902,1.5698947516312247,4.6595985992862348,1.3545030394735624,1.1043812403835771,0.43827652832092479,1.0112222508081661,0.14911939523816617,6.39359950083767,0.16497482340217606,1.0005732605945195,4.7439159160313549E-2,5.5363433824520412,-124.4793084617916,55.520691538208396,null,1000000000,668416389.0625,null,32.432481017619452,-37.452431423961229,null,17.080638760244106,-86.11842792062167,null,0,0]
[26003.5,26.003499999999999,36.328271757039857,1.543266078811961,1.003884527290797,8.7999934156370779E-2,1,0,1115.5945378492424,1.5698999436556917,{"$f":"SQRT(1+(A343/Zero2)^2)","v":4.6853482576058187},{"$f":"ATAN(A343/Zero2)","v":1.3557104711078101},1.1055360225915467,0.44049996703083372,1.0113518985052903,0.14997026765492369,6.3945889129833349,0.16591331869623652,1.0005799205653112,4.771382636985342E-2,5.4749380062454209,-124.53882049163339,55.461179508366612,null,1000000000,676182012.25,null,32.421105699064874,-37.510941822508002,null,17.030839206568913,-86.114409130852721,null,0,0]
[26153.25,26.15325,36.537322398462479,1.5434236343629841,1.0039293090515533,8.8504076972729731E-2,1,0,1122.0190633244233,1.5699050762225355,4.7111046719774752,1.3569047019970983,1.1066962587939861,0.44271875468137328,1.0114822782168649,0.15082092133309549,6.395583885080474,0.16685152464521699,1.0005866189973738,4.7988491679292811E-2,5.4138255416231749,-124.59871289548828,55.401287104511724,null,1000000000,683992485.5625,null,32.409735223568418,-37.569938675284931,null,16.981328921208462,-86.110288306320825,null,0,0]
[26303,26.303000000000001,36.746373936558712,1.5435793972386285,1.0039743459481618,8.9008174686905639E-2,1,0,1128.4435888288253,1.5699101503472794,4.7368677321944057,1.3580859440971262,1.1078619318553982,0.4449328840734742,1.0116133896598571,0.15167135512640972,6.3965844145349955,0.16778943976386834,1.0005933558906519,4.8263155077717612E-2,5.3530021299784059,-124.65897495217743,55.341025047822569,null,1000000000,691847809,null,32.398369005554628,-37.629409483833918,null,16.932104628973562,-86.106067243727253,null,0,0]
[26456,26.456,36.959963396580704,1.543736720789858,1.0040206237392235,8.9523165910888117E-2,1,0,1135.0075447995466,1.5699152752688894,4.7631966755167312,1.3592796236599318,1.1090585006289433,0.44719024808933194,1.0117481020220478,0.15254001746132212,6.3976123951880819,0.16874740839390587,1.0006002787159265,4.8543777466371028E-2,5.2911532759964421,-124.72091572270469,55.279084277295311,null,1000000000,699919936,null,32.386759919445339,-37.690647750176055,null,16.882104051764745,-86.101652874111906,null,0,{"$f":"IF(AH346>0,W346,0)","v":0}]
[26609,26.609000000000002,37.173553760875414,1.5438922364577747,1.0040671677879927,9.0038109526066473E-2,1,0,1141.5715007997362,1.5699203412546205,4.7895323311556508,1.3604601777899219,1.1102607086250844,0.44944273494301717,1.0118835776196962,0.1534084478504176,6.3986461715213787,0.1697050703078827,1.0006072416898502,4.8824397837129128E-2,5.2295982605032378,-124.78322045161495,55.216779548385048,null,1000000000,708038881,null,32.375154111716988,-37.752355230837722,null,16.832395280259366,-86.097137532579438,null,0,0]
[26762,26.762,37.387145013944682,1.5440459752198847,1.0041139780574428,9.0553005265988223E-2,1,0,1148.1354568288882,1.5699253493152918,4.8158745889920667,1.3616278185527586,1.1114685375450082,0.4516903376407968,1.012019816146287,0.15427664507721903,6.3996857407267171,0.17066242393130665,1.0006142448123636,4.9105016178353243E-2,5.1683332131996131,-124.84587841461244,55.154121585387557,null,1000000000,716204644,null,32.363551027076355,-37.81451943255577,null,16.782974997120419,-86.092523008609959,null,0,0]
[26915,26.914999999999999,37.600737140642444,1.5441979673501598,1.0041610545103437,9.106785286435197E-2,1,0,1154.6994128865088,1.5699303004387384,4.8422233412758153,1.3627827535409089,1.1126819690839851,0.45393304941661977,1.0121568172937447,0.15514460792730847,6.4007310999820186,0.17161946769293743,1.0006212880834064,4.9385632478405224E-2,5.1073543421395851,-124.90887911517504,55.09112088482496,null,1000000000,724417225,null,32.351950132016029,-37.877128130090583,null,16.733839941568334,-86.087811051365392,null,0,0]
[27071.75,27.071750000000002,37.819565259018432,1.5443519043403671,1.0042095608082924,9.159526907220443E-2,1,0,1161.4242502490706,1.5699353148749695,4.8692245212450089,1.3639530315062236,1.1139309327290792,0.45622565057778824,1.0122979668761842,0.15603360004521907,6.401808082481093,0.1725996454233116,1.0006285456202157,4.9673124499952787E-2,5.0451737899697626,-124.97376865097186,55.026231349028137,null,1000000000,732879648.0625,null,32.340066636372377,-37.941719818569133,null,16.683793043882826,-86.082884347931227,null,0,0]
[27228.5,27.2285,38.0383942632781,1.5445040701827111,1.0042583464180319,9.2122634184306523E-2,1,0,1168.1490876404998,1.5699402715766724,4.8962322963068647,1.3651104004601688,1.1151857380852168,0.45851310447644567,1.0124399162613382,0.15692234358263318,6.4028911362929577,0.17357949458813449,1.0006358452976096,4.996061435431564E-2,4.9832857999572369,-125.03899633557222,54.961003664427778,null,1000000000,741391212.25,null,32.328184372243413,-38.006752914554625,null,16.634038774332318,-86.07785896859977,null,0,0]
[27385.25,27.385249999999999,38.25722413821984,1.5446544952627803,1.0043074112988586,9.2649947914790684E-2,1,0,1174.8739250603005,1.5699451715352437,4.923246557923993,1.3662550697747999,1.1164463654554102,0.46079540457051693,1.0125826651128442,0.1578108372404145,6.4039802583377332,0.17455901350848585,1.0006431871155217,5.0248102028980536E-2,4.9216865373388998,-125.10455158967866,54.895448410321336,null,1000000000,749951917.5625,null,32.316302832363029,-38.07221510388144,null,16.584573802870395,-86.072736669999074,null,0,0]
[27542,27.542000000000002,38.476054868987838,1.5448032092752162,1.0043567554098434,9.3177209977959294E-2,1,0,1181.5987625079883,1.5699500157195099,4.9502671999024308,1.3673872443855815,1.1177127951403498,0.4630725445621362,1.012726213092636,0.15869907972173522,6.405075445520386,0.17553820050908717,1.0006505710738862,5.053558751143479E-2,4.8603722451276559,-125.17042406136881,54.829575938631194,null,1000000000,758561764,null,32.304421530382726,-38.138094339280933,null,16.535394856298346,-86.067519169159141,null,0,0]
[27702.5,27.702500000000001,38.700121656322096,1.5449537383886602,1.004407569289254,9.3717032131680075E-2,1,0,1188.4844812627307,1.5699549189904531,4.9779407713538388,1.3685337673610667,1.1190155138023987,0.46539880851388593,1.0128740229135704,0.15960831040931989,6.4062031146269005,0.17654046736441206,1.0006581753466317,5.082994835243617E-2,4.7978825376715504,-125.23819054243096,54.761809457569044,null,1000000000,767428506.25,null,32.292255746502711,-38.205969454947969,null,16.485332390425672,-86.062079954794555,null,0,0]
[27863,27.863,38.924189310467135,1.5451025344594418,1.0044586758313596,9.4256799510716652E-2,1,0,1195.3702000457172,1.5699597657725448,5.0056208140254137,1.3696676117458086,1.120324273919393,0.46771964992860249,1.0130226698331515,0.16051727501436927,6.4073371359246218,0.17754238268564534,1.0006658238000956,5.1124306868532907E-2,4.7356838679487065,-125.3062683412813,54.693731658718704,null,1000000000,776346769,null,32.280089244211055,-38.274257075296156,null,16.435563030190533,-86.056544449550586,null,0,0]
[28023.5,28.023499999999999,39.1482578165392,1.5452496272385823,1.0045100749914906,9.4796511808932227E-2,1,0,1202.255918856463,1.5699645570363763,5.0333072211541641,1.3707889838212099,1.1216390543433123,0.47003506283009933,1.0131721534829365,0.16142597215232643,6.408477506041911,0.17854394468633802,1.0006735164342064,5.1418663046294673E-2,4.6737724434380432,-125.3746470504188,54.625352949581199,null,1000000000,785316552.25,null,32.267921565024331,-38.342945094472306,null,16.386083438772548,-86.050914374806055,null,0,0]
[28184,28.184000000000001,39.372327159993304,1.5453950458001453,1.0045617667247313,9.5336168720380948E-2,1,0,1209.1416376944935,1.5699692937304295,5.0609998882890181,1.3718980854808009,1.1229598339281244,0.47234504150293588,1.0133224734926261,0.16233440044121586,6.4096242215906649,0.17954515158410836,1.0006812532488911,5.1713016872291802E-2,4.6121445486379811,-125.4433164887091,54.556683511290899,null,1000000000,794337856,null,32.255752270463979,-38.41202167170259,null,16.336890336354546,-86.045191413142035,null,0,0]
[28348,28.347999999999999,39.601283600995487,1.5455419356654299,1.004614887857862,9.5887536321306865E-2,1,0,1216.1775124227372,1.5699740783135134,5.0893028052995541,1.373018904047077,1.1243155903832305,0.47469977459060453,1.0134769350378727,0.16326235955049812,6.4108024943561883,0.18056782300101445,1.0006892044153222,5.2013787185850965E-2,4.5494618274973568,-125.51377333746802,54.486226662531976,null,1000000000,803609104,null,32.243315497269442,-38.482993902556828,null,16.286917061178283,-86.03924941554574,null,0,0]
[28512,28.512,39.830240886636574,1.5456871367915905,1.0046683143678279,9.6438845448283267E-2,1,0,1223.213387178502,1.569978807855134,5.1176120449451448,1.3741273238652982,1.1256775658706926,0.47704882261773024,1.0136322690299122,0.16419003504837398,6.4119873851139646,0.18159011990932222,1.0006972017100613,5.2314555015610865E-2,4.4870675309832713,-125.58451294089249,54.415487059107505,null,1000000000,812934144,null,32.230876172837114,-38.554347645727347,null,16.237236159099666,-86.033213868324154,null,0,0]
[28676,28.675999999999998,40.059199002434042,1.5458306781283875,1.0047220462059134,9.69900957755334E-2,1,0,1230.2492619613154,1.5699834832996484,5.1459275028778464,1.3752235468614222,1.1270457378443905,0.4793921803174403,1.0137884750677122,0.16511742546889671,6.4131788901963942,0.18261204042074855,1.0007052451330285,5.2615320347246211E-2,4.4249579317325667,-125.65552513416127,54.344474865838734,null,1000000000,822312976,null,32.218433889719876,-38.626071084047119,null,16.187844307185017,-86.027086448021194,null,0,0]
[28840,28.84,40.288157934234519,1.5459725879677673,1.0047760833231352,9.7541286977492953E-2,1,0,1237.2851367707156,1.569988105569933,5.1742490770111633,1.3763077706591076,1.1284200837652218,0.48172984269832536,1.0139455527482368,0.16604452934898167,6.4143770059181389,0.18363358265151442,1.000713334684145,5.2916083166432461E-2,4.3631293780259828,-125.72679997590085,54.273200024099154,null,1000000000,831745600,null,32.205988259412962,-38.698152661404748,null,16.138738239190026,-86.020868793478741,null,0,0]
[29008,29.007999999999999,40.522702061866404,1.5461162962528672,1.0048317549060288,9.810586022121591E-2,1,0,1244.4926183098803,1.5699927863858174,5.2032676586308426,1.37740619934969,1.1298343284261356,0.48411861092640779,1.0141073649596566,0.1669939468836131,6.4156111945618788,0.18467964634934866,1.0007216693707881,5.3224179044047353E-2,4.3000804824216736,-125.80007540147335,54.19992459852665,null,1000000000,841464064,null,32.193235219620455,-38.772351862122008,null,16.088727430670609,-86.014407601070019,null,0,0]
[29176,29.175999999999998,40.75724701674411,1.5462583505501979,1.0048877467364103,9.8670370729392193E-2,1,0,1251.7000998759984,1.5699974132959873,5.2322924485897291,1.3784924428402892,1.1312550040219893,0.48650139290006761,1.0142700909888738,0.16794306063092831,6.4168523123619412,0.18572530910154014,1.0007300524630056,5.3532272254732234E-2,4.2373189865832988,-125.8736060202919,54.126393979708098,null,1000000000,851238976,null,32.180477900164291,-38.846903147687776,null,16.039009754981734,-86.007855083820886,null,0,0]
[29344,29.344000000000001,40.991792784667744,1.5463987792452087,1.0049440587607508,9.9234818152750703E-2,1,0,1258.9075814686059,1.5700019872263034,5.2613233441404379,1.37956670025234,1.1326820863546281,0.48887818413799239,1.0144337303961299,0.16889186902757736,6.4181003552991474,0.18677056889789906,1.0007384839607101,5.3840362783091199E-2,4.1748411994124179,-125.94738183972031,54.052618160279692,null,1000000000,861070336,null,32.167715941010286,-38.921794905571879,null,15.989581877762905,-86.001212887227382,null,0,0]
[29512,29.512,41.226339351760515,1.5465376100776416,1.0050006909252265,9.9799202142259152E-2,1,0,1266.1150630872514,1.5700065090815443,5.2903602447695128,1.3806291664476942,1.1341155512388423,0.49124898045211296,1.0145982827394833,0.16984037051341508,6.4193553193350246,0.18781542373327215,1.0007469638638147,5.4148450613729179E-2,4.1126435048564183,-126.02139308986722,53.978606910132783,null,1000000000,870958144,null,32.154949000207331,-38.997015782893854,null,15.94044052160335,-85.994482619775681,null,0,0]
[29684,29.684000000000001,41.46647117470367,1.5466781193314585,1.0050590030825139,0.10037695776426445,1,0,1273.4941514376158,1.5700110855736171,5.3200946187483638,1.381704912905632,1.1355897333085787,0.49367000950209805,1.0147676983317264,0.17081113578330454,6.420647329472275,0.18888473443755185,1.0007556958171673,5.4463871057998367E-2,4.0492513889666579,-126.09740044461655,53.902599555383446,null,1000000000,881139856,null,32.141872584895246,-39.074357011439709,null,15.890422604445595,-85.987502508491872,null,0,0]
[29856,29.856000000000002,41.706603806885973,1.5468170105777057,1.0051176506910706,0.10095464615616019,1,0,1280.8732398143452,1.570015609335508,5.3498350808620598,1.3827687001409836,1.1370705542214461,0.49608474680355419,1.0149380699062578,0.17178157605436498,6.4219465855792421,0.1899536164300861,1.0007644785081933,5.4779288641899092E-2,3.9861454241357679,-126.17363454129035,53.826365458709645,null,1000000000,891380736,null,32.128790277841574,-39.152019941113032,null,15.840698239537288,-85.980433380317479,null,0,0]
[30028,30.027999999999999,41.946737234409454,1.5469543115989108,1.0051766336921804,0.1015322669441712,1,0,1288.2523282169868,1.57002008127333,5.3795815301377248,1.383820724111827,1.1385579880737902,0.49849318880037607,1.0151093969817337,0.17275168966286511,6.4232530832596346,0.19102206757559081,1.0007733119367974,5.5094703348913088E-2,3.9233219618819177,-126.25008558575738,53.749914414242625,null,1000000000,901680784,null,32.115701766895839,-39.229993192509596,null,15.791264086953769,-85.973276847543389,null,0,0]
[30200,30.2,42.186871443692553,1.5470900495452744,1.005235952026805,0.10210981975479018,1,0,1295.6314166450975,1.570024502272553,5.4093338678034133,1.3848611765704768,1.1400520089817658,0.50089533224710603,1.0152816790744363,0.17372147494865303,6.4245668180962445,0.19209008574439893,1.0007821961028842,5.5410115162523012E-2,3.8607774279968603,-126.32674400534657,53.673255994653431,null,1000000000,912040000,null,32.102606757090456,-39.308265643813755,null,15.742116863847135,-85.966034486215534,null,0,0]
[30375.75,30.37575,42.432241930892012,1.5472271599358716,1.0052969099571012,0.10269989395484751,1,0,1303.17138638747,1.5700289679435699,5.4397408574553845,1.385912555846148,1.1415853801522458,0.50334333892087646,1.015458703288258,0.17471206294740055,6.4259166663463363,0.19318093974368925,1.000791326373186,5.573240068128494E-2,3.7971537513273201,-126.40527822913046,53.59472177086954,null,1000000000,922686188.0625,null,32.089219243106498,-39.388542363470854,null,15.692191140965456,-85.958547171675988,null,0,0]
[30551.5,30.551500000000001,42.67761320661365,1.5473626937201366,1.0053582178767586,0.10328989639348617,1,0,1310.7113561555316,1.5700333822363424,5.4701537933343172,1.3869522453531515,1.1431255741660049,0.5057847635329531,1.0156367235878165,0.17570230465801101,6.4272740613755595,0.19427133720313411,1.0008005096172743,5.6054683144237873E-2,3.7338139823543948,-126.48400944590566,53.515990554094344,null,1000000000,933394152.25,null,32.075824373386432,-39.469108789424325,null,15.64255824232532,-85.950973460789029,null,0,0]
[30727.25,30.727250000000002,42.922985257334602,1.5474966779313668,1.0054198757217536,0.1038798266731083,1,0,1318.2513259488417,1.5700377460324706,5.5005725768092706,1.3879804367621238,1.1446725634819741,0.50821960360677987,1.0158157394494238,0.17669219832103691,6.4286389984042343,0.19536127586901994,1.0008097458350451,5.6376962533763605E-2,3.6707545360492828,-126.5629281247152,53.437071875284801,null,1000000000,944163892.5625,null,32.06242188490895,-39.549953848371409,null,15.593214842026415,-85.943314924219706,null,0,0]
[30903,30.902999999999999,43.168358069839407,1.5476291389884456,1.0054818834277119,0.10446968439641419,1,0,1325.7912957669691,1.5700420601934997,5.5309971114003043,1.3889973176248505,1.1462263205865817,0.51064785699142756,1.0159957503468335,0.17768174218099572,6.4300114726301905,0.19645075349384636,1.0008190350263941,5.6699238832244939E-2,3.6079719003155981,-126.64202495301124,53.357975046988756,null,1000000000,954995409,null,32.049011530811782,-39.631066720509992,null,15.544157670927063,-85.935573097412771,null,0,0]
[31083,31.082999999999998,43.41966528268793,1.5477632513580133,1.0055457531949503,0.10507373048028808,1,0,1333.5135977396965,1.570046428109634,5.5621632372186021,1.3900272564183838,1.1478246373019902,0.51312800114244195,1.0161811451488094,0.17869485084263906,6.431424943890546,0.19756609670912076,1.0008286037601553,5.7029305218454007E-2,3.543954387176742,-126.7232096635264,53.276790336473596,null,1000000000,966152889,null,32.035268491683198,-39.714407630175927,null,15.494207533177669,-85.927559289811882,null,0,0]
[31263,31.263000000000002,43.670973267500031,1.5478958202099882,1.005609989810665,0.10567769961368502,1,0,1341.2358997375725,1.5700507457283264,5.5933351974790293,1.3910457164728063,1.1494299947580631,0.51560123265848279,1.0163675825669685,0.17970758886419291,6.4328463110176877,0.19868095156390531,1.0008382280602706,5.7359368324913007E-2,3.4802200035149773,-126.80456214980249,53.195437850197507,null,1000000000,977375169,null,32.021516727189017,-39.79800727650688,null,15.444550870953789,-85.919461266188947,null,0,0]
[31443,31.443000000000001,43.922282011024976,1.5480268720341586,1.0056745932045592,0.10628159137076268,1,0,1348.9582017601654,1.5700550139133811,5.6245128951753234,1.3920528865437563,1.1510423634956621,0.51806755026914264,1.01655506202766,0.18071995437275304,6.4342755687797517,0.19979531566408998,1.0008479079266259,5.7689428132699096E-2,3.4167652020349859,-126.88607308484623,53.113926915153769,null,1000000000,988662249,null,32.00775602103537,-39.881854821304763,null,15.395184349008666,-85.911280567611811,null,0,0]
[31623,31.623000000000001,44.173591500313556,1.5481564327177084,1.0057395633059534,0.10688540532601359,1,0,1356.6805038070529,1.5700592335089352,5.6556962354225915,1.3930489513167403,1.1526617140921795,0.52052695304754792,1.0167435829544502,0.18173194549984681,6.4357127119204947,0.2009091866224989,1.0008576433591063,5.801948462289068E-2,3.3535865077210305,-126.96773335901982,53.032266640980183,null,1000000000,1000014129,null,31.993986172221533,-39.965939678129082,null,15.346104689066278,-85.903018700602502,null,0,0]
[31807,31.806999999999999,44.430486402549725,1.5482873576557208,1.0058063561350117,0.10750255651202623,1,0,1364.5744125907747,1.5700634975110703,5.6875782741790681,1.3940558607990206,1.15432423597294,0.52303386157765686,1.0169373690708499,0.18276603642450207,6.4371899362486911,0.20204729808894539,1.0008676525664593,5.8356872253052437E-2,3.2892856767426188,-127.05135339655233,52.948646603447671,null,1000000000,1011685249,null,31.979900683216364,-40.052127602267959,null,15.296227509746153,-85.894490875962049,null,0,0]
[31991,31.991,44.687382057627524,1.5484167772919195,1.0058735320001944,0.10811962550187162,1,0,1372.4683213990213,1.5700677124634121,5.7194660150905614,1.3950515436358413,1.155993991415782,0.52553354365855109,1.0171322422281179,0.18379973220961285,6.4386753891263373,0.20318488923061445,1.0008777198367382,5.8694256376553393E-2,3.2252662408133261,-127.13511090665125,52.864889093348751,null,1000000000,1023424081,null,31.965805262424119,-40.138541910423015,null,15.24664333283356,-85.885881312457286,null,0,0]
[32175,32.174999999999997,44.944278452637512,1.548544717434335,1.0059410908247655,0.10873661184213625,1,0,1380.3622302313722,1.5700718792074666,5.7513593633122735,1.396036184603707,1.1576709491209323,0.52802599938877881,1.0173282018015735,0.18483303087382444,6.4401690648605197,0.20432195752024682,1.0008878451698184,5.9031636973186231E-2,3.1615247103315132,-127.21899682849786,52.781003171502135,null,1000000000,1035230625,null,31.951699741050675,-40.225172069541522,null,15.197348832919509,-85.877191513600366,null,0,0]
[32359,32.359000000000002,45.201175574963685,1.5486712033044823,1.0060090325315709,0.10935351507977967,1,0,1388.2561390874159,1.5700759985656001,5.7832582260751,1.3970099644891387,1.1593550778350947,0.53051122922545768,1.0175252471635361,0.18586593044069633,6.4416709577321098,0.20545850043826011,1.000898028565574,5.9369014022744984E-2,3.098057666772875,-127.30300231586277,52.69699768413723,null,1000000000,1047104881,null,31.937583964615719,-40.312007794627817,null,15.148340741341976,-85.868422949277175,null,0,0]
[32547.5,32.547499999999999,45.464356248672559,1.5487993002903269,1.0060790328178006,0.10998541897555895,1,0,1396.3431055211536,1.570080170370644,5.8159428476983317,1.3979964817926953,1.161087798077461,0.53304974685542328,1.0177282368554696,0.18692367521972997,6.4432180967116333,0.20662229181501024,1.0009085212216937,5.9714638442069368E-2,3.0333195775602229,-127.3891772446654,52.610822755334596,null,1000000000,1059339756.25,null,31.923112184032,-40.401169890057808,null,15.098427724274137,-85.859359760161993,null,0,0]
[32736,32.735999999999997,45.727537659811404,1.5489259227730525,1.0061494347779447,0.11061723469284784,1,0,1404.4300719789128,1.5700842941316475,5.8486330662264434,1.398971972001396,1.1628279781267097,0.53558068293623862,1.0179323647513265,0.18798099695821749,6.4447738474333258,0.20778552647985973,1.0009190748149706,6.0060259095772867E-2,2.9688625229595149,-127.47545953086555,52.52454046913445,null,1000000000,1071645696,null,31.908629356132497,-40.490526647994358,null,15.048808528124267,-85.85021692474227,null,0,0]
[32924.5,32.924500000000002,45.990719795720409,1.5490510960621195,1.0062202383276919,0.11124896174577779,1,0,1412.5170384602818,1.5700883706737983,5.8813287883315253,1.3999366171498961,1.1645755845421426,0.53810403910254545,1.0181376301665064,0.18903789354729919,6.4463382036631831,0.2089482017490415,1.0009296893452677,6.0405875962134883E-2,2.904683047682183,-127.56184032936287,52.438159670637134,null,1000000000,1084022700.25,null,31.894135358037307,-40.580067779557787,null,14.999479815465337,-85.840995919737011,null,0,0]
[33113,33.113,46.253902644027875,1.5491748448911322,1.0062914433822734,0.11188059964889968,1,0,1420.604004964857,1.570092400803494,5.9140299227339801,1.4008905953284236,1.1663305839412046,0.54061981736531772,1.0183440324131472,0.19009436288361006,6.4479111591387843,0.21011031494735824,1.0009403648124466,6.0751489019436403E-2,2.8407777669364442,-127.64831100869965,52.35168899130035,null,1000000000,1096470769,null,31.879630080326791,-40.669783242353162,null,14.950438305889261,-85.831698188847113,null,0,0]
[33305.75,33.305750000000003,46.523020047209172,1.5492999359986788,1.0063646689526928,0.11252638603210165,1,0,1428.8733036290635,1.5700964746252939,5.9474738543210215,1.4018552333850931,1.168132762466132,0.54318448379212836,1.01855626313892,0.19117420782384317,6.4495284648283508,0.211298045635995,1.0009513439862712,6.1104890452097681E-2,2.7757117338435737,-127.73681546121772,52.263184538782284,null,1000000000,1109272983.0625,null,31.864785996138,-40.761691527964089,null,14.900584715770506,-85.82211295769406,null,0,0]
[33498.5,33.4985,46.79213816999895,1.5494235882218093,1.0064383141563131,0.11317207817489386,1,0,1437.1426023167107,1.5701005015656651,5.9809232582947462,1.4028090824926134,1.1699426007000571,0.54574123219088733,1.0187696810719449,0.19225360159759813,6.4511547485653589,0.2124851829927695,1.0009623868754769,6.1458287856074802E-2,2.710925458618834,-127.82539630056053,52.174603699439473,null,1000000000,1122149502.25,null,31.849929927390228,-40.853761619129401,null,14.851024665150831,-85.812450453287823,null,0,0]
[33691.25,33.691249999999997,47.061257000052031,1.5495458262414021,1.0065123789010224,0.11381767555962019,1,0,1445.4119010273962,1.5701044824292427,6.0143780433499154,1.4037523209402172,1.1717600631506435,0.54829006590162865,1.018984285466269,0.19333254197396407,6.4527900035627797,0.2136717241854052,1.0009734934799135,6.1811681208151281E-2,2.6464155393138151,-127.91404495696317,52.085955043036833,null,1000000000,1135100326.5625,null,31.835061797374614,-40.945983538100563,null,14.801754823350414,-85.802712118067859,null,0,0]
[33884,33.884,47.330376525303997,1.5496666741771679,1.006586863094211,0.11446317766909243,1,0,1453.6811997607269,1.5701084180023537,6.0478381201870546,1.4046851231480262,1.1735851143963607,0.55083098865508318,1.0192000755724231,0.19441102672812638,6.4544342230030409,0.21485766639111625,1.00098466379943,6.216507048511237E-2,2.5821786433668708,-128.00275307169622,51.997246928303781,null,1000000000,1148125456,null,31.820181541886122,-41.038347550149105,null,14.75277191655386,-85.792899362294392,null,0,0]
[34081.5,34.081499999999998,47.606128758010911,1.5497890829674048,1.0066636178086097,0.11512448772743647,1,0,1462.1542814950092,1.5701124043862875,6.0821281620810863,1.4056302659601023,1.1754629756166048,0.55342632670130887,1.0194224125775015,0.19551561400472525,6.4561282528432979,0.21607220989816961,1.0009961754822037,6.2527164195973206E-2,2.5166385215338574,-128.09370039818444,51.906299601815562,null,1000000000,1161548642.25,null,31.804921955597582,-41.133125175521705,null,14.702876171722801,-85.7827690354666,null,0,0]
[34279,34.279000000000003,47.881881695827737,1.5499100818489522,1.0067408127009665,0.11578569665901879,1,0,1470.6273632522593,1.5701163448347819,6.1164235761878505,1.4065648105739139,1.177348729208098,0.55601336824684933,1.019645992849852,0.19661971821685403,6.4578316798081312,0.21728611856288102,1.0010077540587294,6.2889253579053936E-2,2.4513781770288814,-128.18469303844711,51.815306961552892,null,1000000000,1175049841,null,31.789649540447726,-41.228032046544641,null,14.65327489671102,-85.772563472994406,null,0,0]
[34476.5,34.476500000000001,48.157635326642016,1.5500296950379122,1.0068184476700337,0.11644680390900956,1,0,1479.1004450320822,1.5701202401372656,6.1507242726436573,1.4074889326519127,1.1792423373082228,0.55859211854714674,1.0198708155718124,0.19772333699119182,6.4595444964645221,0.21849938937979541,1.0010193995288426,6.3251338609386462E-2,2.3863942398810547,-128.27572265573343,51.724277344266568,null,1000000000,1188629052.25,null,31.774364264954002,-41.323058444846403,null,14.603964747098647,-85.76228409271711,null,0,0]
[34674,34.673999999999999,48.433389638617101,1.5501479461990528,1.006896522614017,0.1171078089231051,1,0,1487.5735268340927,1.570124091065181,6.1850301635645781,1.4084028040313434,1.1811437621399667,0.56116258326509993,1.0200968799218986,0.19882646796123427,6.4612666953463833,0.21971201935405096,1.0010311118923763,6.3613419262004742E-2,2.3216834089589868,-128.36678112337296,51.633218876627041,null,1000000000,1202286276,null,31.759066109279068,-41.418194893538697,null,14.554942435640573,-85.751932280854888,null,0,0]
[34875.75,34.875749999999996,48.715078595417374,1.5502673597473966,1.0069767318238112,0.11778293196026961,1,0,1496.2289407986632,1.5701279798279451,6.2200795564766223,1.4093259318532301,1.1830941353687539,0.56377981314285719,1.0203290900830932,0.19995283107602285,6.4630356336474151,0.22095007911761363,1.0010431453620654,6.3983286977608925E-2,2.2558586885947807,-128.45982062833696,51.540179371663044,null,1000000000,1216317938.0625,null,31.743425444900875,-41.515482601209598,null,14.50515904941591,-85.741284331580161,null,0,0]
[35077.5,35.077500000000001,48.996768238887611,1.550385400245222,1.0070573999314196,0.11845794714658107,1,0,1504.8843547855997,1.5701318238579007,6.2551341905190307,1.4102387137746433,1.1850525859570142,0.56638841022756747,1.0205625941395162,0.2010786801963329,6.4648143464562438,0.22218746387759833,1.0010552486347553,6.4353150072404913E-2,2.1903122033163713,-128.55287374362953,51.447126256370467,null,1000000000,1230431006.25,null,31.727771333269985,-41.612865899704879,null,14.455669265215063,-85.730563626951508,null,0,0]
[35279.25,35.279249999999998,49.278458557252193,1.5505020912355054,1.0071385268265745,0.11913285389289385,1,0,1513.539768794519,1.5701356239224831,6.2901939780668856,1.4111413212572141,1.1870190739244908,0.56898838183472,1.0207973912032442,0.20220401282176223,6.4666028257084536,0.22342417047606228,1.0010674217102655,6.4723008519786226E-2,2.1250406453573492,-128.64593245181021,51.354067548189789,null,1000000000,1244625480.5625,null,31.71210378776431,-41.710335428114135,null,14.406469755488388,-85.719771548113215,null,0,0]
[35481,35.481000000000002,{"$f":"SQRT(1+(A397/pole1)^2)","v":49.560149539003234},{"$f":"ATAN(A397/pole1)","v":1.550617455726117},{"$f":"SQRT(1+(A397/Zero1)^2)","v":1.0072201123984155},{"$f":"ATAN(A397/Zero1)","v":0.11980765161064676},{"$f":"IF(VIN_nom>Vout, 1, SQRT(1+(A397/z_RHP)^2))","v":1},{"$f":"IF(VIN_nom>Vout, 0, -ATAN(A397/z_RHP))","v":0},{"$f":"SQRT(1+(A397/Pole2)^2)","v":1522.1951828250462},{"$f":"ATAN(A397/Pole2)","v":1.5701393807716713},6.3252588334252895,1.4120339220276537,{"$f":"SQRT(1+(A397/pole4)^2)","v":1.1889935593918861},{"$f":"ATAN(A397/pole4)","v":0.57157973569795961},{"$f":"IF(VOUT_setting=1,1,SQRT(1+(A397*zterm1)^2))","v":1.0210334803822569},{"$f":"IF(VOUT_setting=1,0,ATAN(((A397*zterm1))))","v":0.20332882645943501},6.4684010633042917,{"$f":"IF(VOUT_setting=1,0,ATAN(A397*$Q$4/(1+Afbr-$Q$5*(A397)^2)))","v":0.22466019576673663},{"$f":"SQRT((1-(Z397/pterm2))^2+(A397/pterm1)^2)","v":1.001079664588415},{"$f":"IF((ATAN((A397/pterm1)/(1-A397^2/pterm2))>0),ATAN((A397/pterm1)/(1-A397^2/pterm2)),PI()+ATAN((A397/pterm1)/(1-A397^2/pterm2)))","v":6.5092862293148465E-2},{"$f":"20*LOG10(((E397*K397*G397*O397)/(C397*I397*S397*M397*Q397))*Adc)","v":2.0600407744042224},{"$f":"((F397+L397+H397+P397)-(D397+J397+T397+N397+R397))*radconv","v":-128.73898894193732},{"$f":"IF(V397>0,V397,V397+180)","v":51.261011058062678},null,{"$f":"IF(U397<0,A397,1000000000)","v":1000000000},{"$f":"A397^2","v":1258901361},null,{"$f":"20*LOG10((K397/(I397*M397))*AEA)","v":31.696422832404949},{"$f":"(L397-(J397+N397))*radconv","v":-41.807882062480601},null,{"$f":"20*LOG10((E397*G397/(C397*S397))*Acs*Am)","v":14.357557249475622},{"$f":"(F397+H397-(D397+T397))*radconv","v":-85.708909445516852},null,{"$f":"SUM((U398<0)*(U397>0))*A397","v":0},0]
[35687.75,{"$f":"A398/1000","v":35.687750000000001},49.848822386380348,1.5507343266128195,1.0073041956696525,0.12049905920954733,1,0,1531.0651052798512,1.5701431866588893,6.361197876360535,1.4129384340984872,1.1910252344769574,0.57422637923661168,1.0212767602029313,0.20448097547926056,6.4702539824820011,0.22592614353116669,1.0010922833023974,6.5471877330077408E-2,1.993708551999914,-128.83434140476757,51.165658595232429,null,1000000000,1273615500.0625,null,31.680339376973535,-41.90791690433273,null,14.30772693577628,-85.697706878707805,null,0,0]
[35894.5,35.894500000000001,50.137495906792303,1.5508498517007139,1.007388760396569,0.12119035105916558,1,0,1539.9350277565777,1.570146948702797,6.3971420651809501,1.413832782369989,1.1930652239147221,0.5768639903523769,1.021521395067972,0.20563257419179137,{"$f":"IF(VOUT_setting=1,1,SQRT((1+Afbr-$Q$5*(A399)^2)^2+(A399*$Q$4)^2))","v":6.472117132345633},0.22719136914699534,1.0011049753213619,6.5850887401878444E-2,1.9276549695256027,-128.92967557174757,51.070324428252434,null,1000000000,1288415130.25,null,31.664241922129509,-42.008014057243635,null,14.258191250232867,-85.686433550771383,null,0,0]
[36101.25,36.10125,50.426170088680401,1.550964054099532,1.0074738064579287,0.12188152652801693,1,0,1548.804950254849,1.5701506676566592,6.4330913136303343,1.4147171357906365,1.1951134851288274,0.57949257869300352,1.0217673840040913,0.20678361993894454,6.4739905040638073,0.22845586926656583,1.0011177406451095,6.6229892479926833E-2,1.8618767488790491,-129.02498367789852,50.975016322101482,null,1000000000,1303300251.5625,null,31.648130525512453,-42.108164437112713,null,14.208946850123329,-85.675090820339008,null,0,0]
[36308,36.308,50.714844920749044,1.5510769563929716,1.0075593337318463,0.12257258498527421,1,0,1557.6748727742977,1.5701543442565835,6.4690455373578271,1.4155916596162517,1.197169975662248,0.58211215433908636,1.0220147260335541,0.20793411007105028,6.4758740887669424,0.22971964055524524,1.0011305792734408,6.6608892535600303E-2,1.796370678884339,-129.12025816371954,50.879741836280459,null,1000000000,1318270864,null,31.632005254535752,-42.208359195230237,null,14.159990449856767,-85.663680015865069,null,0,0]
[36519.5,36.519500000000001,51.010152604888489,1.5511911303305694,1.0076473237565688,0.12327939850705262,1,0,1566.7485782994063,1.5701580622502544,6.5058308572894923,1.4164762728837352,1.199282184206055,0.58478259899533713,1.0222691497054908,0.20911045459874783,6.4778115064399886,0.2310116888893311,1.0011437887141494,6.6996594741989338E-2,1.7296379541931539,-129.21767908364257,50.782320916357435,null,1000000000,1333673880.25,null,31.615495235700873,-42.310892822191349,null,14.110203929233263,-85.651937969039707,null,0,0]
[36731,36.731000000000002,51.305460946325589,1.5513039899254775,1.0077358170990811,0.1239860882455448,1,0,1575.8222838459233,1.5701617374269403,6.542621211047571,1.4173509381454117,1.201402915052709,0.58744363477055195,1.0225249872745212,0.21028621210578316,6.4797595928689349,0.23230296750109466,1.0011570748659961,6.7384291631992735E-2,1.6631834378355466,-129.31504945323744,50.684950546762565,null,1000000000,1349166361,null,31.598970869777851,-42.413454885493977,null,14.060712015757675,-85.640127403578731,null,0,0]
[36942.5,36.942500000000003,51.600769933775332,1.5514155577405759,1.0078248136267995,0.12469265352759461,1,0,1584.8959894134812,1.5701653705220366,6.5794165141885887,1.4182158209539104,1.2035321231510399,0.59009527381599913,1.0227822376796341,0.21146137978314322,6.481718338435897,0.23359347286328974,1.0011704377287638,6.7771983174977707E-2,1.5970038983812098,-129.4123618138085,50.587638186191498,null,1000000000,1364748306.25,null,31.582432257809185,-42.516036638022619,null,14.011511369394229,-85.628249649053828,null,0,0]
[37154,37.154000000000003,51.896079556209514,1.5515258558253076,1.0079143132064337,0.12539909368077998,1,0,1593.9696950017205,1.5701689622541946,6.6162166841363348,1.419071083237855,1.2056697635886682,0.59273752872584196,1.0230408998550282,0.21263595483114903,6.4836877334820224,0.23488320146308966,1.0011838773022339,6.8159669340314186E-2,1.5310961703131498,-129.50960890954894,50.490391090451055,null,1000000000,1380419716,null,31.565879509661649,-42.618629564718603,null,13.962598707174008,-85.616306005576973,null,0,0]
[37370.25,37.370249999999999,52.198022073156757,1.5516373406745045,1.0080063428098902,0.12612126943573318,1,0,1603.247183597002,1.5701725926164918,6.6538482833133541,1.4199357714780505,1.2078640843966029,0.59542943599842391,1.0233068297989554,0.2138362935743664,6.485712359260364,0.23620108882890367,1.0011976980241415,6.8556056813274396E-2,1.4639860515205836,-129.60896521062992,50.391034789370082,null,1000000000,1396535585.0625,null,31.548940516762123,-42.723529508077917,null,13.91288193060592,-85.604027323328566,null,0,0]
[37586.5,37.586500000000001,52.499965231404055,1.551747543158972,1.0080988980306336,0.1268433129589101,1,0,1612.5246722131703,1.570176181204985,{"$f":"SQRT(1+(A407/Zero2)^2)","v":6.6914848015190707},{"$f":"ATAN(A407/Zero2)","v":1.4207907334057994},1.2100671260475584,0.59811156090425521,1.0235742333694178,0.21503600688059377,6.4877480976827071,0.23751815676954358,1.0012115989406118,6.8952438599571272E-2,1.3971536008361529,-129.70823856828295,50.291761431717049,null,1000000000,1412744982.25,null,31.531987004292162,-42.828423846299522,null,13.863459454692045,-85.591682417494169,null,0,0]
[37802.75,37.802750000000003,52.801909019949782,1.5518564852753323,1.0081919787239035,0.12756522353396257,1,0,1621.8021608498668,1.5701797287365726,6.7291261562159708,1.4216361309816166,1.2122788409970766,0.60078391829087396,1.0238431094117857,0.21623509178771394,6.4897949382932856,0.23883440157715477,1.0012255800514076,6.9348814666473163E-2,1.3305956373280119,-129.80742185138493,50.19257814861507,null,1000000000,1429047907.5625,null,31.515019115564709,-42.933304191505989,null,13.814327947009817,-85.579272587555764,null,0,0]
[38019,38.018999999999998,53.103853428042441,1.5519641885200439,1.0082855847441718,0.12828700044536043,1,0,1631.0796495067418,1.5701832359118431,6.7667722666925698,1.4224721226172083,1.2144991818605309,0.60344652345591276,1.0241134567662882,0.21743354534394027,6.4918528705925418,0.24014981955980702,1.0012396413562894,6.9745184981251457E-2,1.2643090448325949,-129.90650812861523,50.093491871384771,null,1000000000,1445444361,null,31.498037001747939,-43.038162384005616,null,13.765484132026828,-85.566799104291334,null,0,0]
[38240.5,38.240499999999997,53.413128909722793,1.5520732441288865,1.0083820077398571,0.12902616094693201,1,0,1640.5823720128417,1.5701867871100978,6.8053371768683775,1.4233188206890039,1.216782320180269,0.60616367612007238,1.0243918915748116,0.21866043670206092,6.4939722521094447,0.24149631152542136,1.0012541271717215,7.0151172161672493E-2,1.1966913253467679,-130.00789236232382,49.992107637676185,null,1000000000,1462335840.25,null,31.480628023908181,-43.145535006713828,null,13.715749402790166,-85.55395810524729,null,0,{"$f":"IF(AH410>0,W410,0)","v":0}]
[38462,38.462000000000003,53.722405019338055,1.5521810440880495,1.0084789815678401,0.12976517969907517,1,0,1650.0850945393927,1.570190297406157,6.8439069107896486,1.4241559759995344,1.2190744082171632,0.60887063119594531,1.0246718675225774,0.21988665944645619,6.4961032479700789,0.24284192824294559,1.0012686971218108,7.0557153237787884E-2,1.1293518962342,-130.1091607228733,49.890839277126702,null,1000000000,1479325444,null,31.463204466455515,-43.252867767074214,null,13.666309725684169,-85.54105293466904,null,0,0]
[38683.5,38.683500000000002,54.03168174610537,1.5522876099569787,1.0085765060692344,0.13050405593556583,1,0,1659.5878170860437,1.570193767502633,6.8824813873589266,1.4249837478193312,1.2213753955848883,0.61156740653590491,1.0249533833466546,0.22111221043900653,6.4982458467501827,0.24418666579719775,1.0012833512062962,7.0963128174436965E-2,1.0622876092011722,-130.21030638048651,49.789693619513486,null,1000000000,1496413172.25,null,31.445766514849069,-43.360152602679797,null,13.617161758070864,-85.52808486970865,null,0,0]
[38905,38.905000000000001,54.340959079487334,1.552392962804418,1.0086745810843134,0.13124278889109794,1,0,1669.0905396524511,1.5701971980861364,6.9210605272768788,1.4258022919198188,1.2236852320812022,0.61425402045057254,1.0252364377785566,0.2223370865531013,6.5004000369783981,0.24553052029069708,1.0012980894249146,7.1369096936462498E-2,0.99549538002908433,-130.31132270339646,49.688677296603544,null,1000000000,1513599025,null,31.428314361481728,-43.46738167694663,null,13.568302214429913,-85.515055159350723,null,0,0]
[39131.5,39.131500000000003,54.657218459096946,1.5524994608683678,1.0087754391094148,0.13199804856874767,1,0,1678.8077706490162,1.5702006659475867,6.9605152697895445,1.4266299295236144,1.2260563082606331,0.61699079174520999,1.0255274714707561,0.22358891109355411,6.5026148294128374,0.24690379287168371,1.0013132473387774,7.1784223356998564E-2,0.92747361658718785,-130.41447884998951,49.585521150010493,null,1000000000,1531274292.25,null,31.410453775369568,-43.576965673908369,null,13.518634645371561,-85.50166884882141,null,0,0]
[39358,39.357999999999997,54.97347845148721,1.5526047335761883,1.0088768724421158,0.13275315680816058,1,0,1688.5250016655386,1.570204093894898,6.9999747263948917,1.4274482367546761,1.2284365320106558,0.61971697783402147,1.0258201113174887,0.22484002336756476,6.5048417181073468,0.24827613388862554,1.0013284932274649,7.2199343246656972E-2,0.8597300071576679,-130.51748634304894,49.482513656951056,null,1000000000,1549052164,null,31.392578766519783,-43.686475487318134,null,13.469261897314201,-85.48822063313753,null,0,0]
[39584.5,39.584499999999998,55.289739046142699,1.5527088019528554,1.0089788809089084,0.13350811279403169,1,0,1698.2422327016754,1.5702074826132284,7.0394388178186169,1.4282573694299388,1.2308258502613805,0.62243259972232057,1.0261143559445667,0.22609042006952715,6.5070806906451191,0.24964753923179431,1.0013438270906911,7.2614456567856686E-2,0.79226145095440736,-130.62033870082436,49.379661299175638,null,1000000000,1566932640.25,null,31.374689560654403,-43.79590343229566,null,13.420180634149361,-85.474711761501752,null,0,0]
[39811,39.811,55.606000232787224,1.5528116865451298,1.0090814643353709,0.13426291571207896,1,0,1707.9594637570922,1.5702108327721438,7.0789074665449885,1.4290574799399578,1.2332242101522095,0.6251376788761982,1.0264102039718452,0.22734009790656579,6.5093317345590958,0.25101800481099545,1.0013592489281693,7.3029563283020404E-2,0.72506491013657626,-130.72302963632131,49.276970363678686,null,1000000000,1584915721,null,31.356786389452292,-43.905242045785009,null,13.371387576732769,-85.461143455658643,null,0,0]
[40042.75,40.042749999999998,55.92959257899394,1.5529157515626775,1.0091870204449298,0.13503505478291933,1,0,1717.9019286645328,1.5702142213558208,7.1192955894187575,1.4298669532363886,1.2356874646830731,0.62789456928449461,1.0267145675362546,0.2286179943133177,6.5116474362507848,0.25241925921265396,1.0013751192817464,7.3454284800331462E-2,0.65658927526298094,-130.82792738867767,49.172072611322335,null,1000000000,1603421827.5625,null,31.338454036953788,-44.017014978917402,null,13.321758496117402,-85.447200382397156,null,0,0]
[40274.5,40.274500000000003,56.253185523923349,1.5530186193262687,1.0092931781044625,0.13580703188644538,1,0,1727.8443935914722,1.5702175709419186,7.1596883245581697,1.4306672934590736,1.2381600735777789,0.63064046945889984,1.0270206067499292,0.22989513121053698,6.5139757488387104,0.25381952117977918,1.0013910817345024,7.3878999322238847E-2,0.58839217227651219,-130.93264343521713,49.06735656478287,null,1000000000,1622035350.25,null,31.32010757244575,-44.128679270214761,null,13.272424368305805,-85.433197590773318,null,0,0]
[40506.25,40.506250000000001,56.576779057302197,1.553120310376958,1.009399937124176,0.13657884615378738,1,0,1737.7868585375761,1.5702208821997918,7.2000855943383044,1.4314586533018372,1.2406419809063733,0.63337540382595736,1.0273283201153505,0.23117150511264073,6.5163166588073995,0.2552187863948937,1.0014071362861243,7.430370680850383E-2,0.52047054110454982,-131.03717164184576,48.962828358154241,null,1000000000,1640756289.0625,null,31.301747261098281,-44.240227608854411,null,13.223381857669743,-85.419136305179904,null,0,0]
[40738,40.738,56.900373169090919,1.5532208447886273,1.0095072973132819,0.137350496717218,1,0,1747.729323502517,1.5702241557835646,7.2404873228580122,1.4322411820959624,1.2431331309760669,0.63609939727369014,1.0276377061286068,0.23244711254815356,6.518670152587724,0.25661705056211465,1.0014232829362972,7.4728407218891874E-2,0.45282138363600855,-131.14150606629403,48.858493933705972,null,1000000000,1659584644,null,31.283373373070852,-44.351652902241341,null,13.174627685528467,-85.405017723177508,null,0,0]
[40975.25,40.975250000000003,57.231647557457855,1.5533225874725554,1.0096178279641941,0.13814028997232694,1,0,1757.9077477414685,1.5702274686991189,7.2818524254358215,1.43303328679994,1.2456929186680183,0.63887673079040352,1.0279561657223442,0.23375219572200626,6.5210925216890363,0.25804745756389269,1.0014399081891125,7.5163179447405498E-2,0.38384592778444016,-131.24810986116819,48.751890138831811,null,1000000000,1678971112.5625,null,31.264549650413311,-44.465587950788226,null,13.125011775875578,-85.390505943084023,null,0,0]
[41212.5,41.212499999999999,57.562922531443441,1.5534231590979681,1.0097289882497311,0.13892990982442899,1,0,1768.0861719994912,1.5702307434714418,7.3232220452494605,1.4338164426319786,1.2482622756616657,0.64164265213667215,1.0282763750880617,0.23505646829998642,6.5235280500295438,0.25947680639753817,1.00145662996313,7.5597944174880097E-2,0.31514986519368732,-131.35449855791427,48.645501442085731,null,1000000000,1698470156.25,null,31.245712286529567,-44.579379677280677,null,13.075691276558368,-85.375936571762551,null,0,0]
[41449.75,41.449750000000002,57.89419808099484,1.5535225797655043,1.0098407779619683,0.13971935534629529,1,0,1778.2645962762585,1.5702339807555055,7.3645961061740524,1.4345907994466338,1.2508411429880057,0.6443971894477174,1.028598332591613,0.2363599266037392,6.5259767228785241,0.26090509252461069,1.0014734482580063,7.6032701358162147E-2,0.24673017042548712,-131.46066637311162,48.539333626888379,null,1000000000,1718081775.0625,null,31.226861585288987,-44.693021145241737,null,13.026662847022788,-85.361310811548648,null,0,0]
[41687,41.686999999999998,58.225474196287941,1.5536208691184412,1.0099531968918951,0.14050862561197566,1,0,1788.4430205714498,1.5702371811913718,7.4059745337777469,1.4353565037921612,1.2534294619459638,0.6471403713186511,1.0289220365919816,0.23766256697056873,6.5284385254479096,0.262332311430577,1.0014903630733958,7.6467450954102872E-2,0.17858387914215473,-131.56660771246675,48.433392287533252,null,1000000000,1737805969,null,31.207997854583741,-44.806505633126918,null,12.97792320376754,-85.346629838499993,null,0,0]
[41929.75,41.929749999999999,58.564430628478853,1.5537202861086135,1.0100688729985532,0.14131601061349422,1,0,1798.8574041419643,1.5702404183336682,7.4483166521745137,1.4361311527351741,1.2560875059755552,0.64993542338379617,1.0292550507736928,0.2389945551304021,6.5309709725858216,0.26379150724678008,1.0015077699154995,7.6912271146145808E-2,0.10913775488062182,-131.67476496139244,48.325235038607559,null,1000000000,1758103935.0625,null,31.188683658238936,-44.922451679663894,null,12.928349203258696,-85.331552579048619,null,0,0]
[42172.5,42.172499999999999,58.90338763284349,1.5538185589181812,1.0101852073883086,0.14212321018185228,1,0,1809.271787731112,1.5702436182092128,7.4906631896328024,1.436897043576403,1.2587553214701761,0.65271864940703528,1.029589889868785,0.24032567928293358,6.5335171337501725,0.26524957630177665,1.0015252778043842,7.7357083303609117E-2,3.9971767527796388E-2,-131.78267384784996,48.217326152150036,null,1000000000,1778519756.25,null,31.169356484949752,-45.038219810952292,null,12.87907075635804,-85.3164199270675,null,42172.5,48.217326152150036]
[42415.25,42.41525,59.24234519956071,1.5539157071846619,1.010302199833762,0.14293022332939329,1,0,1819.6861713385736,1.5702467814578578,7.5330140716278784,1.4376543231247698,1.2614328464325548,0.6554900814383261,1.0299265520973668,0.24165593555594878,6.5360769929166658,0.26670651383773208,1.0015428867396736,7.7801887380288953E-2,-2.891707004532975E-2,-131.89032896164176,48.109671038358243,null,42415.25,1799053432.5625,null,31.150016675494129,-45.153803488448602,null,12.830084523007155,-85.301233061644822,null,0,0]
[42658,42.658000000000001,59.581303319032877,1.5540117500987876,1.010419850106332,0.1437370490698881,1,0,1830.1005549640356,1.5702499087048907,7.5753692252940024,1.4384031349458775,1.2641200191659976,0.65824975198128421,1.0302650356721896,0.24298532009456719,6.5386505339999594,0.26816231512320504,1.0015605967209893,7.8246683329986758E-2,-9.7531684870380345E-2,-131.99772507839546,48.002274921604538,null,42658,1819704964,null,31.130664573688215,-45.26919638459605,null,12.781387220181706,-85.285993136188267,null,0,0]
[42906.5,42.906500000000001,59.928290875359458,1.5541089426168144,1.0105409682962134,0.14456279088134608,1,0,1840.7616232869032,1.5702530733738471,7.6187319923927204,1.4391610594171931,1.2668807719200641,0.66106264234034906,1.0306134215773746,0.24434528670112102,6.5412991893690355,0.26965141800581921,1.0015788308614069,7.8702006659831042E-2,-0.16749052008838375,-132.10739154214031,47.892608457859694,null,42906.5,1840967742.25,null,31.110841709435256,-45.387118579316947,null,12.73183233668723,-85.270338441603442,null,0,0]
[43155,43.155000000000001,60.275278991273964,1.5542050161148322,1.0106627753575654,0.14538833421553993,1,0,1851.422691627994,1.5702562015965049,7.6620990865293326,1.4399104046864055,1.2696515050420512,0.66386327775858955,1.030963712321231,0.24570433166757699,6.5439621481903156,0.27113932022287618,1.0015971708906732,7.915732137517166E-2,-0.23716800897391574,-132.21677608958032,47.783223910419679,null,43155,1862354025,null,31.091006701161376,-45.504828081503177,null,12.682573448855859,-85.254630510229731,null,0,0]
[43403.5,43.403500000000001,60.622267657167534,1.5542999898061329,1.0107852710413461,0.1462136780191764,1,0,1862.0837599869949,1.5702592939988669,7.7054704346449414,1.4406513147726046,1.2724321533349225,0.6666516945011598,1.0313159059627992,0.24706245091529866,6.5466393930123443,0.27262601678492276,1.0016156168083745,7.9612627426466506E-2,-0.30656710614328853,-132.32587368890245,47.674126311097552,null,43403.5,1883863812.25,null,31.071159925616314,-45.622318753176344,null,12.633607212181335,-85.238870500418344,null,0,0]
[43652,43.652000000000001,60.969256863650017,1.5543938824667012,1.0109084550972258,0.1470388212405585,1,0,1872.7448283635999,1.570262351192681,7.7488459653092443,1.4413839305077107,1.2752226519379994,0.66942792927750228,1.0316700005532342,0.2484196403848635,6.549330906318656,0.27411150273168011,1.0016341686140953,8.0067924764179538E-2,-0.37569070700996515,-132.43467949096774,47.565320509032261,null,43652,1905497104,null,31.051301761600879,-45.739584663608461,null,12.584930339284242,-85.223059545373573,null,0,0]
[43906,43.905999999999999,61.323926460839814,1.5544887551518889,1.011035076692929,0.14788201880541235,1,0,1883.6418560179313,1.5702654402870508,7.7931857675031546,1.4421243327004851,1.2780850246539193,0.6722530591807957,1.0320338947346341,0.2498059031733996,6.5520967177199214,0.27562861040035574,1.0016532404520788,8.0533290048778919E-2,-0.44606245046727694,-132.5455870512439,47.454412948756101,null,43906,1927736836,null,31.030992707729709,-45.859207755061767,null,12.535471788399972,-85.206847154784995,null,0,0]
[44160,44.16,61.678596603647698,1.5545825367460055,1.011162416936181,0.14872500459414467,1,0,1894.5388836900304,1.570268493845653,7.8375297935456514,1.4428563570351312,1.2809575525890584,0.67506554082567927,1.0323997708005386,0.2511911860566568,6.5548773989865099,0.27714444288628542,1.001672422916263,8.0998646125184121E-2,-0.51615230213419094,-132.65618007277851,47.343819927221489,null,44160,1950105600,null,31.010672561288683,-45.978584134552314,null,12.486308783939435,-85.190583855570225,null,0,0]
[44414,44.414000000000001,62.03326728271508,1.5546752459620876,1.011290475555509,0.14956777748888878,1,0,1905.4359113795929,1.5702715124781659,7.8818779721456869,1.4435801441370109,1.2838401675780393,0.67786541476702,1.0327676266445951,0.25257548476217734,6.5576729312057536,0.27865899498727287,1.0016917160061964,8.1463992940516386E-2,-0.58596317234611339,-132.76645393681366,47.233546063186338,null,44414,1972603396,null,30.990341731602221,-46.097708103395114,null,12.437437992107698,-85.174270780926577,null,0,0]
[44668,44.667999999999999,62.387938488896197,1.5547669010877174,1.0114192522780459,0.15041033637355219,1,0,1916.3329390863203,1.5702744967803997,7.9262302336011361,1.4442958315189007,1.2867328018280184,0.68065272198759652,1.033137460152062,0.2539587950386597,6.5604832953963044,0.28017226153315095,1.001711119721425,8.1929330441903772E-2,-0.65549791349081776,-132.87640420279757,47.123595797202427,null,44668,1995230224,null,30.970000629043504,-46.216574164966019,null,12.38885613598441,-85.157909039573411,null,0,0]
[44928.25,44.928249999999998,62.751337378281093,1.5548597368800803,1.0115519422577413,0.15127340437512832,1,0,1927.4981023348269,1.5702775195163583,7.9716780035966615,1.4450208688053103,1.2897069347022942,0.68349562345976644,1.0335184429298623,0.255375113827705,6.5633781762295476,0.28172142520222226,1.001731115631703,8.2406108461265976E-2,-0.72646016632161592,-132.98871983676145,47.011280163238553,null,44928.25,2018547648.0625,null,30.949148782037781,-46.338092034543884,null,12.33937517954891,-85.141095352995308,null,0,0]
[45188.5,45.188499999999998,63.114736802259564,1.5549515036210471,1.0116853855307171,0.15213624533858089,1,0,1938.6632656007421,1.570280507435192,8.017129916624171,1.4457376854851496,1.292691443090086,0.68632542058640367,1.033901497372864,0.25679038597836473,6.5662885873714139,0.28326922838655899,1.0017512276774421,8.2882876590324783E-2,-0.79713841668648522,-133.1006868656691,46.899313134330896,null,45188.5,2042000532.25,null,30.928287024858054,-46.459328091616285,null,12.290190765579483,-85.124232855937692,null,0,0]
[45448.75,45.448749999999997,63.478136751650311,1.5550422196693907,1.0118195817989304,0.15299885806923283,1,0,1949.8284288837669,1.5702834611350134,8.0625859026160516,1.4464464198561484,1.2956862552939288,0.68914215875759333,1.0342866211793047,0.25820460698712044,6.5692145081840438,0.28481566562976923,1.0017714558581452,8.3359634772230823E-2,-0.86753555351318634,-133.21230106305131,46.787698936948686,null,45448.75,2065588876.5625,null,30.907415800646621,-46.580277047236692,null,12.241299546701045,-85.10732266547349,null,0,0]
[45709,45.709000000000003,63.84153721748104,1.5551319029659452,1.0119545307628151,0.15386124137439766,1,0,1960.9935921836088,1.5702863812003129,8.1080458930697468,1.4471472071473157,1.2986913000313098,0.6919458837743454,1.0346738120384245,0.25961777237395928,6.5721559179564446,0.28636073151093833,1.001791800173313,8.383638295014223E-2,-0.93765440848218384,-133.32355837765346,46.676441622346545,null,45709,2089312681,null,30.886535552596929,-46.700933811046966,null,12.192698232711116,-85.090365874615898,null,0,0]
[45975.25,45.975250000000003,64.213316317327624,1.555222603430751,1.012093369553553,0.15474326805329716,1,0,1972.4161656054516,1.5702893343760156,8.154558026637849,1.4478560647860867,1.3017761405574333,0.69480082952584987,1.0350720661540325,0.26106242088745041,6.5751811482545772,0.28793999374072171,1.0018127337026659,8.4324112028633297E-2,-1.0091047515457097,-133.43700733687564,46.562992663124362,null,45975.25,2113723612.5625,null,30.865165039199873,-46.824064807014402,null,12.143273062366928,-85.07297104005373,null,0,0]
[46241.5,46.241500000000002,64.585095939348093,1.5553122596744267,1.0122329955072922,0.15562505208707586,1,0,1983.8387390442983,1.5702922535440487,8.2010742112225259,1.4485568815459309,1.3048715412718572,0.69764225340909913,1.0354724788103911,0.26250595513321323,6.5782225458483001,0.28951780928227239,1.0018337887820481,8.4811830516200129E-2,-1.0802696523716593,-133.55007473001595,46.44992526998405,null,46241.5,2138276322.25,null,30.843786018624403,-46.946879816929489,null,12.094144529331615,-85.055529671753959,null,0,0]
[46507.75,46.507750000000001,64.956876074576513,1.5554008896252911,1.0123734082983376,0.15650659220516505,1,0,1995.261312499857,1.5702951392884783,8.2475943782809473,1.4492497927951484,1.3079774272007794,0.70047020570584162,1.035875047504379,0.26394837039084623,6.5812800883275369,0.29109417244656194,1.0018549654109159,8.5299538352003143E-2,-1.1511519669417576,-133.66275675646966,46.337243243530338,null,46507.75,2162970810.0625,null,30.822398964034377,-47.069373999156412,null,12.045309287975181,-85.038042866245945,null,0,0]
[46774,46.774000000000001,65.328656714250968,1.5554885108036134,1.0125146075993394,0.15738788713921509,1,0,2006.6838859718421,1.5702979921800726,8.2941184608022507,1.4499349308955187,1.3110937238280647,0.7032847370840758,1.0362797697232966,0.2653896619658882,6.5843537532049874,0.29266907758358901,1.0018762635887219,8.5787235475211318E-2,-1.2217544950482997,-133.77504978650529,46.224950213494708,null,46774,2187807076,null,30.801004347639175,-47.191542705688889,null,11.996764049789379,-85.02051169655293,null,0,0]
[47046.25,47.046250000000001,65.708816021890939,1.5555770812533363,1.012659801809568,0.15828878738752394,1,0,2018.3638695669333,1.5703008759715886,8.3416949539098315,1.450627605685523,1.3142909349582903,0.70614886970588286,1.0366958366821273,0.26686226653594181,6.587513331736317,0.29427796001231282,1.00189816741339,8.628591181532845E-2,-1.2936616105869572,-133.88946751161478,46.110532488385218,null,47046.25,2213349639.0625,null,30.779120270432006,-47.316123304067027,null,11.947421346571286,-85.002540677132458,null,0,0]
[47318.5,47.3185,66.088975839068311,1.555664632746325,1.0128058176799781,0.15918942860167212,1,0,2030.0438531786167,1.570303726578957,8.3892754039525848,1.451312423679463,1.3174988751742804,0.70899907802531492,1.0371141499758056,0.26833368636364074,6.5906897196984033,0.2958853061363001,1.0019201983258188,8.678457682597622E-2,-1.3652819349362839,-134.00347136038067,45.996528639619328,null,47318.5,2239040442.25,null,30.757229281354309,-47.440354358629406,null,11.898375087346961,-84.984525468224916,null,0,0]
[47590.75,47.59075,66.469136157040396,1.5557511827645392,1.0129526548552452,0.16008980943287676,1,0,2041.7238368066073,1.5703065445716822,8.4368597439840016,1.4519895171677661,1.3207174662952004,0.71183541736611367,1.0375347068872993,0.26980391651437341,6.5938828928034647,0.29749111004171624,1.0019423563254133,8.7283230442145657E-2,-1.4366182889559083,-134.11705797465893,45.882942025341066,null,47590.75,2264879485.5625,null,30.735331880756927,-47.564231492139925,null,11.849621933192111,-84.966467145027678,null,0,0]
[47863,47.863,66.849296967263385,1.5558367483923312,1.0131003129782536,0.16098992853482355,1,0,2053.4038204506264,1.5703093305063107,8.4844479085540261,1.4526590155015575,1.3239466306421477,0.71465794340752864,1.0379575046894187,0.27127295208207691,6.5970928266825215,0.29909536585753521,1.0019646414115753,8.778187259883731E-2,-1.5076734384825983,-134.23022416223668,45.769775837763319,null,47863,2290866769,null,30.713428567036125,-47.687750515398832,null,11.801158602139628,-84.94836675981594,null,0,0]
[48141.75,48.141750000000002,67.238534661767304,1.5559233544207483,1.0132523466631205,0.16191126550316126,1,0,2065.3626650611491,1.5703121503081285,8.5331761417871768,1.4533367609472203,1.3272637659575277,0.71753360415939316,1.0383927157604695,0.27277581824429858,6.6003967383664675,0.30073631340669432,1.0019875902301976,8.829240795324618E-2,-1.5801365147890807,-134.34565343779863,45.654346562201368,null,48141.75,2317628093.0625,null,30.690996700845162,-47.813843349058715,null,11.751835119514624,-84.929791721008101,null,0,0]
[48420.5,48.420499999999997,67.627772854795424,1.5560089635110415,1.0134052402007092,0.16283232524695834,1,0,2077.3215096879039,1.5703149376435501,8.5819082501275883,1.4540068095834262,1.3305918222035815,0.72039490335535183,1.0388302701840653,0.27427742178378645,6.6037181687490145,0.30237562574343335,1.0020106722749622,8.8802931156575921E-2,-1.6523104965716318,-134.46063571075666,45.539364289243338,null,48420.5,2344544820.25,null,30.668559686111486,-47.939552460687622,null,11.702808678485439,-84.911174749443916,null,0,0]
[48699.25,48.699249999999999,68.017011537789074,1.5560935927773782,1.0135589932018985,0.16375310632926246,1,0,2089.2803543306136,1.5703176930700788,8.630644167933994,1.4546692911914556,1.3339307176396233,0.72324190181222059,1.0392701650004048,0.27577775752793304,6.6070570914145383,0.30401329670576921,1.0020338875452162,8.9313442139090857E-2,-1.724198182856544,-134.57516806389893,45.424831936101072,null,48699.25,2371616950.5625,null,30.646118050154314,-48.064873930855384,null,11.654075933612242,-84.892516904028639,null,0,0]
[48978,48.978000000000002,68.406250702384412,1.5561772589444578,1.0137136052756159,0.1646736073158806,1,0,2101.2391989890052,1.5703204171325271,8.679383831034384,1.4553243326643177,1.3372803710764238,0.72607466066773507,1.0397123972388784,0.27727682033569218,6.6104134798618102,0.30564932017888008,1.0020572360403028,8.9823940831066013E-2,-1.7958023185234129,-134.68924774158083,45.310752258419171,null,48978,2398844484,null,30.623672317330364,-48.189804023277809,null,11.605633596546554,-84.873819221195262,null,0,0]
[49263.25,49.263249999999999,68.804566785980455,1.5562618960752352,1.0138727115976123,0.16561528143721058,1,0,2113.4769046150295,1.5703231728015272,8.7292638362574149,1.4559870756909592,1.3407191861121726,0.72895879745100256,1.0401673583237452,0.27880951573094936,6.6138661875727722,0.30732178118589543,1.0020812669048482,9.0346330731907523E-2,-1.8687854098729844,-134.80551623061655,45.194483769383453,null,49263.25,2426867800.5625,null,30.600699488737405,-48.317238398518228,null,11.556358934730401,-84.854645355306573,null,0,0]
[49548.5,49.548499999999997,69.202883356780362,1.5563455589011999,1.014032716688793,0.16655665921795562,1,0,2125.7146102569181,1.5703258967418412,8.7791476320509059,1.4566422874884062,1.3441690964616333,0.73182815329562756,1.0406247607831884,0.28034086734067554,6.6173371286892717,0.308992504169669,1.0021054372784397,9.0868707614637945E-2,-1.941477220979585,-134.92130534544918,45.078694654550816,null,49548.5,2455053852.25,null,30.577723470731502,-48.444255578084331,null,11.507381592579272,-84.835431899046085,null,0,0]
[49833.75,49.833750000000002,69.601200406419551,1.5564282641485638,1.0141936201237729,0.1674977391302864,1,0,2137.9523159143987,1.5703285894983166,8.8290351541650143,1.4572900951524916,1.3476300169133546,0.73468279465148001,1.0410846013993411,0.28187086975865022,6.62082627454022,0.31066148273107852,1.0021297471603614,9.1391071404575336E-2,-2.0138805266188413,-135.03661262724992,44.963387372750077,null,49833.75,2483402639.0625,null,30.554744814464794,-48.570852118435823,null,11.458698223633924,-84.816179894014425,null,0,0]
[50119,50.119,69.999517926723868,1.5565100281628841,1.0143554214750492,0.16843851964945072,1,0,2150.1900215872047,1.5703312516033976,8.8789263397891371,1.4579306229475926,1.3511018628584235,0.73752278824793305,1.0415468769428811,0.28339951761344145,6.624333596364723,0.31232871052279743,1.0021541965498935,9.1913422027049704E-2,-2.0859980484142793,-135.15143577371299,44.84856422628701,null,50119,2511914161,null,30.531764067127291,-48.697024753566573,null,11.410305538534605,-84.796890359826548,null,0,0]
[50410.75,50.41075,70.40691239843234,1.5565926983361482,1.0145218381912815,0.16940042647119077,1,0,2162.7065882286984,1.5703339432052428,8.9299581229842193,1.4585783425138017,1.3546640360696809,0.74041241445644534,1.0420222017814806,0.28496159203442389,6.627939611519742,0.31403211185443769,1.002179347379893,9.2447661769497549E-2,-2.1594660705285387,-135.26837234879059,44.731627651209408,null,50410.75,2541243715.5625,null,30.508258059768934,-48.825630759805719,null,11.361107452965122,-84.777123493143478,null,0,0]
[50702.5,50.702500000000001,70.814307345790283,1.5566744173063982,1.0146891933003777,0.17036201688323924,1,0,2175.2231548856798,1.5703366038313109,8.980993610082221,1.4592187008703279,1.3582374612575692,0.74328685976347764,1.0425000669117521,0.28652223820141831,6.631564579297117,0.31573366845243467,1.0022046441463344,9.2981887579585754E-2,-2.2326407310763963,-135.38479808197917,44.61520191802083,null,50702.5,2570743506.25,null,30.484751009490875,-48.95378695592597,null,11.312206666767855,-84.757319457216724,null,0,0]
[50994.25,50.994250000000001,71.221702760635452,1.5567552013954684,1.0148574863381001,0.17132328926428975,1,0,2187.7397215578835,1.5703392340132607,9.0320327382964471,1.4598518222799139,1.3618220498464284,0.74614619635984381,1.0429804688420188,0.28808145048055755,6.6352084686398483,0.31743337369380142,1.0022300868484335,9.3516099377462136E-2,-2.3055247787475777,-135.50071098705729,44.499289012942711,null,50994.25,2600413533.0625,null,30.461243487931821,-49.081490388887389,null,11.263599837591446,-84.737479275537311,null,0,0]
[51286,51.286000000000001,{"$f":"SQRT(1+(A461/pole1)^2)","v":71.629098634991209},{"$f":"ATAN(A461/pole1)","v":1.5568350665539157},{"$f":"SQRT(1+(A461/Zero1)^2)","v":1.015026716837919},{"$f":"ATAN(A461/Zero1)","v":0.17228424199645898},{"$f":"IF(VIN_nom>Vout, 1, SQRT(1+(A461/z_RHP)^2))","v":1},{"$f":"IF(VIN_nom>Vout, 0, -ATAN(A461/z_RHP))","v":0},{"$f":"SQRT(1+(A461/Pole2)^2)","v":2200.2562882450497},{"$f":"ATAN(A461/Pole2)","v":1.570341834270653},9.0830754462470065,1.4604778282356123,{"$f":"SQRT(1+(A461/pole4)^2)","v":1.3654177139154751},{"$f":"ATAN(A461/pole4)","v":0.74899049666768214},{"$f":"IF(VOUT_setting=1,1,SQRT(1+(A461*zterm1)^2))","v":1.0434634040685153},{"$f":"IF(VOUT_setting=1,0,ATAN(((A461*zterm1))))","v":0.28963922327620983},6.6388712483971908,{"$f":"IF(VOUT_setting=1,0,ATAN(A461*$Q$4/(1+Afbr-$Q$5*(A461)^2)))","v":0.31913122101226371},{"$f":"SQRT((1-(Z461/pterm2))^2+(A461/pterm1)^2)","v":1.0022556754854033},{"$f":"IF((ATAN((A461/pterm1)/(1-A461^2/pterm2))>0),ATAN((A461/pterm1)/(1-A461^2/pterm2)),PI()+ATAN((A461/pterm1)/(1-A461^2/pterm2)))","v":9.4050297083287826E-2},{"$f":"20*LOG10(((E461*K461*G461*O461)/(C461*I461*S461*M461*Q461))*Adc)","v":-2.3781209101748217},{"$f":"((F461+L461+H461+P461)-(D461+J461+T461+N461+R461))*radconv","v":-135.61610922864674},{"$f":"IF(V461>0,V461,V461+180)","v":44.383890771353265},null,{"$f":"IF(U461<0,A461,1000000000)","v":51286},{"$f":"A461^2","v":2630253796},null,{"$f":"20*LOG10((K461/(I461*M461))*AEA)","v":30.437736061786737},{"$f":"(L461-(J461+N461))*radconv","v":-49.208738276902352},null,{"$f":"20*LOG10((E461*G461/(C461*S461))*Acs*Am)","v":11.21528368007446},{"$f":"(F461+H461-(D461+T461))*radconv","v":-84.717603950128293},null,{"$f":"SUM((U462<0)*(U461>0))*A461","v":0},0]
[51584.75,{"$f":"A462/1000","v":51.58475},72.046269685595774,1.5569159119438303,1.01520097869083,0.17326791807535893,1,0,2213.0731667445771,1.5703444664366146,9.1353464762033791,1.4611116045353614,1.3691110353923854,0.75188753479034587,1.0439605479553593,0.2912328744309276,6.6426414528360098,0.32086787290420354,1.0022820293024484,9.4597297185371257E-2,-2.4521632535623188,-135.73374113902679,44.26625886097321,null,51584.75,2660986432.5625,null,30.413665304057879,-49.33856443943737,null,11.166106109256352,-84.697216359253844,null,0,0]
[51883.5,51.883499999999998,72.463441201671259,1.556995826481592,1.0153762225333853,0.17425125556005586,1,0,2225.8900452592602,1.5703470682900713,9.1876211338226828,1.4617381691111195,1.3728157857016914,0.75476896079979072,1.0444603406859312,0.29282500444551907,{"$f":"IF(VOUT_setting=1,1,SQRT((1+Afbr-$Q$5*(A463)^2)^2+(A463*$Q$4)^2))","v":6.6464313986380628},0.32260256289558925,1.0023085361395612,9.5144282341669481E-2,-2.5259092607622504,-135.85082996185491,44.149170038145087,null,51883.5,2691897572.25,null,30.389595832639714,-49.467907558344216,null,11.11722653079566,-84.676793978168035,null,0,0]
[52182.25,52.182250000000003,72.880613175224539,1.557074826150892,1.015552447857228,0.1752342527246461,1,0,2238.7069237888395,1.5703496403516517,9.2398993575344956,1.4623576438758714,1.3765318725659024,0.75763485309558209,1.0449627784595032,0.29441560743671169,6.6502410520580986,0.3243352841209291,1.0023351959958817,9.56912524665023E-2,-2.5993616666613328,-135.96737418732468,44.03262581267532,null,52182.25,2722987215.0625,null,30.365528239093464,-49.596765170317433,null,11.068641594559924,-84.656337816646811,null,0,0]
[52481,52.481000000000002,73.297785598444463,1.5571529265715855,1.015729654151508,0.1762169078470513,1,0,2251.5238023330603,1.5703521831301301,9.2921810871498352,1.4629701480209132,1.3802592044204316,0.76048529025495915,1.04546785746256,0.29600467756342014,6.6540703792528779,0.32606602977705756,1.0023620088705452,9.6238207474204626E-2,-2.6725231549301358,-136.08337245116084,43.916627548839159,null,52481,2754255361,null,30.341463109042071,-49.725134977493553,null,11.020348007565065,-84.635848863401478,null,0,0]
[52786.5,52.786499999999997,73.724384131809003,1.5572318775540019,1.0159118782022387,0.17722140970709924,1,0,2264.6302672693137,1.5703547535955311,9.3456476419134518,1.4635894039469564,1.3840822864485058,0.76338422976169862,1.0459870757238852,0.29762806011845555,6.6580065370117998,0.32783383009567985,1.0023895858015843,9.6797504738591916E-2,-2.7470395568541277,-136.20142571798371,43.79857428201629,null,52786.5,2786414582.25,null,30.316857399484682,-49.855898502261006,null,10.971261193622508,-84.614864077107185,null,0,0]
[53092,53.091999999999999,74.150983119429014,1.5573099201090477,1.0160951269641492,0.17822555026412173,1,0,2277.7367322203577,1.5703572944791864,9.3991177397524179,1.4642016144070322,1.3879169359603458,0.7662671745344658,1.0465090478095966,0.29924982754007962,6.6619631957255931,0.32959955037452132,1.0024173227418725,9.7356786013879301E-2,-2.821257264652175,-136.31890563341369,43.681094366586308,null,53092,2818760464,null,30.292255485174007,-49.98614757683228,null,10.922472255848385,-84.593847026789078,null,0,0]
[53397.5,53.397500000000001,74.577582553509203,1.5573870698249499,1.0162793998829323,0.17922932768916577,1,0,2290.8431971859386,1.5703598062888284,9.4525913205408134,1.464806898507498,1.3917630573421667,0.76913420905654628,1.0470337696011471,0.3008699737193275,6.6659403188953066,0.33136318354085498,1.0024452196904694,9.7916051208512503E-2,-2.8951789908572638,-136.43581118025156,43.564188819748438,null,53397.5,2851293006.25,null,30.267657972438094,-50.11588024654241,null,10.873977850038797,-84.572798705132357,null,0,0]
[53703,53.703000000000003,75.004182426431598,1.5574633419353356,1.0164646964015853,0.18023274015752799,1,0,2303.9496621658086,1.5703622895206368,9.5060683255017242,1.4654053726951115,1.395620555749701,0.77198541792758824,1.0475612369665661,0.30248849259348654,6.669937869920493,0.33312472259000464,1.0024732766464286,9.8475300230954188E-2,-2.9688073978932321,-136.55214148037643,43.447858519623566,null,53703,2884012209,null,30.243065460719642,-50.245094715115414,null,10.825774688984195,-84.551720084262712,null,0,0]
[54015.75,54.015749999999997,75.440906638406616,1.5575405305540597,1.0166554500420075,0.18125958524514627,1,0,2317.3671643815169,1.5703648025865597,9.5608179117265344,1.4660111142430234,1.3995812857210439,0.77488798548336468,1.0481040617241724,0.30414372951758462,6.6740514116452143,0.33492588926341577,1.0025021651857644,9.9047804272553497E-2,-3.04388200934065,-136.6706358215333,43.329364178466705,null,54015.75,2917701248.0625,null,30.217895128655712,-50.376837139863483,null,10.77672591111808,-84.530110841920916,null,0,0]
[54328.5,54.328499999999998,75.877631294690673,1.5576168306327671,1.0168472752521021,0.18228604399219908,1,0,2330.7846666116925,1.570367286718821,{"$f":"SQRT(1+(A471/Zero2)^2)","v":9.6155709660839328},{"$f":"ATAN(A471/Zero2)","v":1.4666099575727001},1.4035537404161746,0.77777414706345072,1.0486497551094964,0.3057972482730979,6.6781862843545117,0.33672484660875329,1.0025312214150113,9.9620291171180653E-2,-3.1186547063366437,-136.78852585304318,43.211474146956817,null,54328.5,2951585912.25,null,30.192731286738443,-50.508033152459419,null,10.7279755709699,-84.508471843450067,null,0,0]
[54641.25,54.641249999999999,76.31435638765582,1.5576922574251375,1.0170401714255384,0.18331211445491569,1,0,2344.2021688560858,1.5703697424142427,9.6703274296645816,1.467202019430649,1.4075378205640148,0.78064399369408255,1.0491983126465747,0.30744904250613719,6.6823424484586402,0.33852158733208654,1.0025604453331365,0.10019276082868112,-3.1931281910030411,-136.90581105556603,43.094188944433967,null,54641.25,2985666201.5625,null,30.16757455522378,-50.638681307706058,null,10.679520318981302,-84.486804068567736,null,0,0]
[54954,54.954000000000001,76.751081909847713,1.557766825837708,1.0172341379530625,0.18433779469426576,1,0,2357.6196711144548,1.5703721701583377,9.7250872448822605,1.4677874139531473,1.4115334277253786,0.78349761645029115,1.0497497298453311,0.30909910591370121,6.6865198642626966,0.34031610421403524,1.0025898369391024,0.10076521314691934,-3.2673051162172833,-137.02249104266008,42.977508957339921,null,54954,3019942116,null,30.142425546524663,-50.768780312109108,null,10.631356862688211,-84.465108476831034,null,0,0]
[55274,55.274000000000001,77.197931801677129,1.5578422495906521,1.0174337081285789,0.18538684577913575,1,0,2371.3482106096581,1.570374625745188,9.7811198826491292,1.468379594194015,1.4156334879968098,0.78640069298670801,1.0503168848657334,0.31078562219564104,6.6908160735085884,0.34214991138935963,1.0026200834479346,0.10135091769353441,-3.3428973361308283,-137.14124915036237,42.85875084963763,null,55274,3055215076,null,30.116702171136748,-50.901325611650684,null,10.582375552242873,-84.442882138430363,null,0,{"$f":"IF(AH474>0,W474,0)","v":0}]
[55594,55.594000000000001,77.64478212761091,1.5579168052076737,1.0176343975583233,0.18643548424732528,1,0,2385.0767501189957,1.5703770530632448,9.8371559113584564,1.4689650280888724,1.4197454100519971,0.78928697772409195,1.0508870241119272,0.3124703132888883,6.6951344467584208,0.34398137537206491,1.0026505055069983,0.10193660387987424,-3.4181845547300056,-137.25937324558467,42.740626754415331,null,55594,3090692836,null,30.090988152554509,-51.033293729447557,null,10.53369292661943,-84.420628648733327,null,0,0]
[55914,55.914000000000001,78.091632880197082,1.5579905075907059,1.0178362055802366,0.1874837080373343,1,0,2398.805289642225,1.5703794525978612,9.8931952733903472,1.4695438298756927,1.4238690911257454,0.79215656825749436,1.051460142729451,0.31415317260736719,6.6994749411607817,0.34581048867089254,1.002681103115163,0.10252227160088159,-3.4931694622558522,-137.37686331661729,42.623136683382711,null,55914,3126375396,null,30.065284120992871,-51.164683739739239,null,10.485305636287903,-84.398348973653711,null,0,0]
[56234,56.234000000000002,78.538484052153208,1.5580633713025762,1.0180391315290964,0.188531515092938,1,0,2412.533829179109,1.5703818248233428,9.9492379124197043,1.4701161112365084,1.4280044293476974,0.79500956215604823,1.0520362358490818,0.31583419362081661,6.7038375137560182,0.34763724387598521,1.0027118762712914,0.10310792075152037,-3.5678547006560093,-137.4937194778125,42.506280522187495,null,56234,3162262756,null,30.039590697904963,-51.295494861091825,null,10.437210388788596,-84.376044059374948,null,0,0]
[56561.5,56.561500000000002,78.995808725254292,1.5581370892224311,1.0182479703935128,0.18960344648656918,1,0,2426.5841313752858,1.5703842248548177,10.006597386450419,1.4706951679254499,1.4322486543614499,0.79791234019887503,1.0526289059461813,0.31755270337055047,6.7083251496487399,0.3495043643660688,1.0027435524398609,0.1037072767162089,-3.6439827952822013,-137.61265833227927,42.387341667720733,null,56561.5,3199203282.25,null,30.013306708834367,-51.428771799260382,null,10.388286921890026,-84.353191207451005,null,0,0]
[56889,56.889000000000003,79.453133822702924,1.5582099585152356,1.0184579787818213,0.1906749370415006,1,0,2440.6344335852782,1.5703865972531763,10.063960177512344,1.4712676237633249,1.4365048763028616,0.80079794114758029,1.0532246812427046,0.31926927397373805,6.7128358193893156,0.35136899948774136,1.0027754124792063,0.10430661300729749,-3.7198024592230521,-137.73093384142086,42.269066158579136,null,56889,3236358321,null,29.98703512024937,-51.561441180077132,null,10.339662547268683,-84.330313863761361,null,0,0]
[57216.5,57.216500000000003,79.910459337213481,1.5582819937502219,1.0186691559706964,0.19174598457080608,1,0,2454.6847358088503,1.570388942492924,10.121326229207483,1.4718335906094044,1.4407729888507028,0.80366646938910113,1.0538235564721126,0.32098389861170962,6.7173694765855503,0.35323114156205754,1.0028074563880873,0.10490592951226034,-3.7953163759200552,-137.84854650861118,42.151453491388821,null,57216.5,3273727872.25,null,29.960776569712944,-51.693502602596077,null,10.291333912831355,-84.307412981915931,null,0,0]
[57544,57.543999999999997,80.367785261666228,1.5583532091650372,1.0188815012333876,0.19281658689343328,1,0,2468.7350380457697,1.5703912610377637,10.178695486406081,1.4723931778179544,1.4450528866445851,0.80651802920271198,1.0544255263524585,0.32269657052701428,6.7219260747343075,0.35509078299893598,1.0028396841652578,0.10550522611859552,-3.8705271813983924,-137.96549695621277,42.034503043787225,null,57544,3311311936,null,29.934531685126387,-51.8249558026098,null,10.243297723587739,-84.284489496191014,null,0,0]
[57879,57.878999999999998,80.835584715770878,1.5584252217754313,1.0190999171082524,0.19391124394213133,1,0,2483.1071029429095,1.5703936055325534,10.237381803663689,1.4729590909922727,1.4494428817003389,0.80941744473038346,1.0550444780473791,0.32444643664304218,6.7266107088808402,0.35699041663166597,1.0028728402144105,0.10611822637004856,-3.9471494685478743,-138.08444128594283,41.91555871405717,null,57879,3349978641,null,29.907700556093374,-51.95878996875026,null,10.194460660090201,-84.261018613155571,null,0,0]
[58214,58.213999999999999,81.303384584250054,1.5584964057001571,1.0193195536199218,0.19500543056198069,1,0,2497.4791678535412,1.5703959230439497,10.296071362146026,1.4735185527193291,1.4538449880116884,0.81229932604620814,1.0556666565276136,0.32619424546774767,6.7313192479657022,0.35888741800132667,1.0029061886470687,0.10673120556300458,-4.02346003563148,-138.2026943973803,41.797305602619701,null,58214,3388869796,null,29.880885024208052,-52.091987593219365,null,10.145922792748721,-84.237525996953352,null,0,0]
[58549,58.548999999999999,81.771184859992061,1.5585667751608332,1.0195404099795216,0.19609914443784329,1,0,2511.8512327774324,1.5703982140351254,10.354764106740479,1.4740716723499296,1.4582590958964112,0.81516378429041214,1.0562920560912266,0.32793998996742252,6.7360516418696976,0.36078177927208804,1.002939729461876,0.1073441635771326,-4.099461558246583,-138.32025731422286,41.679742685777143,null,58549,3427985401,null,29.854085730196303,-52.224548805081199,null,10.097680772087095,-84.21401258817626,null,0,0]
[58884,58.884,82.238985536047011,1.558636344055524,1.0197624853944811,0.197192383261105,1,0,2526.2232977143576,1.5704004789587134,10.413459983573981,1.4746185567851646,1.4626850966990537,0.81801093040714812,1.0569206710202936,0.32968366317529368,6.740807840360822,0.36267349270480681,1.002973462657468,0.10795710029212829,-4.1751566655189389,-138.4371311714828,41.562868828517196,null,58884,3467325456,null,29.827303304275866,-52.356473861920151,null,10.049731305645174,-84.190479308505672,null,0,0]
[59227,59.226999999999997,82.717957979203788,1.5587067590099302,1.0199911263419579,0.19831123467114753,1,0,2540.9385761555877,1.5704027714231932,10.473560743323608,1.4751721499643249,1.4672290029643318,0.82090824651290517,1.0575676231206184,0.33146682305693681,6.745702231211661,0.36460762996169715,1.0030082007473697,0.10858465210803891,-4.2523446366040734,-138.55608340508562,41.443916594914384,null,59227,3507837529,null,29.799899422332636,-52.490890642655152,null,10.000936514553286,-84.166364394959942,null,0,0]
[59570,59.57,83.196930827775788,1.5587763631931519,1.0202210435701318,0.19942958319146958,1,0,2555.6538546100173,1.5704050374879688,10.533664676229316,1.4757194258259432,1.4717851496853072,0.82378764845287622,1.0582179338076481,0.33324779697165224,6.7506214702303478,0.36653897529633295,1.0030431405131843,0.10921218134023582,-4.3292168171776675,-138.67431602269318,41.325683977306824,null,59570,3548584900,null,29.772514527272428,-52.624641460337735,null,9.9524416092518688,-84.142230547154242,null,0,0]
[59913,59.912999999999997,83.675904074801025,1.5588451705274315,1.0204522362163297,0.200547426365493,1,0,2570.3691330774204,1.5704072776064522,10.593771728282249,1.4762604915691531,1.4763534235368585,0.8266492545549291,1.0588715968933102,0.33502657765941524,6.7555655031461974,0.36846752071569921,1.003078281953423,0.10983968785967659,-4.4057758859427363,-138.79183057696002,41.208169423039976,null,59913,3589567569,null,29.745149261558666,-52.757726978575995,null,9.9042432331608339,-84.118078696132258,null,0,0]
[60256,60.256,84.154877713476068,1.5589131946180834,1.0206847034138773,0.20166476174391076,1,0,2585.0844115575751,1.5704094922217318,10.653881846689609,1.476795451988514,1.4809337122923869,0.82949318285468521,1.0595286061729419,0.33680315793358662,6.7605342755741518,0.3703932583322454,1.0031136250665875,0.11046717153734871,-4.4820244758636338,-138.90862872424117,41.091371275758831,null,60256,3630785536,null,29.717804256296173,-52.890147981413982,null,9.8563380868469341,-84.093909754364176,null,0,0]
[60607,60.606999999999999,84.645023147493347,1.5589820082890515,1.0209239111672266,0.2028076291758121,1,0,2600.1429035429528,1.5704117325392157,10.715397070993387,1.477336675916946,1.4856331525165358,0.83238526358958564,1.0602043969657871,0.33861888906696647,6.7656444926437231,0.37236099619447494,1.0031500012907442,0.11110926662116005,-4.5597327333201214,-139.02741119326129,40.972588806738713,null,60607,3673208449,null,29.689843088018822,-53.024970515554877,null,9.8076158039208519,-84.069160345212765,null,0,0]
[60958,60.957999999999998,85.135168977716745,1.5590500296030956,1.0211644517704761,0.2039499596824319,1,0,2615.2013955412312,1.5704139470569254,10.776915398253768,1.4778717210172034,1.4903449403456226,0.83525908136684734,1.0608836786649605,0.34043230095455151,6.7707805011253326,0.37432577737532224,1.003186588701819,0.11175133751201637,-4.6371212973976643,-139.14544727076679,40.854552729233205,null,60958,3715877764,null,29.661904437345527,-53.159099201859433,null,9.7591937755044054,-84.044394914752033,null,0,0]
[61309,61.308999999999997,85.625315197342232,1.5591172721666811,1.0214063242819695,0.20509175066286681,1,0,2630.2598875521876,1.5704161362179794,10.838436775634159,1.4784006921975181,1.4950689590372885,0.83811476161118514,1.0615664445691138,0.34224338613330907,6.7759422423829134,0.37628759376390114,1.0032233872981799,0.11239338407176468,-4.7141928488061549,-139.2627390412334,40.737260958766598,null,61309,3758793481,null,29.633988944070207,-53.292535241224336,null,9.7110686433739382,-84.019614383680249,null,0,0]
[61660,61.66,86.115461799720691,1.5591837492765241,1.0216495277557307,0.20623299952429688,1,0,2645.3183795756058,1.5704183004554064,10.899961151488252,1.4789236920112943,1.4998050930188731,0.84095242935245462,1.0622526879597993,0.3440521372203979,6.7811296576656019,0.37824643736395774,1.0032603970781866,0.11303540616228572,-4.7909500233135214,-139.37928868462146,40.620711315378543,null,61660,3801955600,null,29.606097235842142,-53.425279946266109,null,9.6632371064572258,-83.994819654487131,null,0,0]
[62019,62.018999999999998,86.616780223797306,1.5592509632560434,1.0218996501490547,0.20739969626797872,1,0,2660.7200851051057,1.5704204886790645,10.962890841464912,1.4794525394745892,1.5046615864632509,0.84383627017549923,1.0629581624833637,0.3458996912963464,6.7864618017197724,0.3802468435628486,1.003298468842674,0.113692035778862,-4.8691341440483384,-139.49772940626551,40.502270593734494,null,62019,3846356361,null,29.577595065122392,-53.560336502695655,null,9.6146157187878618,-83.969446038157358,null,0,0]
[62378,62.378,87.118099034680611,1.5593174036737032,1.0221511628512043,0.20856582043852356,1,0,2676.1217906471998,1.5704226517152471,11.025823562539038,1.4799753500171471,1.5095305129043706,0.8467015312880658,1.0636672605476925,0.34774478830473704,6.7918206787861193,0.38224412336259705,1.0033367615236153,0.11434863950593474,-4.9469948326568876,-139.6153986868174,40.3846013131826,null,62378,3891014884,null,29.549119065669668,-53.694672967072862,null,9.5662946543418048,-83.944059422662761,null,0,0]
[62737,62.737000000000002,87.619418225731238,1.5593830838068388,1.0224040648361259,0.20973136928817016,1,0,2691.5234962016712,1.5704247899963444,11.088759263102913,1.480492226140701,1.5144117524237011,0.84954834507477306,1.0643799749106935,0.34958742060607845,6.7972062256491039,0.38423826857792759,1.0033752751192244,0.11500521719583424,-5.0245347711128261,-139.73229914165299,40.267700858347013,null,62737,3935931169,null,29.520669870226428,-53.828291076335105,null,9.5182705583412677,-83.918660717712868,null,0,0]
[63096,63.095999999999997,88.120737790460851,1.5594480166306723,1.0226583550731165,0.21089634007812028,1,0,2706.9252017683089,1.5704269039449072,11.151697892711406,1.4810032680458105,1.5193051863424898,0.85237684341715547,1.0650962983127756,0.35142758064822222,6.8026183789792718,0.38622927114772715,1.0034140096277067,0.11566176870092845,-5.1017565972915859,-139.84843347289561,40.151566527104393,null,63096,3981105216,null,29.492248098677258,-53.961192669878898,null,9.4705401330466827,-83.893250815196069,null,0,0]
[63463.25,63.463250000000002,88.633578310193428,1.5595136815973576,1.0229199244204554,0.21208748149623632,1,0,2722.6808462635454,1.5704290417258973,11.216085862957449,1.4815201192108041,1.5243235693433159,0.85525152740514598,1.0658328099968186,0.35330746257527684,6.8081823707966613,0.38826276787497738,1.0034538628589706,0.11633338084058018,-5.1804265633164794,-139.96644679859921,40.033553201400792,null,63463.25,4027584100.5625,null,29.463202189997432,-54.096409025416797,null,9.4220133299721827,-83.867246305629791,null,0,0]
[63830.5,63.830500000000001,89.146419207706856,1.559578591050397,1.0231829443616223,0.21327801221190881,1,0,2738.436490771081,1.5704311549073633,11.280476795209335,1.482031069957507,1.5293544663319374,0.85810732199652728,1.0665730830774336,0.35518474160122993,6.8137740715695729,0.39029295918862655,1.003493947269317,0.11700496526569905,-5.258769076498675,-140.08366436521746,39.916335634782541,null,63830.5,4074332730.25,null,29.434186251760476,-54.230879757867093,null,9.3737870459030077,-83.841231911067041,null,0,0]
[64197.75,64.197749999999999,89.659260476518583,1.5596427579536076,1.023447413778235,0.21446792932245548,1,0,2754.1921352907057,1.5704332439114774,11.344870639032026,1.4825362204897146,1.5343977542178833,0.86094436663859375,1.0673171097280978,0.3570594099241457,6.8193934131505269,0.39231983685998173,1.0035342628567911,0.11767652181836319,-5.3367868250778425,-140.20008932100964,39.799910678990358,null,64197.75,4121351105.0625,null,29.405200906608751,-54.36460713990536,null,9.3258579274421276,-83.815208531542979,null,0,0]
[64565,64.564999999999998,90.172102110293466,1.5597061949759119,1.0237133315469069,0.21565722993513584,1,0,2769.9477798222129,1.5704353091508072,11.409267345126855,1.4830356687609174,1.5394533112224815,0.8637628001609251,1.0680648821044669,0.35893145983717234,6.8250403272801794,0.39434339279473418,1.0035748096194279,0.11834805034069285,-5.4144824539544354,-140.31572489201369,39.684275107986309,null,64565,4168639225,null,29.376246763656816,-54.497593537197346,null,9.278222678161395,-83.789177049629387,null,0,0]
[64941,64.941000000000003,90.697162942930646,1.5597704001872523,1.0239870843479038,0.21687422478934479,1,0,2786.0788141266112,1.5704373993961449,11.475201264927454,1.4835412090725848,1.5446419058526806,0.86662924769505689,1.0688343431509404,0.36084539202977911,6.8308502776562792,0.39641171172505485,1.003616561938947,0.11903554931660842,-5.4936982324317727,-140.43330119107372,39.566698808926276,null,64941,4217333481,null,29.346635715253569,-54.6329833192572,null,9.2297535554529144,-83.762517858135695,null,0,0]
[65317,65.316999999999993,91.22222414514556,1.5598338662880535,1.0242623529400925,0.21809056731406215,1,0,2802.2098484430426,1.5704394655763192,11.541138083947306,1.4840409730059174,1.5498431070274064,0.8694764791645565,1.0696077138418769,0.36275656351031393,6.8366889849537147,0.39847653200589994,1.0036585565764899,0.1197230185757996,-5.5725818355205679,-140.55005711846835,39.449942881531655,null,65317,4266310489,null,29.317058622972908,-54.767601685181077,null,9.1815856563789691,-83.735851991811344,null,0,0]
[65693,65.692999999999998,91.747285710593047,1.5598966059673915,1.0245391361017051,0.21930625443740806,1,0,2818.3408827712992,1.5704415081045473,11.60707775277726,1.4845350587557244,1.5550567882512691,0.87230464145248754,1.0703849857029306,0.364664966316529,6.8425563755736469,0.40053784538548354,1.0037007935299123,0.12041045794896982,-5.6511359678933095,-140.66599636425147,39.33400363574853,null,65693,4315570249,null,29.287516097426899,-54.901451448276035,null,9.1337156204883598,-83.709180343992585,null,0,0]
[66069,66.069000000000003,92.272347633072329,1.5599586316255449,1.024817432605575,0.22052128309856114,1,0,2834.4719171111806,1.5704435273846404,11.673020223122474,1.4850235623091859,1.5602828244181133,0.87511388070128093,1.0711661502416661,0.36657059258989644,6.8484523758085265,0.40259564375772328,1.0037432727970579,0.12109786726686986,-5.7293632914480694,-140.78112268721878,39.218877312781217,null,66069,4365112761,null,29.258008735039663,-55.034535505362982,null,9.0861401444168273,-83.682503790837941,null,0,0]
[66453.75,66.453749999999999,92.809628780049422,1.5600213742027906,1.0251037707166772,0.2217639022209531,1,0,2850.9783412247875,1.5704455700016775,11.740500109755418,1.4855177532818455,1.565643137611511,0.87796905749100618,1.0719695142115844,0.36851768292503173,6.8545151225282179,0.40469768276388385,1.0037869914464774,0.12180124218808401,-5.8090754927023589,-140.8980906164044,39.101909383595597,null,66453.75,4416100889.0625,null,29.227851706271963,-55.169927061661177,null,9.037759060474551,-83.655202258824303,null,0,0]
[66838.5,66.838499999999996,93.346910288177966,1.5600833945190609,1.0253916908074052,0.22300582542919231,1,0,2867.4847653501529,1.5704475891024237,11.807982830936139,1.4860062957615561,1.5710161268253091,0.88080472744193461,1.0727769360945159,0.37046184967986323,6.8606076694356206,0.40679602455366276,1.0038309638141383,0.12250458528049522,-5.8884510045956606,-141.01421551417678,38.985784485823217,null,66838.5,4467385082.25,null,29.197732715104344,-55.304523245846127,null,8.9896795846533291,-83.627897393592846,null,0,0]
[67223.25,67.223249999999993,93.884192151257579,1.5601447049739721,1.0256811915455208,0.22424704947993251,1,0,2883.9911894870738,1.5704495850906628,11.875468338342412,1.4864892858102927,1.5764016624451087,0.88362104464333879,1.0735884067348631,0.37240308477023182,6.8667299372264035,0.40889066091212828,1.0038751898976919,0.12320789636291704,-5.9674925473302629,-141.12950160679202,38.870498393207981,null,67223.25,4518965340.5625,null,29.16765235561051,-55.43832740577222,null,8.9418983548421078,-83.600590081038092,null,0,0]
[67608,67.608000000000004,94.421474363228953,1.5602053176849349,1.0259722715929802,0.22548757114209542,1,0,2900.4976136353544,1.5704515583609873,11.942956584742255,1.4869668173291877,1.5817996163210863,0.8864181623164844,1.074403916958848,0.37434138022472074,6.8728818464926462,0.410981583781727,1.0039196696947754,0.12391117525421613,-6.0462027989377649,-141.24395317974219,38.756046820257808,null,67608,4570841664,null,29.137611207105078,-55.571342962841186,null,8.8944120660096218,-83.573281190185483,null,0,0]
[68001.75,68.001750000000001,94.971324935209182,1.5602666381759547,1.0262717942840025,0.22675638027037387,1,0,2917.3901529799496,1.570453554670791,12.012026291249057,1.4874499634007439,1.5873365633115759,0.88926099014659021,1.0752426762830998,0.37632196413890801,6.8792082667444374,0.41311756408210537,1.0039654526376427,0.12463087159534517,-6.1264139712511625,-141.36022248299338,38.639777517006621,null,68001.75,4624238003.0625,null,29.106908528418508,-55.706657148881071,null,8.8461169672302056,-83.545332750306329,null,0,0]
[68395.5,68.395499999999998,95.521175860189558,1.5603272527058591,1.0265729681803184,0.22802444695778779,1,0,2934.2826923360367,1.570455527995255,12.081098769662761,1.4879275849036877,1.5928862493884783,0.89208403158387684,1.0760856468904785,0.37829945274966353,6.8855655628328263,0.41524963855806774,1.0040115012974578,0.12535053383804085,-6.2062837167465759,-141.47562702395328,38.52437297604672,null,68395.5,4677944420.25,null,29.076248097810954,-55.841152875621844,null,8.7981239428785951,-83.517384446866515,null,0,0]
[68789.25,68.789249999999996,96.071027132108981,1.5603871733956565,1.026875791829075,0.22929176778130811,1,0,2951.1752317034202,1.5704574787290841,12.150173972709354,1.488399775841742,1.5984485418645178,0.89488744795501307,1.0769328188918217,0.38027383787796692,6.8919536493344857,0.41737779908109907,1.0040578156716462,0.12607016178833377,-6.2858147756566938,-141.59017156494508,38.409828435054919,null,68789.25,4731960915.5625,null,29.045630489547129,-55.974834022999119,null,8.7504296278563398,-83.489437159360151,null,0,0]
[69183,69.183000000000007,96.620878745044408,1.5604464120904606,1.0271802637711784,0.23055833933151473,1,0,2968.0677710819054,1.5704594072579972,12.219251854181939,1.4888666281027545,1.6040233095935772,0.89767139958541808,1.0777841823798489,0.38224511146723278,6.8983724407295588,0.4195020376924663,1.0041043957576195,0.12678975525231412,-6.3650098465678804,-141.70386091776979,38.296139082230212,null,69183,4786287489,null,29.015056262617719,-56.107704534296921,null,8.7030307141639813,-83.461491750697462,null,0,0]
[69586,69.585999999999999,97.183647854068155,1.5605063482895012,1.0274935936891099,0.23185388583414118,1,0,2985.3571510793122,1.5704613584919118,12.289955244045791,1.4893390131491233,1.6097418231531044,0.90050076222929865,1.0786598761382744,0.3842594640186171,6.9049737287803366,0.42167210972912084,1.0041523452514958,0.12752621753827217,-6.4457202265388966,-141.81934057864572,38.180659421354278,null,69586,4842211396,null,28.983809273575591,-56.242861200663832,null,8.6548208006728515,-83.43289267590238,null,0,0]
[69989,69.989000000000004,97.746417308189365,1.560565594330219,1.0278086471409726,0.23314864026293725,1,0,3002.6465310879548,1.5704632872552331,12.360661345009611,1.4898059939754504,1.6154731318756717,0.90331007143847086,1.0795399395734737,0.38627054043483977,6.9116069997462395,0.42383805709364808,1.0042005730825008,0.12826264328774165,-6.5260842380614097,-141.93393474223186,38.066065257768145,null,69989,4898460121,null,28.952608864920201,-56.377177241386029,null,8.6069134964645606,-83.404297347049166,null,0,0]
[70392,70.391999999999996,98.30918710148147,1.5606241620646042,1.0281254225423142,0.2344425990070389,1,0,3019.9359111076392,1.5704651939338989,12.4313701108135,1.490267662592788,1.6212171000613285,0.90609949578151039,1.080424362007441,0.38827833247427934,6.918272161651295,0.4259998718006735,1.0042490792478131,0.12899903229301904,-6.6061046457385846,-142.04764870580146,37.952351294198536,null,70392,4955033664,null,28.921455587794593,-56.51065706499913,null,8.5593054323362701,-83.375706638193577,null,0,0]
[70795,70.795000000000002,98.871957228152908,1.5606820630748242,1.0284439183019793,0.23573575847067671,1,0,3037.2252911381779,1.5704670789050594,12.502081496242372,1.490724108939717,1.6269735936288268,0.9088692026869597,1.0813131327443022,0.39028283202813152,6.9249691224323087,0.42815754604773298,1.0042978637445954,0.1297353843464677,-6.6857841729731433,-142.16048780609839,37.839512193901612,null,70795,5011932025,null,28.890349977613468,-56.643305132959981,null,8.5119932962247233,-83.347121407070617,null,0,0]
[71207.25,71.207250000000002,99.447644874195447,1.5607406150246104,1.0287715028244397,0.23705776889139082,1,0,3054.9115117883957,1.5704689850653573,12.574418574178635,1.4911857202463572,1.6328750369554683,0.91168225413902704,1.0822267912931973,0.39232992554051244,6.9318526035659218,0.43036045302815057,1.0043480559693554,0.13048859933059484,-6.7669426635656995,-142.27501727307208,37.724982726927919,null,71207.25,5070472452.5625,null,28.858580267564491,-56.778141944164801,null,8.463898011499003,-83.31788660871949,null,0,0]
[71619.5,71.619500000000002,100.02333285725283,1.5607984929787782,1.0291008841962284,0.2383789353557183,1,0,3072.5977324495861,1.5704708692815057,12.646758300882972,1.4916420507963082,1.6387893085227108,0.91447502336170994,1.0831449773507378,0.39437355694716159,6.9387691649315446,0.43255901136176567,1.0043985394431663,0.13124177520779878,-6.8477500833477851,-142.38864266397698,37.611357336023019,null,71619.5,5129352780.25,null,28.826861521896635,-56.91211797698957,null,8.4161055617384015,-83.288659307741426,null,0,0]
[72031.75,72.031750000000002,100.59902117153925,1.5608557085079653,1.0294320606925624,0.23969925406384723,1,0,3090.2839531215595,1.5704727319302751,12.719100631160879,1.4920931905038364,1.6447162699424989,0.91724768582391403,1.0840676794127657,0.39641371799668013,6.9457187077270399,0.43475321328467326,1.0044493141629411,0.13199491175603392,-6.9282092204360488,-142.50136979819121,37.498630201808794,null,72031.75,5188573008.0625,null,28.795194264355981,-57.045238154941394,null,8.3686125787906853,-83.259440372076043,null,0,0]
[72444,72.444000000000003,101.1747098114006,1.5609122729194778,1.0297650305814849,0.24101872123266344,1,0,3107.9701738041326,1.5704745733798597,12.791445520838632,1.4925392272576492,1.6506557845195917,0.92000041571370084,1.0849948859577707,0.39845040058122433,6.9527011330751236,0.43694305122924554,1.0045003801255745,0.13274800875332943,-7.0083228222122411,-142.61320452425099,37.386795475749011,null,72444,5248133136,null,28.763579002609596,-57.177507443705039,null,8.3214157515635669,-83.230230653622726,null,0,0]
[72865.75,72.865750000000006,101.76366510643894,1.5609694785418737,1.0301075275645488,0.24236770943072111,1,0,3126.0639605289844,1.5704764357019179,12.865460149158878,1.4929903514870202,1.6567450204890373,0.92279613368009594,1.085948108650806,0.40053040909635995,6.959878388047283,0.43917882871831554,1.004552924250153,0.13351841916064205,-7.0899278356905509,-142.72669903336256,37.273300966637436,null,72865.75,5309417523.0625,null,28.731289509989555,-57.311949472856959,null,8.2734343850704501,-83.200358228786598,null,0,0]
[73287.5,73.287499999999994,102.35262073066464,1.5610260258213091,1.030451897857418,0.24371579843453958,1,0,3144.1577472645522,1.5704782765896454,12.93947736581455,1.4934363147076,1.6628471107451943,0.92557135451397154,1.0869060213755175,0.40260676027260711,6.9670898489650526,0.44141002338330615,1.0046057731885807,0.13428878770341671,-7.1711768961283013,-142.83927199391763,37.160728006082365,null,73287.5,5371057656.25,null,28.699055461799784,-57.445511578747507,null,8.2257561474966714,-83.170497205050921,null,0,0]
[73709.25,73.709249999999997,102.94157667842762,1.5610819260570814,1.0307981395825794,0.24506298424791259,1,0,3162.2515340106534,1.5704800964109717,13.013497126640415,1.4938772048067195,1.6689619142938072,0.92832626052579437,1.0878686117426115,0.40467944589170329,6.9743354097455779,0.44363662775210361,1.0046589269374779,0.13505911414422633,-7.2520728193952841,-142.95092974255954,37.049070257440462,null,73709.25,5433053535.5625,null,28.666877351238426,-57.578199192504592,null,8.178377670589466,-83.140648445179892,null,0,0]
[74131,74.131,{"$f":"SQRT(1+(A525/pole1)^2)","v":103.53053294420636},{"$f":"ATAN(A525/pole1)","v":1.5611371902913895},{"$f":"SQRT(1+(A525/Zero1)^2)","v":1.0311462508548457},{"$f":"ATAN(A525/Zero1)","v":0.24640926289310053},{"$f":"IF(VIN_nom>Vout, 1, SQRT(1+(A525/z_RHP)^2))","v":1},{"$f":"IF(VIN_nom>Vout, 0, -ATAN(A525/z_RHP))","v":0},{"$f":"SQRT(1+(A525/Pole2)^2)","v":3180.3453207671087},{"$f":"ATAN(A525/Pole2)","v":1.5704818955254529},13.087519388468886,1.4943131076913594,{"$f":"SQRT(1+(A525/pole4)^2)","v":1.6750892919077616},{"$f":"ATAN(A525/pole4)","v":0.93106103260025985},{"$f":"IF(VOUT_setting=1,1,SQRT(1+(A525*zterm1)^2))","v":1.0888358673462146},{"$f":"IF(VOUT_setting=1,0,ATAN(((A525*zterm1))))","v":0.40674845789035469},6.9816149642458223,{"$f":"IF(VOUT_setting=1,0,ATAN(A525*$Q$4/(1+Afbr-$Q$5*(A525)^2)))","v":0.44585863456288449},{"$f":"SQRT((1-(Z525/pterm2))^2+(A525/pterm1)^2)","v":1.0047123854934463},{"$f":"IF((ATAN((A525/pterm1)/(1-A525^2/pterm2))>0),ATAN((A525/pterm1)/(1-A525^2/pterm2)),PI()+ATAN((A525/pterm1)/(1-A525^2/pterm2)))","v":0.13582939824572768},{"$f":"20*LOG10(((E525*K525*G525*O525)/(C525*I525*S525*M525*Q525))*Adc)","v":-7.3326183810061449},{"$f":"((F525+L525+H525+P525)-(D525+J525+T525+N525+R525))*radconv","v":-143.06167863461286},{"$f":"IF(V525>0,V525,V525+180)","v":36.938321365387139},null,{"$f":"IF(U525<0,A525,1000000000)","v":74131},{"$f":"A525^2","v":5495405161},null,{"$f":"20*LOG10((K525/(I525*M525))*AEA)","v":28.634755655141888},{"$f":"(L525-(J525+N525))*radconv","v":-57.710017776551524},null,{"$f":"20*LOG10((E525*G525/(C525*S525))*Acs*Am)","v":8.1312956430980972},{"$f":"(F525+H525-(D525+T525))*radconv","v":-83.11081279615388},null,{"$f":"SUM((U526<0)*(U525>0))*A525","v":0},0]
[74562.75,{"$f":"A526/1000","v":74.562749999999994},104.13345411623983,1.561193117346749,1.031504550688098,0.24778651896546905,1,0,3198.8681244103691,1.5704837162159682,13.163299318701648,1.4947542678275048,1.6813748353979121,0.93383997978045996,1.0898308767886222,0.40886271410635566,6.989102223715606,0.44812855704562815,1.0047674273207354,0.13661790224013373,-7.4147136718633639,-143.17411867873119,36.82588132126881,null,74562.75,5559603687.5625,null,28.601931247953033,-57.844067425611705,null,8.0834009441429782,-83.080284171104879,null,0,0]
[74994.5,74.994500000000002,104.73637561023565,1.5612484005070986,1.0318648057535909,0.249162815963822,1,0,3217.390928064111,1.5704855159427313,13.23908178147718,1.4951903775159454,1.6876732666082284,0.93659820595339105,1.0908307489614455,0.41097310382232771,{"$f":"IF(VOUT_setting=1,1,SQRT((1+Afbr-$Q$5*(A527)^2)^2+(A527*$Q$4)^2))","v":6.9966248827686428},0.45039364663157672,1.004822788573587,0.13740636136054582,-7.4964475504475807,-143.2856197816686,36.714380218331399,null,74994.5,5624175030.25,null,28.569166922287444,-57.977218016610713,null,8.0358100742442016,-83.049771033392261,null,0,0]
[75426.25,75.426249999999996,105.33929742066546,1.561303050828323,1.0322270140041514,0.25053814968112642,1,0,3235.9137317281552,1.5704872950657403,13.314866733553071,1.4956215228270844,1.6939844417845886,0.93933590051296934,1.0918354705052298,0.41307961888837158,7.0041828273711397,0.4526538962067525,1.0048784692482944,0.13819477535261004,-7.5778228693465568,-143.3961888033339,36.603811196666101,null,75426.25,5689119189.0625,null,28.536463138452618,-58.109475490176145,null,7.9885196582698921,-83.019274242943368,null,0,0]
[75858,75.858000000000004,105.94221954212674,1.5613570791146441,1.0325911733843882,0.25191251593081271,1,0,3254.4365354023257,1.5704890539367973,13.390654132664427,1.4960477878902647,1.7003082190184884,0.94205325127514361,1.0928450280449753,0.4151822513220324,7.0117759434472626,0.45490929888261322,1.0049344693411315,0.1389831439620664,-7.6588424409964979,-143.50583261170664,36.494167388293363,null,75858,5754436164,null,28.503820340144635,-58.240845807269665,null,7.9415263781802672,-82.988794644099244,null,0,0]
[76299.75,76.299750000000003,106.55910659196434,1.5614117259795437,1.0329657845484523,0.25331770895133382,1,0,3273.3883559640217,1.57049083294363,13.468199375169664,1.496478960573641,1.7067913619096067,0.94481267828847237,1.0938829598451156,0.41732955726945042,7.0195812117022989,0.457211916642704,1.0049920970802486,0.13978972517535437,-7.7413732417680166,-143.61706550413217,36.382934495867829,null,76299.75,5821651850.0625,null,28.470485050338329,-58.374346883744778,null,7.8937487973810381,-82.957627748664848,null,0,0]
[76741.5,76.741500000000002,107.17599395635406,1.5614657437679,1.0333424338919068,0.25472188036790144,1,0,3292.3401765359581,1.5704925914693362,13.54574709287821,1.4969051965155111,1.7132874026426765,0.94755120092830136,1.09492592587909,0.41947278227309154,7.0274230578328511,0.45950944650669023,1.0050500591973306,0.1405962583412147,-7.8235374571897331,-143.72734438828306,36.272655611716942,null,76741.5,5889257822.25,null,28.437214491734743,-58.506931908814714,null,7.8462754260970282,-82.926480590479599,null,0,0]
[77183.25,77.183250000000001,107.79288162989546,1.5615191432798179,1.0337211191868421,0.25612502576305396,1,0,3311.2919971179595,1.57049432986558,13.623297243521366,1.4973265798663566,1.7197961950639205,0.95026901523179097,1.0959739117746539,0.42161191832237838,7.0353013595537313,0.46180188181956455,1.0051083556883191,0.14140274318761661,-7.9053379753624995,-143.83667662892722,36.163323371072778,null,77183.25,5957254080.5625,null,28.404009087762713,-58.638607313262753,null,7.7991028875834196,-82.895354025859618,null,0,0]
[77625,77.625,108.40976960731102,1.5615719350695916,1.0341018381965783,0.25752714074194349,1,0,3330.2438177098538,1.5704960484760211,13.700849785786115,1.4977431928783334,1.7263175949390079,0.95296631550627808,1.09702690314544,0.42374695758695391,7.043215994559703,0.46408921616696247,1.0051669865491351,0.1422091794426345,-7.9867776444526228,-143.94506958811675,36.054930411883248,null,77625,6025640625,null,28.370869245103549,-58.769379537068197,null,7.7522278621542737,-82.864248895747465,null,0,0]
[78077,78.076999999999998,109.04097165000486,1.5616253335172476,1.0344934937969541,0.25896071811451121,1,0,3349.6353806119073,1.5704977868342065,13.780204226198791,1.4981646188389943,1.7330032131449098,0.95570516902348246,1.0981094932699984,0.42592728807422281,7.051351754229441,0.46642433760382834,1.005227323924953,0.14303427699533269,-8.0697363964422397,-144.05501305535154,35.944986944648463,null,78077,6096017929,null,28.337028720881221,-58.902257956124586,null,7.7045697314205785,-82.832445075796954,null,0,0]
[78529,78.528999999999996,109.67217400003859,1.5616781173109537,1.0348872738187602,0.2603932074618085,1,0,3369.0269435239666,1.5704995051809865,{"$f":"SQRT(1+(A535/Zero2)^2)","v":13.859561085948004},{"$f":"ATAN(A535/Zero2)","v":1.49858121888449},1.7397017311876941,0.95842295152685364,1.0991972933353291,0.42810331344228753,7.0595252937389557,0.468754105789352,1.0052880113587845,0.14385932309988966,-8.1523232683193623,-144.16398872129423,35.836011278705769,null,78529,6166803841,null,28.303257644994737,-59.034204453019392,null,7.6572162261299166,-82.800665430263933,null,0,0]
[78981,78.980999999999995,110.30337665213605,1.5617302970023441,1.0352831758378636,0.26182460414971492,1,0,3388.4185064458602,1.5705012038599304,13.938920323712559,1.498993075295926,1.7464130006320484,0.96111986555610418,1.1002902878890357,0.43027502588317862,7.0677364820470521,0.47107851462364153,1.0053490488461865,0.14468431746535451,-8.2345411873675438,-144.27200444721564,35.727995552784364,null,78981,6237998361,null,28.269556400971645,-59.165225937748339,null,7.610163967263329,-82.768910812557777,null,0,0]
[79433,79.433000000000007,110.93457960114112,1.5617818829029169,1.0356811974207847,0.26325490356908693,1,0,3407.8100693774195,1.5705028832067878,14.018281899105732,1.4994002684976595,1.7531368750351777,0.96379611176683921,1.1013884614664182,0.43244241778257553,7.0759851881186275,0.47339755826315488,1.0054104363826921,0.1455092598008941,-8.3163930410706968,-144.37906808078023,35.620931919219771,null,79433,6309601489,null,28.235925355532711,-59.2953293182915,null,7.5634096328373488,-82.737182060904772,null,0,0]
[79895.5,79.895499999999998,111.58044575258766,1.5618340630182175,1.0360906565243269,0.26471728838979619,1,0,3427.6521000417815,1.5705045818963483,14.099489429456952,1.4998121758752154,1.7600298425197087,0.96651334118408294,1.1025174904542527,0.43465567838987806,7.0844642108871403,0.47576491406968352,1.0054736122934786,0.14635331145968603,-8.3997703721024699,-144.48764145636869,35.512358543631308,null,79895.5,6383290920.25,null,28.201586086838297,-59.427511869477676,null,7.5158741703422809,-82.704743880738093,null,0,{"$f":"IF(AH538>0,W538,0)","v":0}]
[80358,80.358000000000004,112.22631220434464,1.5618856425367873,1.0365023296262248,0.26617851468717779,1,0,3447.4941307159193,1.5705062610323146,14.180699324636928,1.5002193655066287,1.7669357034513371,0.96920935043263379,1.1036519090836454,0.4368643998779515,7.092982237221797,0.47812664095345675,1.0055371546960712,0.14719730802745851,-8.4827704257335323,-144.59523456166752,35.404765438332475,null,80358,6457408164,null,28.16732104061591,-59.558747781160449,null,7.4686437749803938,-82.672334510927826,null,0,0]
[80820.5,80.820499999999996,112.87217895125681,1.5619366317683867,1.0369162140894947,0.26763857760485193,1,0,3467.3361613996667,1.5705079209503767,14.261911544248379,1.5006219178491031,1.7738543072421347,0.97188434838739146,1.1047917007520742,0.43906857471230476,7.1015391268067356,0.48048273347505716,1.0056010635856047,0.14804124919302306,-8.5653961718997369,-144.70185574486734,35.298144255132655,null,80820.5,6531953220.25,null,28.133130557552267,-59.689044430365492,null,7.4217150649350119,-82.639954802600002,null,0,0]
[81283,81.283000000000001,113.5180459882863,1.5619870407881564,1.0373323072672087,0.26909747231400927,1,0,3487.1781920928588,1.5705095619785838,14.343126048807809,1.5010199115436551,1.7807855053686716,0.97453854188308853,1.1059368488469852,0.4412681955661476,7.1101347393629544,0.48283318646754358,1.0056653389571886,0.14888513464532335,-8.6476505407915845,-144.80751332958431,35.19248667041569,null,81283,6606926089,null,28.099014961546892,-59.818409180847532,null,7.3750847154080104,-82.607605591865834,null,0,0]
[81756.25,81.756249999999994,114.1789253651351,1.56203803115023,1.0377603553459551,0.2705890622060253,1,0,3507.4814159415023,1.5705112219304767,14.426230566825513,1.5014225172693034,1.7878906910589614,0.97723310564884402,1.1071141411829946,0.44351422133166568,7.1189700790488581,0.48523242883041906,1.0057314876501318,0.14974857673737091,-8.7314353582677811,-144.91463793953753,35.085362060462472,null,81756.25,6684084414.0625,null,28.064184247342009,-59.949823811754555,null,7.3276759589167328,-82.574536906522113,null,0,0]
[82229.5,82.229500000000002,114.83980503543424,1.5620884346341524,1.0381907103689887,0.27207941881178144,1,0,3527.7846397996987,1.5705128627755485,14.509337396423742,1.501820510954998,1.7950087552180503,0.9799063182400044,1.1082970066203892,0.44575546409765976,7.1278456657054035,0.48762575637415329,1.0057980200491332,0.15061195983762882,-8.814837417507384,-145.02077118097043,34.979228819029572,null,82229.5,6761690670.25,null,28.029432575912715,-60.080278266152639,null,7.280572727929151,-82.541501877654284,null,0,0]
[82702.75,82.702749999999995,115.50068499414645,1.5621382613137877,1.0386233694686531,0.27356853704779971,1,0,3548.0878636672855,1.5705144848418042,14.592446498107787,1.5022139712751221,1.8021395452443867,0.98255839467321449,1.1094854273340711,0.44799191668194294,7.1367613492110618,0.49001316443460302,1.0058649361488672,0.15147528361327667,-8.8978597343641148,-145.12592187816827,34.87407812183173,null,82702.75,6839744857.5625,null,27.994760242267862,-60.209780374671233,null,7.2337716374317607,-82.508501354644949,null,0,0]
[83176,83.176000000000002,116.16156523634913,1.5621875210337579,1.0390583297667277,0.27505641186101504,1,0,3568.3910875441006,1.5705160884497837,14.675557833276528,1.502602975127536,1.8092829106714803,0.98518954776781054,1.1106793854916968,0.45022357212466779,7.1457169795170676,0.49239464863655408,1.0059322359439782,0.15233854773164188,-8.9805052849216693,-145.23009881982605,34.769901180173946,null,83176,6918246976,null,27.960167524729176,-60.338337943402834,null,7.1872693594159927,-82.475536172007921,null,0,0]
[83660.5,83.660499999999999,116.83815607407494,1.5622373744544653,1.0395060107377438,0.27657836276716519,1,0,3589.1769554210459,1.5705177113837987,14.760647148082121,1.502996688143321,1.816608959150767,0.98786179267420393,1.1119074440076084,0.45250330142673301,7.1549267271025538,0.49482660395186362,1.0060015330555974,0.15322227103545821,-9.0647282274836396,-145.33575261874338,34.664247381256615,null,83660.5,6999079260.25,null,27.92483522739305,-60.468981191639443,null,7.1399677744203753,-82.441824814587747,null,0,0]
[84145,84.144999999999996,117.51474719884227,1.5622866538131821,1.0399560974761466,0.27809899981070541,1,0,3609.9628233073358,1.5705193156283737,14.845738724706338,1.5033858879154984,1.8239478755781138,0.99051255205984468,1.1131412685225439,0.454777988748294,7.1641780252706448,0.49725234205623886,1.0060712323102197,0.15410593110679441,-9.14856246675736,-145.4404043357398,34.5595956642602,null,84145,7080381025,null,27.889586914942651,-60.598650929199742,null,7.0929724957378451,-82.408152221666541,null,0,0]
[84629.5,84.629499999999993,118.19133860572157,1.5623353689683943,1.0404085868596895,0.27961831766891831,1,0,3630.7486912028098,1.5705209015044967,14.930832524478525,1.5037706514907727,1.8312995052489662,0.99314204720500965,1.1143808398844395,0.45704762733632304,7.1734707133042095,0.49967185917961521,1.0061413337020051,0.15498952758917164,-9.232011072289751,-145.54406327348684,34.455936726513158,null,84629.5,7162152270.25,null,27.854422834362733,-60.727355438449997,null,7.0462801296647655,-82.374519242638456,null,0,0]
[85114,85.114000000000004,118.86793028989553,1.5623835295541426,1.0408634757549031,0.2811363110526785,1,0,3651.5345591073119,1.5705224693258484,15.01592850960359,1.504151054174661,1.8386636956671591,0.99575049703031138,1.1156261389373434,0.45931221067579303,7.1828046306006952,0.50208515185814651,1.0062118372250815,0.15587306012627711,-9.3150770736744519,-145.64673868793486,34.353261312065143,null,85114,7244392996,null,27.819343216098851,-60.855102965901622,null,6.9998873396058148,-82.340926712122723,null,0,0]
[85609.5,85.609499999999997,119.5598834706808,1.5624322197819056,1.0413311709350097,0.28268739328399167,1,0,3672.7923455905457,1.5705240543878938,15.102958720362725,1.504535659628859,1.8462079164337719,0.99839662685800112,1.1169056152954395,0.46162297345062342,7.1923929402001985,0.50454679417636039,1.0062843573709945,0.15677658571501987,-9.3996363741530793,-145.75073755027631,34.249262449723687,null,85609.5,7328986490.25,null,27.783554740340868,-60.984769585282287,null,6.9527476928551302,-82.306614194022913,null,0,0]
[86105,86.105000000000004,120.25183693164929,1.5624803496628883,1.0418013691551407,0.28423707913496193,1,0,3694.0501320829012,1.5705256212071386,15.189991139572061,1.5049158578757396,1.8537649590826974,1.0010212005571784,1.1181910418435457,0.46392843579605691,7.2020240330717584,0.50700191984390142,1.00635729810279,0.15768004366864807,-9.4838017852991712,-145.85372714821551,34.146272851784488,null,86105,7414071025,null,27.74785504209666,-61.113452598618686,null,6.9059144979909659,-82.272345701911206,null,0,0]
[86600.5,86.600499999999997,120.94379066799193,1.5625279288145744,1.0422740670277275,0.2857853630572571,1,0,3715.3079185842216,1.5705271700967203,15.27702572948732,1.5052917241292063,1.8613346674429214,1.0036244447428626,1.1194823980850497,0.46622859150496537,7.2116977378506473,0.50945052613069564,1.0064306594140844,0.15858343360656921,-9.5675764236796912,-145.95571722069019,34.04428277930981,null,86600.5,7499646600.25,null,27.712244316979458,-61.241160698497225,null,6.8593843629617135,-82.238122082918522,null,0,0]
[87096,87.096000000000004,121.63574467500916,1.5625749666356126,1.0427492611533518,0.28733223953946413,1,0,3736.5657050943537,1.5705287013626517,15.364062453218555,1.5056633319037893,1.8689168876139621,1.0062065835181704,1.1207796635234699,0.46852343462336793,7.2214138833342645,0.51189261062899016,1.0065044412984596,0.15948675514837615,-9.6509633658147891,-146.0567174489959,33.943282551004103,null,87096,7585713216,null,27.67672274436147,-61.367902530541606,null,6.8131539526899454,-82.203944169532733,null,0,0]
[87603.25,87.603250000000003,122.3441075541438,1.5626225687355009,1.043238305942715,0.28891433414064538,1,0,3758.3275864499751,1.5705302509968728,15.453165288076947,1.5060394156366339,1.8766917102068696,1.0088283229242192,1.1221137912145269,0.47086718731624061,7.2314042155606302,0.51438584752285488,1.0065804084481385,0.16041142628884267,-9.735929272787363,-146.15909745251619,33.840902547483807,null,87603.25,7674329410.5625,null,27.640451353160167,-61.496657910503593,null,6.7661343080440588,-82.169003979260538,null,0,0]
[88110.5,88.110500000000002,123.05247070731353,1.5626696227835397,1.0437299595310554,0.29049494218978572,1,0,3780.0894678145169,1.5705317827886824,15.542270283554283,1.5064111871893442,1.8844793257825669,1.0114284113897831,1.1234540682154635,0.47320536064916202,7.2414386626534073,0.51687224556752076,1.0066568163401279,0.16133602494474356,-9.8204952781406618,-146.26046045157256,33.739539548427445,null,88110.5,7763460210.25,null,27.604273722992442,-61.624418830379511,null,6.7194218759480409,-82.134113408028725,null,0,0]
[88617.75,88.617750000000001,123.76083412981289,1.5627161381900863,1.0442242182334593,0.29207405789449359,1,0,3801.8513491878266,1.5705332970444714,15.631377402701428,1.5067787202033855,1.8922795763937357,1.0140070812860251,1.1248004725443044,0.47553794904662205,7.2515170415260304,0.51935180320833763,1.0067336649674303,0.16226055070857329,-9.9046645575540495,-146.36081663634479,33.639183363655206,null,88617.75,7853105615.0625,null,27.568189996283643,-61.751194402265973,null,6.6730132555966124,-82.099273303542347,null,0,0]
[89125,89.125,124.46919781704358,1.5627621241512866,1.0447210783524794,0.29365167550308025,1,0,3823.6132305697547,1.5705347940636556,15.720486609406127,1.5071420866551621,1.9000923064325062,1.0165645623109696,1.1261529822239453,0.47786494720281097,7.2616391693090696,0.52182451923030082,1.0068109543230097,0.16318500317303439,-9.9884402463319422,-146.46017612826881,33.539823871731187,null,89125,7943265625,null,27.532200299532597,-61.876993680101499,null,6.6269051032506123,-82.064484498912776,null,0,0]
[89644,89.644000000000005,125.19397039522427,1.5628086367265357,1.0452321364334036,0.29526428072819738,1,0,3845.8792067977847,1.5705363082250203,15.811662076330947,1.5075096310932496,1.9080987679921633,1.0191595911415996,1.1275431178109447,0.4802400569902126,7.2720408575364592,0.52434743145426277,1.0068904901712823,0.16413079347505205,-10.073752381910042,-146.56081608732629,33.439183912673712,null,89644,8036046736,null,27.495474371197709,-62.004705889927095,null,6.5800364558105553,-82.028943792318273,null,0,0]
[90163,90.162999999999997,125.91874324113415,1.5628546138605239,1.0457459099750888,0.29687530559785319,1,0,3868.14518303453,1.5705378049546295,15.902839654743504,1.5078729610104087,1.916117971589385,1.0217329161127007,1.128939598348442,0.48260930416845421,7.282487958382144,0.52686317992788001,1.0069704873874605,0.1650765061805638,-10.158658995976852,-146.66043385565109,33.339566144348908,null,90163,8129366569,null,27.458847098341263,-62.131415035697223,null,6.5334754531748267,-81.993458508945182,null,0,0]
[90682,90.682000000000002,126.64351635017661,1.5629000647459479,1.0462623949772039,0.29848474408384656,1,0,3890.4111592798417,1.570539284551784,15.994019308532732,1.5082321483890564,1.924149757910705,1.024284774717666,1.1303424003198466,0.48497268391701531,7.292980276739673,0.52937176442986489,1.0070509459638861,0.16602214085399103,-10.243163320966072,-146.7590400441255,33.240959955874501,null,90682,8223225124,null,27.422318567640897,-62.257130617640961,null,6.4872186909687093,-81.958029495929907,null,0,0]
[91201,91.200999999999993,127.36828971785968,1.5629449983662738,1.0467815874262218,0.30009259020271578,1,0,3912.6771355335732,1.5705407473089725,16.085201002405551,1.5085872635837636,1.9321939700436981,1.0268154016225197,1.1317515002189737,0.48733019170140263,7.3035176177817931,0.53187318509499026,1.0071318658928599,0.16696769705998812,-10.32726854861988,-146.85664518398812,33.143354816011879,null,91201,8317622401,null,27.385888850276729,-62.381862066869544,null,6.4412628218530488,-81.922657585870738,null,0,0]
[91732,91.731999999999999,128.10982111437133,1.5629904447268967,1.0473155821959137,0.30173595774167383,1,0,3935.457932056072,1.5705422267567242,16.178493018944497,1.5089464467453881,1.9404368744357414,1.0293828081987124,1.1331996739960017,0.48973612671893052,7.3143449900796362,0.53442502837729366,1.0072151342713114,0.16793503417361644,-10.412908647216597,-146.95548195432184,33.04451804567816,null,91732,8414759824,null,27.348719152580507,-62.508468715003104,null,6.3945523658438521,-81.886527780293548,null,0,0]
[92263,92.263000000000005,128.85135277243191,1.5630353680055575,1.0478524025183764,0.30337764589874544,1,0,3958.2387285870855,1.5705436891751858,16.271787098778152,1.5093015112084067,1.9486924611098966,1.031928477929714,1.1346543905595587,0.49213590640052102,7.325219079445902,0.5369693741263214,1.0072988855667346,0.16890228822810982,-10.498137612210733,-147.05329289343055,32.946707106569448,null,92263,8512461169,null,27.311652993513263,-62.634064941986907,null,6.3481499663366847,-81.850459466884061,null,0,0]
[92794,92.793999999999997,129.59288468755165,1.5630797771813154,1.0483920440532088,0.30501764841133144,1,0,3981.0195251264672,1.5705451348566997,16.365083206619229,1.5096525273236905,1.9569605695626615,1.0344526531242904,1.1361156247769038,0.49452952680336787,7.3361396781968571,0.53950622361680056,1.0073831197707501,0.1698694587579869,-10.58295873497956,-147.15008901608124,32.849910983918761,null,92794,8610726436,null,27.274690401949535,-62.758660617032525,null,6.3020522154317522,-81.81445349225487,null,0,0]
[93325,93.325000000000003,130.33441685534305,1.563123681028894,1.0489345024461545,0.30665595906595594,1,0,4003.8003216740753,1.5705465640869556,16.458381307979781,1.5099995638509538,1.9652410417501871,1.0369555731122695,1.1375833515321141,0.49691698428718889,7.3471065789979955,0.54203557849548445,1.0074678368749344,0.17083654529802689,-10.66737526582507,-147.24588124662048,32.754118753379515,null,93325,8709555625,null,27.237831391775135,-62.882265529456468,null,6.2562557622264308,-81.778510688511346,null,0,0]
[93868.5,93.868499999999997,131.09340531063816,1.5631681040327119,1.0494926431202263,0.30833107785459257,1,0,4027.1173893352252,1.57054801021666,16.553877721613489,1.5103507187172434,1.9737290816263913,1.0394956481260973,1.1390923266921016,0.49935425796061367,7.358379379832475,0.54461671640234954,1.0075550483379219,0.17182631006461213,-10.753363362804183,-147.34290016110032,32.657099838899683,null,93868.5,8811295292.25,null,27.200211969333822,-63.007764272873658,null,6.2096898194051695,-81.741788046165581,null,0,0]
[94412,94.412000000000006,131.8523940216551,1.5632120156077762,1.0500537255592923,0.31000441117895194,1,0,4050.4344570047001,1.5705494396965436,16.649376153085225,1.5106978452781246,1.9822297468579526,1.0420139533743129,1.1406080504784804,0.50178506838520542,7.3697002499520909,0.54719000735570678,1.0076427656860905,0.17281598585509941,-10.838934357189951,-147.43889022928806,32.561109770711937,null,94412,8913625744,null,27.162701045760244,-63.132245551533146,null,6.1634326003226043,-81.705133302723468,null,0,0]
[94955.5,94.955500000000001,132.61138298400303,1.5632554245352619,1.0506177450502032,0.31167595253633179,1,0,4073.7515246823564,1.5705508528125036,16.744876567870925,1.5110410123726592,1.9907428757104011,1.044510735995537,1.1421304960229024,0.50420941262384478,7.3810689682374235,0.54975545430217043,1.0077309889102617,0.17380557217149156,-10.9240916058684,-147.53386286765829,32.466137132341714,null,94955.5,9016546980.25,null,27.125298590217493,-63.255719597627845,null,6.1174806889871327,-81.668547305353499,null,0,0]
[95499,95.498999999999995,133.37037219339115,1.5632983393964617,1.0511846968652805,0.31334569547800473,1,0,4097.0685923680558,1.5705522498439293,16.840378932228955,1.5113802872821329,1.9992683089688792,1.0469862399955512,1.1436596364812519,0.50662728805905299,7.3924853139976587,0.5523130605763894,1.0078197180012078,0.17479506851608362,-11.008838424126861,-147.62782939145859,32.37217060854141,null,95499,9120059001,null,27.088004557440506,-63.378196552733392,null,6.07183072646023,-81.632030886696043,null,0,0]
[96611.5,96.611500000000007,134.92396171428936,1.5633846769828212,1.0523543249948082,0.31675788755334183,1,0,4144.7967208200525,1.5705550604368439,17.035870394261195,1.5120628929076578,2.0167568861605476,1.0519880488685525,1.1468104264054153,0.51155629948220993,7.4160012343413948,0.5575238369450185,1.00800291663936,0.17682020385694491,-11.181042068353824,-147.81708076839783,32.18291923160217,null,96611.5,9333781932.25,null,27.012004567042062,-63.625829705067865,null,5.9793167515142773,-81.557505169091968,null,0,0]
[97724,97.724000000000004,136.47755221803712,1.5634690489241354,1.0535361784547224,0.3201624636226556,1,0,4192.5248493040453,1.5705578070376081,17.231369614050863,1.5127300097772121,2.034295050515095,1.0569037352834856,1.1499889251967439,0.51645818248155129,7.4397139024787151,0.5627018146684043,1.0081882346763458,0.17884495588146282,-11.351567302068492,-148.00225836550194,31.997741634498055,null,97724,9549980176,null,26.936457910319412,-63.869412177896031,null,5.8880264993650879,-81.483281230916319,null,0,0]
[98862,98.861999999999995,138.06675409316941,1.5635533902170313,1.054757727616441,0.32363714185742892,1,0,4241.3469708774028,1.570560552637269,17.431357693950453,1.5133969352078909,2.0522851929589012,1.0618450471822216,1.1532687094353569,0.52144434428729736,7.4641717065739552,0.56796458879061995,1.0083799931929083,0.18091571691820385,-11.524292676651447,-148.18756256979754,31.812437430202465,null,98862,9773695044,null,26.859647720418817,-64.11447379407636,null,5.7958820269231222,-81.40767510071845,null,0,0]
[100000,100,139.65595692808103,1.5636358120016649,1.0559919817267651,0.32710373938652676,1,0,4290.169092482005,1.5705632357470851,17.631353351246258,1.51404873080939,2.0703245735874365,1.0667003655489635,1.1565770029902722,0.52640210375433727,7.488831422421967,0.57319314178504244,1.0085739692082851,0.18298606786013763,-11.695318031055447,-148.36879912444249,31.631200875557511,null,100000,10000000000,null,26.783309752791041,-64.355471638755745,null,5.7049624259317264,-81.332398484427827,null,0,0]
[101165,101.16500000000001,141.28286588730595,1.5637182685775295,1.0572686337653567,0.33064415699186273,1,0,4340.1495597095454,1.5705659199863085,17.836101655539654,1.5147008490746454,2.0888416260457792,1.0715838925546581,1.1599930658368298,0.53144806947022594,7.5142832900657401,0.57851036031358483,1.0087748444150069,0.18510511005653621,-11.868668703394391,-148.55022202555088,31.44977797444912,null,101165,10234357225,null,26.705648305159055,-64.598067296833605,null,5.6131265829724342,-81.255684086094519,null,0,0]
[102330,102.33,142.90977578525417,1.5637988477537512,1.0585585061354112,0.33417599065405734,1,0,4390.1300269676449,1.570568543106827,18.040857372614877,1.5153381651005675,2.1074076188204072,1.0763814858031096,1.1634384902800019,0.53646427588111067,7.5399425602143531,0.5837918483103417,1.0089780434038995,0.18722371283511804,-12.040295116190137,-148.72758284280238,31.272417157197623,null,102330,10471428900,null,26.628478581181987,-64.836583917296352,null,5.5225186729170241,-81.179328767612859,null,0,0]
[103520,103.52,144.57159884897536,1.5638792837362763,1.0598896569017344,0.33777469365567947,1,0,4441.1830364720608,1.5705711615629667,18.250014382861618,1.515974392844093,2.1264212174222479,1.0811954259746963,1.1669878939167857,0.54155741493519016,7.5663643913259477,0.58914986518146828,1.0091880019022392,0.18938732047279316,-12.213853432454203,-148.90465827540783,31.095341724592174,null,103520,10716390400,null,26.550158537878815,-65.076099234202957,null,5.4312062434589379,-81.10171250229088,null,0,0]
[104710,104.71,146.2334228268077,1.5639578915401897,1.0612344994037095,0.34136432218184165,1,0,4492.2360460062355,1.5705737205030594,18.459178613043381,1.5165962024155457,2.1454832196792157,1.0859239331579109,1.1705673852590071,0.54661953589925949,7.5929981854440518,0.59447077319635411,1.0094003847801341,0.19155045938160728,-12.385670985472604,-149.07770079957544,30.922299200424561,null,104710,10964184100,null,26.47234733538243,-65.311542291829738,null,5.3411193846467846,-81.024484563010404,null,0,0]
[105930,105.93,147.93714244349022,1.5640366476563985,1.0626274049160631,0.34503496445291848,1,0,4544.5761062307774,1.5705762842684443,18.67362313231623,1.5172192265830653,2.1650746876320279,1.0906850995486241,1.1742680628612239,0.55177709911954487,7.6205211395647217,0.59988739968424265,1.0096206385657933,0.19376763919075229,-12.560042652603665,-149.25102413730437,30.74897586269563,null,105930,11221164900,null,26.393100229434285,-65.548787269450912,null,5.2500057482415272,-80.945719691240612,null,0,0]
[107150,107.15,149.64086295686258,1.5641136104339024,1.064034590262958,0.34869594709643786,1,0,4596.9161664845105,1.5705787896522405,18.888074735337426,1.5178281035870069,2.1847143541413008,1.0953607685688744,1.1779997797934869,0.55690212126297012,7.648262164139914,0.60526523712254132,1.009843440283346,0.19598431534641014,-12.732644383750598,-149.42031992975271,30.579680070247292,null,107150,11481122500,null,26.314382637461904,-65.781940836326896,null,5.1601242888745151,-80.867376667403832,null,0,0]
[108400,108.4,151.38647913533521,1.564190669022808,1.0654911302288494,0.35243687267435891,1,0,4650.5432774294668,1.5705812981524239,19.107806836203537,1.5184377773443654,2.2048856073853451,1.1000649144643952,1.1818551463945901,0.5621194595427611,7.6769090536618867,0.61073520981558871,1.0100743632934164,0.19825497174242157,-12.907685129092592,-149.58970942795762,30.410290572042385,null,108400,11750560000,null,26.234275492917977,-66.016680535919136,null,5.0692824511742085,-80.787551580360585,null,0,0]
[109650,109.65,153.13209619225003,1.5642659707657365,1.0669625404036456,0.35616753238628879,1,0,4704.1703884030194,1.5705837494592634,19.327545877987262,1.5190335882938664,2.2251047672680588,1.1046836694324749,1.1857424741122984,0.56730272919525826,7.705779864536658,0.61616472363503194,1.010307960835797,0.20052508761758497,-13.080928991729447,-149.75508781707964,30.244912182920359,null,109650,12023122500,null,26.154717799559052,-66.247318699200818,null,4.979677806954391,-80.708183054689115,null,0,0]
[110925,110.925,154.9126264644776,1.5643410302319314,1.0684786343570731,0.35996216591902391,1,0,4758.870041624501,1.5705861928768421,19.551686608440743,1.5196275182996439,2.2457763218500997,1.1093090200894902,1.1897401498135562,0.57255462570307458,7.7354561760344867,0.62166129563856987,1.0105489854998122,0.20284004279061346,-13.255817530203522,-149.91975134237305,30.080248657626953,null,110925,12304355625,null,26.07413137978391,-66.478442085737584,null,4.8895275075087943,-80.627704320174587,null,0,0]
[112200,112.2,156.69315758963623,1.5644143838714513,1.0700100698669488,0.36374599178453426,1,0,4813.5696948737486,1.5705885807622053,19.77583407946581,1.5202079848103658,2.2664950452790675,1.1138499029343747,1.1937704211111353,0.57777120358529255,7.7653602074004606,0.62711608295690635,1.0107927924775395,0.20515442310201121,-13.428898547068735,-150.08046152018343,29.919538479816566,null,112200,12588840000,null,25.99410913104596,-66.705494042812489,null,4.8006083360583256,-80.547714145564683,null,0,0]
[113510,113.51,158.5225668979638,1.5644880348461609,1.071599454691778,0.36762236569731305,1,0,4869.7709072597345,1.5705909783244918,20.006141400850694,1.5207908379942239,2.2878302998688782,1.1184296777533993,1.1979449315451685,0.58309427326594065,7.7963195626940562,0.63267726408571312,1.0110461899783454,0.20753173005267778,-13.604879876046802,-150.24157809221185,29.758421907788147,null,113510,12884520100,null,25.912473618012545,-66.934638154014024,null,4.7105022331166397,-80.466043825342723,null,0,0]
[114820,114.82,160.35197704657094,1.5645600052951627,1.0732048938298833,0.37148719997391355,1,0,4925.9721196730752,1.5705933211784266,20.236455363979172,1.5213604242987411,2.3092126529041113,1.1229247317678845,1.2021531495329281,0.58838022432773263,7.8275137276675792,0.63819470003613832,1.0113025243464178,0.209908416678075,-13.779016849104615,-150.39874719084088,29.601252809159121,null,114820,13183632400,null,25.831425012736315,-67.159685122309739,null,4.6216390988142226,-80.384902848521207,null,0,0]
[116155,116.155,162.21630043764657,1.5646316791537929,1.0748574134419244,0.37541385283519157,1,0,4983.245874335229,1.5705956543753674,20.47117123272993,1.5219276947358225,2.3310501794584919,1.1274206361931218,1.2064759904252396,0.59372896235288053,7.8595418814623459,0.64377262839964755,1.0115667719059001,0.21232981467349116,-13.954611809967183,-150.55496851791864,29.445031482081362,null,116155,13491984025,null,25.749428755929653,-67.384912951677549,null,4.5323305858726721,-80.302764707122861,null,0,0]
[117490,117.49,164.08062464311345,1.5647017242609376,1.0765264548245015,0.37932839017097708,1,0,5040.5196290238946,1.5705979345496206,20.705893539666636,1.5224821041762897,2.3529339487457017,1.1318329989382827,1.2108331003594295,0.59903935717364698,7.8918080573568341,0.64930554514366456,1.0118340691736796,0.21475055417673897,-14.128355874739585,-150.70731814918761,29.292681850812386,null,117490,13803900100,null,25.668032313455733,-67.606088038209052,null,4.4442565695406309,-80.221189684794396,null,0,0]
[118860,118.86,165.99382708012666,1.5647719699472442,1.0782563505590932,0.3833328931783121,1,0,5099.2949428508728,1.5706002212513623,20.946776081551171,1.5230381305851906,2.3754381866062206,1.1362764297190842,1.2153396835551131,0.60444923173122311,7.9251645792903949,0.6549369559616206,1.0121115447502731,0.21723406661571643,-14.304763631810278,-150.85975256532839,29.140247434671608,null,118860,14127699600,null,25.585120186865055,-67.828950920593115,null,4.3551285750601041,-80.138068125807692,null,0,0]
[120230,120.23,{"$f":"SQRT(1+(A589/pole1)^2)","v":167.90703031756314},{"$f":"ATAN(A589/pole1)","v":1.5648406148161664},{"$f":"SQRT(1+(A589/Zero1)^2)","v":1.0800034817072655},{"$f":"ATAN(A589/Zero1)","v":0.38732450378398986},{"$f":"IF(VIN_nom>Vout, 1, SQRT(1+(A589/z_RHP)^2))","v":1},{"$f":"IF(VIN_nom>Vout, 0, -ATAN(A589/z_RHP))","v":0},{"$f":"SQRT(1+(A589/Pole2)^2)","v":5158.0702567039089},{"$f":"ATAN(A589/Pole2)","v":1.5706024558399665},21.187664952200599,1.5235815138993618,{"$f":"SQRT(1+(A589/pole4)^2)","v":2.3979884444731412},{"$f":"ATAN(A589/pole4)","v":1.1406363747707255},{"$f":"IF(VOUT_setting=1,1,SQRT(1+(A589*zterm1)^2))","v":1.2198815723761207},{"$f":"IF(VOUT_setting=1,0,ATAN(((A589*zterm1))))","v":0.60981897815512776},7.9587655946453628,{"$f":"IF(VOUT_setting=1,0,ATAN(A589*$Q$4/(1+Afbr-$Q$5*(A589)^2)))","v":0.66052144678672486},{"$f":"SQRT((1-(Z589/pterm2))^2+(A589/pterm1)^2)","v":1.0123922316864029},{"$f":"IF((ATAN((A589/pterm1)/(1-A589^2/pterm2))>0),ATAN((A589/pterm1)/(1-A589^2/pterm2)),PI()+ATAN((A589/pterm1)/(1-A589^2/pterm2)))","v":0.21971687027400941},{"$f":"20*LOG10(((E589*K589*G589*O589)/(C589*I589*S589*M589*Q589))*Adc)","v":-14.479288346985866},{"$f":"((F589+L589+H589+P589)-(D589+J589+T589+N589+R589))*radconv","v":-151.00834221675439},{"$f":"IF(V589>0,V589,V589+180)","v":28.991657783245614},null,{"$f":"IF(U589<0,A589,1000000000)","v":120230},{"$f":"A589^2","v":14455252900},null,{"$f":"20*LOG10((K589/(I589*M589))*AEA)","v":25.502828852107463},{"$f":"(L589-(J589+N589))*radconv","v":-68.047751833147245},null,{"$f":"20*LOG10((E589*G589/(C589*S589))*Acs*Am)","v":4.2672438337674503},{"$f":"(F589+H589-(D589+T589))*radconv","v":-80.055552916802696},null,{"$f":"SUM((U590<0)*(U589>0))*A589","v":0},0]
[126030,{"$f":"A590/1000","v":126.03},176.00673112215452,1.5651146953379598,1.0875891084027656,0.40407902164853648,1,0,5406.900052847177,1.5706113779340101,22.207551819940374,1.5257513680845018,2.49393773308176,1.1582183461799385,1.2394921455286623,0.63211097568950991,8.1036562646363794,0.68365002792087737,1.0136161137517499,0.23021998000625737,-15.198020637235498,-151.59735975068855,28.402640249311446,null,126030,15883560900,null,25.161188431184698,-68.931312302790232,null,3.9083357466343402,-79.713077271562412,null,0,0]
[131830,131.83000000000001,184.10644398503032,1.5653646596813535,1.0954757587483712,0.42059688042896703,1,0,5655.729849382983,1.5706195149541897,23.227534064425107,1.527730662885407,2.5906007221698175,1.1744929703927975,1.2596993106450489,0.65369823593238052,{"$f":"IF(VOUT_setting=1,1,SQRT((1+Afbr-$Q$5*(A591)^2)^2+(A591*$Q$4)^2))","v":8.2526466985514944},0.70596305774535084,1.0148975360459331,0.24070966420563231,-15.88586827385279,-152.12740448443003,27.872595515569969,null,131830,17379148900,null,24.830133034366643,-69.750840562694975,null,3.5693260925854635,-79.382010211426788,null,0,0]
[144540,144.54,201.85602224593765,1.5658422804438665,1.1137794138604291,0.45594836708062053,1,0,6201.0103184506115,1.5706350627503329,25.462979565173313,1.5315135227722199,2.8045603430295554,1.2062107657385948,1.3059305350734873,0.69860906362239361,8.5924272195861899,0.75211882574536548,1.017906749770876,0.26364677476740483,-17.295138563286585,-153.11625333560022,26.88374666439978,null,144540,20891811600,null,24.1394932782617,-71.352285290394803,null,2.8880840442261242,-78.698084509306796,null,0,0]
[158490,158.49,221.33731076820013,1.5662783203250379,1.1354155638623571,0.49338486835116208,1,0,6799.4888834966678,1.5706492569164485,27.916866290769981,1.5349680226367481,3.0421607821594772,1.235855035612011,1.3594840534865722,0.74428395261377089,8.9843149276507734,0.79869741891392598,1.021527334284215,0.28873711574823357,-18.704899896599937,-153.98700869271374,26.012991307286256,null,158490,25119080100,null,23.432018404276015,-72.85366184585007,null,2.2240988548222025,-78.015684875624999,null,0,0]
[173780,173.78,242.68996040227262,1.5666758315420444,1.1608848729446419,0.53275340824433814,1,0,7455.4557134473971,1.5706621968313594,30.60678524012981,1.5381180172964999,3.3051911098399667,1.2634248382696684,1.4211781111454627,0.79028677965398197,9.4337844979696257,0.84525116989214544,1.0258774536896393,0.31612701589887565,-20.108824848177711,-154.75491786087198,25.245082139128016,null,173780,30199488400,null,22.710792613055094,-74.253555184761154,null,1.5799315371798421,-77.352135088355482,null,0,0]
[190550,190.55,266.10948264937593,1.5670384661443328,1.1907935577467601,0.5739255792173672,1,0,8174.9170448096638,1.5706740013942824,33.557366192551328,1.5409921980296293,3.5961259943906532,1.2890047383058705,1.491997834655534,0.83626115467578432,9.9474733068297958,0.89143145682509117,1.0311073429216473,0.34602372112636387,-21.503906655061371,-155.44307481658026,24.556925183419736,null,190550,36309302500,null,21.97724597266555,-75.555173424757726,null,0.95653933742840214,-76.726875920593741,null,0,0]
[208930,208.93,291.7774241861103,1.567369050128457,1.2257711074697482,0.61666272258901789,1,0,8963.4500972061815,1.5706847626102101,36.791481880014722,1.5436127745948265,3.9172730027772693,1.3126594229558957,1.57289225895781,0.88178876485254898,10.531712953968359,0.93684434860110222,1.0373899738458217,0.37860251614723789,-22.885775143408512,-156.07919470819098,23.920805291809017,null,208930,43651744900,null,21.233618426891312,-76.760955617473272,null,0.3554073767910213,-76.16378649969208,null,0,0]
[229090,229.09,319.93119251968915,1.5676706496127633,1.2665585281667582,0.66073546921789417,1,0,9828.3481578461324,1.5706945802973504,40.339045253028118,1.5460039092979563,4.2716436977245653,1.3345016085534174,1.6649832749302218,0.9265367099954146,11.19405666924321,0.9811966789999329,1.0449425030633606,0.41409161056245097,-24.252877647334653,-156.6970266220342,23.302973377965799,null,229090,52482228100,null,20.480854944310856,-77.875981254127936,null,-0.22337990077366035,-75.689259832052883,null,0,0]
[251190,251.19,350.7942302605739,1.5679456489098798,1.3139102121536042,0.70580904508665376,1,0,10776.475497052204,1.5707035320772074,44.228211653947902,1.5481843968920825,4.6620833190184605,1.3546201463102692,1.769344222639085,0.97014350685090234,11.941693142622141,1.0241791123835988,1.0540158506381427,0.45267834223352066,-25.602749410261126,-157.33362820137444,22.666371798625562,null,251190,63096416100,null,19.720705756300674,-78.904268721525966,null,-0.7795834949211693,-75.33334733585346,null,0,0]
[275420,275.42,384.63187573072548,1.5681964353410911,1.3686669477045201,0.75154049415201507,1,0,11815.983435839818,1.5707116956673546,{"$f":"SQRT(1+(A599/Zero2)^2)","v":48.492417294284124},{"$f":"ATAN(A599/Zero2)","v":1.5501730841174921},5.09197302055356,1.3731239906095403,1.8871773283120832,1.0123232207328621,12.782738288129249,1.0655660089793377,1.064916619143162,0.4945735519151469,-26.934980425961569,-158.02948833351076,21.970511666489244,null,275420,75856176400,null,18.954211030391232,-79.850985260196751,null,-1.3141675461538918,-75.127916013796394,null,0,0]
[302000,302,421.75136303355816,1.5684252593256622,1.4317583332126,0.79757829067724406,1,0,12956.310345919404,1.5707191443274893,53.170379811851099,1.5519877539320635,5.5652365914070545,1.3901281854372789,2.0198239493630856,1.0528548572168501,13.726309751293831,1.1052004573690526,1.0780190217269792,0.54000267067779806,-28.250825828341092,-158.82704167773059,21.172958322269409,null,302000,91204000000,null,18.181949471871327,-80.721707714043333,null,-1.8291695733597675,-75.106151995459655,null,0,0]
[331130,331.13,462.43199606030817,1.5686338449858785,1.5040767608197092,0.84349037175715247,1,0,14206.036565214774,1.5707259341842459,58.297298331048658,1.5536420319084148,6.0854501151240363,1.4057212557772827,2.1685148916128973,1.0915110606223981,14.780759314634658,1.1429211045004253,1.0937507908723985,0.58911109742163437,-29.550807995087848,-159.76754945128556,20.232450548714439,null,331130,109647076900,null,17.405509580584638,-81.520730719038468,null,-2.3268306771512344,-75.301240190087938,null,0,0]
[363080,363.08,507.05083525575867,1.5688241366736604,1.5866887215254886,0.88892973273548714,1,0,15576.745549929305,1.5707321285323339,63.920693178664145,1.5551513025328194,6.6574465872971746,1.420017934318982,2.334825480189918,1.1281884045335886,15.956910844644728,1.1786865247842637,1.1126520780618885,0.64210624554849427,-30.838981774630319,-160.89213711715647,19.107862882843534,null,363080,131827086400,null,16.624994894054069,-82.253750134451494,null,-2.8112886078814228,-75.745057815691084,null,0,{"$f":"IF(AH602>0,W602,0)","v":0}]
[398110,398.11,555.9709760310094,1.5689976707817124,1.6806368336204172,0.93351506914426685,1,0,17079.591739375424,1.5707377773859978,70.08632599866138,1.5565277242005033,7.2858901481256293,1.433110119120115,2.5202759138143027,1.1627879785436381,17.265222603924407,1.2124563857314143,1.1353501580379037,0.69910874328891903,-32.119031467766341,-162.23757920860777,17.762420791392231,null,398110,158491572100,null,15.841317504954688,-82.925337572014527,null,-3.2870669341891134,-76.466451526344642,null,0,0]
[436520,436.52,609.6113747713157,1.5691559367203918,1.787061962749467,0.97692017538468778,1,0,18727.44564045671,1.5707429292296506,76.846999807467668,1.5577830897509066,7.9761695820474134,1.4450920716191367,2.7265910958834718,1.1952741902939821,18.717628540195829,1.2442475327595375,1.1626058849144902,0.76022185124668229,-33.39630780048897,-163.83630000733794,16.16369999266206,null,436520,190549710400,null,15.054933557532102,-83.540220912351089,null,-3.759824941864391,-77.490113259855463,null,0,0]
[478630,478.63,668.41891841998086,1.569300258467865,1.9071508633727832,1.0188537123592163,1,0,20534.035793874595,1.5707476271622265,84.259038870002996,1.5589278852549993,8.7340407646672649,1.4560501456984736,2.955601149361748,1.2256433401581843,20.326832702158114,1.274102728967071,1.195324575857353,0.82548239614823848,-34.676781007019265,-165.71418938125706,14.285810618742943,null,478630,229086676900,null,14.266393134667481,-84.102749530250563,null,-4.2358962483526241,-78.834921391301222,null,0,0]
[524810,524.80999999999995,732.91032013715915,1.5694319029591286,2.0422225716787579,1.0590935895731981,1,0,22515.235824819429,1.5707519124255287,92.387569161865642,1.5599721484289262,9.5661667944235784,1.4660699196655729,3.2094086836574052,1.2539368937359228,22.107482909363817,1.3021037997697507,1.2346069925312415,0.89489027791497877,-35.967685670248166,-167.89068200151419,12.109317998485807,null,524810,275425536100,null,13.475835530583531,-84.617253945762684,null,-4.7224355353566025,-80.513667624656449,null,0,0]
[575440,575.44000000000005,803.6162584135102,1.5695519514508083,2.1936160456105784,1.0974487989233004,1,0,24687.348375382175,1.57075582021699,101.2994776911429,1.5609244472421906,10.479398099126914,1.4752255784644199,3.4901746463989309,1.2802052056390434,24.074665529480594,1.3283364419926968,1.2817508621994091,0.96832998234264767,-37.276020055239712,-170.37595185338404,9.6240481466159622,null,575440,331131193600,null,12.683782133247439,-85.087495751258345,null,-5.2267399589182171,-82.530739393163515,null,0,0]
[630960,630.96,881.15120318451341,1.5696614475471076,2.3628396306320134,1.1338004279607194,1,0,27069.250189039962,1.5707593845082339,111.07221339754783,1.5617930533445814,11.481673437470635,1.4835905195254713,3.8003963566919818,1.3045307579546745,26.24585701180531,1.3529140261987889,1.3383337065482177,1.0456298538829587,-38.609621329650004,-173.17253993208357,6.8274600679164337,null,630960,398110521600,null,11.890333899357749,-85.517208325542214,null,-5.7565177481012366,-84.883174533936597,null,0,0]
[691830,691.83,966.15755492903816,1.5697612987361236,2.5514563347435053,1.1680645434453951,1,0,29680.676043067331,1.5707626348399446,121.78674635440785,1.5625851604140559,12.581298731528205,1.4912293479073933,4.1426892689194013,1.3269993088747731,28.639397306991871,1.3759498203193319,1.406224568873085,1.1264906223631987,-39.975756965045356,-176.27302764975533,3.7269723502446652,null,691830,478628748900,null,11.095869001331595,-85.909682790985229,null,-6.3191954928993033,-87.558687144785267,null,0,0]
[758580,758.58,1059.3754708087299,1.5698523742718649,2.7612412308841781,1.2002164873524617,1,0,32544.363833022599,1.5707655995081293,133.53636886655369,1.5633076601849154,13.787849867407983,1.4982049655015659,4.520069195517066,1.3477150923578112,31.276471182955746,1.3975734625858771,1.4876951876709772,1.2105448788664146,-41.381951155567293,-179.66249295590862,0.33750704409138166,null,758580,575443616400,null,10.300398309955884,-86.26812991444335,null,-6.9220960134621574,-90.537688850732181,null,0,0]
[831760,831.76,1161.5730385196873,1.5699354251637778,2.9940309393461848,1.2302544664312491,1,0,35683.90948826119,1.5707683029596591,146.41789430183869,1.5639665073987352,15.111269472972362,1.5045721544232706,4.9356731795795925,1.3667773222053212,34.179166869598106,1.4179079153509166,1.5854343717241326,1.2972874957394638,-42.834508228783676,-183.31629963812171,-3.3162996381217056,null,831760,691824697600,null,9.5042692518126177,-86.59534869906031,null,-7.571675753676228,-93.791383744470693,null,0,0]
[912010,912.01,1273.6440329092206,1.5700111779802322,3.2519485201116152,1.2582233638619558,1,0,39126.770090217273,1.5707707688457533,160.54397879951418,1.5645674636885822,16.563132366413143,1.5103845338396125,5.3931573150418828,1.384296924680849,37.373271551437291,1.4370880391754906,1.7027220474561882,1.3861647434908104,-44.339624849704634,-187.2043060700731,-7.2043060700731019,null,912010,831762240100,null,8.7074047226807263,-86.894082534672648,null,-8.2738688416906001,-97.285515475609344,null,0,0]
[1000000,1000,1396.524124585681,1.5700802631996797,3.5372173451912854,1.2841801133966793,1,0,42901.689771019352,1.5707730176896975,176.03255977133963,1.565115528993078,18.155560690873749,1.5156888952710854,5.8963578914950547,1.4003763891572458,40.885926778398073,1.4552401909734276,1.8434555750727812,1.4765108284191069,-45.901860904943987,-191.28890230917719,-11.288902309177189,null,1000000,1000000000000,null,7.9100325151692825,-87.166727078441198,null,-9.0332930368333137,-100.97871093503458,null,0,0]
[]
[]
["Pole/Zero Locations for Chart"]
[{"$f":"U4*1000","v":42172.5},null,{"$f":"SQRT(1+(A617/pole1)^2)","v":58.90338763284349},{"$f":"ATAN(A617/pole1)","v":1.5538185589181812},{"$f":"SQRT(1+(A617/Zero1)^2)","v":1.0101852073883086},{"$f":"ATAN(A617/Zero1)","v":0.14212321018185228},{"$f":"IF(VIN_nom>Vout, 1, SQRT(1+(A617/z_RHP)^2))","v":1},{"$f":"IF(VIN_nom>Vout, 0, -ATAN(A617/z_RHP))","v":0},{"$f":"SQRT(1+(A617/Pole2)^2)","v":1809.271787731112},{"$f":"ATAN(A617/Pole2)","v":1.5702436182092128},{"$f":"SQRT(1+(A617/Zero2)^2)","v":7.4906631896328024},{"$f":"ATAN(A617/Zero2)","v":1.436897043576403},{"$f":"SQRT(1+(A617/pole4)^2)","v":1.2587553214701761},{"$f":"ATAN(A617/pole4)","v":0.65271864940703528},{"$f":"IF(VOUT_setting=1,1,SQRT(1+(A617*zterm1)^2))","v":1.029589889868785},{"$f":"IF(VOUT_setting=1,0,ATAN(((A617*zterm1))))","v":0.24032567928293358},{"$f":"IF(VOUT_setting=1,1,SQRT((1+Afbr-$Q$5*(A617)^2)^2+(A617*$Q$4)^2))","v":6.5335171337501725},{"$f":"IF(VOUT_setting=1,0,ATAN(A617*$Q$4/(1+Afbr-$Q$5*(A617)^2)))","v":0.26524957630177665},{"$f":"SQRT((1-(A617^2/(pole3^2)))^2+(A617/(Q*pole3))^2)","v":1.0015252778043842},{"$f":"ATAN((A617/(Q*pole3))/(1-A617^2/pole3^2))","v":7.7357083303609117E-2},{"$f":"20*LOG10(((E617*K617*G617*O617)/(C617*I617*S617*M617*Q617))*Adc)","v":3.9971767527796388E-2},{"$f":"((F617+L617+H617+P617)-(D617+J617+T617+N617+R617))*radconv","v":-131.78267384784996},{"$f":"IF(V617>0,V617,V617+180)","v":48.217326152150036},"crossover",null,null,null,{"$f":"20*LOG10((K617/(I617*M617))*AEA)","v":31.169356484949752},{"$f":"(L617-(J617+N617))*radconv","v":-45.038219810952292},null,{"$f":"20*LOG10((E617*G617/(C617*S617))*Acs*Am)","v":12.87907075635804},{"$f":"(F617+H617-(D617+T617))*radconv","v":-85.3164199270675}]
[{"$f":"A617","v":42172.5},null,null,null,null,null,null,null,null,null,null,null,null,null,null,null,null,null,null,null,null,-135]
[{"$f":"A618","v":42172.5}]
[1000000,null,null,null,null,null,null,null,null,null,null,null,null,null,null,null,null,null,null,null,null,{"$f":"V617","v":-131.78267384784996}]
[]
[{"$f":"pole1","v":716.0637176033531},null,1.4142135623730951,0.78539816339744828,1.0000029513448434,2.4295421728493475E-3,{"$f":"IF(VIN_nom>Vout, 1, SQRT(1+(A622/z_RHP)^2))","v":1},{"$f":"IF(VIN_nom>Vout, 0, -ATAN(A622/z_RHP))","v":0},30.736615011002016,1.538256097521145,1.0079128053341531,0.12538722553603479,1.0000842470754214,{"$f":"ATAN(A622/pole4)","v":1.2980074052575601E-2},{"$f":"IF(VOUT_setting=1,1,SQRT(1+(A622*zterm1)^2))","v":1.0000086569400128},{"$f":"IF(VOUT_setting=1,0,ATAN(((A622*zterm1))))","v":4.1609800674920656E-3},{"$f":"IF(VOUT_setting=1,1,SQRT((1+Afbr-$Q$5*(A622)^2)^2+(A622*$Q$4)^2))","v":6.307921847726969},{"$f":"IF(VOUT_setting=1,0,ATAN(A622*$Q$4/(1+Afbr-$Q$5*(A622)^2)))","v":4.6103580904489115E-3},{"$f":"SQRT((1-(A622^2/(pole3^2)))^2+(A622/(Q*pole3))^2)","v":1.0000004397615161},{"$f":"ATAN((A622/(Q*pole3))/(1-A622^2/pole3^2))","v":1.3141684188898264E-3},{"$f":"20*LOG10(((E622*K622*G622*O622)/(C622*I622*S622*M622*Q622))*Adc)","v":52.382825695174297},{"$f":"((F622+L622+H622+P622)-(D622+J622+T622+N622+R622))*radconv","v":-126.65696823130253},53.343031768697472,"p1",null,null,null,{"$f":"20*LOG10((K622/(I622*M622))*AEA)","v":51.142460481811263},{"$f":"(L622-(J622+N622))*radconv","v":-81.695126924486345},null,{"$f":"20*LOG10((E622*G622/(C622*S622))*Acs*Am)","v":45.196816273498889},{"$f":"(F622+H622-(D622+T622))*radconv","v":-44.936093842665429}]
[{"$f":"Zero1","v":294731.37643288216},null,411.60058670933847,1.5683667846220473,1.4142135623730951,0.78539816339744828,1,0,12644.47411361704,1.5707172408643899,51.891117936630607,1.5515240130323862,5.4356671845010753,1.3857723952329195,{"$f":"IF(VOUT_setting=1,1,SQRT(1+(A623*zterm1)^2))","v":1.9832365242479553},{"$f":"IF(VOUT_setting=1,0,ATAN(((A623*zterm1))))","v":1.042310534992589},{"$f":"IF(VOUT_setting=1,1,SQRT((1+Afbr-$Q$5*(A623)^2)^2+(A623*$Q$4)^2))","v":13.466348287366767},{"$f":"IF(VOUT_setting=1,0,ATAN(A623*$Q$4/(1+Afbr-$Q$5*(A623)^2)))","v":1.0948998137270196},1.0743171973070091,0.52763663582440679,-27.90444101784535,-158.60389429950592,21.396105700494076,"z1",null,null,null,{"$f":"20*LOG10((K623/(I623*M623))*AEA)","v":18.386641656742711},{"$f":"(L623-(J623+N623))*radconv","v":-80.49860065457122},null,-1.694775888029628,-75.092149922371703]
[{"$f":"Pole2","v":23.309105203291317},null,1.0005296669442008,3.2540229273751706E-2,1.0000000031272922,7.90859305066325E-5,1,0,1.4142135623730951,0.78539816339744828,1.0000084176598769,4.1030722220754883E-3,1.0000000892731737,4.2254743397716481E-4,1.0000000091730583,1.3544783643510197E-4,6.3078556964964827,1.500761256263516E-4,1.0000000004659777,4.2778448099586878E-5,82.063686029085815,-46.652297192056217,133.34770280794379,"p2",null,null,{"$f":"Pole2","v":23.309105203291317},{"$f":"20*LOG10((K624/(I624*M624))*AEA)","v":77.817626085664756},{"$f":"(L624-(J624+N624))*radconv","v":-44.789121514427713},null,48.20249502730411,-1.8623375383953862]
[{"$f":"Zero2","v":5680.8589118273958},null,7.9962303657719387,1.4454091012588619,1.0001857397837137,1.9272313762510426E-2,1,0,243.72049814093089,1.5666932545728212,1.4142135623730951,0.78539816339744828,1.005288723718337,0.10262085166211297,1.0005447192067869,3.2999153195894734E-2,6.3120222273588018,3.6560320470310631E-2,1.0000276784309889,1.042579723095456E-2,22.247817038622454,-133.15766608731317,46.842333912686826,"z2",null,null,{"$f":"Zero2","v":5680.8589118273958},{"$f":"20*LOG10((K625/(I625*M625))*AEA)","v":36.054496295242657},{"$f":"(L625-(J625+N625))*radconv","v":-50.644653026784816},null,30.150761224926455,-82.308973205331071]
[{"$f":"pole3","v":1100000},null,1536.1764686927283,1.5701453598708444,3.8638590711900616,1.3090077409742333,1,0,47191.85874589633,1.5707751366992604,193.63527349265897,1.5656319555153346,19.965858474906611,1.5206898629627048,6.4697846969865358,1.4156095351689859,44.888719297929505,1.4730790565488856,2.0187944799561039,{"$error":"#DIV/0!"},-47.582450534200134,{"$error":"#DIV/0!"},{"$error":"#DIV/0!"},"p3",null,null,null,{"$f":"20*LOG10((K626/(I626*M626))*AEA)","v":7.0844417365295822},{"$f":"(L626-(J626+N626))*radconv","v":-87.423793771096783},null,-9.8831443664687342,{"$error":"#DIV/0!"}]
[{"$f":"Fp2_u","v":55163.283318623115},null,{"$f":"SQRT(1+(A627/pole1)^2)","v":77.043326323750904},{"$f":"ATAN(A627/pole1)","v":1.5578162527423209},{"$f":"SQRT(1+(A627/Zero1)^2)","v":1.0173645322511449},{"$f":"ATAN(A627/Zero1)","v":0.185023931561977},1,0,{"$f":"SQRT(1+(A627/Pole2)^2)","v":2366.5982783172331},{"$f":"ATAN(A627/Pole2)","v":1.5703737793609194},{"$f":"SQRT(1+(A627/Zero2)^2)","v":9.7617327844625361},{"$f":"ATAN(A627/Zero2)","v":1.4681754751327836},{"$f":"SQRT(1+(A627/pole4)^2)","v":1.4142135623730951},0.78539816339744828,1.05012031722798,0.31020231121904002,6.6893271198478974,0.34151569785161739,1.0026095986076748,0.1011482720665255,-3.3167778579828946,-137.10023180468849,{"$f":"IF(V627>0,V627,V627+180)","v":42.899768195311509},"p4",null,null,null,null,null,null,10.59928861261149,-84.450575342553236]
[{"$f":"z_RHP","v":0},null,{"$f":"SQRT(1+(A628/pole1)^2)","v":1},{"$f":"ATAN(A628/pole1)","v":0},{"$f":"SQRT(1+(A628/Zero1)^2)","v":1},{"$f":"ATAN(A628/Zero1)","v":0},1,0,{"$f":"SQRT(1+(A628/Pole2)^2)","v":1},{"$f":"ATAN(A628/Pole2)","v":0},{"$f":"SQRT(1+(A628/Zero2)^2)","v":1},{"$f":"ATAN(A628/Zero2)","v":0},{"$f":"SQRT(1+(A628/pole4)^2)","v":1},0,1,0,6.3078556263269636,0,1,0,85.078513051068484,0,{"$f":"IF(V628>0,V628,V628+180)","v":180},"z_RHP",null,null,null,null,null,null,48.207094414840093,0]
[{"$f":"Fp2_u","v":55163.283318623115},null,null,null,null,null,null,null,null,null,null,null,null,null,null,null,null,null,null,null,-25]
[]
[null,null,null,"System","Plant"]
["p1","p-dom",{"$f":"pole1","v":716.0637176033531},{"$f":"U622","v":52.382825695174297},{"$f":"AE622","v":45.196816273498889}]
["z1","ESR zero",{"$f":"Zero1","v":294731.37643288216},{"$f":"U623","v":-27.90444101784535},{"$f":"AE623","v":-1.694775888029628}]
["p2","EA pole",{"$f":"Pole2","v":23.309105203291317},{"$f":"U624","v":82.063686029085815},{"$f":"AE624","v":48.20249502730411}]
["z2","EA zero",{"$f":"Zero2","v":5680.8589118273958},{"$f":"U625","v":22.247817038622454},{"$f":"AE625","v":30.150761224926455}]
["p3","p_sampling",{"$f":"pole3","v":1100000},{"$f":"U626","v":-47.582450534200134},{"$f":"AE626","v":-9.8831443664687342}]
[]
[]
[{"$f":"U4*1000","v":42172.5}]
[{"$f":"U4*1000","v":42172.5}]
[]
[]
[]
[]
[]
[]
[]
[]
[]
[]
[]
[]
[]
[]
[]
[]
[]
[]
[]
[]
[]
[]
[]
[]
[]
[]
[]
[]
[]
[]
[]
[]
[]
[]
[]
[]
[]
[]
[]
[]
[]
[]
[]
[]
[]
[]
[null,null,null,null,null,null,null,null,null,null,null,null,null,null,null,null,null,null,null,null,null,null,null,null,null,null,null,null,null,null,null,null,null,"phase margin",{"$f":"SUM(AI689:AI1306)","v":0}]

{"sheet":"Bode Plot Management","index":8,"n_rows":6,"n_cols":14,"rows_kept":6,"cut":false,"hidden":true,"merged":[]}
[null,null,null,null,null,null,null,null,null,"Single or dual output (MODE)",null,null,null,"3.3V or 5V fixed (FB1/2)"]
[{"$f":"CHOOSE(BODE_PLOT_TYPE, \"BODE_PLOT_Ch1\", \"BODE_PLOT_Ch2\")","v":"BODE_PLOT_Ch1"},null,null,null,null,null,null,null,null,"With/without dither (DITH)",null,null,null,"With/without VOUT connected to VCCX"]
[null,null,null,null,null,null,null,null,null,"FPWM or DEM (DEMB)"]
[null,null,null,null,null,null,null,null,null,"Shunt or inductor DCR current sensing"]
[]
[null,null,null,null,null,{"$f":"INDIRECT(A2)","v":0}]

{"sheet":"Efficiency Calculations","index":9,"n_rows":109,"n_cols":57,"rows_kept":109,"cut":false,"hidden":true,"merged":[[6,51,6,56],[6,27,6,32],[6,33,6,36],[6,40,6,44],[6,45,6,49],[6,24,6,26],[0,0,3,3],[5,0,6,3],[6,6,6,13],[6,17,6,20],[6,21,6,23]]}
["BUCK CONTROLLER POWER DESIGN TOOL"]
[null,null,null,null,null,null,null,{"$f":"AV19","v":0.56985800393603148},"10% load"]
[null,null,null,null,null,null,null,{"$f":"AV59","v":0.79145970728401749},"50% load",null,null,null,null,null,null,null,null,null,null,null,null,null,null,null,null,null,null,null,null,null,null,null,null,null,null,null,null,null,null,null,null,{"$f":"IF(MODE=1, (Qg_Q1+Qg_Q2)*Fsw*Vin, (Qg_Q1+Qg_Q2+Qg_Q3+Qg_Q4)*Fsw*Vin)","v":2.1120000000000001}]
[null,null,null,null,null,null,null,{"$f":"AV109","v":0.83483416313212655},"100% load",null,null,null,null,null,null,null,null,null,null,null,null,null,null,null,null,null,null,null,null,null,null,null,null,null,null,null,null,null,null,null,"I_VCC",{"$f":"(Qg_Q1+Qg_Q2)*Fsw*1000","v":88.000000000000014},"mA",{"$f":"AP4*5/1000","v":0.44000000000000006}]
[]
["Enter the values of your design and MOSFET datasheet specifications below. Note that thermal resistance (θJA) will change when components are placed on the PCB"]
[null,null,null,null,null,null,"Operating Point Condtions",null,null,null,null,null,null,null,null,null,null,"Filter Inductor",null,null,null,"Cout",null,null,"Cin",null,null,"High-side BUCK \"Control\" MOSFET Losses ",null,null,null,null,null,"Low-side BUCK \"Sync\" MOSFET Losses ",null,null,null,"External Diode","Diode/FET","Sense Rs","Controller IC Losses",null,null,null,null,"RESULTS",null,null,null,null,null,"Consolidated Buck/Boost Efficiency & Losses"]
["Input Parameters",null,null,null,null,null,"Step","Vin","Mode","Iout","Iout/ phase","Iin","Duty Cycle BUCK Leg","Ripple Current pk-pk","Peak Inductor Current","Valley Inductor Current","SW node voltage at Q1 turn-on","Irms Lf","DCR    Loss","Core Loss","Total Inductor Loss","Irms Cout","Cout ESR Loss","Total Cout Loss","Irms Cin","Cin ESR Loss","Total Cin Loss","Irms","RDS(on) Loss","Transition Loss (not including capacitive loss)","MOSFET Output Capacitance Loss","Dead Time Loss ","Total Control MOSFET Loss","Irms","RDS(on) Loss","Deadtime Loss","Total Sync MOSFET Loss","Deadtime Loss","Reverse Recovery Loss","Isense Shunt Loss","IQ Loss","Switching Current Loss","Switching Current Diss","LDO Loss Saved from Gate Drive Current (ext VCC)","Total IC Loss","Total Loss","Pout","EFF, h",{"$f":"IF(Vin>Vout, \"Buck ''CONTROL'' MOSFET Temp Rise\", \"Boost ''CONTROL'' MOSFET Temp Rise\")","v":"Buck ''CONTROL'' MOSFET Temp Rise"},{"$f":"IF(Vin>Vout, \"Buck ''SYNC'' MOSFET Temp Rise\", \"Boost ''SYNC'' MOSFET Temp Rise\")","v":"Buck ''SYNC'' MOSFET Temp Rise"},null,"h","Inductor Cu & Core Loss","Total MOSFET Loss","Control MOSFET Loss","SYNC MOSFET Loss","Shunt Loss"]
["Design","Input Value","Units","Description",null,null,0,{"$f":"Vin","v":24},{"$f":"MODE","v":1},0,{"$f":"Iout*G9/100/Number_of_Phases","v":0},{"$f":"Vout*K9/(Vin*Efficiency)","v":0},{"$f":"(Vout+(Rdson2+Rs+Rdcr)*K9)/(Vin+(Rs+Rdson2-Rdson1)*K9)","v":0.20833333333333334},{"$f":"(Vin-(Rdson1+Rdcr)*K9-Vout)*M9/(Fsw*Lf)","v":2.6459447415329764},{"$f":"K9+N9/2","v":1.3229723707664882},{"$f":"K9-N9/2","v":-1.3229723707664882},{"$f":"IF(MIN(Vin, -P9/(Coss_Q1+Coss_Q2)*0.00000002)<0, 0, MIN(Vin, -P9/(Coss_Q1+Coss_Q2)*0.00000002))","v":24},{"$f":"SQRT(K9^2+(N9^2)/12)","v":0.76381845439246931},{"$f":"R9^2*Rdcr","v":1.2835209887951018E-3},{"$f":"Core_Loss_Ch1","v":0.2},{"$f":"(T9+S9*(1+Ltc*(Ta-25)))/(1-S9*Ltc*ThetaCa)","v":0.20130419124116236},{"$f":"N9/SQRT(12)","v":0.76381845439246943},{"$f":"RCoutEsr*V9^2","v":5.8341863127050087E-4},{"$f":"W9","v":5.8341863127050087E-4},{"$f":"SQRT(M9*(1-M9))*SQRT(K9^2+(N9^2)/12)","v":0.31019922465555178},{"$f":"RCinEsr*Y9^2","v":9.622355897690547E-5},{"$f":"Z9","v":9.622355897690547E-5},{"$f":"SQRT(M9)*SQRT(K9^2+(N9^2)/12)","v":0.34863383109123869},{"$f":"Rdson1*AB9^2","v":4.8618219272541743E-4},{"$f":"(Vin*K9/2)*Fsw*(Tr_buck+Tf_buck)","v":0},{"$f":"(0.5*Coss_Q1*(Vin-Q9)^2-0.5*Coss_Q2*(Vin-Q9)^2+(Qoss_Q2*(Vin-Q9)/Vin)*Vin)*Fsw","v":0},{"$f":"IF(K9>N9/2,0,ABS(K9-N9/2)*Vsd_Q1*Deadtime*Fsw)","v":3.2598039215686277E-2},{"$f":"(AF9+AE9+AD9+AC9*(1+RdsonTopTc*Ta-RdsonTopTc*25))/(1-AC9*RdsonTopTc*ThetaJA_Q1)","v":3.3087438713112739E-2},{"$f":"SQRT((1-M9))*SQRT(K9^2+(N9^2)/12)","v":0.67961245065783371},{"$f":"Rdson2*AH9^2","v":1.8474923323565859E-3},{"$f":"IF(K9<N9/2,Deadtime*Fsw*IF(VfdSky_Q2>0,0,Vsd_Q2)*(K9+N9/2),2*Deadtime*Fsw*IF(VfdSky_Q2>0,0,Vsd_Q2)*K9)","v":3.259803921568627E-2},{"$f":"(AJ9+AI9*(1+RdsonBotTc*Ta-RdsonBotTc*25))/(1-AI9*RdsonBotTc*ThetaJA_Q2)","v":3.4458263823682972E-2},{"$f":"2*Deadtime*Fsw*IF(VfdSky_Q2>0,VfdSky_Q2,Vsd_Q2)*K9","v":0},{"$f":"IF(QrrSky_Q2>0,QrrSky_Q2,Qrr_Q2*K9/(Iout/Number_of_Phases))*Fsw*Vin","v":0},{"$f":"Rs*R9^2","v":2.333674525082003E-3},{"$f":"Iq*Vin","v":5.2800000000000003E-5},{"$f":"IF(Ext_VCC=1,  (Qg_Q1+Qg_Q2)*Fsw*VCC, (Qg_Q1+Qg_Q2)*Fsw*Vin)","v":2.1120000000000001},{"$f":"(Vin-VCC)*Fsw*(Qg_Q1+Qg_Q2)+(RdsonDRT+RdsonDRT2)*Fsw*Qg_Q1*VCC/(RdsonDRT+2*Rgate1+RdsonDRT2)+(RdsonDRB+RdsonDRB2)*Fsw*Qg_Q2*VCC/(RdsonDRB+2*Rgate2+RdsonDRB2)","v":1.841230769230769},{"$f":"(Qg_Q1+Qg_Q2)*Fsw*(Vin-VCC)","v":1.6720000000000002},{"$f":"SUM(AO9:AP9)","v":2.1120528000000003},{"$f":" SUM(U9,X9,AA9,AG9,AK9,AL9,AM9,AS9,AN9)","v":2.3839160104932882},{"$f":"Vout*K9","v":0},{"$f":"AU9/(AU9+AT9)","v":0},{"$f":"ThetaJA_Q1*BC9","v":1.654371935655637},{"$f":"ThetaJA_Q2*BD9","v":1.7229131911841487},null,{"$f":"AV9*100","v":0},{"$f":"U9","v":0.20130419124116236},{"$f":"AG9+AK9+AM9","v":6.7545702536795704E-2},{"$f":"AG9+AM9*0.66","v":3.3087438713112739E-2},{"$f":"AK9+AM9*0.33","v":3.4458263823682972E-2},{"$f":"AN9","v":2.333674525082003E-3}]
[null,null,null,null,null,null,1,24,1,{"$f":"Iout*G10/100","v":0.1},0.1,2.3148148148148147E-2,0.20837236046065899,2.6463540493910656,{"$f":"K10+N10/2","v":1.4231770246955329},{"$f":"K10-N10/2","v":-1.2231770246955327},24,{"$f":"SQRT(K10^2+(N10^2)/12)","v":0.7704538572993026},1.3059181217002231E-3,0.2,0.20132695144284229,{"$f":"N10/SQRT(12)","v":0.763936611393494},5.8359914622737436E-4,{"$f":"W10","v":5.8359914622737436E-4},{"$f":"SQRT(M10*(1-M10))*SQRT(K10^2+(N10^2)/12)","v":0.31291556342616667},9.791614983431534E-5,{"$f":"Z10","v":9.791614983431534E-5},{"$f":"SQRT(M10)*SQRT(K10^2+(N10^2)/12)","v":0.35169540125914334},4.9475862106731941E-4,2.8751416464891044E-2,0,3.0139081888497926E-2,5.9391133829551718E-2,0.68549944636049431,1.8796379638421771E-3,3.5067081888497928E-2,3.6960614367126381E-2,4.9280000000000001E-3,9.5039999999999986E-3,2.3743965849094962E-3,5.2800000000000003E-5,2.1120000000000001,1.841230769230769,1.6720000000000002,2.1120528000000003,2.4272194115204919,0.5,{"$f":"AU10/(AU10+AT10)","v":0.17081056446680365},3.2831886914775859,2.004846718356319,null,{"$f":"AV10*100","v":17.081056446680364},0.20132695144284229,0.1058557481966781,6.5663773829551714E-2,4.0096934367126379E-2,2.3743965849094962E-3]
["Vin",{"$f":"Vin","v":24},"V","Vin",null,null,2,24,1,0.2,0.2,4.6296296296296294E-2,0.20841138628712375,2.6467633083799162,1.5233816541899581,-1.1233816541899582,24,0.78979723192022522,1.3723152686074703E-3,0.2,0.20139442540020663,0.76405475428718461,5.8377966754885006E-4,5.8377966754885006E-4,0.32079389731743435,1.0290872455610862E-4,1.0290872455610862E-4,0.36055898997470165,5.2001114100630799E-4,5.7502832929782088E-2,0,2.7680123959240573E-2,8.5711882256767E-2,0.7026925944517084,1.9751075291890925E-3,3.7536123959240567E-2,3.9526845442437349E-2,9.8560000000000002E-3,1.9007999999999997E-2,2.4951186701954002E-3,5.2800000000000003E-5,2.1120000000000001,1.841230769230769,1.6720000000000002,2.1120528000000003,2.4707317601617116,1,0.28812367797429755,4.9128581128383502,2.2899742721218677,null,28.812367797429754,0.20139442540020663,0.14424672769920435,9.8257162256767006E-2,4.5799485442437352E-2,2.4951186701954002E-3]
["Vout",{"$f":"Vout","v":5},"V","Vout",null,null,3,24,1,0.3,0.3,6.9444444444444434E-2,0.20845041081279267,2.6471725185019706,1.6235862592509853,-1.0235862592509852,24,0.82095078733502991,1.4827124294972121E-3,0.2,0.20150661453845739,0.76417288307424613,5.8396019522600551E-4,5.8396019522600551E-4,0.33347061103905012,1.1120264842675746E-4,1.1120264842675746E-4,0.37481632777445911,5.6194911826532316E-4,8.6254249394673119E-2,0,2.5221165427944277E-2,0.11204995721581454,0.73039230257422261,2.1338916626386989E-3,4.0005165427944279E-2,4.2157048805576511E-2,1.4783999999999999E-2,2.8512000000000003E-2,2.6958407809040221E-3,5.2800000000000003E-5,2.1120000000000001,1.841230769230769,1.6720000000000002,2.1120528000000003,2.5144534241844054,1.5,0.37364986998317135,6.5433938607907276,2.5783004402788254,null,37.364986998317136,0.20150661453845739,0.18271900602139104,0.13086787721581455,5.1566008805576512E-2,2.6958407809040221E-3]
["Fsw",{"$f":"Fsw/1000","v":2200},"kHz","Switching Frequency",null,null,4,24,1,0.4,0.4,9.2592592592592587E-2,0.20848943403773082,2.6475816797596736,1.7237908398798369,-0.92379083987983679,24,0.8626359192903581,1.6371096043498268E-3,0.2,0.20166352122734568,0.76429099775538456,5.8414072924992122E-4,5.8414072924992122E-4,0.3504272909952163,1.2279928627424602E-4,1.2279928627424602E-4,0.39388510949989003,6.2058191794296148E-4,0.11500566585956418,0,2.2762206294639178E-2,0.13840563247871784,0.76746025940382134,2.3559809990567229E-3,4.2474206294639182E-2,4.4851321065738602E-2,1.9712E-2,3.8015999999999994E-2,2.9765629169996853E-3,5.2800000000000003E-5,2.1120000000000001,1.841230769230769,1.6720000000000002,2.1120528000000003,2.558384777704326,2,0.43875190391611285,8.1748096239358912,2.8698300532869299,null,43.875190391611284,0.20166352122734568,0.22127295354445645,0.16349619247871783,5.7396601065738601E-2,2.9765629169996853E-3]
["Iout",{"$f":"Iout","v":10},"A","Max Output Current",null,null,5,24,1,0.5,0.5,0.11574074074074073,0.20852845596200317,2.6479907921554662,1.8239953960777331,-0.82399539607773309,24,0.91341188387916095,1.8355067931456915E-3,0.2,0.20186514878129672,0.76440909833130444,5.8432126961167788E-4,5.8432126961167788E-4,0.37107950963390285,1.377000024701378E-4,1.377000024701378E-4,0.41710877014081271,6.959189045135254E-4,0.14375708232445519,0,2.0303246559355344E-2,0.16477918237794148,0.81261401875878103,2.641366173933186E-3,4.4943246559355339E-2,4.7609763697164256E-2,2.4639999999999999E-2,4.752E-2,3.3372850784467115E-3,5.2800000000000003E-5,2.1120000000000001,1.841230769230769,1.6720000000000002,2.1120528000000003,2.6025262012069312,2.5,0.48995338807053257,9.8071191188970737,3.1645681848582132,null,48.995338807053258,0.20186514878129672,0.25990894607510573,0.19614238237794149,6.329136369716426E-2,3.3372850784467115E-3]
["Ta",{"$f":"Ta","v":25},"°C","Ambient Temperature",null,null,6,24,1,0.6,0.6,0.13888888888888887,0.20856747658567476,2.648399855691792,1.9241999278458959,-0.72419992784589604,21.489612102252106,0.97185483293666797,2.0779039958651897E-3,0.2,0.20211150145958465,0.76452718480271109,5.8450181630235879E-4,5.8450181630235879E-4,0.39484954214187135,1.5590616092964543E-4,1.5590616092964543E-4,0.44383821428170139,7.8796944182707798E-4,0.17250849878934624,0.16568560125136095,1.784428622212288E-2,0.35688259822100077,0.86458629172893398,2.9900378233823576E-3,4.7412286222122874E-2,5.0432483051875671E-2,2.9567999999999997E-2,5.7024000000000005E-2,3.7780072652094355E-3,5.2800000000000003E-5,2.1120000000000001,1.841230769230769,1.6720000000000002,2.1120528000000003,2.8125897979749026,3,0.51612105864501145,19.725921911050037,3.4625201525937834,null,51.612105864501146,0.20211150145958465,0.46433908127287643,0.39451843822100074,6.9250403051875672E-2,3.7780072652094355E-3]
["Vcc",{"$f":"VCC","v":5},"V","Subregulated VCC Voltage",null,null,7,24,1,0.7,0.7,0.16203703703703703,0.20860649590881061,2.6488088703710941,2.0244044351855468,-0.62440443518554711,18.528321518858966,1.0366688812311524,2.3643012124887081E-3,0.2,0.20240258446655793,0.76464525717030996,5.8468236931304943E-4,5.8468236931304943E-4,0.42121149688926862,1.7741912511169835E-4,1.7741912511169835E-4,0.47348254801774214,8.9674289310949398E-4,0.20125991525423725,0.36113077975530822,1.538532528297188E-2,0.57877656594006777,0.92222375052677741,3.401986584142703E-3,4.9881325282971872E-2,5.3319590373338992E-2,3.4495999999999999E-2,6.652799999999999E-2,4.2987294772521964E-3,5.2800000000000003E-5,2.1120000000000001,1.841230769230769,1.6720000000000002,2.1120528000000003,3.052636371751642,3.5,0.53413615550047444,31.134252297003389,3.7636915186669491,null,53.413615550047446,0.20240258446655793,0.6986241563134068,0.62268504594006779,7.5273830373338985E-2,4.2987294772521964E-3]
["Components","Input Value","Units","Description",null,null,8,24,1,0.8,0.8,0.18518518518518517,0.20864551393147582,2.6492178361958154,2.1246089180979078,-0.52460891809790766,15.567030210620404,1.1067352567957869,2.69469844299664E-3,0.2,0.20273840395191384,0.76476331543480602,5.8486292863483657E-4,5.8486292863483657E-4,0.44971130519368935,2.0224025801901161E-4,2.0224025801901161E-4,0.505531557116495,1.0222486209625122E-3,0.23001133171912835,0.55657600609905333,1.2926363741932446E-2,0.80069965300429446,0.98453073765840771,3.8772030935768339E-3,5.2350363741932443E-2,5.6271201811057506E-2,3.9424000000000001E-2,7.6031999999999988E-2,4.8994517145393452E-3,5.2800000000000003E-5,2.1120000000000001,1.841230769230769,1.6720000000000002,2.1120528000000003,3.2929046136684597,4,0.54847831034333649,42.544038650214723,4.0680880905528749,null,54.847831034333652,0.20273840395191384,0.93300285481535195,0.85088077300429443,8.1361761811057504E-2,4.8994517145393452E-3]
["L",{"$f":"Lf*1000000","v":0.68},"uH","Filter Inductance",null,null,9,24,1,0.9,0.9,0.20833333333333331,0.20868453065373527,2.649626753168397,2.2248133765841986,-0.42481337658419849,12.605738177572654,1.1811195935462286,3.0690956873693784E-3,0.2,0.2031189670110235,0.76488135959690406,5.850434942588084E-4,5.850434942588084E-4,0.47996970966734337,2.3037092219815389E-4,2.3037092219815389E-4,0.53955907632153333,1.1644959873637849E-3,0.25876274818401934,0.75202128028020476,1.0467401599034653E-2,1.0226541013701238,1.0506757337151467,4.4156779896714479E-3,5.4819401599034652E-2,5.9287438436099356E-2,4.4351999999999996E-2,8.5536000000000001E-2,5.5801739770352339E-3,5.2800000000000003E-5,2.1120000000000001,1.841230769230769,1.6720000000000002,2.1120528000000003,3.5333968952107391,4.5,0.5601615429561011,53.955393068506183,4.3757159218049679,null,56.016154295610107,0.2031189670110235,1.1674775398062232,1.0791078613701237,8.7514318436099359E-2,5.5801739770352339E-3]
["Rdcr",{"$f":"Rdcr*1000","v":2.2000000000000002},"mW","Inductor DCR at 25°C",null,null,10,24,1,1,1,0.23148148148148145,0.20872354607565405,2.6500356212912815,2.3250178106456407,-0.32501781064564073,9.6444454197519498,1.2590568161032509,3.4874929455873224E-3,0.2,0.20354428168530669,0.76499938965730929,5.852240661760557E-4,5.852240661760557E-4,0.51167614732330102,2.6181247973961646E-4,2.6181247973961646E-4,0.57521612322390059,1.3234943536669344E-3,0.28751416464891039,0.94746660229637136,8.0084388543085888E-3,1.2446421555262923,1.1199778916386349,5.0174019110372876E-3,5.7288438854308586E-2,6.2368426257564488E-2,4.9279999999999997E-2,9.5039999999999999E-2,6.3408962647042225E-3,5.2800000000000003E-5,2.1120000000000001,1.841230769230769,1.6720000000000002,2.1120528000000003,3.7741155962797834,5,0.56985800393603148,65.368427776314618,4.6865813128782241,null,56.985800393603149,0.20354428168530669,1.4020505817838569,1.3073685555262924,9.3731626257564482E-2,6.3408962647042225E-3]
["LTc",{"$f":"Ltc*1000000","v":4000},"ppm","Inductor Series Resistance Temp Co",null,null,11,24,1,1.1000000000000001,1.1000000000000001,0.25462962962962959,0.20876256019729714,2.6504444405669112,2.4252222202834557,-0.22522222028345551,6.6831519371945252,1.339927104128307,3.9498902176308762E-3,0.2,0.20401435696265671,0.7651174056167267,5.8540464437767067E-4,5.8540464437767067E-4,0.54457900462456466,2.9656629227788165E-4,2.9656629227788165E-4,0.61221995242755711,1.4992530806016012E-3,0.31626558111380149,1.1429119721451613,5.549475507784344E-3,1.4666660625698531,1.1918856380656957,5.6823654969090824E-3,5.9757475507784347E-2,6.5514296239995107E-2,5.4207999999999999E-2,0.10454400000000001,7.1816185775106832E-3,5.2800000000000003E-5,2.1120000000000001,1.841230769230769,1.6720000000000002,2.1120528000000003,4.0150631052866723,5.5,0.5780308484705835,76.783255128492655,5.000690811999756,null,57.803084847058351,0.20401435696265671,1.6367243588098481,1.5356651025698531,0.10001381623999511,7.1816185775106832E-3]
["ThetaCa",{"$f":"ThetaCa","v":20},"°C/W","Core to Ambient Thermal Resistance",null,null,12,24,1,1.2,1.2,0.27777777777777773,0.20880157301872959,2.6508532109977287,2.5254266054988643,-0.12542660549886442,3.7218577299366298,1.4232305606804356,4.4562875034804437E-3,0.2,0.20452920277791536,0.76523540747586127,5.8558522885474745E-4,5.8558522885474745E-4,0.57847534173159909,3.3463372099149034E-4,3.3463372099149034E-4,0.65034251134950005,1.6917815282734986E-3,0.34501699757869247,1.3383573898241823,3.0905115594920193E-3,1.6887280722824332,1.265954125071826,6.4105593871454898E-3,6.2226511559492013E-2,6.8725184321734897E-2,5.9135999999999994E-2,0.11404800000000001,8.1023409154189884E-3,5.2800000000000003E-5,2.1120000000000001,1.841230769230769,1.6720000000000002,2.1120528000000003,4.2562418192473483,6,0.585009607392458,88.199987614121653,5.3180512160867455,null,58.500960739245798,0.20452920277791536,1.871501256604168,1.7639997522824331,0.1063610243217349,8.1023409154189884E-3]
["Cin",{"$f":"Cin*1000000","v":30},"μF","Input Capacitance",null,null,13,24,1,1.3,1.3,0.30092592592592593,0.20884058454001633,2.6512619325861748,2.6256309662930875,-2.5630966293087365E-2,0.76056279801446192,1.5085641582638711,5.0066848031164405E-3,0.2,0.20508883001339781,0.76535339523541779,5.8576581959838159E-4,5.8576581959838159E-4,0.61320153832415647,3.7601612660311196E-4,3.7601612660311196E-4,0.68939993040405478,1.9010890561644623E-3,0.37376841404358352,1.5338028553310452,6.3154700946167265E-4,1.9108304372067269,1.3418247111889341,7.2019742222290658E-3,6.4695547009461674E-2,7.2001231434242377E-2,6.4063999999999996E-2,0.12355200000000002,9.1030632783935285E-3,5.2800000000000003E-5,2.1120000000000001,1.841230769230769,1.6720000000000002,2.1120528000000003,4.4976541438789628,6.5,0.59103513485353132,99.618737860336353,5.6386695717121196,null,59.103513485353133,0.20508883001339781,2.1063836686409694,1.992374757206727,0.11277339143424239,9.1030632783935285E-3]
["RCinEsr",{"$f":"RCinEsr*1000","v":1},"mW","Input Capacitor ESR",null,null,14,24,1,1.4,1.4,0.32407407407407407,0.20887959476122239,2.651670605334691,2.7258353026673454,7.4164697332654406E-2,0,1.5956022112668526,5.6010821165192737E-3,0.2,0.20569325049946818,0.7654713688961009,5.8594641659967062E-4,5.8594641659967062E-4,0.64862536905336243,4.207148693796106E-4,4.207148693796106E-4,0.72924361895262768,2.1271850231325013E-3,0.40251983050847451,1.5839999999999999,0,1.9894934196527883,1.4192075820036139,8.056600643266177E-3,6.8991999999999998E-2,7.7172950972555818E-2,6.8991999999999998E-2,0.13305599999999998,1.0183785666398678E-2,5.2800000000000003E-5,2.1120000000000001,1.841230769230769,1.6720000000000002,2.1120528000000003,4.5976508680771904,7,0.60357050575368387,103.8655189826394,6.0540715486277898,null,60.35705057536839,0.20569325049946818,2.1997223706253437,2.0773103796527881,0.1210814309725558,1.0183785666398678E-2]
["Cout",{"$f":"Cout*1000000","v":540},"μF","Output Capcitance",null,null,15,24,1,1.5,1.5,0.34722222222222221,0.20891860368241272,2.6520792292457185,2.826039614622859,0.17396038537714076,0,1.6840804671540235,6.2394794436693712E-3,0.2,0.20634247701516473,0.76558932845861549,5.8612701984971387E-4,5.8612701984971387E-4,0.68463954686544137,4.6873130913211694E-4,4.6873130913211694E-4,0.76975301029159005,2.3700787874118587E-3,0.43127124697336561,1.5839999999999999,0,2.0185981731028533,1.497867591944211,8.9744292919869996E-3,7.392E-2,8.3043482865013479E-2,7.392E-2,0.14255999999999996,1.1344508079398857E-2,5.2800000000000003E-5,2.1120000000000001,1.841230769230769,1.6720000000000002,2.1120528000000003,4.6489162993914128,7.5,0.61733901322340201,105.63438865514266,6.5044141432506741,null,61.733901322340202,0.20634247701516473,2.2442016559678666,2.1126877731028531,0.13008828286501348,1.1344508079398857E-2]
["RCoutEsr",{"$f":"Cout_ESR*1000","v":1},"mW","Output Capacitor ESR",null,null,16,24,1,1.6,1.6,0.37037037037037035,0.20895761130365237,2.6524878043216988,2.9262439021608495,0.27375609783915067,0,1.7737834223319409,6.9218767845471482E-3,0.2,0.2070365232888757,0.76570727392366611,5.8630762933961221E-4,5.8630762933961221E-4,0.72115657468825167,5.2006680521609196E-4,5.2006680521609196E-4,0.81082977661976796,2.6297797066130511E-3,0.46002266343825671,1.5839999999999999,0,2.0477294586198522,1.577612976203717,9.955450810745399E-3,7.8848000000000001E-2,8.898061924634873E-2,7.8848000000000001E-2,0.15206399999999998,1.2585230517358451E-2,5.2800000000000003E-5,2.1120000000000001,1.841230769230769,1.6720000000000002,2.1120528000000003,4.700403006106991,8,0.62990127133392526,107.40458493099261,6.9580869623174362,null,62.990127133392527,0.2070365232888757,2.2887740778662007,2.1480916986198522,0.13916173924634873,1.2585230517358451E-2]
["Top Driver","Input Value","Units","Description",null,null,17,24,1,1.7,1.7,0.39351851851851849,0.20899661762500626,2.6528963305650741,3.0264481652825372,0.37355183471746289,0,1.8645343239158858,7.6482741391330333E-3,0.2,0.20777540399906536,0.76582520529195808,5.8648824506046966E-4,5.8648824506046966E-4,0.75810468705278411,5.747227165313997E-4,5.747227165313997E-4,0.85239326864466258,2.9062971377229276E-3,0.4887740799031477,1.5839999999999999,0,2.0768875875310733,1.6582864531285715,1.0999655842518951E-2,8.3775999999999989E-2,9.4984615458594657E-2,8.3775999999999989E-2,0.16156799999999999,1.3905952980241878E-2,5.2800000000000003E-5,2.1120000000000001,1.841230769230769,1.6720000000000002,2.1120528000000003,4.7521115709305661,8.5,0.6414072168427366,109.17612337655368,7.4151027729297327,null,64.140721684273657,0.20777540399906536,2.3334402029896677,2.1835224675310734,0.14830205545859465,1.3905952980241878E-2]
["RdsonDRT",0.7,"W","Drain to Source Resistance of pullup Top FET Driver",null,null,18,24,1,1.8,1.8,0.41666666666666663,0.20903562264653938,2.6533048079782837,3.1266524039891417,0.47334759601085818,0,1.9561873292206424,8.4186715074074589E-3,0.2,0.2085591347750507,0.76594312256419528,5.8666886700338981E-4,5.8666886700338981E-4,0.79542466740878304,6.3270040152237311E-4,6.3270040152237311E-4,0.89437693914600747,3.1996404371047245E-3,0.51752549636803868,1.5839999999999999,0,2.1060728719900852,1.7397582469203039,1.2107035030908837E-2,8.8703999999999991E-2,0.101055732088603,8.8703999999999991E-2,0.171072,1.5306675468013561E-2,5.2800000000000003E-5,2.1120000000000001,1.841230769230769,1.6720000000000002,2.1120528000000003,4.8040425835902791,9,0.65198292061912777,110.94901959950425,7.8754746044301491,null,65.198292061912781,0.2085591347750507,2.3782006040786885,2.218980391990085,0.15750949208860299,1.5306675468013561E-2]
["RdsonDRT2",{"$f":"RdsonDRT2","v":0.5},"W","Drain to Source Resistance of pulldown Top FET Driver",null,null,19,24,1,1.9,1.9,0.43981481481481477,0.2090746263683167,2.6537132365637683,3.2268566182818841,0.57314338171811574,0,2.0486213645179725,9.2330688893508556E-3,0.2,0.20938773219782827,0.76606102574108237,5.8684949515947925E-4,5.8684949515947925E-4,0.83306735512675256,6.9400121817788285E-4,6.9400121817788285E-4,0.9367255415139093,3.5098189604981065E-3,0.54627691283292967,1.5839999999999999,0,2.1352856249879602,1.8219206225944511,1.3277579020139809E-2,9.3631999999999993E-2,0.10719423500529705,9.3631999999999993E-2,0.18057599999999996,1.6787397980637921E-2,5.2800000000000003E-5,2.1120000000000001,1.841230769230769,1.6720000000000002,2.1120528000000003,4.8561966408850612,9.5,0.66173515434756014,112.72328924939801,8.3392157502648523,null,66.173515434756013,0.20938773219782827,2.4230558599932572,2.2544657849879601,0.16678431500529706,1.6787397980637921E-2]
["Bottom Driver","Input Value","Units","Description",null,null,20,24,1,2,2,0.46296296296296291,0.20911362879040321,2.65412161632397,3.3270608081619848,0.67293919183801498,0,2.1417353079967296,1.0091466284943661E-2,0.2,0.21026121380095197,0.76617891482332445,5.870301295198471E-4,5.870301295198471E-4,0.87099168998986787,7.5862652403140603E-4,7.5862652403140603E-4,0.97939293225692026,3.836842063019234E-3,0.57502832929782077,1.5839999999999999,0,2.164526160364558,1.9046835993846953,1.4511278455060153E-2,9.8559999999999995E-2,0.11340039539796691,9.8559999999999995E-2,0.19008,1.8348120518079384E-2,5.2800000000000003E-5,2.1120000000000001,1.841230769230769,1.6720000000000002,2.1120528000000003,4.908574346735108,10,0.67075494728239671,114.49894801822791,8.8063397698983454,null,67.075494728239676,0.21026121380095197,2.4680065557625248,2.2899789603645582,0.17612679539796691,1.8348120518079384E-2]
["RdsonDRB",0.7,"W","Drain to Source Resistance of pullup Bottom FET Driver",null,null,21,24,1,2.1,2.1,0.4861111111111111,0.20915262991286382,2.6545299472613277,3.4272649736306642,0.77273502636933622,0,2.2354441997230889,1.0993863694166325E-2,0.2,0.21117959807146128,0.76629678981162541,5.8721077007560247E-4,5.8721077007560247E-4,0.90916317356187193,8.2657767616109445E-4,8.2657767616109445E-4,1.0223403419557497,4.1807190991607979E-3,0.60377974576271198,1.5839999999999999,0,2.1937947928198693,1.9879715780879268,1.5808123981141609E-2,0.103488,0.11967448981561864,0.103488,0.19958399999999998,1.9988843080302406E-2,5.2800000000000003E-5,2.1120000000000001,1.841230769230769,1.6720000000000002,2.1120528000000003,4.9611763122334889,10.5,0.67912038437152988,116.27601164099346,9.2768604907809316,null,67.912038437152987,0.21117959807146128,2.5130532826354877,2.3255202328198692,0.18553720981561864,1.9988843080302406E-2]
["RdsonDRB2",0.5,"W","Drain to Source Resistance of pulldown Bottom FET Driver",null,null,22,24,1,2.2000000000000002,2.2000000000000002,0.50925925925925919,0.20919162973576352,2.6549382293782826,3.5274691146891417,0.87253088531085887,0,2.3296762472107275,1.1940261116999289E-2,0.2,0.21214290445086023,0.76641465070669001,5.8739141681785772E-4,5.8739141681785772E-4,0.94755265351844331,8.9785603118984307E-4,8.9785603118984307E-4,1.0655350091376738,4.5414594227920907E-3,0.63253116222760297,1.5839999999999999,0,2.2230918379254105,2.0717206764233049,1.7168106244479342E-2,0.108416,0.12601680020738931,0.108416,0.20908800000000002,2.1709565667271436E-2,5.2800000000000003E-5,2.1120000000000001,1.841230769230769,1.6720000000000002,2.1120528000000003,5.0140031556989397,11,0.68689882804758939,118.05449589627052,9.7507920103694659,null,68.689882804758938,0.21214290445086023,2.5581966381327996,2.3610899179254106,0.19501584020738932,2.1709565667271436E-2]
["Deadtime","Input Value","Units","Description",null,null,23,24,1,2.2999999999999998,2.2999999999999998,0.53240740740740733,0.20923062825916733,2.6553464626772749,3.6276732313386373,0.97232676866136236,0,2.424370448124157,1.2930658553422998E-2,0.2,0.21315115333614765,0.7665324975092227,5.8757206973772652E-4,5.8757206973772652E-4,0.98613535850072687,9.7246294528535715E-4,9.7246294528535715E-4,1.1089490956711039,4.9190723871590366E-3,0.66128257869249385,1.5839999999999999,0,2.252417612135694,2.1558766135722998,1.8591215891791871E-2,0.11334399999999999,0.13242761396403993,0.11334399999999999,0.21859199999999995,2.3510288278950901E-2,5.2800000000000003E-5,2.1120000000000001,1.841230769230769,1.6720000000000002,2.1120528000000003,5.0670555027298558,11.5,0.69414869758268594,119.83441660678471,10.228148698201995,null,69.414869758268594,0.21315115333614765,2.603437226099734,2.3966883321356942,0.20456297396403991,2.3510288278950901E-2]
["Deadtime",{"$f":"Deadtime*1000000000","v":14},"ns","Total Deadtime",null,null,24,24,1,2.4,2.4,0.55555555555555547,0.20926962548314007,2.6557546471607432,3.7278773235803717,1.0721226764196283,0,2.5194746930315302,1.396505600341791E-2,0.2,0.21420436608089763,0.76665033021992735,5.8775272882632371E-4,5.8775272882632371E-4,1.024890127847967,1.0503997741602221E-3,1.0503997741602221E-3,1.1525588211545061,5.31356734488426E-3,0.69003399515738495,1.5839999999999999,0,2.2817724327997451,2.2403930219060357,2.0077443570421037E-2,0.11827199999999999,0.13890722396053934,0.11827199999999999,0.22809600000000002,2.5391010915305292E-2,5.2800000000000003E-5,2.1120000000000001,1.841230769230769,1.6720000000000002,2.1120528000000003,5.1203339862594746,12,0.70092090549349217,121.61578963998724,10.708945198026967,null,70.092090549349223,0.21420436608089763,2.648775656760284,2.432315792799745,0.21417890396053935,2.5391010915305292E-2]
["IQ","Input Value","Units","Description",null,null,25,24,1,2.5,2.5,0.57870370370370372,0.20930862140774675,2.6561627828311281,3.828081391415564,1.171918608584436,0,2.6149442430145173,1.5043453466964488E-2,0.2,0.2153025649963918,0.76676814883950872,5.8793339407476697E-4,5.8793339407476697E-4,1.0637987935093607,1.1316678730719713E-3,1.1316678730719713E-3,1.1963437683173612,5.7249536479671362E-3,0.71878541162227605,1.5839999999999999,0,2.311156618172689,2.3252300922882845,2.1626779928331934E-2,0.12319999999999999,0.14545592859975154,0.12319999999999999,0.23759999999999998,2.7351733576299071E-2,5.2800000000000003E-5,2.1120000000000001,1.841230769230769,1.6720000000000002,2.1120528000000003,5.1738392466122782,12.5,0.70726002571263624,123.39863090863446,11.193196429987577,null,70.726002571263621,0.2153025649963918,2.6942125467724405,2.4679726181726891,0.22386392859975152,2.7351733576299071E-2]
["IQ ",{"$f":"Iq*1000","v":2.2000000000000001E-3},"mA","Quiescent Current Of Controller (Not Switching!)",null,null,26,24,1,2.6,2.6,0.60185185185185186,0.20934761603305233,2.6565708696908694,3.928285434845435,1.2717145651545654,0,2.710740501315863,1.616585094404319E-2,0.2,0.21644577335280235,0.76688595336867094,5.8811406547417538E-4,5.8811406547417538E-4,1.1028456813276977,1.2162685968231538E-3,1.2162685968231538E-3,1.240286322566672,6.153240647783836E-3,0.74753682808716704,1.5839999999999999,0,2.3405704874273989,2.4103534810330656,2.3239215614112869E-2,0.12812799999999999,0.15207403185724044,0.12812799999999999,0.24710400000000005,2.9392456261896707E-2,5.2800000000000003E-5,2.1120000000000001,1.841230769230769,1.6720000000000002,2.1120528000000003,5.227571931561636,13,0.71320525020066317,125.18295637136995,11.680917592862022,null,71.320525020066313,0.21644577335280235,2.7397485192846398,2.5036591274273992,0.23361835185724045,2.9392456261896707E-2]
["High-side FET","Input Value","Units","Description",null,null,27,24,1,2.7,2.7,0.625,0.20938660935912173,2.6569789077424071,4.0284894538712042,1.3715105461287966,0,2.8068300167654741,1.7332248434634479E-2,0.2,0.21763401538042654,0.76700374380811831,5.8829474301566966E-4,5.8829474301566966E-4,1.1420172064209031,1.3042032997614037E-3,1.3042032997614037E-3,1.2843712172778727,6.5984376950873787E-3,0.77628824455205825,1.5839999999999999,0,2.3700143606662092,2.4957334231130992,2.4914741276975315E-2,0.13305600000000001,0.15876184332720591,0.13305600000000001,0.256608,3.151317897206269E-2,5.2800000000000003E-5,2.1120000000000001,1.841230769230769,1.6720000000000002,2.1120528000000003,5.2815326963886813,13.5,0.71879117738861564,126.96878203331046,12.172124166360296,null,71.879117738861567,0.21763401538042654,2.7853842039934151,2.5393756406662091,0.24344248332720592,3.151317897206269E-2]
["RdsonTop",{"$f":"Rdson1*1000","v":4},"mW","Drain-Source Resistance of Top FET ",null,null,28,24,1,2.8,2.8,0.64814814814814814,0.20942560138601984,2.6573868969881786,4.1286934484940891,1.4713065515059105,0,2.90318367085005,1.8542645938718818E-2,0.2,0.21886731627097245,0.76712152015855473,5.8847542669037192E-4,5.8847542669037192E-4,1.1813015431207674,1.3954733357795064E-3,1.3954733357795064E-3,1.3285851628713612,7.0605541400076853E-3,0.80503966101694902,1.5839999999999999,0,2.3994885589326915,2.5813440087846584,2.6653347566753801E-2,0.137984,0.16551967826956498,0.137984,0.26611199999999996,3.3713901706761487E-2,5.2800000000000003E-5,2.1120000000000001,1.841230769230769,1.6720000000000002,2.1120528000000003,5.3357222039424608,14,0.72404846596034922,128.75612394663457,12.66683191347825,null,72.404846596034929,0.21886731627097245,2.8311202372022568,2.5751224789326916,0.25333663826956498,3.3713901706761487E-2]
["RdsonTopTc",{"$f":"RdsonTopTc*1000000","v":4000},"ppm","Drain to Source Resistance Temp Co",null,null,29,24,1,2.9,2.9,0.67129629629629628,0.20946459211381166,2.6577948374306244,4.2288974187153121,1.5711025812846877,0,2.9997760110530596,1.9797043456276694E-2,0.2,0.22014570217889656,0.7672392824206844,5.8865611648940678E-4,5.8865611648940678E-4,1.2206883542966522,1.4900800583154692E-3,1.4900800583154692E-3,1.3729165426248275,7.5395993320516398E-3,0.83379107748184023,1.5839999999999999,0,2.4289934042234997,2.6671625903713663,2.8455025133905989E-2,0.14291199999999998,0.17234785765819374,0.14291199999999998,0.27561599999999997,3.5994624465957623E-2,5.2800000000000003E-5,2.1120000000000001,1.841230769230769,1.6720000000000002,2.1120528000000003,5.3901411247013522,14.5,0.72900438006408141,130.54499821117497,13.165056882909687,null,72.900438006408137,0.22014570217889656,2.8769572618816932,2.6108999642234996,0.26330113765819374,3.5994624465957623E-2]
["QgTop",{"$f":"Qg_Q1*1000000000","v":20},"nC","Gate Charge Of Top FET",null,null,30,24,1,3,3,0.69444444444444442,0.20950358154256205,2.6582027290721837,4.3291013645360916,1.6708986354639082,0,3.0965847013127061,2.1095440987288584E-2,0.2,0.22146920022279273,0.76735703059521154,5.8883681240390036E-4,5.8883681240390036E-4,1.2601685682291037,1.5880248203525894E-3,1.5880248203525894E-3,1.4173551619215916,8.0355826201031245E-3,0.86254249394673121,1.5839999999999999,0,2.458529219500281,2.7531692932651488,3.0319764629512476E-2,0.14784,0.17924670823034425,0.14784,0.28511999999999993,3.8355347249615604E-2,5.2800000000000003E-5,2.1120000000000001,1.841230769230769,1.6720000000000002,2.1120528000000003,5.4447901368357909,15,0.73368324642150262,132.33542097501405,13.666815411517211,null,73.368324642150256,0.22146920022279273,2.9228959277306252,2.646708419500281,0.27333630823034422,3.8355347249615604E-2]
["QgdTop",{"$f":"Qgd_Q1*1000000000","v":4.7},"nC","Gate to Drain Charge",null,null,31,24,1,3.1,3.1,0.71759259259259256,0.20954256967233598,2.6586105719152942,4.4293052859576472,1.770694714042353,0,3.1935900667469803,2.2437838531734963E-2,0.2,0.22283783848683325,0.76747476468284004,5.8901751442498075E-4,5.8901751442498075E-4,1.2997341937563693,1.6893089744195193E-3,1.6893089744195193E-3,1.4618920405097537,8.5485133524230861E-3,0.89129391041162231,1.5839999999999999,0,2.4880963287016495,2.8393466108101721,3.2247556705276841E-2,0.15276799999999999,0.18621656253725319,0.15276799999999999,0.294624,4.0796070057699932E-2,5.2800000000000003E-5,2.1120000000000001,1.841230769230769,1.6720000000000002,2.1120528000000003,5.499669926272281,15.5,0.73810683950837952,134.12740843508249,14.172124126862659,null,73.810683950837955,0.22283783848683325,2.9689368912389025,2.6825481687016497,0.28344248253725318,4.0796070057699932E-2]
["QgsTop",{"$f":"Qgs_Q1*1000000000","v":3.9000000000000004},"nC",null,null,null,32,{"$f":"Vin","v":24},{"$f":"MODE","v":1},3.2,{"$f":"Iout*G41/100/Number_of_Phases","v":3.2},{"$f":"Vout*K41/(Vin*Efficiency)","v":0.7407407407407407},{"$f":"(Vout+(Rdson2+Rs+Rdcr)*K41)/(Vin+(Rs+Rdson2-Rdson1)*K41)","v":0.20958155650319829},{"$f":"(Vin-(Rdson1+Rdcr)*K41-Vout)*M41/(Fsw*Lf)","v":2.6590183659623956},4.5295091829811982,1.8704908170188024,{"$f":"IF(MIN(Vin, -P41/(Coss_Q1+Coss_Q2)*0.00000002)<0, 0, MIN(Vin, -P41/(Coss_Q1+Coss_Q2)*0.00000002))","v":0},3.2907747146445288,{"$f":"R41^2*Rdcr","v":2.3824236089596315E-2},{"$f":"Core_Loss_Ch1","v":0.2},{"$f":"(T41+S41*(1+Ltc*(Ta-25)))/(1-S41*Ltc*ThetaCa)","v":0.22425164602226155},0.76759248468427399,5.8919822254377744E-4,5.8919822254377744E-4,1.339378166385558,1.7939338725903393E-3,1.7939338725903393E-3,1.5065192395593205,{"$f":"Rdson1*AB41^2","v":9.0784008766495745E-3},{"$f":"(Vin*K41/2)*Fsw*(Tr_buck+Tf_buck)","v":0.92004532687651341},{"$f":"(0.5*Coss_Q1*(Vin-Q41)^2-0.5*Coss_Q2*(Vin-Q41)^2+(Qoss_Q2*(Vin-Q41)/Vin)*Vin)*Fsw","v":1.5839999999999999},{"$f":"IF(K41>N41/2,0,ABS(K41-N41/2)*Vsd_Q1*Deadtime*Fsw)","v":0},{"$f":"(AF41+AE41+AD41+AC41*(1+RdsonTopTc*Ta-RdsonTopTc*25))/(1-AC41*RdsonTopTc*ThetaJA_Q1)","v":2.5176950567552394},{"$f":"SQRT((1-M41))*SQRT(K41^2+(N41^2)/12)","v":2.925679067051167},{"$f":"Rdson2*AH41^2","v":3.4238392013525548E-2},{"$f":"IF(K41<N41/2,Deadtime*Fsw*IF(VfdSky_Q2>0,0,Vsd_Q2)*(K41+N41/2),2*Deadtime*Fsw*IF(VfdSky_Q2>0,0,Vsd_Q2)*K41)","v":0.157696},{"$f":"(AJ41+AI41*(1+RdsonBotTc*Ta-RdsonBotTc*25))/(1-AI41*RdsonBotTc*ThetaJA_Q2)","v":0.19325775899595735},{"$f":"2*Deadtime*Fsw*IF(VfdSky_Q2>0,VfdSky_Q2,Vsd_Q2)*K41","v":0.157696},{"$f":"IF(QrrSky_Q2>0,QrrSky_Q2,Qrr_Q2*K41/(Iout/Number_of_Phases))*Fsw*Vin","v":0.30412799999999995},{"$f":"Rs*R41^2","v":4.3316792890175114E-2},{"$f":"Iq*Vin","v":5.2800000000000003E-5},{"$f":"IF(Ext_VCC=1,  (Qg_Q1+Qg_Q2)*Fsw*VCC, (Qg_Q1+Qg_Q2)*Fsw*Vin)","v":2.1120000000000001},1.841230769230769,{"$f":"(Qg_Q1+Qg_Q2)*Fsw*(Vin-VCC)","v":1.6720000000000002},{"$f":"SUM(AO41:AP41)","v":2.1120528000000003},{"$f":" SUM(U41,X41,AA41,AG41,AK41,AL41,AM41,AS41,AN41)","v":5.5547811867587678},{"$f":"Vout*K41","v":16},0.74229470767390104,{"$f":"ThetaJA_Q1*BC41","v":135.92097683776197},{"$f":"ThetaJA_Q2*BD41","v":14.680999949797869},null,74.229470767390097,{"$f":"U41","v":0.22425164602226155},{"$f":"AG41+AK41+AM41","v":3.0150808157511966},{"$f":"AG41+AM41*0.66","v":2.7184195367552393},{"$f":"AK41+AM41*0.33","v":0.29361999899595737},{"$f":"AN41","v":4.3316792890175114E-2}]
["RGateTop",{"$f":"Rgate1","v":1.2},"W","Gate Resistance",null,null,33,24,1,{"$f":"Iout*G42/100","v":3.3},3.3,0.76388888888888884,0.20962054203521396,2.6594261112159252,4.6297130556079624,1.9702869443920372,0,3.3881232174688423,2.5254633660853124E-2,0.2,0.22571065284893727,0.76771019060021706,5.8937893675142165E-4,5.8937893675142165E-4,1.3790942195820493,1.9019008664846217E-3,1.9019008664846217E-3,1.551229717014682,9.6252545397978034E-3,0.94879674334140418,1.5839999999999999,0,2.5473257295898173,3.0121529346635056,3.6292261207207882E-2,0.16262399999999999,0.20037064194233331,0.16262399999999999,{"$f":"IF(QrrSky_Q2>0,QrrSky_Q2,Qrr_Q2*K42/(Iout/Number_of_Phases))*Fsw*Vin","v":0.31363200000000002},4.5917515747005679E-2,5.2800000000000003E-5,2.1120000000000001,1.841230769230769,1.6720000000000002,2.1120528000000003,5.6101246199313302,16.5,0.74626445050092372,137.71614247949086,15.193460097116668,null,74.626445050092372,0.22571065284893727,3.0613283715321509,2.7543228495898173,0.30386920194233336,4.5917515747005679E-2]
["GfsTop",{"$f":"Gfs_Q1","v":55},"S","Transconductance of Top FET",null,null,34,24,1,3.4,3.4,0.78703703703703698,0.20965952626844786,2.6598338076783219,4.7299169038391611,2.0700830961608387,0,3.485621846534567,2.6729031245485899E-2,0.2,0.22721488995693379,0.76782788243137323,5.8955965703904668E-4,5.8955965703904668E-4,1.4188767766326646,2.0132113072675005E-3,2.0132113072675005E-3,1.5960172060679834,1.0189083688260207E-2,0.97754815980629539,1.5839999999999999,0,2.576988674147473,3.0987559979730563,3.8409154939895968E-2,0.16755199999999998,0.20755556168537809,0.16755199999999998,0.32313599999999998,4.8598238628156175E-2,5.2800000000000003E-5,2.1120000000000001,1.841230769230769,1.6720000000000002,2.1120528000000003,5.6657009353822483,17,0.75003195570546788,139.51292170737366,15.709522084268905,null,75.003195570546794,0.22721488995693379,3.1076802358328508,2.7902584341474732,0.31419044168537807,4.8598238628156175E-2]
["VthTop",{"$f":"Vth_Q1","v":1.6},"V","Threshold Voltage of Top FET",null,null,35,24,1,3.5,3.5,0.81018518518518512,0.20969850920296496,2.6602414553520251,4.8301207276760127,2.1698792723239873,0,3.5832583472864177,2.8247428843475138E-2,0.2,0.22876438930818749,0.76794556017844673,5.897403833977884E-4,5.897403833977884E-4,1.4587208594003669,2.127866545649745E-3,2.127866545649745E-3,1.6408761126153375,1.0769897667806488E-2,1.0062995762711864,1.5839999999999999,0,2.6066842183958747,3.1854773529953349,4.0589063865784661E-2,0.17247999999999999,0.2148128745627487,0.17247999999999999,0.33263999999999999,5.1358961533591159E-2,5.2800000000000003E-5,2.1120000000000001,1.841230769230769,1.6720000000000002,2.1120528000000003,5.7215108507294499,17.5,0.75361160229805968,141.31133091979373,16.229203728137435,null,75.361160229805961,0.22876438930818749,3.1541370929586234,2.8262266183958746,0.32458407456274868,5.1358961533591159E-2]
["VspTop",{"$f":"Vsp_Q1","v":1.781818181818182},"V",null,null,null,36,24,1,3.6,3.6,0.83333333333333326,0.20973749083883003,2.6606490542394701,4.9303245271197351,2.2696754728802651,0,3.6810217488923893,2.980982645480133E-2,0.2,0.23035918383820025,0.76806322384214065,5.8992111581878228E-4,5.8992111581878228E-4,1.4986220110113873,2.2458679318878147E-3,2.2458679318878147E-3,1.6858014283704685,1.1367705823583648E-2,1.0350509927360774,1.5839999999999999,0,2.6364126913406047,3.2723072380085081,4.2831978639691487E-2,0.17740799999999998,0.22214294299757756,0.17740799999999998,0.342144,5.4199684463275138E-2,5.2800000000000003E-5,2.1120000000000001,1.841230769230769,1.6720000000000002,2.1120528000000003,5.7775550916873639,18,0.75701643548258679,143.11138656703025,16.752523149878879,null,75.701643548258673,0.23035918383820025,3.2006996343381822,2.8622277313406048,0.33505046299757757,5.4199684463275138E-2]
["VsdTop",{"$f":"Vsd_Q1","v":0.8},"V",null,null,null,37,24,1,3.7,3.7,0.8564814814814814,0.20977647117610806,2.6610566043430968,5.0305283021715486,2.3694716978284518,0,3.7789022022663104,3.1416224079444978E-2,0.2,0.2319993074577946,0.76818087342315922,5.9010185429316778E-4,5.9010185429316778E-4,1.5385762300854453,2.3672168157839414E-3,2.3672168157839414E-3,1.7307886569506454,1.1982517500116077E-2,1.0638024092009686,1.5839999999999999,0,2.6661744230375666,3.3592368894235713,4.5137889917056605E-2,0.182336,0.2295461355565844,0.182336,0.35164800000000002,5.7120407417172683E-2,5.2800000000000003E-5,2.1120000000000001,1.841230769230769,1.6720000000000002,2.1120528000000003,5.8338343921391944,18.5,0.76025831777569108,144.91310515187834,17.279498777829222,null,76.02583177756911,0.2319993074577946,3.2473685585941507,2.8982621030375668,0.34558997555658444,5.7120407417172683E-2]
["θJATop",{"$f":"ThetaJA_Q1","v":50},"°C/W","Junction to Ambient Resistance",null,null,38,24,1,3.8,3.8,0.87962962962962954,0.20981545021486392,2.6614641056653419,5.1307320528326708,2.4692679471673289,0,3.8768908417457517,3.3066621717386585E-2,0.2,0.23368479505492148,0.76829850892220586,5.9028259881208479E-4,5.9028259881208479E-4,1.5785799145707475,2.491914546686189E-3,2.491914546686189E-3,1.7758337507566389,1.2614342041305569E-2,1.0925538256658593,1.5839999999999999,0,2.695969744605458,3.4462584187036365,4.7506788353942751E-2,0.18726399999999999,0.23702282700950145,0.18726399999999999,0.36115199999999992,6.0121130395248336E-2,5.2800000000000003E-5,2.1120000000000001,1.841230769230769,1.6720000000000002,2.1120528000000003,5.8903494942106276,19,0.76334806003504718,146.71650323027291,17.810149350475072,null,76.334806003504724,0.23368479505492148,3.2941445716149591,2.934330064605458,0.35620298700950143,6.0121130395248336E-2]
["Low-side FET","Input Value","Units","Description",null,null,39,24,1,3.9,3.9,0.90277777777777768,0.20985442795516249,2.6618715582086434,5.2309357791043212,2.5690642208956782,0,3.9749796665349968,3.4761019368606684E-2,0.2,0.23541568249652151,0.76841613033998446,5.9046334936667605E-4,5.9046334936667605E-4,1.6186298136042492,2.6199624734885262E-3,2.6199624734885262E-3,1.8209330568716287,1.3263188790431417E-2,1.1213052421307506,1.5839999999999999,0,2.7257989882383362,3.533364706870608,4.993866460703527E-2,0.19219199999999997,0.2445733983898338,0.19219199999999997,0.37065599999999999,6.3201853397466701E-2,5.2800000000000003E-5,2.1120000000000001,1.841230769230769,1.6720000000000002,2.1120528000000003,5.9471011483450136,19.5,0.76629553544523121,148.52159741191682,18.34449391949169,null,76.62955354452312,0.23541568249652151,3.34102838662817,2.9704319482383363,0.36688987838983378,6.3201853397466701E-2]
["RdsonBot",{"$f":"Rdson2*1000","v":4},"mW","Drain-Source Resistance of Low-side FET",null,null,40,24,1,4,4,0.92592592592592582,0.20989340439706863,2.6622789619754386,5.3311394809877193,2.6688605190122807,0,4.0731614387289001,3.6499417033085783E-2,0.2,0.23719200663043929,0.76853373767719846,5.9064410594808492E-4,5.9064410594808492E-4,1.6587229861043387,2.7513619446308943E-3,2.7513619446308943E-3,1.8660832705261585,1.3929067090150416E-2,1.1500566585956415,1.5839999999999999,0,2.7556624872182467,3.6205493137658658,5.243350933364193E-2,0.19711999999999999,0.25219823705697292,0.19711999999999999,0.38016,6.6362576423792341E-2,5.2800000000000003E-5,2.1120000000000001,1.841230769230769,1.6720000000000002,2.1120528000000003,6.0040901133800304,20,0.76910977899239352,150.32840436091232,18.882551852848646,null,76.910977899239356,0.23719200663043929,3.3880207242752198,3.0065680872182465,0.37765103705697289,6.6362576423792341E-2]
["RdsonBotTc",{"$f":"RdsonBotTc*1000000","v":4000},"ppm","Drain To Source Resitance Temp Co",null,null,41,24,1,4.0999999999999996,4.0999999999999996,0.94907407407407396,0.20993237954064722,2.662686316968164,5.4313431584840819,2.7686568415159174,0,4.171429595300328,3.8281814710804413E-2,0.2,0.2390138052873913,0.7686513309345514,5.9082486854745736E-4,5.9082486854745736E-4,1.6988567650332582,2.886114308099267E-3,2.886114308099267E-3,1.9112813949348846,1.4611986282496953E-2,1.1788080750605325,1.5839999999999999,0,2.785560575927934,3.7078063997359973,5.4991313191692877E-2,0.20204799999999998,0.25989773675968569,0.20204799999999998,0.3896639999999999,6.9603299474189848E-2,5.2800000000000003E-5,2.1120000000000001,1.841230769230769,1.6720000000000002,2.1120528000000003,6.0613171566258481,20.5,0.77179907453822094,152.13694079639671,19.42434283798428,null,77.179907453822096,0.2390138052873913,3.4351223126876196,3.042738815927934,0.38848685675968564,6.9603299474189848E-2]
["QgBot",{"$f":"Qg_Q2*1000000000","v":20},"nC","Gate Charge Of Top FET",null,null,42,24,1,4.2,4.2,0.97222222222222221,0.20997135338596315,2.6630936231892575,5.5315468115946285,2.8684531884053714,0,4.269778171890894,4.010821240174308E-2,0.2,0.24088111728298753,0.76876891011274684,5.9100563715594066E-4,5.9100563715594066E-4,1.7390287264521347,3.0242209114257337E-3,3.0242209114257337E-3,1.9565247065193829,1.5311955708883031E-2,1.207559491525424,1.5839999999999999,0,2.8154935898636344,3.7951306578213075,5.7612066839740766E-2,0.20697599999999999,0.26767229770100021,0.20697599999999999,0.39916799999999997,7.292402254862379E-2,5.2800000000000003E-5,2.1120000000000001,1.841230769230769,1.6720000000000002,2.1120528000000003,6.1187830539448278,21,0.7743710312600196,153.94722349318172,19.969886885050009,null,77.437103126001958,0.24088111728298753,3.4823338875646344,3.0789444698636346,0.39939773770100018,7.292402254862379E-2]
["RGateBot",{"$f":"Rgate2","v":1.2},"W","Gate Resistance",null,null,43,24,1,4.3,4.3,0.99537037037037035,0.21001032593308128,2.6635008806411546,5.6317504403205767,2.9682495596794225,0,4.3682017366148145,4.1978610105882296E-2,0.2,0.24279398241980674,0.76888647521248799,5.9118641176468393E-4,5.9118641176468393E-4,1.7792366626417497,3.1656831016885515E-3,3.1656831016885515E-3,2.0018107247001606,1.6028984710098327E-2,1.2363109079903145,1.5839999999999999,0,2.8454618656479398,3.8825172548541365,6.0295760936960402E-2,0.21190399999999998,0.27552232660450854,0.21190399999999998,0.40867199999999992,7.6324745647058725E-2,5.2800000000000003E-5,2.1120000000000001,1.841230769230769,1.6720000000000002,2.1120528000000003,6.1764885898327666,21.5,0.77683265094179033,155.75926928239699,20.519204330225428,null,77.683265094179035,0.24279398241980674,3.5296561922524479,3.1151853856479397,0.41038408660450854,7.6324745647058725E-2]
["VsdBot",{"$f":"Vsd_Q2","v":0.8},"V","Diode Forward Voltage of Bottom FET Body Diode",null,null,44,24,1,4.4000000000000004,4.4000000000000004,1.0185185185185184,0.21004929718206647,2.6639080893262936,5.731954044663147,3.0680459553368538,0,4.4666953323866672,4.389300782320265E-2,0.2,0.24475244148952649,0.76900402623447872,5.9136719236483877E-4,5.9136719236483877E-4,1.8194785586843902,3.3105022255122264E-3,3.3105022255122264E-3,2.0471371855783316,1.676308262631029E-2,1.2650623244552059,1.5839999999999999,0,2.8754657410427611,3.9699617801418774,6.3042386143149054E-2,0.216832,0.28344823678211162,0.216832,0.41817600000000005,7.9805468769459348E-2,5.2800000000000003E-5,2.1120000000000001,1.841230769230769,1.6720000000000002,2.1120528000000003,6.2344345575017357,22,0.77919038736884216,157.57309505213806,21.072315839105581,null,77.919038736884218,0.24475244148952649,3.5770899778248726,3.1514619010427611,0.42144631678211164,7.9805468769459348E-2]
["QrrBot",{"$f":"Qrr_Q2*1000000000","v":18},"nC","Reverse Recovery Charge of Body Diode",null,null,45,24,1,4.5,4.5,1.0416666666666665,0.21008826713298356,2.6643152492471103,5.8321576246235551,3.1678423753764449,0,4.5652544265295401,4.5851405553684631E-2,0.2,0.24675653627510644,0.76912156317942204,5.9154797894755778E-4,5.9154797894755778E-4,1.8597525720018715,3.4586796290675763E-3,3.4586796290675763E-3,2.0925020189395345,1.7514258797064114E-2,1.2938137409200969,1.5839999999999999,0,2.9055055549623439,4.0574602006281628,6.5851933118726128E-2,0.22175999999999998,0.29145044820322646,0.22175999999999998,0.42767999999999995,8.3366191915790241E-2,5.2800000000000003E-5,2.1120000000000001,1.841230769230769,1.6720000000000002,2.1120528000000003,6.2926217589644819,22.5,0.7814501988862721,159.38871774811722,21.629242410161321,null,78.145019888627203,0.24675653627510644,3.6246360031655702,3.1877743549623441,0.43258484820322646,8.3366191915790241E-2]
["TrrBot",{"$f":"Trr_Q2*1000000000","v":40},"ns","Reverse Recovery Time of Body Diode",null,null,46,24,1,4.5999999999999996,4.5999999999999996,1.0648148148148147,0.21012723578589748,2.6647223604060413,5.9323611802030207,3.267638819796979,0,4.6638748666215299,4.7853803297308789E-2,0.2,0.24880630955302718,0.76923908604802149,5.9172877150399537E-4,5.9172877150399537E-4,1.900057014426618,3.6102166580717935E-3,3.6102166580717935E-3,2.1379033281045965,1.8282522561282839E-2,1.3225651573849877,1.5839999999999999,0,2.9355816474864018,4.1450088216050016,6.8724392524733141E-2,0.22668799999999997,0.29952938756548175,0.22668799999999997,0.43718399999999991,8.7006915086015976E-2,5.2800000000000003E-5,2.1120000000000001,1.841230769230769,1.6720000000000002,2.1120528000000003,6.3510510051205022,23,0.78361759502198014,161.20615437432008,22.190005378274087,null,78.361759502198012,0.24880630955302718,3.6722950350518833,3.2241230874864018,0.44380010756548172,8.7006915086015976E-2]
["θJABot",{"$f":"ThetaJA_Q2","v":50},"°C/W","Junction to Ambient Resistance",null,null,47,24,1,4.7,4.7,1.0879629629629628,0.21016620314087298,2.665129422805522,6.0325647114027614,3.367435288597239,0,4.7625528417042586,4.9900201054055682E-2,0.2,0.2509018050955833,0.76935659484098007,5.9190957002530793E-4,5.9190957002530793E-4,1.9403903364499944,3.7651146577885224E-3,3.7651146577885224E-3,2.1833393722270595,1.9067883257267399E-2,1.3513165738498791,1.5839999999999999,0,2.9656943598733063,4.2326042521960945,7.1659755022833838E-2,0.23161599999999999,0.30768548836692478,0.23161599999999999,0.44668800000000008,9.0727638280101233E-2,5.2800000000000003E-5,2.1120000000000001,1.841230769230769,1.6720000000000002,2.1120528000000003,6.4097231158437298,23.5,0.78569767794178003,163.02542199366533,22.754626418346241,null,78.569767794178006,0.2509018050955833,3.7200678482402312,3.2605084398733064,0.45509252836692482,9.0727638280101233E-2]
["Bottom Schottky","Input Value","Units","Std Units",null,null,48,24,1,4.8,4.8,1.1111111111111109,0.21020516919797494,2.6655364364479888,6.132768218223994,3.4672317817760057,0,4.8612848481139892,5.1990598823905838E-2,0.2,0.25304306767323143,0.7694740895590011,5.9209037450265369E-4,5.9209037450265369E-4,1.9807511133476416,3.9233749730279216E-3,3.9233749730279216E-3,2.2288085507001636,1.9870350222696655E-2,1.3800679903147699,1.5839999999999999,0,2.9958440345733761,4.3202433749533702,7.4658011275313935E-2,0.23654399999999998,0.31591919097976495,0.23654399999999998,0.45619200000000004,9.452836149801061E-2,5.2800000000000003E-5,2.1120000000000001,1.841230769230769,1.6720000000000002,2.1120528000000003,6.4686389200719141,24,0.78769517939278377,164.84653772866881,23.32312754898825,null,78.769517939278373,0.25304306767323143,3.7679552255531412,3.2969307545733759,0.46646255097976497,9.452836149801061E-2]
["VfdSky",{"$f":"VfdSky_Q2","v":0},"V","Diode Forward Voltage",null,null,49,24,1,4.9000000000000004,4.9000000000000004,1.1342592592592591,0.21024413395726821,2.6659434013358778,6.2329717006679388,3.5670282993320614,0,4.9600676593094164,5.412499660683983E-2,0.2,0.25523014305699371,0.76959157020278779,5.9227118492719249E-4,5.9227118492719249E-4,2.0211380329276714,4.0849989481467367E-3,4.0849989481467367E-3,2.2743093893876605,2.0689932794627493E-2,1.4088194067796611,1.5839999999999999,0,3.0260310152422525,4.4079233190097939,7.7719151945081263E-2,0.24147199999999999,0.32423094272568009,0.24147199999999999,0.46569599999999994,9.8409084739708774E-2,5.2800000000000003E-5,2.1120000000000001,1.841230769230769,1.6720000000000002,2.1120528000000003,6.52779925589771,24.5,0.78961449369771464,166.66951876211263,23.895531136284003,null,78.961449369771458,0.25523014305699371,3.8159579579679326,3.3333903752422525,0.47791062272568008,9.8409084739708774E-2]
["QrrSky",{"$f":"QrrSky_Q2*1000000000","v":0},"nC","Diode Reverse Recovery Charge",null,null,50,24,1,5,5,1.1574074074074074,0.21028309741881765,2.6663503174716254,6.3331751587358127,3.6668248412641873,0,5.0588982991645608,5.63033944028382E-2,0.2,0.25746307802091667,0.76970903677304359,5.9245200129008657E-4,5.9245200129008657E-4,2.0615498846858795,4.2499879270483636E-3,4.2499879270483636E-3,2.3198405284358876,2.1526640309494794E-2,1.4375708232445521,1.5839999999999999,0,3.056255646754356,4.4956414363154433,8.0843167695665533E-2,0.24639999999999998,0.33262119795271033,0.24639999999999998,0.47519999999999996,0.10236980800516035,5.2800000000000003E-5,2.1120000000000001,1.841230769230769,1.6720000000000002,2.1120528000000003,6.5872049706614808,25,0.79145970728401749,168.49438233771781,24.471859897635518,null,79.14597072840175,0.25746307802091667,3.8640768447070664,3.3698876467543561,0.48943719795271035,0.10236980800516035]
["Ireverse",{"$f":"Ireverse","v":0},"mA","Reverse Leakage Current",null,null,51,24,1,5.0999999999999996,5.0999999999999996,1.1805555555555556,0.21032205958268804,2.6667571848576657,6.4333785924288325,3.7666214075711668,0,5.1577740182740168,5.8525792211881505E-2,0.2,0.25974192034458571,0.76982648927047093,5.9263282358249848E-4,5.9263282358249848E-4,2.1019855501841378,4.4183432531829121E-3,4.4183432531829121E-3,2.3654007114605111,2.2380482103111568E-2,1.4663222397094431,1.5839999999999999,0,3.0865182752164362,4.5833952805539919,8.4030049191218426E-2,0.251328,0.34109041811376906,0.251328,0.48470399999999991,0.10641053129433001,5.2800000000000003E-5,2.1120000000000001,1.841230769230769,1.6720000000000002,2.1120528000000003,6.6468569210458863,25.5,0.79323462516503973,170.32114576082179,25.05213690568845,null,79.32346251650398,0.25974192034458571,3.9123126933302048,3.406422915216436,0.50104273811376898,0.10641053129433001]
["Controller","Input Value","Units","Std Units",null,null,52,24,1,5.2,5.2,1.2037037037037037,0.21036102044894425,2.6671640034964343,6.5335820017482176,3.8664179982517828,0,5.256692272883738,6.0792190033950318E-2,0.2,0.26206671881569576,0.76994392769577324,5.9281365179559415E-4,5.9281365179559415E-4,2.1424439944949065,4.590066269547291E-3,4.590066269547291E-3,2.4109887759314104,2.3251467510668963E-2,1.4950736561743341,1.5839999999999999,0,3.1168192479812151,4.6711825883954008,8.7279787096513434E-2,0.25625599999999998,0.34963907184679566,0.25625599999999998,0.49420800000000009,0.1105312546071824,5.2800000000000003E-5,2.1120000000000001,1.841230769230769,1.6720000000000002,2.1120528000000003,6.7067559731722328,26,0.79494279473410745,172.14982639906077,25.636385592339785,null,79.494279473410742,0.26206671881569576,3.9606663198280105,3.4429965279812151,0.51272771184679566,0.1105312546071824]
["θJA",30,"°C/W","Junction to Ambient Resistance",null,null,53,24,1,5.3,5.3,1.2268518518518519,0.21039998001765106,2.6675707733903673,6.6337853866951839,3.9662146133048162,0,5.3556507061159744,6.3102587869025187E-2,0.2,0.26443752323267777,0.77006135204965342,5.9299448592054025E-4,5.9299448592054025E-4,2.1829242585772999,4.7651583186852546E-3,4.7651583186852546E-3,2.4566036446044923,2.4139605866736302E-2,1.5238250726392251,1.5839999999999999,0,3.1471589136611144,4.7590012627899627,9.0592372076945843E-2,0.26118399999999997,0.35826763505658044,0.26118399999999997,0.50371199999999994,0.11473197794368215,5.2800000000000003E-5,2.1120000000000001,1.841230769230769,1.6720000000000002,2.1120528000000003,6.7669030026986619,26.5,0.79658752718430925,173.98044168305572,26.224629752829021,null,79.658752718430918,0.26443752323267777,4.0091385487176945,3.4796088336611142,0.52449259505658041,0.11473197794368215]
["Theta Ja",2,"°C/W","Junction to Ambient Resistance",null,null,54,24,1,5.4,5.4,1.25,0.21043893828887336,2.6679774945418995,6.7339887472709501,4.0660112527290506,0,5.4546471312036777,6.5456985717086733E-2,0.2,0.26685438440738246,0.77017876233281457,5.9317532594850607E-4,5.9317532594850607E-4,2.2234254524691153,4.9436207426874906E-3,4.9436207426874906E-3,2.5022443178705212,2.5044906505261238E-2,1.5525764891041165,1.5839999999999999,0,3.177537622142077,4.8468493580503615,9.3967794798532803E-2,0.26611200000000002,0.36697659099829133,0.26611200000000002,0.51321600000000001,0.11901270130379404,5.2800000000000003E-5,2.1120000000000001,1.841230769230769,1.6720000000000002,2.1120528000000003,6.8272988949201805,27,0.79817191682586774,175.81300910710385,26.816893549914568,null,79.817191682586781,0.26685438440738246,4.0577302131403687,3.5162601821420769,0.53633787099829133,0.11901270130379404]
[null,null,null,null,null,null,55,24,1,5.5,5.5,1.2731481481481481,0.21047789526267588,2.6683841669534654,6.8341920834767329,4.1658079165232671,0,5.5536795164891055,6.7855383578115464E-2,0.2,0.26931735416781949,0.77029615854595934,5.9335617187066176E-4,5.9335617187066176E-4,2.2639467491952345,5.1254548831916706E-3,5.1254548831916706E-3,2.5479098669090319,2.5967378759569601E-2,1.5813279055690073,1.5839999999999999,0,3.2079557245974866,4.93472506650353,9.7406045927913076E-2,0.27104,0.37576643036272905,0.27104,0.52271999999999996,0.12337342468748265,5.2800000000000003E-5,2.1120000000000001,1.841230769230769,1.6720000000000002,2.1120528000000003,6.8879445448705798,27.5,0.79969885853796963,177.64754622987434,27.413201518136454,null,79.969885853796967,0.26931735416781949,4.1064421549602157,3.5529509245974866,0.54826403036272908,0.12337342468748265]
[null,null,null,null,null,null,56,24,1,5.6,5.6,1.2962962962962963,0.21051685093912348,2.6687907906274995,6.9343953953137492,4.2656046046862501,0,5.6527459719748752,7.0297781452091992E-2,0.2,0.27182648536095555,0.77041354068979051,5.9353702367817953E-4,5.9353702367817953E-4,2.3044873793064107,5.310662081382529E-3,5.310662081382529E-3,2.5935994275507199,2.6907031962365689E-2,1.610079322033898,1.5839999999999999,0,3.2384135735021795,5.0226267065238632,0.100907116132347,0.27596799999999999,0.38463765136334588,0.27596799999999999,0.53222399999999992,0.1278141480947127,5.2800000000000003E-5,2.1120000000000001,1.841230769230769,1.6720000000000002,2.1120528000000003,6.948840857426255,28,0.80117106356190637,179.48407067510897,28.01357856816729,null,80.117106356190632,0.27182648536095555,4.1552752248655258,3.5896814135021793,0.56027157136334582,0.1278141480947127]
["Outputs",null,null,null,null,null,57,24,1,5.7,5.7,1.3194444444444444,0.21055580531828097,2.6691973655664372,7.0345986827832192,4.3654013172167812,0,5.7518447372440642,7.2784179338996932E-2,0.2,0.27438183185556803,0.77053090876501129,5.9371788136223418E-4,5.9371788136223418E-4,2.3450466259739775,5.499243677991936E-3,5.499243677991936E-3,2.6393121947645826,2.7863875445732152E-2,1.6388307384987892,1.5839999999999999,0,3.2689115226465502,5.1105527117846261,0.10447099607971679,0.28089599999999998,0.39359075982505598,0.28089599999999998,0.54172799999999999,0.13233487152544895,5.2800000000000003E-5,2.1120000000000001,1.841230769230769,1.6720000000000002,2.1120528000000003,7.0099887474119775,28.5,0.80259107381657846,181.32260013232749,28.618049991252796,null,80.259107381657842,0.27438183185556803,4.204230282471606,3.6264520026465501,0.57236099982505595,0.13233487152544895]
["Design","Value","Units",null,null,null,58,24,1,5.8,5.8,1.3425925925925926,0.21059475840021316,2.6696038917727125,7.1348019458863563,4.4651980541136433,0,5.8509741705902272,7.5314577238810784E-2,0.2,0.27698344854515694,0.77064826277232412,5.9389874491400107E-4,5.9389874491400107E-4,2.385623820575856,5.6912010132989434E-3,5.6912010132989434E-3,2.6850474176972225,2.8837918541130093E-2,1.6675821549636805,1.5839999999999999,0,3.2994499271507522,5.1985016215859234,0.10809767643852591,0.28582399999999997,0.40262626927487105,0.28582399999999997,0.55123199999999994,0.13693559497965599,5.2800000000000003E-5,2.1120000000000001,1.841230769230769,1.6720000000000002,2.1120528000000003,7.0713891397086499,29,0.80396127489517122,183.16315235753763,29.226641463743551,null,80.396127489517127,0.27698344854515694,4.253308196425623,3.6632630471507523,0.58453282927487105,0.13693559497965599]
["Dmax",{"$f":"D1_Vinmin","v":0.55555555555555558},"index",null,null,null,59,24,1,5.9,5.9,1.3657407407407407,0.21063371018498478,2.6700103692487587,7.2350051846243799,4.5649948153756208,0,5.9501327392189038,7.7888975151514259E-2,0.2,0.27963139135091547,0.77076560271243155,5.9407961432465784E-4,5.9407961432465784E-4,2.4262183387176592,5.8865354271298784E-3,5.8865354271298784E-3,2.7308043952011261,2.9829170579399152E-2,1.6963335714285717,1.5839999999999999,0,3.3300291434790119,5.2864720721360925,0.11178714787789949,0.29075200000000001,0.41174470103439414,0.29075200000000001,0.56073600000000001,0.14161631845729863,5.2800000000000003E-5,2.1120000000000001,1.841230769230769,1.6720000000000002,2.1120528000000003,7.1330429693630748,29.5,0.80528390788260262,185.00574517395057,29.839379051719707,null,80.528390788260268,0.27963139135091547,4.3025098445134065,3.7001149034790117,0.59678758103439411,0.14161631845729863]
["Dprime",{"$f":"1-B68","v":0.44444444444444442},"index",null,null,null,60,24,1,6,6,1.3888888888888888,0.21067266067266069,2.6704167979970119,7.335208398998506,4.664791601001494,0,6.0493190103998806,8.0507373077087857E-2,0.2,0.28232571722475741,0.77088292858603669,5.942604895853846E-4,5.942604895853846E-4,2.4668295966398643,6.0852482588583962E-3,6.0852482588583962E-3,2.7765824717968268,3.0837640890757505E-2,1.7250849878934624,1.5839999999999999,0,3.3606495294540188,5.3744627886790708,0.11553940106758405,0.29568,0.42094658431420579,0.29568,0.57023999999999986,0.14637704195834156,5.2800000000000003E-5,2.1120000000000001,1.841230769230769,1.6720000000000002,2.1120528000000003,7.1949511816997678,30,0.80656108011670835,186.85039647270094,30.456289215710285,null,80.656108011670838,0.28232571722475741,4.3518361137682247,3.7370079294540188,0.60912578431420572,0.14637704195834156]
["Ipp",{"$f":"Iripple_Vinnom","v":2.6742972941710339},"A",null,null,null,61,24,1,6.1,6.1,1.412037037037037,0.21071160986330564,2.6708231780199041,7.4354115890099521,4.7645884109900472,0,6.148531643464751,8.3169771015512178E-2,0.2,0.28506648415240443,0.77100024039384174,5.944413706873618E-4,5.944413706873618E-4,2.507457047968229,6.2873408474055457E-3,6.2873408474055457E-3,2.8223810340208293,3.1863338804801945E-2,1.7538364043583532,1.5839999999999999,0,3.3913114442714396,5.4624725783739061,0.11935442667794748,0.30060799999999999,0.4302324563101767,0.30060799999999999,0.57974400000000004,0.1512177654827494,5.2800000000000003E-5,2.1120000000000001,1.841230769230769,1.6720000000000002,2.1120528000000003,7.2571147324348635,30.5,0.80779477500168428,188.69712421357198,31.07739881550884,null,80.779477500168426,0.28506648415240443,4.4012879005816163,3.7739424842714397,0.62154797631017678,0.1512177654827494]
["Top FET","Value","Units",null,null,null,62,24,1,6.2,6.2,1.4351851851851851,0.21075055775698448,2.6712295093198701,7.5356147546599352,4.8643852453400651,0,6.2477693825574079,8.5876168966767918E-2,0.2,0.28785375115653083,0.77111753813654949,5.9462225762177293E-4,5.9462225762177293E-4,2.5481001807699521,6.4928145312398633E-3,6.4928145312398633E-3,2.8681995071171373,3.2906273650507953E-2,1.7825878208232446,1.5839999999999999,0,3.4220152485145188,5.5505003238442194,0.12323221537997914,0.30553599999999997,0.43960286230174389,0.30553599999999997,0.58924799999999999,0.1561384890304871,5.2800000000000003E-5,2.1120000000000001,1.841230769230769,1.6720000000000002,2.1120528000000003,7.3195345877921429,31,0.80898686096975714,190.54594642572593,31.702735115087194,null,80.898686096975709,0.28785375115653083,4.4508661108162624,3.8109189285145186,0.63405470230174388,0.1561384890304871]
["Tr",{"$f":"(Qgd_Q1+Qgs_Q1/2)*(RdsonDRT+Rgate1)/(VCC-Vsp_Q1)*1000000000","v":4.5460451977401135},"ns","Turn on of MOSFET -> Rise time of current",null,null,63,24,1,6.3,6.3,1.4583333333333333,0.21078950435376187,2.6716357918993432,7.6358178959496712,4.9641821040503284,0,6.3470310500563807,8.8626566930835565E-2,0.2,0.29068757829996872,0.77123482181486247,5.9480315037980266E-4,5.9480315037980266E-4,2.5887585148826435,6.7016706483773898E-3,6.7016706483773898E-3,2.9140373520353893,3.3966454756229697E-2,1.8113392372881356,1.5839999999999999,0,3.4527613041687872,5.6385449773254779,0.1271727578452895,0.31046399999999996,0.44905835575218472,0.31046399999999996,0.59875199999999995,0.1611392126015192,5.2800000000000003E-5,2.1120000000000001,1.841230769230769,1.6720000000000002,2.1120528000000003,7.3822117246212162,31.5,0.81013909967609665,192.39688120843937,32.332325787609236,null,81.013909967609663,0.29068757829996872,4.500571659920972,3.8479376241687873,0.64664651575218468,0.1611392126015192]
["Tf",{"$f":"(Qgd_Q1+Qgs_Q1/2)*(RdsonDRT2+Rgate1)/(Vsp_Q1)*1000000000","v":6.3446428571428566},"ns","Turn off of MOSFET -> Fall time of current",null,null,64,{"$f":"Vin","v":24},{"$f":"MODE","v":1},6.4,{"$f":"Iout*G73/100/Number_of_Phases","v":6.4},{"$f":"Vout*K73/(Vin*Efficiency)","v":1.4814814814814814},{"$f":"(Vout+(Rdson2+Rs+Rdcr)*K73)/(Vin+(Rs+Rdson2-Rdson1)*K73)","v":0.2108284496537027},{"$f":"(Vin-(Rdson1+Rdcr)*K73-Vout)*M73/(Fsw*Lf)","v":2.6720420257607564},7.7360210128803786,5.0639789871196221,{"$f":"IF(MIN(Vin, -P73/(Coss_Q1+Coss_Q2)*0.00000002)<0, 0, MIN(Vin, -P73/(Coss_Q1+Coss_Q2)*0.00000002))","v":0},6.4463155405977952,{"$f":"R73^2*Rdcr","v":9.1420964907695829E-2},{"$f":"Core_Loss_Ch1","v":0.2},{"$f":"(T73+S73*(1+Ltc*(Ta-25)))/(1-S73*Ltc*ThetaCa)","v":0.29356802668897219},0.77135209142948291,5.9498404895263731E-4,5.9498404895263731E-4,2.6294315994871971,6.9139105363817998E-3,6.9139105363817998E-3,2.959894062703095,{"$f":"Rdson1*AB73^2","v":3.5043891449700132E-2},{"$f":"(Vin*K73/2)*Fsw*(Tr_buck+Tf_buck)","v":1.8400906537530268},{"$f":"(0.5*Coss_Q1*(Vin-Q73)^2-0.5*Coss_Q2*(Vin-Q73)^2+(Qoss_Q2*(Vin-Q73)/Vin)*Vin)*Fsw","v":1.5839999999999999},{"$f":"IF(K73>N73/2,0,ABS(K73-N73/2)*Vsd_Q1*Deadtime*Fsw)","v":0},{"$f":"(AF73+AE73+AD73+AC73*(1+RdsonTopTc*Ta-RdsonTopTc*25))/(1-AC73*RdsonTopTc*ThetaJA_Q1)","v":3.4835499746368828},{"$f":"SQRT((1-M73))*SQRT(K73^2+(N73^2)/12)","v":5.7266055553466932},{"$f":"Rdson2*AH73^2","v":0.13117604474611044},{"$f":"IF(K73<N73/2,Deadtime*Fsw*IF(VfdSky_Q2>0,0,Vsd_Q2)*(K73+N73/2),2*Deadtime*Fsw*IF(VfdSky_Q2>0,0,Vsd_Q2)*K73)","v":0.31539200000000001},{"$f":"(AJ73+AI73*(1+RdsonBotTc*Ta-RdsonBotTc*25))/(1-AI73*RdsonBotTc*ThetaJA_Q2)","v":0.45859949841092962},{"$f":"2*Deadtime*Fsw*IF(VfdSky_Q2>0,VfdSky_Q2,Vsd_Q2)*K73","v":0.31539200000000001},{"$f":"IF(QrrSky_Q2>0,QrrSky_Q2,Qrr_Q2*K73/(Iout/Number_of_Phases))*Fsw*Vin","v":0.60825599999999991},{"$f":"Rs*R73^2","v":0.1662199361958106},{"$f":"Iq*Vin","v":5.2800000000000003E-5},{"$f":"IF(Ext_VCC=1,  (Qg_Q1+Qg_Q2)*Fsw*VCC, (Qg_Q1+Qg_Q2)*Fsw*Vin)","v":2.1120000000000001},{"$f":"(Vin-VCC)*Fsw*(Qg_Q1+Qg_Q2)+(RdsonDRT+RdsonDRT2)*Fsw*Qg_Q1*VCC/(RdsonDRT+2*Rgate1+RdsonDRT2)+(RdsonDRB+RdsonDRB2)*Fsw*Qg_Q2*VCC/(RdsonDRB+2*Rgate2+RdsonDRB2)","v":1.841230769230769},{"$f":"(Qg_Q1+Qg_Q2)*Fsw*(Vin-VCC)","v":1.6720000000000002},2.1120528000000003,{"$f":" SUM(U73,X73,AA73,AG73,AK73,AL73,AM73,AS73,AN73)","v":7.4451471305179293},{"$f":"Vout*K73","v":32},0.81125315350242999,{"$f":"ThetaJA_Q1*BC73","v":194.24994673184415},{"$f":"ThetaJA_Q2*BD73","v":32.966198920546482},null,81.125315350243,{"$f":"U73","v":0.29356802668897219},4.5504054730478121,3.884998934636883,0.6593239784109296,0.1662199361958106]
["Part Power","Value","Units",null,null,null,65,24,1,{"$f":"Iout*G74/100","v":6.5},6.5,1.5046296296296295,0.21086739365687174,2.6724482109065444,{"$f":"K74+N74/2","v":7.8362241054532724},{"$f":"K74-N74/2","v":5.1637758945467276},0,{"$f":"SQRT(K74^2+(N74^2)/12)","v":6.5456218156361174},9.4259362897329224E-2,0.2,0.29649515847654057,{"$f":"N74/SQRT(12)","v":0.77146934698111358},{"$f":"RCoutEsr*V74^2","v":5.9516495333146577E-4},{"$f":"W74","v":5.9516495333146577E-4},{"$f":"SQRT(M74*(1-M74))*SQRT(K74^2+(N74^2)/12)","v":2.6701190108990316},{"$f":"RCinEsr*Y74^2","v":7.1295355323644227E-3},{"$f":"Z74","v":7.1295355323644227E-3},{"$f":"SQRT(M74)*SQRT(K74^2+(N74^2)/12)","v":3.0057691635432935},3.6138593058031E-2,1.8688420702179176,1.5839999999999999,0,3.5143816247534656,5.8146811338906383,0.13524206675529488,0.32031999999999999,0.46822686041794814,0.32031999999999999,0.61775999999999998,0.17138065981332584,5.2800000000000003E-5,2.1120000000000001,1.841230769230769,1.6720000000000002,2.1120528000000003,7.5083418039469754,32.5,{"$f":"AU74/(AU74+AT74)","v":0.81233059243644412},196.10516123767329,33.604383020897409,null,{"$f":"AV74*100","v":81.233059243644419},0.29649515847654057,{"$f":"AG74+AK74+AM74","v":4.6003684851714137},{"$f":"AG74+AM74*0.66","v":3.9221032247534655},{"$f":"AK74+AM74*0.33","v":0.67208766041794821},{"$f":"AN74","v":0.17138065981332584}]
["Power Dis",{"$f":"AS9","v":2.1120528000000003},"W",null,null,null,66,24,1,6.6,6.6,1.5277777777777777,0.21090633636333367,2.6728543473391388,7.9364271736695695,5.2635728263304298,0,6.644948898487292,9.7141760899716462E-2,0.2,0.29946903686580334,0.77158658847045669,5.9534586350747792E-4,5.9534586350747792E-4,2.7108203505552204,7.3485469729843286E-3,7.3485469729843286E-3,3.0516622072123645,3.7250568907712958E-2,1.8975934866828084,1.5839999999999999,0,3.5452566208002501,5.9027708439832924,0.13937081454631692,0.32524799999999998,0.47794102041025188,0.32524799999999998,0.62726400000000004,0.17662138345402992,5.2800000000000003E-5,2.1120000000000001,1.841230769230769,1.6720000000000002,{"$f":"SUM(AO75:AP75)","v":2.1120528000000003},7.5717967543668276,33,0.81337290038672339,197.96254304001252,34.246907020512594,null,81.337290038672336,0.29946903686580334,4.6504616412105024,3.9592508608002501,0.68493814041025192,0.17662138345402992]
["Temp rise",{"$f":"B75*B62","v":63.361584000000008},"°C",null,null,null,67,24,1,6.7,6.7,1.5509259259259258,0.21094527777315331,2.673260435060973,8.0366302175304867,5.3633697824695137,0,6.7442958698052289,0.10006815891483811,0.2,0.30248972611346436,0.77170381589821446,5.9552677947186528E-4,5.9552677947186528E-4,2.7515352431775981,7.5709461944484047E-3,7.5709461944484047E-3,3.0975727725356021,3.8379828324615589E-2,1.9263449031476998,1.5839999999999999,0,3.5761753305211403,5.9908738676688875,0.14356227879327191,0.33017599999999997,0.48774256563055168,0.33017599999999997,0.636768,0.18194210711788747,5.2800000000000003E-5,2.1120000000000001,1.841230769230769,1.6720000000000002,2.1120528000000003,7.635513002356964,33.5,0.81438148098652696,199.822110526057,34.893800281527589,null,81.43814809865269,0.30248972611346436,4.7006858961516924,3.9964422105211401,0.69787600563055174,0.18194210711788747]
["Current (switching)",{"$f":"(Qg_Q1+Qg_Q2)*Fsw+Iq","v":8.8002200000000003E-2},"A",null,null,null,68,24,1,6.8,6.8,1.574074074074074,0.2109842178863954,2.67366647407448,8.1368332370372407,5.4631667629627598,0,6.8436618634482382,0.10303855694267479,0.2,0.30555729153330713,0.77182102926508933,5.9570770121582185E-4,5.9570770121582185E-4,2.7922633350942019,7.7967345325113948E-3,7.7967345325113948E-3,3.1435004626207461,3.9526380633987383E-2,1.9550963196125908,1.5839999999999999,0,3.6071381231374775,6.0789894343319073,0.14781645017087583,0.33510399999999996,0.49763209203811187,0.33510399999999996,0.64627199999999996,0.18734283080486325,5.2800000000000003E-5,2.1120000000000001,1.841230769230769,1.6720000000000002,2.1120528000000003,7.6994915797474865,34,0.81535766293402578,201.68388215687386,35.545092601905594,null,81.535766293402574,0.30555729153330713,4.7510422151755893,4.0336776431374775,0.71090185203811185,0.18734283080486325]
["Qrr Current",{"$f":"Qrr_Q2*Fsw","v":3.9599999999999996E-2},"A",null,null,null,69,24,1,6.9,6.9,1.5972222222222221,0.21102315670312474,2.6740724643820921,8.2370362321910466,5.5629637678089541,0,6.9430460626968724,0.1060529549832072,0.2,0.30867179949976192,0.77193822857178351,5.9588862873054304E-4,5.9588862873054304E-4,2.8330042927034214,8.0259133224760137E-3,8.0259133224760137E-3,3.1894449031318888,4.0690235160455938E-2,1.9838477360774822,1.5839999999999999,0,3.6381453693634023,6.1671168173317881,0.15213331935446628,0.340032,0.50761020442184512,0.340032,0.65577599999999991,0.19282355451492217,5.2800000000000003E-5,2.1120000000000001,1.841230769230769,1.6720000000000002,2.1120528000000003,7.7637335297511374,34.5,0.81630270491162515,203.5478764681701,36.200814221092251,null,81.63027049116252,0.30867179949976192,4.8015315737852475,4.0709575293634019,0.72401628442184507,0.19282355451492217]
["Diode Current",{"$f":"Deadtime*Fsw*(Iripple_Vinnom/2)*(Vsd_Q2)/Vin","v":1.3728059443411306E-3},null,null,null,null,70,24,1,7,7,1.6203703703703702,0.21106209422340602,2.6744784059862421,8.3372392029931213,5.6627607970068787,0,7.042447696788896,0.10911135303641591,0.2,0.31183331745153359,0.77205541381899911,5.9606956200722598E-4,5.9606956200722598E-4,2.8737578010669158,8.258483899192955E-3,8.258483899192955E-3,3.235405740708106,4.187140122802787E-2,2.0125991525423728,1.5839999999999999,0,3.6691974414213218,6.2552553309197743,0.15651287702000102,0.34495999999999999,0.51767751651568883,0.34495999999999999,0.66527999999999998,0.19838427824802893,5.2800000000000003E-5,2.1120000000000001,1.841230769230769,1.6720000000000002,2.1120528000000003,7.8282399070977737,35,0.81721780012256751,205.41411207106611,36.860995825784443,null,81.721780012256744,0.31183331745153359,4.8521549579370111,4.108282241421322,0.73721991651568886,0.19838427824802893]
["Total",{"$f":"SUM(B77:B79)","v":0.12897500594434114},"A",null,null,null,71,24,1,7.1,7.1,1.6435185185185184,0.21110103044730402,2.6748842988893622,8.4374421494446814,5.7625578505553188,0,7.1418660377409111,0.11221375110228153,0.2,0.31504191389529218,0.77217258500743835,5.9625050103706957E-4,5.9625050103706957E-4,2.9145235626189425,8.4944475970610139E-3,8.4944475970610139E-3,3.2813826415129097,4.3069888160088964E-2,2.0413505690072635,1.5839999999999999,0,3.7002947130575037,6.3434043274108598,0.16095511384405931,0.34988799999999998,0.52783465111631223,0.34988799999999998,0.67478399999999994,0.20402500200414825,5.2800000000000003E-5,2.1120000000000001,1.841230769230769,1.6720000000000002,2.1120528000000003,7.8930117781713554,35.5,0.81810408047910843,207.28260765287519,37.525668555815614,null,81.81040804791084,0.31504191389529218,4.9029133641738154,4.1456521530575037,0.75051337111631222,0.20402500200414825]
[null,null,null,null,null,null,72,24,1,7.2,7.2,1.6666666666666665,0.21113996537488347,2.6752901430938838,8.5376450715469421,5.8623549284530583,0,7.2413003974294066,0.11536014918078483,0.2,0.31829765840942525,0.77228974213780321,5.9643144581127464E-4,5.9643144581127464E-4,2.9553012959810245,8.7338057500271227E-3,8.7338057500271227E-3,3.3273752899020939,4.4285705279404168E-2,2.0701019854721547,1.5839999999999999,0,3.7314375595577736,6.4315631945865412,0.16546002050384095,0.35481599999999996,0.53808224020319562,0.35481599999999996,0.68428800000000001,0.20974572578324513,5.2800000000000003E-5,2.1120000000000001,1.841230769230769,1.6720000000000002,2.1120528000000003,7.9580502211494775,36,0.81896262047308388,209.15338197788867,38.194864010159776,null,81.896262047308383,0.31829765840942525,4.9538077997609697,4.1830676395577733,0.76389728020319558,0.20974572578324513]
[null,null,null,null,null,null,73,24,1,7.3,7.3,1.6898148148148147,0.21117889900620912,2.6756959386022405,8.6378479693011201,5.9621520306988796,0,7.3407501249069256,0.1185505472719063,0.2,0.32160062164785336,0.77240688521079603,5.9661239632104385E-4,5.9661239632104385E-4,2.996090734872098,8.976559691586429E-3,8.976559691586429E-3,3.3733833871988845,4.5518861908117679E-2,2.0988534019370459,1.5839999999999999,0,3.7626263577633385,6.5197313533067929,0.17002758767716653,0.35974399999999995,0.54842092506113138,0.35974399999999995,0.69379199999999996,0.21554644958528418,5.2800000000000003E-5,2.1120000000000001,1.841230769230769,1.6720000000000002,2.1120528000000003,8.0233563261455156,36.5,0.81979444075661589,211.02645388816694,38.868614253056563,null,81.97944407566159,0.32160062164785336,5.0048392828244701,4.2205290777633389,0.77737228506113132,0.21554644958528418]
[null,null,null,null,null,null,74,24,1,7.4,7.4,1.7129629629629628,0.21121783134134567,2.676101685416862,8.7380508427084322,6.0619491572915694,0,7.4402146039316355,0.12178494537562669,0.2,0.32495087534390826,0.77252401422711825,5.9679335255758087E-4,5.9679335255758087E-4,3.0368916271053146,9.2227107547823654E-3,9.2227107547823654E-3,3.419406650566474,4.6769367367752931E-2,2.1276048184019372,1.5839999999999999,0,3.7938614860867212,6.6079082553119139,0.17465780604247738,0.364672,0.55885135640519623,0.364672,0.70329600000000003,0.22142717341023033,5.2800000000000003E-5,2.1120000000000001,1.841230769230769,1.6720000000000002,2.1120528000000003,8.0889311953533962,37,0.8206005114579652,212.90184230433607,39.546951820259814,null,82.060051145796521,0.32495087534390826,5.0560088424919174,4.2580368460867213,0.79093903640519625,0.22142717341023033]
[null,null,null,null,null,null,75,24,1,7.5,7.5,1.7361111111111109,0.2112567623803579,2.6765073835401818,8.8382536917700918,6.1617463082299091,0,7.5396932506907799,0.12506334349192663,0.2,0.32834849231427521,0.77264112918747252,5.9697431451209259E-4,5.9697431451209259E-4,3.0777037336635753,9.4722602722067117E-3,9.4722602722067117E-3,3.4654448119690482,4.8037230979212767E-2,2.1563562348668279,1.5839999999999999,0,3.8251433245278279,6.6960933811968983,0.17935066627883564,0.36959999999999998,0.56937419450824134,0.36959999999999998,0.71279999999999999,0.22738789725804842,5.2800000000000003E-5,2.1120000000000001,1.841230769230769,1.6720000000000002,2.1120528000000003,8.1547759431951103,37.5,0.82138175525510182,214.77956622639138,40.229909725412064,null,82.138175525510178,0.32834849231427521,5.1073175190360693,4.2955913245278277,0.80459819450824133,0.22738789725804842]
[null,null,null,null,null,null,76,24,1,7.6,7.6,1.7592592592592591,0.21129569212331045,2.6769130329746305,8.9384565164873155,6.2615434835126846,0,7.6391855117005623,0.12838574162078673,0.2,0.33179354646299813,0.77275823009256028,5.9715528217578636E-4,5.9715528217578636E-4,3.11852682784671,9.7252095759996632E-3,9.7252095759996632E-3,3.5114976172133212,4.9322462062779328E-2,2.1851076513317187,1.5839999999999999,0,3.8564722546901202,6.78428623854278,0.18410615906592379,0.37452799999999997,0.57999010933095307,0.37452799999999997,0.72230399999999984,0.23342862112870313,5.2800000000000003E-5,2.1120000000000001,1.841230769230769,1.6720000000000002,2.1120528000000003,8.2208916964709502,38,0.82213905022739686,216.65964473450597,40.917521466547655,null,82.213905022739681,0.33179354646299813,5.1587663640210728,4.3331928946901197,0.81835042933095303,0.23342862112870313]
[null,null,null,null,null,null,77,24,1,7.7,7.7,1.7824074074074072,0.21133462057026817,2.6773186337226402,9.0386593168613203,6.3613406831386801,0,7.738690861866746,0.13175213976218775,0.2,0.3352861127855512,0.77287531694308376,5.973362555398721E-4,5.973362555398721E-4,3.1593606944839192,9.9815599978499113E-3,9.9815599978499113E-3,3.5575648250634289,5.0625069938114345E-2,2.2138590677966103,1.5839999999999999,0,3.8878486597969295,6.8724863601909965,0.18892427508404516,0.37945600000000002,0.59069978065453788,0.37945600000000002,0.7318079999999999,0.23954934502215952,5.2800000000000003E-5,2.1120000000000001,1.841230769230769,1.6720000000000002,2.1120528000000003,8.2872795945125688,38.5,0.82287323250389321,218.54209698984647,41.609821032726892,null,82.287323250389321,0.3352861127855512,5.2103564404514673,4.3708419397969296,0.83219642065453781,0.23954934502215952]
[null,null,null,null,null,null,78,24,1,7.8,7.8,1.8055555555555554,0.21137354772129566,2.6777241857866412,9.1388620928933211,6.4611379071066795,0,7.8382088026918213,0.13516253791611021,0.2,0.33882626737297211,0.77299238973974438,5.9751723459556085E-4,5.9751723459556085E-4,3.2002051292057341,1.0241312868994689E-2,1.0241312868994689E-2,3.6036462064226988,5.1945063924258836E-2,2.2426104842615011,1.5839999999999999,0,3.9192729247078728,6.9606933026481528,0.1938050050141234,0.38438399999999995,0.60150389821607986,0.38438399999999995,0.74131199999999997,0.24575006893838222,5.2800000000000003E-5,2.1120000000000001,1.841230769230769,1.6720000000000002,2.1120528000000003,8.3539407893388962,39,0.82358509872488439,220.42694223539362,42.306842910803994,null,82.35850987248844,0.33882626737297211,5.2620888229239524,4.4085388447078726,0.84613685821607987,0.24575006893838222]
[null,null,null,null,null,null,79,24,1,7.9,7.9,1.8287037037037035,0.21141247357645768,2.6781296891690647,9.2390648445845329,6.5609351554154678,0,7.9377388606160428,0.13861693608253498,0.2,0.34241408741606394,0.77310944848324414,5.9769821933406601E-4,5.9769821933406601E-4,3.241059937770336,1.0504469520219854E-2,1.0504469520219854E-2,3.6497415435765288,5.3282453339633537E-2,2.2713619007263923,1.5839999999999999,0,3.9507454359354259,7.0489066446099065,0.19874833953770274,0.38931199999999999,0.61240316184663424,0.38931199999999999,0.75081599999999993,0.25203079287733632,5.2800000000000003E-5,2.1120000000000001,1.841230769230769,1.6720000000000002,2.1120528000000003,8.4208764458150149,39.5,0.82427540833196888,222.31419979677131,43.008622092331713,null,82.427540833196886,0.34241408741606394,5.3139645977820607,4.4462839959354259,0.86017244184663422,0.25203079287733632]
[null,null,null,null,null,null,80,24,1,8,8,1.8518518518518516,0.2114513981358189,2.6785351438723404,9.3392675719361709,6.66073242806383,0,8.0372805854808007,0.14211533426144254,0.2,0.34604965120965991,0.77322649317428438,5.9787920974660165E-4,5.9787920974660165E-4,3.2819249354395592,1.0771031281859954E-2,1.0771031281859954E-2,3.6958506294910873,5.4637247502038667E-2,2.3001133171912831,1.5839999999999999,0,3.9822665816615896,7.1371259855937064,0.20375426933694774,0.39423999999999998,0.62339828161210442,0.39423999999999998,0.76032,0.25839151683898642,5.2800000000000003E-5,2.1120000000000001,1.841230769230769,1.6720000000000002,2.1120528000000003,8.4880877418139473,40,0.8249448857003655,224.2038890830795,43.715194080605222,null,82.494488570036552,0.34604965120965991,5.3659848632736944,4.4840777816615898,0.87430388161210448,0.25839151683898642]
[null,null,null,null,null,null,81,24,1,8.1,8.1,1.8749999999999998,0.2114903213994441,2.6789405498989023,9.4394702749494499,6.7605297250505485,0,8.1368335491039989,0.14565773245281366,0.2,0.34973303815695572,0.77334352381356775,5.9806020582438627E-4,5.9806020582438627E-4,3.3227999464003681,1.1040999483798291E-2,1.1040999483798291E-2,3.7419732671631345,5.6009455728654178E-2,2.3288647336561739,1.5839999999999999,0,4.0138367517547184,7.2253509446711881,0.2088227850946433,0.39916799999999997,0.63448997795696582,0.39916799999999997,0.76982400000000006,0.26483224082329754,5.2800000000000003E-5,2.1120000000000001,1.841230769230769,1.6720000000000002,2.1120528000000003,8.5555758683815597,40.5,0.82559422212601119,226.09602958773593,44.42659489784829,null,82.55942221260112,0.34973303815695572,5.4181507297116838,4.5219205917547187,0.88853189795696585,0.26483224082329754]
[null,null,null,null,null,null,82,24,1,8.1999999999999993,8.1999999999999993,1.8981481481481479,0.21152924336739787,2.6793459072511765,9.5396729536255869,6.8603270463744108,0,8.2363973439580143,0.149244130656629,0.2,0.35346432877390827,0.77346054040179446,5.9824120755863598E-4,5.9824120755863598E-4,3.3636848032280011,1.1314375455466995E-2,1.1314375455466995E-2,3.7881092690166565,5.7399087336039628E-2,2.3576161501210651,1.5839999999999999,0,4.0454563377864519,7.31358115929185,0.21395387749419489,0.40409599999999996,0.64567898185089545,0.40409599999999996,0.7793279999999998,0.27135296483023458,5.2800000000000003E-5,2.1120000000000001,1.841230769230769,1.6720000000000002,2.1120528000000003,8.6233420299045136,41,0.82622407767885064,227.99064088932261,45.14286109254477,null,82.622407767885065,0.35346432877390827,5.4704633196373464,4.5598128177864519,0.90285722185089545,0.27135296483023458]
[null,null,null,null,null,null,83,24,1,8.3000000000000007,8.3000000000000007,1.9212962962962963,0.21156816403974502,2.679751215931597,9.6398756079657986,6.960124392034202,0,8.3359715819417577,0.15287452887286926,0.2,0.35724360469370092,0.7735775429396673,5.9842221494057276E-4,5.9842221494057276E-4,3.4045793463873166,1.1591160525847089E-2,1.1591160525847089E-2,3.8342584563424529,5.8806151640134439E-2,2.3863675665859567,1.5839999999999999,0,4.0771257330488035,7.4018162841904527,0.21914753721962785,0.409024,0.65696603493836514,0.409024,0.78883199999999998,0.27795368885976229,5.2800000000000003E-5,2.1120000000000001,1.841230769230769,1.6720000000000002,2.1120528000000003,8.6913874442814194,41.5,0.82683508293270591,229.88774265244015,45.864029746918256,null,82.683508293270592,0.35724360469370092,5.5229237679871686,4.5977548530488033,0.91728059493836511,0.27795368885976229]
[null,null,null,null,null,null,84,24,1,8.4,8.4,1.9444444444444444,0.21160708341655016,2.6801564759425927,9.7400782379712965,7.0599217620287043,0,8.4355558932391297,0.15654892710151511,0.2,0.36107094867127626,0.77369453142788736,5.9860322796141815E-4,5.9860322796141815E-4,3.4454834237692311,1.1871356023468543E-2,1.1871356023468543E-2,3.8804206587771413,6.0230657956257698E-2,2.4151189830508479,1.5839999999999999,0,4.1088453325713594,7.4900559903712987,0.22440375495558793,0.41395199999999999,0.66835188969126447,0.41395199999999999,0.79833599999999993,0.28463441291184566,5.2800000000000003E-5,2.1120000000000001,1.841230769230769,1.6720000000000002,2.1120528000000003,8.7597133430971752,42,0.82742784058120744,231.78735462856798,46.590138484563226,null,82.742784058120748,0.36107094867127626,5.5755332222626235,4.6357470925713598,0.93180276969126452,0.28463441291184566]
[null,null,null,null,null,null,85,24,1,8.5,8.5,1.9675925925925926,0.21164600149787804,2.6805616872865934,9.8402808436432974,7.1597191563567035,0,8.5351499252568725,0.16026732534254728,0.2,0.36494644458793779,0.77381150586715608,5.9878424661239575E-4,5.9878424661239575E-4,3.4863968902593947,1.2154963276410378E-2,1.2154963276410378E-2,3.9265957138184118,6.1672615599108492E-2,2.4438703995157383,1.5839999999999999,0,4.1406155331386376,7.578299964163155,0.22972252138734112,0.41887999999999997,0.67983730956461508,0.41887999999999997,0.80783999999999989,0.29139513698644959,5.2800000000000003E-5,2.1120000000000001,1.841230769230769,1.6720000000000002,2.1120528000000003,8.8283209718006628,42.5,0.82800292694844102,233.68949665693188,47.321225478230758,null,82.800292694844103,0.36494644458793779,5.6282928427032521,4.6737899331386377,0.9464245095646151,0.29139513698644959]
[null,null,null,null,null,null,86,24,1,8.6,8.6,1.9907407407407407,0.21168491828379321,2.6809668499660284,9.9404834249830145,7.2595165750169857,0,8.6347533416354594,0.16402972359594642,0.2,0.3688701774560183,0.7739284662581748,5.989652708847309E-4,5.989652708847309E-4,3.5273196073365227,1.2441983612300683E-2,1.2441983612300683E-2,3.9727834663735968,6.3132033882765642E-2,2.472621815980629,1.5839999999999999,0,4.1724367333075678,7.6665479063391579,0.2351038272007733,0.42380799999999996,0.69142306915544316,0.42380799999999996,0.81734399999999985,0.29823586108353889,5.2800000000000003E-5,2.1120000000000001,1.841230769230769,1.6720000000000002,2.1120528000000003,8.8972115898857549,43,0.82856089340222405,235.59418866537837,48.057329457772155,null,82.856089340222411,0.3688701774560183,5.6812038024630116,4.7118837733075676,0.96114658915544315,0.29823586108353889]
[null,null,null,null,null,null,87,24,1,8.6999999999999993,8.6999999999999993,2.0138888888888888,0.21172383377436049,2.6813719639833287,10.040685981991663,7.3593140180083347,0,8.7343658213272484,0.16783612186169317,0.2,0.372842233423619,0.77404541260164517,5.991463007696511E-4,5.991463007696511E-4,3.5682514426980512,1.2732418358316724E-2,1.2732418358316724E-2,4.0189837683389582,6.4608922120688056E-2,2.5013732324455202,1.5839999999999999,0,4.2043093334251171,7.7547995312965767,0.24054766308239042,0.42873599999999995,0.70310995436487789,0.42873599999999995,0.82684799999999992,0.30515658520307848,5.2800000000000003E-5,2.1120000000000001,1.841230769230769,1.6720000000000002,2.1120528000000003,8.9663864710757792,43.5,0.82910226767725159,237.50145067125584,48.798489718243893,null,82.910226767725163,0.372842233423619,5.7342672877899954,4.7500290134251166,0.97596979436487785,0.30515658520307848]
[null,null,null,null,null,null,88,24,1,8.8000000000000007,8.8000000000000007,2.0370370370370368,0.21176274796964453,2.6817770293409242,10.140888514670463,7.4591114853295384,0,8.8339870577366373,0.17168652013976851,0.2,0.37686269977941705,0.77416234489826885,5.9932733625838624E-4,5.9932733625838624E-4,3.6091922699109591,1.3026268841185022E-2,1.3026268841185022E-2,4.0651964782072563,6.6103289625714726E-2,2.5301246489104119,1.5839999999999999,0,4.2362337356460538,7.843054566291741,0.24605401971931892,0.43366399999999999,0.71489876256354434,0.43366399999999999,0.8363520000000001,0.31215730934503366,5.2800000000000003E-5,2.1120000000000001,1.841230769230769,1.6720000000000002,2.1120528000000003,9.0358469035114926,44,0.82962755511474207,239.4113027823027,49.544746128177216,null,82.962755511474199,0.37686269977941705,5.7874844982095981,4.7882260556460539,0.99089492256354439,0.31215730934503366]
[null,null,null,null,null,null,89,24,1,8.9,8.9,2.0601851851851851,0.21180166086970992,2.6821820460412416,10.241091023020621,7.5589089769793798,0,8.9336167579173758,0.17558091843015278,0.2,0.3809316649575426,0.77427926314874607,5.9950837734216512E-4,5.9950837734216512E-4,3.6501419680858067,1.3323536387181326E-2,1.3323536387181326E-2,4.1114214607014077,6.7615145710064384E-2,2.5588760653753031,1.5839999999999999,0,4.2682103439508552,7.9313127507258256,0.25162288779930425,0.43859199999999998,0.72679030276032064,0.43859199999999998,0.84585600000000016,0.31923803350936869,5.2800000000000003E-5,2.1120000000000001,1.841230769230769,1.6720000000000002,2.1120528000000003,9.1055941899426109,44.5,0.83013723982466392,241.32376519754274,50.296139138016038,null,83.013723982466388,0.3809316649575426,5.8408566467111767,4.826475303950855,1.0059227827603208,0.31923803350936869]
[null,null,null,null,null,null,90,24,1,9,9,2.083333333333333,0.2118405724746214,2.682587014086713,10.341293507043357,7.6587064929566431,0,9.0332546418227473,0.17951931673282687,0.2,0.38504921854252799,0.77439616735377914,5.996894240122224E-4,5.996894240122224E-4,3.6911004215722483,1.3624222322130829E-2,1.3624222322130829E-2,4.1576585864322793,6.914449968533623E-2,2.5876274818401939,1.5839999999999999,0,4.3002395641637685,8.0195738354776775,0.25725425801071261,0.44351999999999997,0.7387853957745385,0.44351999999999997,0.8553599999999999,0.32639875769604887,5.2800000000000003E-5,2.1120000000000001,1.841230769230769,1.6720000000000002,2.1120528000000003,9.1756296479230279,45,0.83063178577611962,243.23885820818845,51.052709788726922,null,83.063178577611964,0.38504921854252799,5.8943849599383071,4.8647771641637689,1.0210541957745385,0.32639875769604887]
[null,null,null,null,null,null,91,24,1,9.1,9.1,2.1064814814814814,0.21187948278444357,2.6829919334797658,10.441495966739883,7.7585040332601167,0,9.132900441604507,0.18350171504777157,0.2,0.38921545127432611,0.77451305751406874,5.9987047625979122E-4,5.9987047625979122E-4,3.7320675196743314,1.3928327971408116E-2,1.3928327971408116E-2,4.2039077315787221,7.0691360862509434E-2,2.6163788983050842,1.5839999999999999,0,4.3323218039710003,8.1078375822800286,0.26294812104252985,0.44844799999999996,0.75088487441169194,0.44844799999999996,0.86486399999999997,0.33363948190503917,5.2800000000000003E-5,2.1120000000000001,1.841230769230769,1.6720000000000002,2.1120528000000003,9.2459546100097239,45.5,0.83111163782101261,245.15660219855002,51.814499720584593,null,83.111163782101258,0.38921545127432611,5.9480706783826918,4.9031320439710004,1.0362899944116919,0.33363948190503917]
[null,null,null,null,null,null,92,24,1,9.1999999999999993,9.1999999999999993,2.1296296296296293,0.21191839179924118,2.6833968042228298,10.541698402111415,7.858301597888584,0,9.2325539009569884,0.18752811337496744,0.2,0.39343045505340096,0.77462993363031618,6.0005153407610798E-4,6.0005153407610798E-4,3.7730431563841513,1.4235854659937279E-2,1.4235854659937279E-2,4.2501687775882324,7.2255738551943394E-2,2.6451303147699754,1.5839999999999999,0,4.3644574729390708,8.1961037631358877,0.26870446758436106,0.45337599999999995,0.76308958364273982,0.45337599999999995,0.87436799999999981,0.3409602061363044,5.2800000000000003E-5,2.1120000000000001,1.841230769230769,1.6720000000000002,2.1120528000000003,9.3165704239655298,46,0.83157722265570555,247.07701764695352,52.581551182136991,null,83.157722265570555,0.39343045505340096,6.0019150565818107,4.9415403529390707,1.0516310236427397,0.3409602061363044]
[null,null,null,null,null,null,93,24,1,9.3000000000000007,9.3000000000000007,2.1527777777777777,0.21195729951907877,2.6838016263183331,10.641900813159168,7.9580991868408342,0,9.3322147745030186,0.19159851171439535,0.2,0.39769432294589113,0.77474679570322258,6.0023259745241092E-4,6.0023259745241092E-4,3.8140272301324729,1.4546803712191985E-2,1.4546803712191985E-2,4.2964416108966805,7.3837642063377854E-2,2.6738817312348671,1.5839999999999999,0,4.3966469825333094,8.284372159772154,0.2745232883264318,0.45830399999999999,0.77540038078707907,0.45830399999999999,0.88387199999999999,0.3483609303898097,5.2800000000000003E-5,2.1120000000000001,1.841230769230769,1.6720000000000002,2.1120528000000003,9.387478452965734,46.5,0.83202894972500629,249.00012512666549,53.353907039353956,null,83.20289497250063,0.39769432294589113,6.0559193633203883,4.9800025025333099,1.0670781407870791,0.3483609303898097]
[null,null,null,null,null,null,94,24,1,9.4,9.4,2.1759259259259256,0.21199620594402102,2.684206399768704,10.742103199884353,8.0578968001156479,0,9.4318828272185371,0.19571291006603589,0.2,0.40200714918884389,0.77486364373348882,6.0041366637993913E-4,6.0041366637993913E-4,3.8550196435550781,1.4861176452195521E-2,1.4861176452195521E-2,4.3427261226657139,7.5437080705932746E-2,2.7026331476997583,1.5839999999999999,0,4.4288907461365028,8.3726425631276502,0.28040457395958696,0.46323199999999998,0.78781813569926462,0.46323199999999998,0.89337600000000017,0.35584165466551981,5.2800000000000003E-5,2.1120000000000001,1.841230769230769,1.6720000000000002,2.1120528000000003,9.4586800758087062,47,0.83246721207247032,250.92594530682516,54.131610784963236,null,83.246721207247035,0.40200714918884389,6.1100848818357676,5.018518906136503,1.0826322156992647,0.35584165466551981]
[null,null,null,null,null,null,95,24,1,9.5,9.5,2.199074074074074,0.21203511107413262,2.6846111245763722,10.842305562288185,8.1576944377118146,0,9.531557833893153,0.19987130842986989,0.2,0.4063690291955247,0.77498047772181622,6.0059474084993444E-4,6.0059474084993444E-4,3.8960203032737013,1.5178974203520905E-2,1.5178974203520905E-2,4.3890222085365584,7.7054063788108529E-2,2.731384564164649,1.5839999999999999,0,4.4611891790676976,8.4609147728731315,0.28634831517529119,0.46815999999999997,0.80034373095956679,0.46815999999999997,0.9028799999999999,0.36340237896339977,5.2800000000000003E-5,2.1120000000000001,1.841230769230769,1.6720000000000002,2.1120528000000003,9.5301766871305595,47.5,0.83289238714069869,252.85449895338488,54.914706547978341,null,83.289238714069867,0.4063690291955247,6.1644129100272638,5.0570899790676975,1.0982941309595668,0.36340237896339977]
[null,null,null,null,null,null,96,24,1,9.6,9.6,{"$f":"Vout*K105/(Vin*Efficiency)","v":2.2222222222222219},0.21207401490947819,{"$f":"(Vin-(Rdson1+Rdcr)*K105-Vout)*M105/(Fsw*Lf)","v":2.6850158007437654},10.942507900371883,8.2574920996281165,{"$f":"IF(MIN(Vin, -P105/(Coss_Q1+Coss_Q2)*0.00000002)<0, 0, MIN(Vin, -P105/(Coss_Q1+Coss_Q2)*0.00000002))","v":0},9.6312395786240117,{"$f":"R105^2*Rdcr","v":0.204073706805878},0.2,{"$f":"(T105+S105*(1+Ltc*(Ta-25)))/(1-S105*Ltc*ThetaCa)","v":0.41078005956079894},0.77509729766890578,6.0077582085364038E-4,6.0077582085364038E-4,3.9370291196904934,1.5500198289290902E-2,1.5500198289290902E-2,4.4353297683990167,{"$f":"Rdson1*AB105^2","v":7.8688600617785889E-2},2.7601359806295398,1.5839999999999999,0,{"$f":"(AF105+AE105+AD105+AC105*(1+RdsonTopTc*Ta-RdsonTopTc*25))/(1-AC105*RdsonTopTc*ThetaJA_Q1)","v":4.4935426986011651},8.5491885969609509,{"$f":"Rdson2*AH105^2","v":0.29235450266562862},0.47308799999999995,{"$f":"(AJ105+AI105*(1+RdsonBotTc*Ta-RdsonBotTc*25))/(1-AI105*RdsonBotTc*ThetaJA_Q2)","v":0.81297806206844603},0.47308799999999995,0.91238400000000008,0.3710431032834145,5.2800000000000003E-5,2.1120000000000001,1.841230769230769,1.6720000000000002,2.1120528000000003,{"$f":" SUM(U105,X105,AA105,AG105,AK105,AL105,AM105,AS105,AN105)","v":9.6019696976239679},48,0.83330483752502571,254.78580693005827,55.703239103422298,null,83.330483752502573,0.41078005956079894,6.2189047606696111,5.0957161386011656,1.1140647820684459,0.3710431032834145]
[null,null,null,null,null,null,97,24,1,9.6999999999999993,9.6999999999999993,{"$f":"Vout*K106/(Vin*Efficiency)","v":2.2453703703703702},0.21211291745012231,{"$f":"(Vin-(Rdson1+Rdcr)*K106-Vout)*M106/(Fsw*Lf)","v":2.6854204282733107},11.042710214136655,8.3572897858633439,{"$f":"IF(MIN(Vin, -P106/(Coss_Q1+Coss_Q2)*0.00000002)<0, 0, MIN(Vin, -P106/(Coss_Q1+Coss_Q2)*0.00000002))","v":0},9.7309278543406279,{"$f":"R106^2*Rdcr","v":0.20832010519404107},0.2,{"$f":"(T106+S106*(1+Ltc*(Ta-25)))/(1-S106*Ltc*ThetaCa)","v":0.41524033806658833},0.77521410357545806,6.0095690638230107E-4,6.0095690638230107E-4,3.9780460067950609,1.582485003217813E-2,1.582485003217813E-2,4.4816487061746102,{"$f":"Rdson1*AB106^2","v":8.0340700502226234E-2},2.7888873970944306,1.5839999999999999,0,{"$f":"(AF106+AE106+AD106+AC106*(1+RdsonTopTc*Ta-RdsonTopTc*25))/(1-AC106*RdsonTopTc*ThetaJA_Q1)","v":4.525951723985508},8.6374638512022575,{"$f":"Rdson2*AH106^2","v":0.29842312712330293},0.47801599999999994,{"$f":"(AJ106+AI106*(1+RdsonBotTc*Ta-RdsonBotTc*25))/(1-AI106*RdsonBotTc*ThetaJA_Q2)","v":0.82572203764503427},0.47801599999999994,0.92188799999999982,0.37876382762552918,5.2800000000000003E-5,2.1120000000000001,1.841230769230769,1.6720000000000002,2.1120528000000003,{"$f":" SUM(U106,X106,AA106,AG106,AK106,AL106,AM106,AS106,AN106)","v":9.6740605342612227},48.5,0.83370491168372629,256.71989019927543,56.497253882251705,null,83.370491168372624,0.41524033806658833,6.2735617616305426,5.1343978039855083,1.1299450776450342,0.37876382762552918]
[null,null,null,null,null,null,98,24,1,9.8000000000000007,9.8000000000000007,{"$f":"Vout*K107/(Vin*Efficiency)","v":2.2685185185185182},0.21215181869612965,{"$f":"(Vin-(Rdson1+Rdcr)*K107-Vout)*M107/(Fsw*Lf)","v":2.6858250071674372},11.14291250358372,8.4570874964162819,{"$f":"IF(MIN(Vin, -P107/(Coss_Q1+Coss_Q2)*0.00000002)<0, 0, MIN(Vin, -P107/(Coss_Q1+Coss_Q2)*0.00000002))","v":0},9.8306224623584839,{"$f":"R107^2*Rdcr","v":0.21261050359433981},0.2,{"$f":"(T107+S107*(1+Ltc*(Ta-25)))/(1-S107*Ltc*ThetaCa)","v":0.41974996368740258},0.77533089544217426,6.0113799742716383E-4,6.0113799742716383E-4,4.0190708819831871,1.6152930754405114E-2,1.6152930754405114E-2,4.5279789296128374,{"$f":"Rdson1*AB107^2","v":8.201037274807127E-2},2.8176388135593222,1.5839999999999999,0,{"$f":"(AF107+AE107+AD107+AC107*(1+RdsonTopTc*Ta-RdsonTopTc*25))/(1-AC107*RdsonTopTc*ThetaJA_Q1)","v":4.5584166764629437},8.725740358869805,{"$f":"Rdson2*AH107^2","v":0.30455417924163741},0.48294399999999998,{"$f":"(AJ107+AI107*(1+RdsonBotTc*Ta-RdsonBotTc*25))/(1-AI107*RdsonBotTc*ThetaJA_Q2)","v":0.83857657962971477},0.48294399999999998,0.93139199999999989,0.38656455198970874,5.2800000000000003E-5,2.1120000000000001,1.841230769230769,1.6720000000000002,2.1120528000000003,{"$f":" SUM(U107,X107,AA107,AG107,AK107,AL107,AM107,AS107,AN107)","v":9.7464506405216014},49,0.83409294460763928,258.65676982314716,57.296796981485734,null,83.409294460763931,0.41974996368740258,6.3283852560926581,5.1731353964629436,1.1459359396297146,0.38656455198970874]
[null,null,null,null,null,null,99,24,1,9.9,9.9,{"$f":"Vout*K108/(Vin*Efficiency)","v":2.2916666666666665},0.21219071864756484,{"$f":"(Vin-(Rdson1+Rdcr)*K108-Vout)*M108/(Fsw*Lf)","v":2.6862295374285718},11.243114768714285,8.5568852312857153,{"$f":"IF(MIN(Vin, -P108/(Coss_Q1+Coss_Q2)*0.00000002)<0, 0, MIN(Vin, -P108/(Coss_Q1+Coss_Q2)*0.00000002))","v":0},9.9303232119593918,{"$f":"R108^2*Rdcr","v":0.2169449020067549},0.2,{"$f":"(T108+S108*(1+Ltc*(Ta-25)))/(1-S108*Ltc*ThetaCa)","v":0.42430903659594599},0.77544767326975494,6.0131909397947655E-4,6.0131909397947655E-4,4.0601036658864178,1.648444177774433E-2,1.648444177774433E-2,4.5743203500996561,{"$f":"Rdson1*AB108^2","v":8.3697626661343366E-2},2.8463902300242134,1.5839999999999999,0,{"$f":"(AF108+AE108+AD108+AC108*(1+RdsonTopTc*Ta-RdsonTopTc*25))/(1-AC108*RdsonTopTc*ThetaJA_Q1)","v":4.5909379792887339},8.8140179503245655,{"$f":"Rdson2*AH108^2","v":0.31074764971457464},0.48787199999999997,{"$f":"(AJ108+AI108*(1+RdsonBotTc*Ta-RdsonBotTc*25))/(1-AI108*RdsonBotTc*ThetaJA_Q2)","v":0.85154262349088994},0.48787199999999997,0.94089600000000007,0.39444527637591797,5.2800000000000003E-5,2.1120000000000001,1.841230769230769,1.6720000000000002,2.1120528000000003,{"$f":" SUM(U108,X108,AA108,AG108,AK108,AL108,AM108,AS108,AN108)","v":9.8191414766232139},49.5,0.83446925845188114,260.59646696443667,58.101915174544501,null,83.446925845188119,0.42430903659594599,6.3833766027796246,5.2119293392887336,1.1620383034908901,0.39444527637591797]
[null,null,null,null,null,null,100,24,1,10,10,{"$f":"Vout*K109/(Vin*Efficiency)","v":2.3148148148148149},0.21222961730449252,{"$f":"(Vin-(Rdson1+Rdcr)*K109-Vout)*M109/(Fsw*Lf)","v":2.6866340190591433},11.343317009529571,8.6566829904704292,{"$f":"IF(MIN(Vin, -P109/(Coss_Q1+Coss_Q2)*0.00000002)<0, 0, MIN(Vin, -P109/(Coss_Q1+Coss_Q2)*0.00000002))","v":0},10.030029919996773,{"$f":"R109^2*Rdcr","v":0.22132330043126705},0.2,{"$f":"(T109+S109*(1+Ltc*(Ta-25)))/(1-S109*Ltc*ThetaCa)","v":0.42891765816880062},0.77556443705890132,6.015001960304906E-4,6.015001960304906E-4,4.1011442822117745,1.6819384423518335E-2,1.6819384423518335E-2,4.620672882477332,{"$f":"Rdson1*AB109^2","v":8.5402471547445499E-2},2.8751416464891042,1.5839999999999999,0,{"$f":"(AF109+AE109+AD109+AC109*(1+RdsonTopTc*Ta-RdsonTopTc*25))/(1-AC109*RdsonTopTc*ThetaJA_Q1)","v":4.6235160577507939},8.9022964626645127,{"$f":"Rdson2*AH109^2","v":0.31700352923667641},0.49279999999999996,{"$f":"(AJ109+AI109*(1+RdsonBotTc*Ta-RdsonBotTc*25))/(1-AI109*RdsonBotTc*ThetaJA_Q2)","v":0.86462111843603329},0.49279999999999996,0.95039999999999991,0.40240600078412192,5.2800000000000003E-5,2.1120000000000001,1.841230769230769,1.6720000000000002,2.1120528000000003,{"$f":" SUM(U109,X109,AA109,AG109,AK109,AL109,AM109,AS109,AN109)","v":9.8921345197592991},50,0.83483416313212655,262.53900288753971,58.912655921801658,null,83.483416313212658,0.42891765816880062,6.4385371761868271,5.2507800577507941,1.1782531184360332,0.40240600078412192]

{"sheet":"Efficiency Plot Management","index":10,"n_rows":2,"n_cols":1,"rows_kept":2,"cut":false,"hidden":true,"merged":[]}
[]
[{"$f":"IF(PLOT_TYPE=1, \"EFF_Ch1\", \"EFF_Ch2\")","v":"EFF_Ch1"}]

{"sheet":"Input Filter Calculations","index":11,"n_rows":97,"n_cols":40,"rows_kept":97,"cut":false,"hidden":true,"merged":[[10,29,10,30],[10,31,10,34],[9,0,11,0],[9,1,10,1],[10,8,10,9],[10,11,10,14],[10,16,10,19],[11,17,11,19]]}
[]
[null,null,null,null,null,null,null,null,null,null,null,null,null,null,null,null,null,null,null,null,null,null,null,null,null,null,null,null,null,"AEF comparison Values"]
[null,null,null,{"$f":"L_infilter*0.000001","v":6.8000000000000005E-7},null,null,null,null,null,null,null,"Lfilter Passive",{"$f":"'Input Filters'!O9*0.000001","v":6.8000000000000005E-7},null,null,null,null,null,null,null,null,null,null,null,null,null,null,null,null,"Lfilter",{"$f":"'Input Filters'!G9*0.000001","v":9.9999999999999995E-7}]
[null,null,null,null,null,null,null,null,null,null,null,"Cfilter Passive",{"$f":"'Input Filters'!O10*0.000001","v":4.6999999999999995E-7},null,null,null,null,null,null,null,null,null,null,null,null,null,null,null,null,"Cinj",{"$f":"'Input Filters'!G10*0.000001","v":9.9999999999999995E-7}]
[null,null,null,null,null,null,null,null,null,null,null,"Cdamp passive",{"$f":"'Input Filters'!O11*0.000001","v":9.9999999999999995E-7},null,null,null,null,null,null,null,null,null,null,null,null,null,null,null,null,"Cdamp",{"$f":"'Input Filters'!G11*0.000001","v":9.9999999999999995E-7}]
[null,null,null,null,null,null,null,null,null,null,null,"Rdamp passive",{"$f":"'Input Filters'!O12","v":0.35},null,null,null,null,null,null,null,null,null,null,null,null,null,null,null,null,"Rdamp",{"$f":"'Input Filters'!G12","v":10}]
[]
[]
[]
["Freq (Hz)","(kHz)",null,null,null,null,null,null,null,null,null,null,null,null,null,null,null,null,null,null,null,null,"AEF",null,null,null,"Passive",null,null,"AEFCompare"]
[null,null,null,null,null,null,null,null,"AEF Numerator",null,null,"AEF Denominator",null,null,null,null,"Passive",null,null,null,null,null,"Magnitude","Phase",null,null,"Magnitude","Phase",null,"AEF Numerator",null,"AEF Denominator"]
[null,null,"jω","-ω^2","-jω^3",null,"Gop",null,null,null,null,null,null,null,null,null,"Numerator","Denominator",null,null,null,null,null,null,null,null,null,null,null,null,null,null,null,null,null,null,null,null,"Magnitude","Phase"]
[1,{"$f":"A13/1000","v":1E-3},{"$f":"COMPLEX(0,2*Pi*A13)","v":"6.2831853i"},{"$f":"COMPLEX(-POWER(2*Pi*A13,2),0)","v":"-39.4784175141361"},{"$f":"COMPLEX(0,-POWER(2*Pi*A13,3))","v":"-248.050212592082i"},null,{"$f":"IMSUM(IMPRODUCT(C13,Rcomp_AEF*Csen_AEF),Csen_AEF/Ccomp_AEF)","v":{"$error":"#VALUE!"}},null,{"$f":"IMPRODUCT((RdampSel*CdampSel+RdampSel*CinjSel),C13)","v":{"$error":"#REF!"}},{"$f":"IMSUM(1,I13)","v":{"$error":"#REF!"}},null,{"$f":"IMPRODUCT(G13,L_infilterStd*RdampSel*CinjSel*CdampSel,E13)","v":{"$error":"#VALUE!"}},{"$f":"IMPRODUCT(G13,L_infilterStd*CinjSel,D13)","v":{"$error":"#VALUE!"}},{"$f":"J13","v":{"$error":"#REF!"}},{"$f":"IMSUM(L13:N13)","v":{"$error":"#VALUE!"}},0,{"$f":"IMSUM(IMPRODUCT(C13,RdampPssv*CdampPssv),1)","v":"1+0.000002199114855i"},{"$f":"IMPRODUCT(RdampPssv*CdampPssv*CfilterPssv*LinfilterPssv,E13)","v":"-2.77468967805503E-17i"},{"$f":"IMPRODUCT(D13,LinfilterPssv*(CfilterPssv+CdampPssv))","v":"-3.94626261471304E-11"},{"$f":"IMSUM(S13,R13,Q13)","v":"0.999999999960537+2.19911485497225E-06i"},1,{"$f":"CHOOSE(INFILTER_TYPE,U13,IMDIV(J13,O13))","v":1},{"$f":"20*LOG10(IMABS(V13))","v":0},{"$f":"IMARGUMENT(V13)*180/Pi","v":0},null,{"$f":"IMDIV(Q13,T13)","v":"1.00000000003946-5.9033537744459E-17i"},{"$f":"20*LOG10(IMABS(Z13))","v":3.4274512546547312E-10},{"$f":"IMARGUMENT(Z13)*180/Pi","v":-3.3823725662152017E-15},null,{"$f":"IMPRODUCT((RdampCom*CdampCom+RdampCom*CinjCom),C13)","v":"0.000125663706i"},{"$f":"IMSUM(1,AD13)","v":"1+0.000125663706i"},{"$f":"IMPRODUCT(G13,L_infilterStd*RdampSel*CinjSel*CdampSel,E13)","v":{"$error":"#VALUE!"}},{"$f":"IMPRODUCT(G13,LAEFCom*CinjCom,D13)","v":{"$error":"#VALUE!"}},{"$f":"AE13","v":"1+0.000125663706i"},{"$f":"IMSUM(AF13:AH13)","v":{"$error":"#VALUE!"}},null,{"$f":"IMDIV(AE13,AI13)","v":{"$error":"#VALUE!"}},null,{"$f":"20*LOG10(IMABS(AK13))","v":{"$error":"#VALUE!"}},{"$f":"IMARGUMENT(AK13)*180/Pi","v":{"$error":"#VALUE!"}}]
[2,{"$f":"A14/1000","v":2E-3},"12.5663706i","-157.913670056544","-1984.40170073666i",null,{"$error":"#VALUE!"},null,{"$error":"#REF!"},{"$f":"IMSUM(1,I14)","v":{"$error":"#REF!"}},null,{"$error":"#VALUE!"},{"$error":"#VALUE!"},{"$f":"J14","v":{"$error":"#REF!"}},{"$f":"IMSUM(L14:N14)","v":{"$error":"#VALUE!"}},0,"1+0.00000439822971i","-2.21975174244403E-16i","-1.57850504588521E-10",{"$f":"IMSUM(S14,R14,Q14)","v":"0.999999999842149+4.39822970977802E-06i"},1,{"$f":"CHOOSE(INFILTER_TYPE,U14,IMDIV(J14,O14),IMDIV(Q14,T14))","v":1},{"$f":"20*LOG10(IMABS(V14))","v":0},0,null,"1.00000000015785-4.72284395630731E-16i",{"$f":"20*LOG10(IMABS(Z14))","v":1.3710672912527204E-9},-2.7059902626176745E-14,null,"0.000251327412i",{"$f":"IMSUM(1,AD14)","v":"1+0.000251327412i"},{"$error":"#VALUE!"},{"$error":"#VALUE!"},{"$f":"AE14","v":"1+0.000251327412i"},{"$f":"IMSUM(AF14:AH14)","v":{"$error":"#VALUE!"}},null,{"$f":"IMDIV(AE14,AI14)","v":{"$error":"#VALUE!"}},null,{"$f":"20*LOG10(IMABS(AK14))","v":{"$error":"#VALUE!"}},{"$error":"#VALUE!"}]
[3,3.0000000000000001E-3,"18.8495559i","-355.305757627225","-6697.35573998623i",null,{"$error":"#VALUE!"},null,{"$error":"#REF!"},{"$error":"#REF!"},null,{"$error":"#VALUE!"},{"$error":"#VALUE!"},{"$error":"#REF!"},{"$error":"#VALUE!"},0,"1+0.000006597344565i","-7.4916621307486E-16i","-3.55163635324174E-10","0.999999999644836+6.59734456425083E-06i",1,1,0,0,null,"1.00000000035516-1.59396947052946E-15i",3.0848797076462865E-9,-9.1327723405961694E-14,null,"0.000376991118i","1+0.000376991118i",{"$error":"#VALUE!"},{"$error":"#VALUE!"},"1+0.000376991118i",{"$error":"#VALUE!"},null,{"$error":"#VALUE!"},null,{"$error":"#VALUE!"},{"$error":"#VALUE!"}]
[4,4.0000000000000001E-3,"25.1327412i","-631.654680226178","-15875.2136058933i",null,{"$error":"#VALUE!"},null,{"$error":"#REF!"},{"$error":"#REF!"},null,{"$error":"#VALUE!"},{"$error":"#VALUE!"},{"$error":"#REF!"},{"$error":"#VALUE!"},0,"1+0.00000879645942i","-1.77580139395522E-15i","-6.31402018354088E-10","0.999999999368598+0.0000087964594182242i",1,1,0,0,null,"1.0000000006314-3.77830227167012E-15i",5.484271092367277E-9,-2.1648077400206861E-13,null,"0.000502654824i","1+0.000502654824i",{"$error":"#VALUE!"},{"$error":"#VALUE!"},"1+0.000502654824i",{"$error":"#VALUE!"},null,{"$error":"#VALUE!"},null,{"$error":"#VALUE!"},{"$error":"#VALUE!"}]
[5,5.0000000000000001E-3,"31.4159265i","-986.960437853402","-31006.2765740103i",null,{"$error":"#VALUE!"},null,{"$error":"#REF!"},{"$error":"#REF!"},null,{"$error":"#VALUE!"},{"$error":"#VALUE!"},{"$error":"#REF!"},{"$error":"#VALUE!"},0,"1+0.000010995574275i","-3.46836209756879E-15i","-9.86565653678261E-10","0.999999999013434+0.0000109955742715316i",1,1,0,0,null,"1.00000000098657-7.37945946308484E-15i",8.5692375875376739E-9,-4.2281188238863731E-13,null,"0.00062831853i","1+0.00062831853i",{"$error":"#VALUE!"},{"$error":"#VALUE!"},"1+0.00062831853i",{"$error":"#VALUE!"},null,{"$error":"#VALUE!"},null,{"$error":"#VALUE!"},{"$error":"#VALUE!"}]
[6,6.0000000000000001E-3,"37.6991118i","-1421.2230305089","-53578.8459198898i",null,{"$error":"#VALUE!"},null,{"$error":"#REF!"},{"$error":"#REF!"},null,{"$error":"#VALUE!"},{"$error":"#VALUE!"},{"$error":"#REF!"},{"$error":"#VALUE!"},0,"1+0.00001319468913i","-5.99332970459887E-15i","-1.4206545412967E-09","0.999999998579345+0.0000131946891240067i",1,1,0,0,null,"1.00000000142066-1.27518015159367E-14i",1.2339696260264985E-8,-7.3062440784858933E-13,null,"0.000753982236i","1+0.000753982236i",{"$error":"#VALUE!"},{"$error":"#VALUE!"},"1+0.000753982236i",{"$error":"#VALUE!"},null,{"$error":"#VALUE!"},null,{"$error":"#VALUE!"},{"$error":"#VALUE!"}]
[7,7.0000000000000001E-3,"43.9822971i","-1934.44245819267","-85081.2229190843i",null,{"$error":"#VALUE!"},null,{"$error":"#REF!"},{"$error":"#REF!"},null,{"$error":"#VALUE!"},{"$error":"#VALUE!"},{"$error":"#REF!"},{"$error":"#VALUE!"},0,"1+0.000015393803985i","-9.51718559572877E-15i","-1.93366868120939E-09","0.999999998066331+0.0000153938039754828i",1,1,0,0,null,"1.00000000193367-2.02493221373488E-14i",1.6795643252346658E-8,-1.1602006955531912E-12,null,"0.000879645942i","1+0.000879645942i",{"$error":"#VALUE!"},{"$error":"#VALUE!"},"1+0.000879645942i",{"$error":"#VALUE!"},null,{"$error":"#VALUE!"},null,{"$error":"#VALUE!"},{"$error":"#VALUE!"}]
[8,8.0000000000000002E-3,"50.2654824i","-2526.61872090471","-127001.708847146i",null,{"$error":"#VALUE!"},null,{"$error":"#REF!"},{"$error":"#REF!"},null,{"$error":"#VALUE!"},{"$error":"#VALUE!"},{"$error":"#REF!"},{"$error":"#VALUE!"},0,"1+0.00001759291884i","-1.42064111516417E-14i","-2.52560807341635E-09","0.999999997474392+0.0000175929188257936i",1,1,0,0,null,"1.00000000252561-3.02264148354676E-14i",2.1937169209509332E-8,-1.7318459974888673E-12,null,"0.001005309648i","1+0.001005309648i",{"$error":"#VALUE!"},{"$error":"#VALUE!"},"1+0.001005309648i",{"$error":"#VALUE!"},null,{"$error":"#VALUE!"},null,{"$error":"#VALUE!"},{"$error":"#VALUE!"}]
[9,8.9999999999999993E-3,"56.5486677i","-3197.75181864502","-180828.604979628i",null,{"$error":"#VALUE!"},null,{"$error":"#REF!"},{"$error":"#REF!"},null,{"$error":"#VALUE!"},{"$error":"#VALUE!"},{"$error":"#REF!"},{"$error":"#VALUE!"},0,"1+0.000019792033695i","-2.02274877530212E-14i","-3.19647271791756E-09","0.999999996803527+0.0000197920336747725i",1,1,0,0,null,"1.00000000319647-4.30372020696133E-14i",2.7764185412408903E-8,-2.4658500355761629E-12,null,"0.001130973354i","1+0.001130973354i",{"$error":"#VALUE!"},{"$error":"#VALUE!"},"1+0.001130973354i",{"$error":"#VALUE!"},null,{"$error":"#VALUE!"},null,{"$error":"#VALUE!"},{"$error":"#VALUE!"}]
[10,0.01,"62.831853i","-3947.84175141361","-248050.212592082i",null,{"$error":"#VALUE!"},null,{"$error":"#REF!"},{"$error":"#REF!"},null,{"$error":"#VALUE!"},{"$error":"#VALUE!"},{"$error":"#REF!"},{"$error":"#VALUE!"},0,"1+0.00002199114855i","-2.77468967805503E-14i","-3.94626261471304E-09","0.999999996053737+0.0000219911485222531i",1,1,0,0,null,"1.00000000394626-5.90359570729332E-14i",3.4276778649137416E-8,-3.3825111703113878E-12,null,"0.00125663706i","1+0.00125663706i",{"$error":"#VALUE!"},{"$error":"#VALUE!"},"1+0.00125663706i",{"$error":"#VALUE!"},null,{"$error":"#VALUE!"},null,{"$error":"#VALUE!"},{"$error":"#VALUE!"}]
[20,0.02,"125.663706i","-15791.3670056544","-1984401.70073666i",null,{"$error":"#VALUE!"},null,{"$error":"#REF!"},{"$error":"#REF!"},null,{"$error":"#VALUE!"},{"$error":"#VALUE!"},{"$error":"#REF!"},{"$error":"#VALUE!"},0,"1+0.0000439822971i","-2.21975174244403E-13i","-1.57850504588521E-08","0.99999998421495+0.0000439822968780248i",1,1,0,0,null,"1.00000001578505-4.72287580174405E-13i",1.3710720057442979E-7,-2.7060084664215768E-11,null,"0.00251327412i","1+0.00251327412i",{"$error":"#VALUE!"},{"$error":"#VALUE!"},"1+0.00251327412i",{"$error":"#VALUE!"},null,{"$error":"#VALUE!"},null,{"$error":"#VALUE!"},{"$error":"#VALUE!"}]
[30,0.03,"188.495559i","-35530.5757627225","-6697355.73998623i",null,{"$error":"#VALUE!"},null,{"$error":"#REF!"},{"$error":"#REF!"},null,{"$error":"#VALUE!"},{"$error":"#VALUE!"},{"$error":"#REF!"},{"$error":"#VALUE!"},0,"1+0.00006597344565i","-7.4916621307486E-13i","-3.55163635324174E-08","0.999999964483636+0.0000659734449008338i",1,1,0,0,null,"1.00000003551637-1.59397081397336E-12i",3.0849126526975555E-7,-9.1327797168431367E-11,null,"0.00376991118i","1+0.00376991118i",{"$error":"#VALUE!"},{"$error":"#VALUE!"},"1+0.00376991118i",{"$error":"#VALUE!"},null,{"$error":"#VALUE!"},null,{"$error":"#VALUE!"},{"$error":"#VALUE!"}]
[40,0.04,"251.327412i","-63165.4680226178","-15875213.6058933i",null,{"$error":"#VALUE!"},null,{"$error":"#REF!"},{"$error":"#REF!"},null,{"$error":"#VALUE!"},{"$error":"#VALUE!"},{"$error":"#REF!"},{"$error":"#VALUE!"},0,"1+0.0000879645942i","-1.77580139395522E-12i","-6.31402018354088E-08","0.999999936859798+0.0000879645924241986i",1,1,0,0,null,"1.00000006314021-3.77830129983406E-12i",5.4842887803037698E-7,-2.1648070478801279E-10,null,"0.00502654824i","1+0.00502654824i",{"$error":"#VALUE!"},{"$error":"#VALUE!"},"1+0.00502654824i",{"$error":"#VALUE!"},null,{"$error":"#VALUE!"},null,{"$error":"#VALUE!"},{"$error":"#VALUE!"}]
[50,0.05,"314.159265i","-98696.0437853402","-31006276.5740103i",null,{"$error":"#VALUE!"},null,{"$error":"#REF!"},{"$error":"#REF!"},null,{"$error":"#VALUE!"},{"$error":"#VALUE!"},{"$error":"#REF!"},{"$error":"#VALUE!"},0,"1+0.00010995574275i","-3.46836209756879E-12i","-9.86565653678261E-08","0.999999901343435+0.000109955739281638i",1,1,0,0,null,"1.00000009865657-7.37949525076775E-12i",8.5692003703246746E-7,-4.2281389157559421E-10,null,"0.0062831853i","1+0.0062831853i",{"$error":"#VALUE!"},{"$error":"#VALUE!"},"1+0.0062831853i",{"$error":"#VALUE!"},null,{"$error":"#VALUE!"},null,{"$error":"#VALUE!"},{"$error":"#VALUE!"}]
[60,0.06,"376.991118i","-142122.30305089","-53578845.9198898i",null,{"$error":"#VALUE!"},null,{"$error":"#REF!"},{"$error":"#REF!"},null,{"$error":"#VALUE!"},{"$error":"#VALUE!"},{"$error":"#REF!"},{"$error":"#VALUE!"},0,"1+0.0001319468913i","-5.99332970459887E-12i","-1.4206545412967E-07","0.999999857934546+0.00013194688530667i",1,1,0,0,null,"1.00000014206547-1.27517683815965E-11i",1.2339649066219747E-6,-7.3062240663248992E-10,null,"0.00753982236i","1+0.00753982236i",{"$error":"#VALUE!"},{"$error":"#VALUE!"},"1+0.00753982236i",{"$error":"#VALUE!"},null,{"$error":"#VALUE!"},null,{"$error":"#VALUE!"},{"$error":"#VALUE!"}]
[70,7.0000000000000007E-2,"439.822971i","-193444.245819267","-85081222.9190843i",null,{"$error":"#VALUE!"},null,{"$error":"#REF!"},{"$error":"#REF!"},null,{"$error":"#VALUE!"},{"$error":"#VALUE!"},{"$error":"#REF!"},{"$error":"#VALUE!"},0,"1+0.00015393803985i","-9.51718559572877E-12i","-1.93366868120939E-07","0.999999806633132+0.000153938030332814i",1,1,0,0,null,"1.0000001933669-2.02493379799158E-11i",1.6795633910819215E-6,-1.1602013811643187E-9,null,"0.00879645942i","1+0.00879645942i",{"$error":"#VALUE!"},{"$error":"#VALUE!"},"1+0.00879645942i",{"$error":"#VALUE!"},null,{"$error":"#VALUE!"},null,{"$error":"#VALUE!"},{"$error":"#VALUE!"}]
[80,0.08,"502.654824i","-252661.872090471","-127001708.847146i",null,{"$error":"#VALUE!"},null,{"$error":"#REF!"},{"$error":"#REF!"},null,{"$error":"#VALUE!"},{"$error":"#VALUE!"},{"$error":"#REF!"},{"$error":"#VALUE!"},0,"1+0.0001759291884i","-1.42064111516417E-11i","-2.52560807341635E-07","0.999999747439193+0.000175929174193589i",1,1,0,0,null,"1.00000025256087-3.02264211687963E-11i",2.1937155666510632E-6,-1.731845927339326E-9,null,"0.01005309648i","1+0.01005309648i",{"$error":"#VALUE!"},{"$error":"#VALUE!"},"1+0.01005309648i",{"$error":"#VALUE!"},null,{"$error":"#VALUE!"},null,{"$error":"#VALUE!"},{"$error":"#VALUE!"}]
[90,0.09,"565.486677i","-319775.181864502","-180828604.979628i",null,{"$error":"#VALUE!"},null,{"$error":"#REF!"},{"$error":"#REF!"},null,{"$error":"#VALUE!"},{"$error":"#VALUE!"},{"$error":"#REF!"},{"$error":"#VALUE!"},0,"1+0.00019792033695i","-2.02274877530212E-11i","-3.19647271791756E-07","0.999999680352728+0.000197920316722512i",1,1,0,0,null,"1.00000031964737-4.30372335896138E-11i",2.7764213343660625E-6,-2.4658510612183728E-9,null,"0.01130973354i","1+0.01130973354i",{"$error":"#VALUE!"},{"$error":"#VALUE!"},"1+0.01130973354i",{"$error":"#VALUE!"},null,{"$error":"#VALUE!"},null,{"$error":"#VALUE!"},{"$error":"#VALUE!"}]
[100,0.1,"628.31853i","-394784.175141361","-248050212.592082i",null,{"$error":"#VALUE!"},null,{"$error":"#REF!"},{"$error":"#REF!"},null,{"$error":"#VALUE!"},{"$error":"#VALUE!"},{"$error":"#REF!"},{"$error":"#VALUE!"},0,"1+0.0002199114855i","-2.77468967805503E-11i","-3.94626261471305E-07","0.999999605373739+0.000219911457753103i",1,1,0,0,null,"1.0000003946264-5.90359940073355E-11i",3.4276806823585146E-6,-3.382511965016509E-9,null,"0.0125663706i","1+0.0125663706i",{"$error":"#VALUE!"},{"$error":"#VALUE!"},"1+0.0125663706i",{"$error":"#VALUE!"},null,{"$error":"#VALUE!"},null,{"$error":"#VALUE!"},{"$error":"#VALUE!"}]
[200,0.2,"1256.63706i","-1579136.70056544","-1984401700.73666i",null,{"$error":"#VALUE!"},null,{"$error":"#REF!"},{"$error":"#REF!"},null,{"$error":"#VALUE!"},{"$error":"#VALUE!"},{"$error":"#REF!"},{"$error":"#VALUE!"},0,"1+0.000439822971i","-2.21975174244403E-10i","-1.57850504588521E-06","0.999998421494954+0.000439822749024826i",1,1,0,0,null,"1.00000157850733-4.72289004721146E-10i",1.3710729639650269E-5,-2.7060123997272546E-8,null,"0.0251327412i","1+0.0251327412i",{"$error":"#VALUE!"},{"$error":"#VALUE!"},"1+0.0251327412i",{"$error":"#VALUE!"},null,{"$error":"#VALUE!"},null,{"$error":"#VALUE!"},{"$error":"#VALUE!"}]
[300,0.3,"1884.95559i","-3553057.57627225","-6697355739.98623i",null,{"$error":"#VALUE!"},null,{"$error":"#REF!"},{"$error":"#REF!"},null,{"$error":"#VALUE!"},{"$error":"#VALUE!"},{"$error":"#REF!"},{"$error":"#VALUE!"},0,"1+0.0006597344565i","-7.4916621307486E-10i","-3.55163635324174E-06","0.999996448363647+0.000659733707333787i",1,1,0,0,null,"1.00000355164792-1.59398129480179E-09i",3.084916708360373E-5,-9.1328076554125626E-8,null,"0.0376991118i","1+0.0376991118i",{"$error":"#VALUE!"},{"$error":"#VALUE!"},"1+0.0376991118i",{"$error":"#VALUE!"},null,{"$error":"#VALUE!"},null,{"$error":"#VALUE!"},{"$error":"#VALUE!"}]
[400,0.4,"2513.27412i","-6316546.80226177","-15875213605.8933i",null,{"$error":"#VALUE!"},null,{"$error":"#REF!"},{"$error":"#REF!"},null,{"$error":"#VALUE!"},{"$error":"#VALUE!"},{"$error":"#REF!"},{"$error":"#VALUE!"},0,"1+0.000879645942i","-1.77580139395522E-09i","-6.31402018354087E-06","0.999993685979816+0.000879644166198606i",1,1,0,0,null,"1.00000631405673-3.77834562794476E-09i",5.4843026783634755E-5,-2.1648189139136651E-7,null,"0.0502654824i","1+0.0502654824i",{"$error":"#VALUE!"},{"$error":"#VALUE!"},"1+0.0502654824i",{"$error":"#VALUE!"},null,{"$error":"#VALUE!"},null,{"$error":"#VALUE!"},{"$error":"#VALUE!"}]
[500,0.5,"3141.59265i","-9869604.37853402","-31006276574.0103i",null,{"$error":"#VALUE!"},null,{"$error":"#REF!"},{"$error":"#REF!"},null,{"$error":"#VALUE!"},{"$error":"#VALUE!"},{"$error":"#REF!"},{"$error":"#VALUE!"},0,"1+0.0010995574275i","-3.46836209756879E-09i","-9.86565653678261E-06","0.999990134343463+0.0010995539591379i",1,1,0,0,null,"1.00000986574575-7.37963050952798E-09i",8.5692356072072088E-5,-4.228175116350063E-7,null,"0.062831853i","1+0.062831853i",{"$error":"#VALUE!"},{"$error":"#VALUE!"},"1+0.062831853i",{"$error":"#VALUE!"},null,{"$error":"#VALUE!"},null,{"$error":"#VALUE!"},{"$error":"#VALUE!"}]
[600,0.6,"3769.91118i","-14212230.305089","-53578845919.8898i",null,{"$error":"#VALUE!"},null,{"$error":"#REF!"},{"$error":"#REF!"},null,{"$error":"#VALUE!"},{"$error":"#VALUE!"},{"$error":"#REF!"},{"$error":"#VALUE!"},0,"1+0.001319468913i","-5.99332970459887E-09i","-0.000014206545412967","0.999985793454587+0.0013194629196703i",1,1,0,0,null,"1.00001420673042-1.27521054564846E-08i",1.2339721601309145E-4,-7.3063144351324126E-7,null,"0.0753982236i","1+0.0753982236i",{"$error":"#VALUE!"},{"$error":"#VALUE!"},"1+0.0753982236i",{"$error":"#VALUE!"},null,{"$error":"#VALUE!"},null,{"$error":"#VALUE!"},{"$error":"#VALUE!"}]
[700,0.7,"4398.22971i","-19344424.5819267","-85081222919.0843i",null,{"$error":"#VALUE!"},null,{"$error":"#REF!"},{"$error":"#REF!"},null,{"$error":"#VALUE!"},{"$error":"#VALUE!"},{"$error":"#REF!"},{"$error":"#VALUE!"},0,"1+0.0015393803985i","-9.51718559572877E-09i","-0.0000193366868120939","0.999980663313188+0.0015393708813144i",1,1,0,0,null,"1.00001933702955-2.02500661951286E-08i",1.6795768070547058E-4,-1.1602208939414706E-6,null,"0.0879645942i","1+0.0879645942i",{"$error":"#VALUE!"},{"$error":"#VALUE!"},"1+0.0879645942i",{"$error":"#VALUE!"},null,{"$error":"#VALUE!"},null,{"$error":"#VALUE!"},{"$error":"#VALUE!"}]
[800,0.8,"5026.54824i","-25266187.2090471","-127001708847.146i",null,{"$error":"#VALUE!"},null,{"$error":"#REF!"},{"$error":"#REF!"},null,{"$error":"#VALUE!"},{"$error":"#VALUE!"},{"$error":"#REF!"},{"$error":"#VALUE!"},0,"1+0.001759291884i","-1.42064111516417E-08i","-0.0000252560807341635","0.999974743919266+0.00175927767758885i",1,1,0,0,null,"1.00002525666544-3.02278400042037E-08i",2.1937383832667357E-4,-1.7318839164039424E-6,null,"0.1005309648i","1+0.1005309648i",{"$error":"#VALUE!"},{"$error":"#VALUE!"},"1+0.1005309648i",{"$error":"#VALUE!"},null,{"$error":"#VALUE!"},null,{"$error":"#VALUE!"},{"$error":"#VALUE!"}]
[900,0.9,"5654.86677i","-31977518.1864502","-180828604979.628i",null,{"$error":"#VALUE!"},null,{"$error":"#REF!"},{"$error":"#REF!"},null,{"$error":"#VALUE!"},{"$error":"#VALUE!"},{"$error":"#REF!"},{"$error":"#VALUE!"},0,"1+0.0019792033695i","-2.02274877530212E-08i","-0.0000319647271791756","0.999968035272821+0.00197918314201225i",1,1,0,0,null,"1.00003196566377-4.30397908600739E-08i",2.7764579017865241E-4,-2.4659195454707077E-6,null,"0.1130973354i","1+0.1130973354i",{"$error":"#VALUE!"},{"$error":"#VALUE!"},"1+0.1130973354i",{"$error":"#VALUE!"},null,{"$error":"#VALUE!"},null,{"$error":"#VALUE!"},{"$error":"#VALUE!"}]
[1000,1,"6283.1853i","-39478417.5141361","-248050212592.082i",null,{"$error":"#VALUE!"},null,{"$error":"#REF!"},{"$error":"#REF!"},null,{"$error":"#VALUE!"},{"$error":"#VALUE!"},{"$error":"#REF!"},{"$error":"#VALUE!"},0,"1+0.002199114855i","-2.77468967805503E-08i","-0.0000394626261471304","0.999960537373853+0.00219908710810322i",1,1,0,0,null,"1.00003946405367-5.90403247598128E-08i",3.4277365128982361E-4,-3.3826279414737456E-6,null,"0.125663706i","1+0.125663706i",{"$error":"#VALUE!"},{"$error":"#VALUE!"},"1+0.125663706i",{"$error":"#VALUE!"},null,{"$error":"#VALUE!"},null,{"$error":"#VALUE!"},{"$error":"#VALUE!"}]
[2000,2,"12566.3706i","-157913670.056544","-1984401700736.66i",null,{"$error":"#VALUE!"},null,{"$error":"#REF!"},{"$error":"#REF!"},null,{"$error":"#VALUE!"},{"$error":"#VALUE!"},{"$error":"#REF!"},{"$error":"#VALUE!"},0,"1+0.00439822971i","-2.21975174244403E-07i","-0.000157850504588521","0.999842149495412+0.00439800773482576i",1,1,0,0,null,"1.00015787334724-4.72427600959129E-07i",1.3711622397485389E-3,-2.7063835033150666E-5,null,"0.251327412i","1+0.251327412i",{"$error":"#VALUE!"},{"$error":"#VALUE!"},"1+0.251327412i",{"$error":"#VALUE!"},null,{"$error":"#VALUE!"},null,{"$error":"#VALUE!"},{"$error":"#VALUE!"}]
[3000,3,"18849.5559i","-355305757.627225","-6697355739986.23i",null,{"$error":"#VALUE!"},null,{"$error":"#REF!"},{"$error":"#REF!"},null,{"$error":"#VALUE!"},{"$error":"#VALUE!"},{"$error":"#REF!"},{"$error":"#VALUE!"},0,"1+0.006597344565i","-7.4916621307486E-07i","-0.000355163635324174","0.999644836364676+0.00659659539878692i",1,1,0,0,null,"1.00035527929582-1.59503405307709E-06i",3.0853687138606856E-3,-9.135626253668961E-5,null,"0.376991118i","1+0.376991118i",{"$error":"#VALUE!"},{"$error":"#VALUE!"},"1+0.376991118i",{"$error":"#VALUE!"},null,{"$error":"#VALUE!"},null,{"$error":"#VALUE!"},{"$error":"#VALUE!"}]
[4000,4,"25132.7412i","-631654680.226177","-15875213605893.3i",null,{"$error":"#VALUE!"},null,{"$error":"#REF!"},{"$error":"#REF!"},null,{"$error":"#VALUE!"},{"$error":"#VALUE!"},{"$error":"#REF!"},{"$error":"#VALUE!"},0,"1+0.00879645942i","-1.77580139395522E-06i","-0.000631402018354087","0.999368597981646+0.00879468361860604i",1,1,0,0,null,"1.00063176764934-3.78278365967147E-06i",5.4857314697180446E-3,-2.1660069744338419E-4,null,"0.502654824i","1+0.502654824i",{"$error":"#VALUE!"},{"$error":"#VALUE!"},"1+0.502654824i",{"$error":"#VALUE!"},null,{"$error":"#VALUE!"},null,{"$error":"#VALUE!"},{"$error":"#VALUE!"}]
[5000,5,"31415.9265i","-986960437.853402","-31006276574010.3i",null,{"$error":"#VALUE!"},null,{"$error":"#REF!"},{"$error":"#REF!"},null,{"$error":"#VALUE!"},{"$error":"#VALUE!"},{"$error":"#REF!"},{"$error":"#VALUE!"},0,"1+0.010995574275i","-3.46836209756879E-06i","-0.000986565653678261","0.999013434346322+0.0109921059129024i",1,1,0,0,null,"1.00098745857977-7.39318105431537E-06i",8.5727245740982051E-3,-4.2318019914624398E-4,null,"0.62831853i","1+0.62831853i",{"$error":"#VALUE!"},{"$error":"#VALUE!"},"1+0.62831853i",{"$error":"#VALUE!"},null,{"$error":"#VALUE!"},null,{"$error":"#VALUE!"},{"$error":"#VALUE!"}]
[6000,6,{"$f":"COMPLEX(0,2*Pi*A45)","v":"37699.1118i"},{"$f":"COMPLEX(-POWER(2*Pi*A45,2),0)","v":"-1421223030.5089"},{"$f":"COMPLEX(0,-POWER(2*Pi*A45,3))","v":"-53578845919889.8i"},null,{"$f":"IMSUM(IMPRODUCT(C45,Rcomp_AEF*Csen_AEF),Csen_AEF/Ccomp_AEF)","v":{"$error":"#VALUE!"}},null,{"$f":"IMPRODUCT((RdampSel*CdampSel+RdampSel*CinjSel),C45)","v":{"$error":"#REF!"}},{"$error":"#REF!"},null,{"$f":"IMPRODUCT(G45,L_infilterStd*RdampSel*CinjSel*CdampSel,E45)","v":{"$error":"#VALUE!"}},{"$f":"IMPRODUCT(G45,L_infilterStd*CinjSel,D45)","v":{"$error":"#VALUE!"}},{"$error":"#REF!"},{"$error":"#VALUE!"},0,{"$f":"IMSUM(IMPRODUCT(C45,RdampPssv*CdampPssv),1)","v":"1+0.01319468913i"},{"$f":"IMPRODUCT(RdampPssv*CdampPssv*CfilterPssv*LinfilterPssv,E45)","v":"-5.99332970459887E-06i"},{"$f":"IMPRODUCT(D45,LinfilterPssv*(CfilterPssv+CdampPssv))","v":"-0.0014206545412967"},"0.998579345458703+0.0131886958002954i",1,{"$f":"CHOOSE(INFILTER_TYPE,U45,IMDIV(J45,O45),IMDIV(Q45,T45))","v":1},0,{"$f":"IMARGUMENT(V45)*180/Pi","v":0},null,{"$f":"IMDIV(Q45,T45)","v":"1.00142250680344-0.000012785844067251i"},1.2346958077157324E-2,{"$f":"IMARGUMENT(Z45)*180/Pi","v":-7.3153429085745297E-4},null,{"$f":"IMPRODUCT((RdampCom*CdampCom+RdampCom*CinjCom),C45)","v":"0.753982236i"},"1+0.753982236i",{"$f":"IMPRODUCT(G45,L_infilterStd*RdampSel*CinjSel*CdampSel,E45)","v":{"$error":"#VALUE!"}},{"$f":"IMPRODUCT(G45,LAEFCom*CinjCom,D45)","v":{"$error":"#VALUE!"}},"1+0.753982236i",{"$error":"#VALUE!"},null,{"$error":"#VALUE!"},null,{"$error":"#VALUE!"},{"$f":"IMARGUMENT(AK45)*180/Pi","v":{"$error":"#VALUE!"}}]
[7000,7,"43982.2971i","-1934442458.19267","-85081222919084.3i",null,{"$error":"#VALUE!"},null,{"$error":"#REF!"},{"$error":"#REF!"},null,{"$error":"#VALUE!"},{"$error":"#VALUE!"},{"$error":"#REF!"},{"$error":"#VALUE!"},0,"1+0.015393803985i","-9.51718559572877E-06i","-0.00193366868120939","0.998066331318791+0.0153842867994043i",1,1,0,0,null,"1.00193710173868-0.0000203230411399365i",1.680917841515581E-2,-1.1621732375608322E-3,null,"0.879645942i","1+0.879645942i",{"$error":"#VALUE!"},{"$error":"#VALUE!"},"1+0.879645942i",{"$error":"#VALUE!"},null,{"$error":"#VALUE!"},null,{"$error":"#VALUE!"},{"$error":"#VALUE!"}]
[8000,8,"50265.4824i","-2526618720.90471","-127001708847146i",null,{"$error":"#VALUE!"},null,{"$error":"#REF!"},{"$error":"#REF!"},null,{"$error":"#VALUE!"},{"$error":"#VALUE!"},{"$error":"#REF!"},{"$error":"#VALUE!"},0,"1+0.01759291884i","-0.0000142064111516418i","-0.00252560807341635","0.997474391926584+0.0175787124288484i",1,1,0,0,null,"1.00253146769905-0.0000303702348632679i",2.1960268903701091E-2,-1.7356924326137229E-3,null,"1.005309648i","1+1.005309648i",{"$error":"#VALUE!"},{"$error":"#VALUE!"},"1+1.005309648i",{"$error":"#VALUE!"},null,{"$error":"#VALUE!"},null,{"$error":"#VALUE!"},{"$error":"#VALUE!"}]
[9000,9,"56548.6677i","-3197751818.64502","-180828604979628i",null,{"$error":"#VALUE!"},null,{"$error":"#REF!"},{"$error":"#REF!"},null,{"$error":"#VALUE!"},{"$error":"#VALUE!"},{"$error":"#REF!"},{"$error":"#VALUE!"},0,"1+0.019792033695i","-0.0000202274877530212i","-0.00319647271791756","0.996803527282082+0.019771806207247i",1,1,0,0,null,"1.00320586412249-0.0000432966329094656i",2.7801250322054171E-2,-2.4727869152797537E-3,null,"1.130973354i","1+1.130973354i",{"$error":"#VALUE!"},{"$error":"#VALUE!"},"1+1.130973354i",{"$error":"#VALUE!"},null,{"$error":"#VALUE!"},null,{"$error":"#VALUE!"},{"$error":"#VALUE!"}]
[10000,10,"62831.853i","-3947841751.41361","-248050212592082i",null,{"$error":"#VALUE!"},null,{"$error":"#REF!"},{"$error":"#REF!"},null,{"$error":"#VALUE!"},{"$error":"#VALUE!"},{"$error":"#REF!"},{"$error":"#VALUE!"},0,"1+0.02199114855i","-0.0000277468967805503i","-0.00394626261471305","0.996053737385287+0.0219634016532194i",1,1,0,0,null,"1.0039605858368-0.0000594757476545141i",3.4333281589256678E-2,-3.394266041884357E-3,null,"1.25663706i","1+1.25663706i",{"$error":"#VALUE!"},{"$error":"#VALUE!"},"1+1.25663706i",{"$error":"#VALUE!"},null,{"$error":"#VALUE!"},null,{"$error":"#VALUE!"},{"$error":"#VALUE!"}]
[11000,11,"69115.0383i","-4776888519.21047","-330154832960062i",null,{"$error":"#VALUE!"},null,{"$error":"#REF!"},{"$error":"#REF!"},null,{"$error":"#VALUE!"},{"$error":"#VALUE!"},{"$f":"J50","v":{"$error":"#REF!"}},{"$f":"IMSUM(L50:N50)","v":{"$error":"#VALUE!"}},0,"1+0.024190263405i","-0.0000369311196149125i","-0.00477497776380279",{"$f":"IMSUM(S50,R50,Q50)","v":"0.995225022236197+0.0241533322853851i"},1,1,0,0,null,"1.00479596336193-0.0000792859658181959i",4.1557660533084087E-2,-4.5210683336785549E-3,null,"1.382300766i","1+1.382300766i",{"$error":"#VALUE!"},{"$error":"#VALUE!"},"1+1.382300766i",{"$error":"#VALUE!"},null,{"$error":"#VALUE!"},null,{"$error":"#VALUE!"},{"$error":"#VALUE!"}]
[12000,12,"75398.2236i","-5684892122.0356","-428630767359119i",null,{"$error":"#VALUE!"},null,{"$error":"#REF!"},{"$error":"#REF!"},null,{"$error":"#VALUE!"},{"$error":"#VALUE!"},{"$f":"J51","v":{"$error":"#REF!"}},{"$f":"IMSUM(L51:N51)","v":{"$error":"#VALUE!"}},0,"1+0.02638937826i","-0.000047946637636791i","-0.00568261816518679",{"$f":"IMSUM(S51,R51,Q51)","v":"0.994317381834813+0.0263414316223632i"},1,1,0,0,null,"1.00571236324959-0.000103111129481765i",4.9475824752593413E-2,-5.8742765248443194E-3,null,"1.507964472i","1+1.507964472i",{"$error":"#VALUE!"},{"$error":"#VALUE!"},"1+1.507964472i",{"$error":"#VALUE!"},null,{"$error":"#VALUE!"},null,{"$error":"#VALUE!"},{"$error":"#VALUE!"}]
[13000,13,"81681.4089i","-6671852559.889","-544966317064805i",null,{"$error":"#VALUE!"},null,{"$error":"#REF!"},{"$error":"#REF!"},null,{"$error":"#VALUE!"},{"$error":"#VALUE!"},{"$f":"J52","v":{"$error":"#REF!"}},{"$f":"IMSUM(L52:N52)","v":{"$error":"#VALUE!"}},0,"1+0.028588493115i","-0.0000609599322268691i","-0.00666918381886504",{"$f":"IMSUM(S52,R52,Q52)","v":"0.993330816181135+0.0285275331827731i"},1,1,0,0,null,"1.00671018846073-0.00013134112988737i",5.808935257490936E-2,-7.4751328348372729E-3,null,"1.633628178i","1+1.633628178i",{"$error":"#VALUE!"},{"$error":"#VALUE!"},"1+1.633628178i",{"$error":"#VALUE!"},null,{"$error":"#VALUE!"},null,{"$error":"#VALUE!"},{"$error":"#VALUE!"}]
[15000,15,"94247.7795i","-8882643940.68062","-837169467498278i",null,{"$error":"#VALUE!"},null,{"$error":"#REF!"},{"$error":"#REF!"},null,{"$error":"#VALUE!"},{"$error":"#VALUE!"},{"$f":"J53","v":{"$error":"#REF!"}},{"$f":"IMSUM(L53:N53)","v":{"$error":"#VALUE!"}},0,"1+0.032986722825i","-0.0000936457766343574i","-0.00887909088310435",{"$f":"IMSUM(S53,R53,Q53)","v":"0.991120909116896+0.0328930770483656i"},1,1,0,0,null,"1.00895191127968-0.00020260911556929i",7.7409522394356958E-2,-1.1505649516535831E-2,null,"1.88495559i","1+1.88495559i",{"$error":"#VALUE!"},{"$error":"#VALUE!"},"1+1.88495559i",{"$error":"#VALUE!"},null,{"$error":"#VALUE!"},null,{"$error":"#VALUE!"},{"$error":"#VALUE!"}]
[16000,16,"100530.9648i","-10106474883.6188","-1016013670777170i",null,{"$error":"#VALUE!"},null,{"$error":"#REF!"},{"$error":"#REF!"},null,{"$error":"#VALUE!"},{"$error":"#VALUE!"},{"$f":"J54","v":{"$error":"#REF!"}},{"$f":"IMSUM(L54:N54)","v":{"$error":"#VALUE!"}},0,"1+0.03518583768i","-0.000113651289213134i","-0.0101024322936654",{"$f":"IMSUM(S54,R54,Q54)","v":"0.989897567706335+0.0350721863907869i"},1,1,0,0,null,"1.01019680079824-0.000246462681525396i",8.8120034652894183E-2,-1.3978732840646416E-2,null,"2.010619296i","1+2.010619296i",{"$error":"#VALUE!"},{"$error":"#VALUE!"},"1+2.010619296i",{"$error":"#VALUE!"},null,{"$error":"#VALUE!"},null,{"$error":"#VALUE!"},{"$error":"#VALUE!"}]
[17500,17.5,"109955.74275i","-12090265363.7042","-1329394108110690i",null,{"$error":"#VALUE!"},null,{"$error":"#REF!"},{"$error":"#REF!"},null,{"$error":"#VALUE!"},{"$error":"#VALUE!"},{"$error":"#REF!"},{"$error":"#VALUE!"},0,"1+0.0384845099625i","-0.000148706024933262i","-0.0120854292575587","0.987914570742441+0.0383358039375667i",1,1,0,0,null,"1.01222071263725-0.000323696833892721i",0.10550484102978921,-1.8322547228315767E-2,null,"2.199114855i","1+2.199114855i",{"$error":"#VALUE!"},{"$error":"#VALUE!"},"1+2.199114855i",{"$error":"#VALUE!"},null,{"$error":"#VALUE!"},null,{"$error":"#VALUE!"},{"$error":"#VALUE!"}]
[19000,19,"119380.5207i","-14251708722.6031","-1701376408169090i",null,{"$error":"#VALUE!"},null,{"$error":"#REF!"},{"$error":"#REF!"},null,{"$error":"#VALUE!"},{"$error":"#VALUE!"},{"$error":"#REF!"},{"$error":"#VALUE!"},0,"1+0.041783182245i","-0.000190315965017794i","-0.0142460080391141","0.985753991960886+0.0415928662799822i",1,1,0,0,null,"1.01443433812182-0.000415975520938413i",0.12447955922984369,-2.3494512681856306E-2,null,"2.387610414i","1+2.387610414i",{"$error":"#VALUE!"},{"$error":"#VALUE!"},"1+2.387610414i",{"$error":"#VALUE!"},null,{"$error":"#VALUE!"},null,{"$error":"#VALUE!"},{"$error":"#VALUE!"}]
[20000,20,"125663.706i","-15791367005.6544","-1984401700736660i",null,{"$error":"#VALUE!"},null,{"$error":"#REF!"},{"$error":"#REF!"},null,{"$error":"#VALUE!"},{"$error":"#VALUE!"},{"$error":"#REF!"},{"$error":"#VALUE!"},0,"1+0.0439822971i","-0.000221975174244403i","-0.0157850504588521","0.984214949541148+0.0437603219257556i",1,1,0,0,null,"1.01601657935512-0.000486596443905099i",0.13801689257265934,-2.744041881657654E-2,null,"2.51327412i","1+2.51327412i",{"$error":"#VALUE!"},{"$error":"#VALUE!"},"1+2.51327412i",{"$error":"#VALUE!"},null,{"$error":"#VALUE!"},null,{"$error":"#VALUE!"},{"$error":"#VALUE!"}]
[25000,25,"157079.6325i","-24674010946.3351","-3875784571751290i",null,{"$error":"#VALUE!"},null,{"$error":"#REF!"},{"$error":"#REF!"},null,{"$error":"#VALUE!"},{"$error":"#VALUE!"},{"$error":"#REF!"},{"$error":"#VALUE!"},0,"1+0.054977871375i","-0.000433545262196099i","-0.0246641413419566","0.975335858658043+0.0545443261128039i",1,1,0,0,null,"1.02523378537434-0.000966656304033977i",0.21646204909008521,-5.4022127344881758E-2,null,"3.14159265i","1+3.14159265i",{"$error":"#VALUE!"},{"$error":"#VALUE!"},"1+3.14159265i",{"$error":"#VALUE!"},null,{"$error":"#VALUE!"},null,{"$error":"#VALUE!"},{"$error":"#VALUE!"}]
[30000,30,"188495.559i","-35530575762.7225","-6697355739986230i",null,{"$error":"#VALUE!"},null,{"$error":"#REF!"},{"$error":"#REF!"},null,{"$error":"#VALUE!"},{"$error":"#VALUE!"},{"$error":"#REF!"},{"$error":"#VALUE!"},0,"1+0.06597344565i","-0.00074916621307486i","-0.0355163635324174","0.964483636467583+0.0652242794369251i",1,1,0,0,null,"1.03670887459481-0.00170572482425677i",0.31314808208663503,-9.4270192682177109E-2,null,"3.76991118i","1+3.76991118i",{"$error":"#VALUE!"},{"$error":"#VALUE!"},"1+3.76991118i",{"$error":"#VALUE!"},null,{"$error":"#VALUE!"},null,{"$error":"#VALUE!"},{"$error":"#VALUE!"}]
[35000,35,"219911.4855i","-48361061454.8167","-10635152864885500i",null,{"$error":"#VALUE!"},null,{"$error":"#REF!"},{"$error":"#REF!"},null,{"$error":"#VALUE!"},{"$error":"#VALUE!"},{"$error":"#REF!"},{"$error":"#VALUE!"},0,"1+0.076969019925i","-0.00118964819946609i","-0.0483417170302348","0.951658282969765+0.0757793717255339i",1,1,0,0,null,"1.05057619978726-0.00277724104542023i",0.42858150735745315,-0.15146337803870516,null,"4.39822971i","1+4.39822971i",{"$error":"#VALUE!"},{"$error":"#VALUE!"},"1+4.39822971i",{"$error":"#VALUE!"},null,{"$error":"#VALUE!"},null,{"$error":"#VALUE!"},{"$error":"#VALUE!"}]
[40000,40,"251327.412i","-63165468022.6178","-15875213605893300i",null,{"$error":"#VALUE!"},null,{"$error":"#REF!"},{"$error":"#REF!"},null,{"$error":"#VALUE!"},{"$error":"#VALUE!"},{"$error":"#REF!"},{"$error":"#VALUE!"},0,"1+0.0879645942i","-0.00177580139395522i","-0.0631402018354088","0.936859798164591+0.0861887928060448i",1,1,0,0,null,"1.06700286965865-0.00426861635465528i",0.56338125510820847,-0.22921437604912545,null,"5.02654824i","1+5.02654824i",{"$error":"#VALUE!"},{"$error":"#VALUE!"},"1+5.02654824i",{"$error":"#VALUE!"},null,{"$error":"#VALUE!"},null,{"$error":"#VALUE!"},{"$error":"#VALUE!"}]
[45000,45,"282743.3385i","-79943795466.1256","-22603575622453500i",null,{"$error":"#VALUE!"},null,{"$error":"#REF!"},{"$error":"#REF!"},null,{"$error":"#VALUE!"},{"$error":"#VALUE!"},{"$error":"#REF!"},{"$error":"#VALUE!"},0,"1+0.098960168475i","-0.00252843596912765i","-0.0799118179479392","0.920088182052061+0.0964317325058724i",1,1,0,0,null,"1.08619356566251-0.00628565719175738i",0.71828994959670589,-0.33155932819996564,null,"5.65486677i","1+5.65486677i",{"$error":"#VALUE!"},{"$error":"#VALUE!"},"1+5.65486677i",{"$error":"#VALUE!"},null,{"$error":"#VALUE!"},null,{"$error":"#VALUE!"},{"$error":"#VALUE!"}]
[50000,50,"314159.265i","-98696043785.3402","-31006276574010300i",null,{"$error":"#VALUE!"},null,{"$error":"#REF!"},{"$error":"#REF!"},null,{"$error":"#VALUE!"},{"$error":"#VALUE!"},{"$error":"#REF!"},{"$error":"#VALUE!"},0,"1+0.10995574275i","-0.00346836209756879i","-0.0986565653678261","0.901343434632174+0.106487380652431i",1,1,0,0,null,"1.10839666057698-0.00895831050462997i",0.89418785513768861,-0.46306726345210286,null,"6.2831853i","1+6.2831853i",{"$error":"#VALUE!"},{"$error":"#VALUE!"},"1+6.2831853i",{"$error":"#VALUE!"},null,{"$error":"#VALUE!"},null,{"$error":"#VALUE!"},{"$error":"#VALUE!"}]
[55000,55,"345575.1915i","-119422212980.262","-41269354120007700i",null,{"$error":"#VALUE!"},null,{"$error":"#REF!"},{"$error":"#REF!"},null,{"$error":"#VALUE!"},{"$error":"#VALUE!"},{"$error":"#REF!"},{"$error":"#VALUE!"},0,"1+0.120951317025i","-0.00461638995186406i","-0.11937444409507","0.88062555590493+0.116334927073136i",1,1,0,0,null,"1.1339119415625-0.0124482487823856i",1.0921099587044569,-0.628976061964027,null,"6.91150383i","1+6.91150383i",{"$error":"#VALUE!"},{"$error":"#VALUE!"},"1+6.91150383i",{"$error":"#VALUE!"},null,{"$error":"#VALUE!"},null,{"$error":"#VALUE!"},{"$error":"#VALUE!"}]
[60000,60,"376991.118i","-142122303050.89","-53578845919889800i",null,{"$error":"#VALUE!"},null,{"$error":"#REF!"},{"$error":"#REF!"},null,{"$error":"#VALUE!"},{"$error":"#VALUE!"},{"$error":"#REF!"},{"$error":"#VALUE!"},0,"1+0.1319468913i","-0.00599332970459887i","-0.14206545412967","0.85793454587033+0.125953561595401i",1,1,0,0,null,"1.1631003258263-0.0169590294511739i",1.3132667689997053,-0.83536384612322845,null,"7.53982236i","1+7.53982236i",{"$error":"#VALUE!"},{"$error":"#VALUE!"},"1+7.53982236i",{"$error":"#VALUE!"},null,{"$error":"#VALUE!"},null,{"$error":"#VALUE!"},{"$error":"#VALUE!"}]
[65000,65,"408407.0445i","-166796313997.225","-68120789633100600i",null,{"$error":"#VALUE!"},null,{"$error":"#REF!"},{"$error":"#REF!"},null,{"$error":"#VALUE!"},{"$error":"#VALUE!"},{"$error":"#REF!"},{"$error":"#VALUE!"},0,"1+0.142942465575i","-0.00761999152835863i","-0.166729595471626","0.833270404528374+0.135322474046641i",1,1,0,0,null,"1.19639605981863-0.0227498889631618i",1.5590695347266561,-1.0893679748558442,null,"8.16814089i","1+8.16814089i",{"$error":"#VALUE!"},{"$error":"#VALUE!"},"1+8.16814089i",{"$error":"#VALUE!"},null,{"$error":"#VALUE!"},null,{"$error":"#VALUE!"},{"$error":"#VALUE!"}]
[70000,70,"439822.971i","-193444245819.267","-85081222919084300i",null,{"$error":"#VALUE!"},null,{"$error":"#REF!"},{"$error":"#REF!"},null,{"$error":"#VALUE!"},{"$error":"#VALUE!"},{"$error":"#REF!"},{"$error":"#VALUE!"},0,"1+0.15393803985i","-0.00951718559572877i","-0.193366868120939","0.806633131879061+0.144420854254271i",1,1,0,0,null,"1.23432201043572-0.0301547238275632i",1.8311607132208529,-1.3994685289579945,null,"8.79645942i","1+8.79645942i",{"$error":"#VALUE!"},{"$error":"#VALUE!"},"1+8.79645942i",{"$error":"#VALUE!"},null,{"$error":"#VALUE!"},null,{"$error":"#VALUE!"},{"$error":"#VALUE!"}]
[75000,75,"471238.8975i","-222066098517.016","-104646183437285000i",null,{"$error":"#VALUE!"},null,{"$error":"#REF!"},{"$error":"#REF!"},null,{"$error":"#VALUE!"},{"$error":"#VALUE!"},{"$error":"#REF!"},{"$error":"#VALUE!"},0,"1+0.164933614125i","-0.0117057220792947i","-0.221977272077609","0.778022727922391+0.153227892045705i",1,1,0,0,null,"1.27750877655212-0.0396085636961541i",2.1314506343374608,-1.775860031243816,null,"9.42477795i","1+9.42477795i",{"$error":"#VALUE!"},{"$error":"#VALUE!"},"1+9.42477795i",{"$error":"#VALUE!"},null,{"$error":"#VALUE!"},null,{"$error":"#VALUE!"},{"$error":"#VALUE!"}]
[80000,80,"502654.824i","-252661872090.471","-127001708847146000i",null,{"$error":"#VALUE!"},null,{"$error":"#REF!"},{"$error":"#REF!"},null,{"$error":"#VALUE!"},{"$error":"#VALUE!"},{"$error":"#REF!"},{"$error":"#VALUE!"},0,"1+0.1759291884i","-0.0142064111516417i","-0.252560807341635","0.747439192658365+0.161722777248358i",1,1,0,0,null,"1.32671843606306-0.0516850094110243i",2.4621613570964245,-2.2309452403961947,null,"10.05309648i","1+10.05309648i",{"$error":"#VALUE!"},{"$error":"#VALUE!"},"1+10.05309648i",{"$error":"#VALUE!"},null,{"$error":"#VALUE!"},null,{"$error":"#VALUE!"},{"$error":"#VALUE!"}]
[90000,90,"565486.677i","-319775181864.502","-180828604979628000i",null,{"$error":"#VALUE!"},null,{"$error":"#REF!"},{"$error":"#REF!"},null,{"$error":"#VALUE!"},{"$error":"#VALUE!"},{"$error":"#REF!"},{"$error":"#VALUE!"},0,"1+0.19792033695i","-0.0202274877530212i","-0.319647271791756","0.680352728208244+0.177692849196979i",1,1,0,0,null,"1.44709298035524-0.0870397594174791i",3.2256122149724868,-3.4420800766964819,null,"11.30973354i","1+11.30973354i",{"$error":"#VALUE!"},{"$error":"#VALUE!"},"1+11.30973354i",{"$error":"#VALUE!"},null,{"$error":"#VALUE!"},null,{"$error":"#VALUE!"},{"$error":"#VALUE!"}]
[100000,100,"628318.53i","-394784175141.361","-248050212592082000i",null,{"$error":"#VALUE!"},null,{"$error":"#REF!"},{"$error":"#REF!"},null,{"$error":"#VALUE!"},{"$error":"#VALUE!"},{"$error":"#REF!"},{"$error":"#VALUE!"},0,"1+0.2199114855i","-0.0277468967805503i","-0.394626261471305","0.605373738528695+0.19216458871945i",1,1,0,0,null,"1.60541786286688-0.146344269997555i",4.1477004385549856,-5.208487782900634,null,"12.5663706i","1+12.5663706i",{"$error":"#VALUE!"},{"$error":"#VALUE!"},"1+12.5663706i",{"$error":"#VALUE!"},null,{"$error":"#VALUE!"},null,{"$error":"#VALUE!"},{"$error":"#VALUE!"}]
[110000,110,"691150.383i","-477688851921.047","-330154832960062000i",null,{"$error":"#VALUE!"},null,{"$error":"#REF!"},{"$error":"#REF!"},null,{"$error":"#VALUE!"},{"$error":"#VALUE!"},{"$f":"J72","v":{"$error":"#REF!"}},{"$f":"IMSUM(L72:N72)","v":{"$error":"#VALUE!"}},1,"1+0.24190263405i","-0.0369311196149125i","-0.477497776380279",{"$f":"IMSUM(S72,R72,Q72)","v":"0.522502223619721+0.204971514435088i"},1,1,0,0,null,"1.81601781079008-0.249432980334241i",5.2635704959533189,-7.8207323086855629,null,"13.82300766i","1+13.82300766i",{"$error":"#VALUE!"},{"$error":"#VALUE!"},"1+13.82300766i",{"$error":"#VALUE!"},null,{"$error":"#VALUE!"},null,{"$error":"#VALUE!"},{"$error":"#VALUE!"}]
[120000,120,"753982.236i","-568489212203.56","-428630767359118000i",null,{"$error":"#VALUE!"},null,{"$error":"#REF!"},{"$error":"#REF!"},null,{"$error":"#VALUE!"},{"$error":"#VALUE!"},{"$error":"#REF!"},{"$error":"#VALUE!"},2,"1+0.2638937826i","-0.0479466376367909i","-0.568261816518679","0.431738183481321+0.215947144963209i",1,1,0,0,null,"2.09725415352119-0.43777055480966i",6.6182385434260986,-11.79034914070173,null,"15.07964472i","1+15.07964472i",{"$error":"#VALUE!"},{"$error":"#VALUE!"},"1+15.07964472i",{"$error":"#VALUE!"},null,{"$error":"#VALUE!"},null,{"$error":"#VALUE!"},{"$error":"#VALUE!"}]
[130000,130,"816814.089i","-667185255988.9","-544966317064805000i",null,{"$error":"#VALUE!"},null,{"$error":"#REF!"},{"$error":"#REF!"},null,{"$error":"#VALUE!"},{"$error":"#VALUE!"},{"$error":"#REF!"},{"$error":"#VALUE!"},3,"1+0.28588493115i","-0.0609599322268691i","-0.666918381886505","0.333081618113495+0.224924998923131i",1,1,0,0,null,"2.4600564712321-0.802936137717432i",8.2585333921617039,-18.076129196132914,null,"16.33628178i","1+16.33628178i",{"$error":"#VALUE!"},{"$error":"#VALUE!"},"1+16.33628178i",{"$error":"#VALUE!"},null,{"$error":"#VALUE!"},null,{"$error":"#VALUE!"},{"$error":"#VALUE!"}]
[150000,150,"942477.795i","-888264394068.062","-837169467498278000i",null,{"$error":"#VALUE!"},null,{"$error":"#REF!"},{"$error":"#REF!"},null,{"$error":"#VALUE!"},{"$error":"#VALUE!"},{"$error":"#REF!"},{"$error":"#VALUE!"},4,"1+0.32986722825i","-0.0936457766343574i","-0.887909088310435","0.112090911689565+0.236221451615643i",1,1,0,0,null,"2.77938675294686-2.91445167327342i",12.100245900170394,-46.358872275853109,null,"18.8495559i","1+18.8495559i",{"$error":"#VALUE!"},{"$error":"#VALUE!"},"1+18.8495559i",{"$error":"#VALUE!"},null,{"$error":"#VALUE!"},null,{"$error":"#VALUE!"},{"$error":"#VALUE!"}]
[160000,160,"1005309.648i","-1010647488361.88","-1016013670777170000i",null,{"$error":"#VALUE!"},null,{"$error":"#REF!"},{"$error":"#REF!"},null,{"$error":"#VALUE!"},{"$error":"#VALUE!"},{"$error":"#REF!"},{"$error":"#VALUE!"},5,"1+0.3518583768i","-0.113651289213134i","-1.01024322936654","-0.01024322936654+0.238207087586866i",1,1,0,0,null,"1.29419724044521-4.25368014631354i",12.959790177872241,-73.077431398381563,null,"20.10619296i","1+20.10619296i",{"$error":"#VALUE!"},{"$error":"#VALUE!"},"1+20.10619296i",{"$error":"#VALUE!"},null,{"$error":"#VALUE!"},null,{"$error":"#VALUE!"},{"$error":"#VALUE!"}]
[175000,175,{"$f":"COMPLEX(0,2*Pi*A77)","v":"1099557.4275i"},{"$f":"COMPLEX(-POWER(2*Pi*A77,2),0)","v":"-1209026536370.42"},{"$f":"COMPLEX(0,-POWER(2*Pi*A77,3))","v":"-1329394108110690000i"},null,{"$error":"#VALUE!"},null,{"$f":"IMPRODUCT((RdampSel*CdampSel+RdampSel*CinjSel),C77)","v":{"$error":"#REF!"}},{"$error":"#REF!"},null,{"$f":"IMPRODUCT(G77,L_infilterStd*RdampSel*CinjSel*CdampSel,E77)","v":{"$error":"#VALUE!"}},{"$f":"IMPRODUCT(G77,L_infilterStd*CinjSel,D77)","v":{"$error":"#VALUE!"}},{"$error":"#REF!"},{"$error":"#VALUE!"},6,{"$f":"IMSUM(IMPRODUCT(C77,RdampPssv*CdampPssv),1)","v":"1+0.384845099625i"},{"$f":"IMPRODUCT(RdampPssv*CdampPssv*CfilterPssv*LinfilterPssv,E77)","v":"-0.148706024933262i"},{"$f":"IMPRODUCT(D77,LinfilterPssv*(CfilterPssv+CdampPssv))","v":"-1.20854292575587"},"-0.20854292575587+0.236139074691738i",1,1,0,0,null,{"$f":"IMDIV(Q77,T77)","v":"-1.18552956082797-3.18780870043445i"},10.632434371784214,{"$f":"IMARGUMENT(Z77)*180/Pi","v":-110.39990747553254},null,{"$f":"IMPRODUCT((RdampCom*CdampCom+RdampCom*CinjCom),C77)","v":"21.99114855i"},"1+21.99114855i",{"$f":"IMPRODUCT(G77,L_infilterStd*RdampSel*CinjSel*CdampSel,E77)","v":{"$error":"#VALUE!"}},{"$f":"IMPRODUCT(G77,LAEFCom*CinjCom,D77)","v":{"$error":"#VALUE!"}},"1+21.99114855i",{"$error":"#VALUE!"},null,{"$error":"#VALUE!"},null,{"$error":"#VALUE!"},{"$f":"IMARGUMENT(AK77)*180/Pi","v":{"$error":"#VALUE!"}}]
[190000,190,"1193805.207i","-1425170872260.31","-1701376408169090000i",null,{"$error":"#VALUE!"},null,{"$error":"#REF!"},{"$error":"#REF!"},null,{"$error":"#VALUE!"},{"$error":"#VALUE!"},{"$error":"#REF!"},{"$error":"#VALUE!"},7,"1+0.41783182245i","-0.190315965017794i","-1.42460080391141","-0.42460080391141+0.227515857432206i",1,1,0,0,null,"-1.42011816933091-1.74500664759685i",{"$f":"20*LOG10(IMABS(Z78))","v":7.0430359282769261},-129.13932379003126,null,"23.87610414i",{"$f":"IMSUM(1,AD78)","v":"1+23.87610414i"},{"$error":"#VALUE!"},{"$error":"#VALUE!"},{"$f":"AE78","v":"1+23.87610414i"},{"$f":"IMSUM(AF78:AH78)","v":{"$error":"#VALUE!"}},null,{"$f":"IMDIV(AE78,AI78)","v":{"$error":"#VALUE!"}},null,{"$f":"20*LOG10(IMABS(AK78))","v":{"$error":"#VALUE!"}},{"$error":"#VALUE!"}]
[200000,200,"1256637.06i","-1579136700565.44","-1984401700736660000i",null,{"$error":"#VALUE!"},null,{"$error":"#REF!"},{"$error":"#REF!"},null,{"$error":"#VALUE!"},{"$error":"#VALUE!"},{"$error":"#REF!"},{"$error":"#VALUE!"},0,"1+0.439822971i","-0.221975174244403i","-1.57850504588521","-0.57850504588521+0.217847796755597i",1,1,0,0,null,"-1.26317208366406-1.23594812428182i",4.9459582998103908,-135.6241223057485,null,"25.1327412i","1+25.1327412i",{"$error":"#VALUE!"},{"$error":"#VALUE!"},"1+25.1327412i",{"$error":"#VALUE!"},null,{"$error":"#VALUE!"},null,{"$error":"#VALUE!"},{"$error":"#VALUE!"}]
[300000,300,"1884955.59i","-3553057576272.25","-6697355739986230000i",null,{"$error":"#VALUE!"},null,{"$error":"#REF!"},{"$error":"#REF!"},null,{"$error":"#VALUE!"},{"$error":"#VALUE!"},{"$error":"#REF!"},{"$error":"#VALUE!"},0,"1+0.6597344565i","-0.74916621307486i","-3.55163635324174","-2.55163635324174-0.08943175657486i",1,1,0,0,null,"-0.400475408867723-0.244517302172491i",-6.5724330903943216,-148.59311414511541,null,"37.6991118i","1+37.6991118i",{"$error":"#VALUE!"},{"$error":"#VALUE!"},"1+37.6991118i",{"$error":"#VALUE!"},null,{"$error":"#VALUE!"},null,{"$error":"#VALUE!"},{"$error":"#VALUE!"}]
[400000,400,"2513274.12i","-6316546802261.78","-15875213605893300000i",null,{"$error":"#VALUE!"},null,{"$error":"#REF!"},{"$error":"#REF!"},null,{"$error":"#VALUE!"},{"$error":"#VALUE!"},{"$error":"#REF!"},{"$error":"#VALUE!"},0,"1+0.879645942i","-1.77580139395522i","-6.31402018354088","-5.31402018354088-0.89615545195522i",1,1,0,0,null,"-0.210121191022436-0.130098243366712i",-12.141260868793136,-148.23594278994108,null,"50.2654824i","1+50.2654824i",{"$error":"#VALUE!"},{"$error":"#VALUE!"},"1+50.2654824i",{"$error":"#VALUE!"},null,{"$error":"#VALUE!"},null,{"$error":"#VALUE!"},{"$error":"#VALUE!"}]
[500000,500,"3141592.65i","-9869604378534.03","-31006276574010300000i",null,{"$error":"#VALUE!"},null,{"$error":"#REF!"},{"$error":"#REF!"},null,{"$error":"#VALUE!"},{"$error":"#VALUE!"},{"$error":"#REF!"},{"$error":"#VALUE!"},0,"1+1.0995574275i","-3.46836209756879i","-9.86565653678262","-8.86565653678262-2.36880467006879i",1,1,0,0,null,"-0.136208802833546-0.0876308907321328i",-15.811684145573038,-147.2445124058745,null,"62.831853i","1+62.831853i",{"$error":"#VALUE!"},{"$error":"#VALUE!"},"1+62.831853i",{"$error":"#VALUE!"},null,{"$error":"#VALUE!"},null,{"$error":"#VALUE!"},{"$error":"#VALUE!"}]
[600000,600,"3769911.18i","-14212230305089","-53578845919889800000i",null,{"$f":"IMSUM(IMPRODUCT(C83,Rcomp_AEF*Csen_AEF),Csen_AEF/Ccomp_AEF)","v":{"$error":"#VALUE!"}},null,{"$error":"#REF!"},{"$error":"#REF!"},null,{"$error":"#VALUE!"},{"$error":"#VALUE!"},{"$error":"#REF!"},{"$error":"#VALUE!"},0,"1+1.319468913i","-5.99332970459887i","-14.206545412967","-13.206545412967-4.67386079159887i",1,{"$f":"CHOOSE(INFILTER_TYPE,U83,IMDIV(J83,O83),IMDIV(Q83,T83))","v":1},0,{"$f":"IMARGUMENT(V83)*180/Pi","v":0},null,"-0.0987148424567274-0.0649745603002369i",-18.549182102928064,-146.64690503853296,null,"75.3982236i","1+75.3982236i",{"$error":"#VALUE!"},{"$error":"#VALUE!"},"1+75.3982236i",{"$error":"#VALUE!"},null,{"$error":"#VALUE!"},null,{"$error":"#VALUE!"},{"$error":"#VALUE!"}]
[700000,700,"4398229.71i","-19344424581926.7","-85081222919084300000i",null,{"$error":"#VALUE!"},null,{"$error":"#REF!"},{"$error":"#REF!"},null,{"$error":"#VALUE!"},{"$error":"#VALUE!"},{"$error":"#REF!"},{"$error":"#VALUE!"},0,"1+1.5393803985i","-9.51718559572877i","-19.3366868120939","-18.3366868120939-7.97780519722877i",1,1,0,0,null,"-0.0765669830392885-0.050638587700621i",-20.743388875708668,-146.52081538204177,null,"87.9645942i","1+87.9645942i",{"$error":"#VALUE!"},{"$error":"#VALUE!"},"1+87.9645942i",{"$error":"#VALUE!"},null,{"$error":"#VALUE!"},null,{"$error":"#VALUE!"},{"$error":"#VALUE!"}]
[800000,800,"5026548.24i","-25266187209047.1","-127001708847146000000i",null,{"$error":"#VALUE!"},null,{"$error":"#REF!"},{"$error":"#REF!"},null,{"$error":"#VALUE!"},{"$error":"#VALUE!"},{"$error":"#REF!"},{"$error":"#VALUE!"},0,"1+1.759291884i","-14.2064111516417i","-25.2560807341635","-24.2560807341635-12.4471192676417i",1,1,0,0,null,"-0.0620946151681225-0.040665794855093i",-22.588919033913939,-146.77919071706401,null,"100.5309648i","1+100.5309648i",{"$error":"#VALUE!"},{"$error":"#VALUE!"},"1+100.5309648i",{"$error":"#VALUE!"},null,{"$error":"#VALUE!"},null,{"$error":"#VALUE!"},{"$error":"#VALUE!"}]
[900000,900,"5654866.77i","-31977518186450.2","-180828604979628000000i",null,{"$error":"#VALUE!"},null,{"$error":"#REF!"},{"$error":"#REF!"},null,{"$error":"#VALUE!"},{"$error":"#VALUE!"},{"$error":"#REF!"},{"$error":"#VALUE!"},0,"1+1.9792033695i","-20.2274877530212i","-31.9647271791756","-30.9647271791756-18.2482843835212i",1,1,0,0,null,"-0.0519283597315569-0.033315323192724i",-24.194781244722876,-147.31726418522518,null,"113.0973354i","1+113.0973354i",{"$error":"#VALUE!"},{"$error":"#VALUE!"},"1+113.0973354i",{"$error":"#VALUE!"},null,{"$error":"#VALUE!"},null,{"$error":"#VALUE!"},{"$error":"#VALUE!"}]
[1000000,1000,"6283185.3i","-39478417514136.1","-248050212592083000000i",null,{"$error":"#VALUE!"},null,{"$error":"#REF!"},{"$error":"#REF!"},null,{"$error":"#VALUE!"},{"$error":"#VALUE!"},{"$error":"#REF!"},{"$error":"#VALUE!"},0,"1+2.199114855i","-27.7468967805504i","-39.4626261471305","-38.4626261471305-25.5477819255504i",1,1,0,0,null,"-0.044391344457259-0.0276895930961649i",-25.626768047686518,-148.04569057314714,null,"125.663706i","1+125.663706i",{"$error":"#VALUE!"},{"$error":"#VALUE!"},"1+125.663706i",{"$error":"#VALUE!"},null,{"$error":"#VALUE!"},null,{"$error":"#VALUE!"},{"$error":"#VALUE!"}]
[2000000,2000,"12566370.6i","-157913670056544","-1.98440170073666E+21i",null,{"$error":"#VALUE!"},null,{"$error":"#REF!"},{"$error":"#REF!"},null,{"$error":"#VALUE!"},{"$error":"#VALUE!"},{"$error":"#REF!"},{"$error":"#VALUE!"},0,"1+4.39822971i","-221.975174244403i","-157.850504588521","-156.850504588521-217.576944534403i",1,1,0,0,null,"-0.0154820114155727-0.00656485596685991i",-35.485359346827785,-157.02154019060663,null,"251.327412i","1+251.327412i",{"$error":"#VALUE!"},{"$error":"#VALUE!"},"1+251.327412i",{"$error":"#VALUE!"},null,{"$error":"#VALUE!"},null,{"$error":"#VALUE!"},{"$error":"#VALUE!"}]
[3000000,3000,"18849555.9i","-355305757627225","-6.69735573998623E+21i",null,{"$error":"#VALUE!"},null,{"$error":"#REF!"},{"$error":"#REF!"},null,{"$error":"#VALUE!"},{"$error":"#VALUE!"},{"$error":"#REF!"},{"$error":"#VALUE!"},0,"1+6.597344565i","-749.16621307486i","-355.163635324174","-354.163635324174-742.56886850986i",1,1,0,0,null,"-0.00776127767315144-0.00235501700871593i",-41.818827844809874,-163.12054420169724,null,"376.991118i","1+376.991118i",{"$error":"#VALUE!"},{"$error":"#VALUE!"},"1+376.991118i",{"$error":"#VALUE!"},null,{"$error":"#VALUE!"},null,{"$error":"#VALUE!"},{"$error":"#VALUE!"}]
[4000000,4000,"25132741.2i","-631654680226178","-1.58752136058933E+22i",null,{"$error":"#VALUE!"},null,{"$error":"#REF!"},{"$error":"#REF!"},null,{"$error":"#VALUE!"},{"$error":"#VALUE!"},{"$error":"#REF!"},{"$error":"#VALUE!"},0,"1+8.79645942i","-1775.80139395522i","-631.402018354088","-630.402018354088-1767.00493453522i",1,1,0,0,null,"-0.00459520096124435-0.00107346840047734i",-46.523147642689807,-166.85114049434898,null,"502.654824i","1+502.654824i",{"$error":"#VALUE!"},{"$error":"#VALUE!"},"1+502.654824i",{"$error":"#VALUE!"},null,{"$error":"#VALUE!"},null,{"$error":"#VALUE!"},{"$error":"#VALUE!"}]
[5000000,5000,"31415926.5i","-986960437853403","-3.10062765740103E+22i",null,{"$error":"#VALUE!"},null,{"$error":"#REF!"},{"$error":"#REF!"},null,{"$error":"#VALUE!"},{"$error":"#VALUE!"},{"$error":"#REF!"},{"$error":"#VALUE!"},0,"1+10.995574275i","-3468.36209756879i","-986.565653678262","-985.565653678262-3457.36652329379i",1,1,0,0,null,"-0.00301757308495533-0.000570959537178404i",-50.254080822840123,-169.28564289756036,null,"628.31853i","1+628.31853i",{"$error":"#VALUE!"},{"$error":"#VALUE!"},"1+628.31853i",{"$error":"#VALUE!"},null,{"$error":"#VALUE!"},null,{"$error":"#VALUE!"},{"$error":"#VALUE!"}]
[6000000,6000,"37699111.8i","-1421223030508900","-5.35788459198898E+22i",null,{"$error":"#VALUE!"},null,{"$error":"#REF!"},{"$error":"#REF!"},null,{"$error":"#VALUE!"},{"$error":"#VALUE!"},{"$error":"#REF!"},{"$error":"#VALUE!"},0,"1+13.19468913i","-5993.32970459887i","-1420.6545412967","-1419.6545412967-5980.13501546887i",1,1,0,0,null,"-0.00212628728062533-0.000337549802608077i",-53.339467507298949,-170.979524286046,null,"753.982236i","1+753.982236i",{"$error":"#VALUE!"},{"$error":"#VALUE!"},"1+753.982236i",{"$error":"#VALUE!"},null,{"$error":"#VALUE!"},null,{"$error":"#VALUE!"},{"$error":"#VALUE!"}]
[7000000,7000,"43982297.1i","-1934442458192670","-8.50812229190843E+22i",null,{"$error":"#VALUE!"},null,{"$error":"#REF!"},{"$error":"#REF!"},null,{"$error":"#VALUE!"},{"$error":"#VALUE!"},{"$error":"#REF!"},{"$error":"#VALUE!"},0,"1+15.393803985i","-9517.18559572877i","-1933.66868120939","-1932.66868120939-9501.79179174377i",1,1,0,0,null,"-0.00157628762603077-0.000215374297002146i",-55.966960551322785,-172.21963347996476,null,"879.645942i","1+879.645942i",{"$error":"#VALUE!"},{"$error":"#VALUE!"},"1+879.645942i",{"$error":"#VALUE!"},null,{"$error":"#VALUE!"},null,{"$error":"#VALUE!"},{"$error":"#VALUE!"}]
[8000000,8000,"50265482.4i","-2526618720904710","-1.27001708847146E+23i",null,{"$error":"#VALUE!"},null,{"$error":"#REF!"},{"$error":"#REF!"},null,{"$error":"#VALUE!"},{"$error":"#VALUE!"},{"$error":"#REF!"},{"$error":"#VALUE!"},0,"1+17.59291884i","-14206.4111516417i","-2525.60807341635","-2524.60807341635-14188.8182328017i",1,1,0,0,null,"-0.00121401992445827-0.000145531817287078i",-58.253518683206799,-173.1642323462458,null,"1005.309648i","1+1005.309648i",{"$error":"#VALUE!"},{"$error":"#VALUE!"},"1+1005.309648i",{"$error":"#VALUE!"},null,{"$error":"#VALUE!"},null,{"$error":"#VALUE!"},{"$error":"#VALUE!"}]
[9000000,9000,"56548667.7i","-3197751818645020","-1.80828604979628E+23i",null,{"$error":"#VALUE!"},null,{"$error":"#REF!"},{"$error":"#REF!"},null,{"$error":"#VALUE!"},{"$error":"#VALUE!"},{"$error":"#REF!"},{"$error":"#VALUE!"},0,"1+19.792033695i","-20227.4877530212i","-3196.47271791756","-3195.47271791756-20207.6957193262i",1,1,0,0,null,"-0.000963171180292813-0.000102821581350465i",-60.27671706539698,-173.90657129969617,null,"1130.973354i","1+1130.973354i",{"$error":"#VALUE!"},{"$error":"#VALUE!"},"1+1130.973354i",{"$error":"#VALUE!"},null,{"$error":"#VALUE!"},null,{"$error":"#VALUE!"},{"$error":"#VALUE!"}]
[10000000,10000,"62831853i","-3947841751413610","-2.48050212592082E+23i",null,{"$error":"#VALUE!"},null,{"$error":"#REF!"},{"$error":"#REF!"},null,{"$error":"#VALUE!"},{"$error":"#VALUE!"},{"$error":"#REF!"},{"$error":"#VALUE!"},0,"1+21.99114855i","-27746.8967805503i","-3946.26261471304","-3945.26261471304-27724.9056320003i",1,1,0,0,null,"-0.000782478973720499-0.0000752783461022707i",-62.09053569388221,-174.50477476720093,null,"1256.63706i","1+1256.63706i",{"$error":"#VALUE!"},{"$error":"#VALUE!"},"1+1256.63706i",{"$error":"#VALUE!"},null,{"$error":"#VALUE!"},null,{"$error":"#VALUE!"},{"$error":"#VALUE!"}]
[{"$f":"Fsw","v":2200000},{"$f":"A97/1000","v":2200},"13823007.66i","-191075540768419","-2.64123866368049E+21i",null,{"$error":"#VALUE!"},null,{"$error":"#REF!"},{"$f":"IMSUM(1,I97)","v":{"$error":"#REF!"}},null,{"$error":"#VALUE!"},{"$error":"#VALUE!"},{"$f":"J97","v":{"$error":"#REF!"}},{"$f":"IMSUM(L97:N97)","v":{"$error":"#VALUE!"}},2,"1+4.838052681i","-295.4489569193i","-190.999110552112",{"$f":"IMSUM(S97,R97,Q97)","v":"-189.999110552112-290.6109042383i"},1,1,{"$f":"20*LOG10(IMABS(V97))","v":0},0,null,"-0.0132387578455215-0.00521436805489343i",-36.936729013371945,-158.50193846281121,null,"276.4601532i","1+276.4601532i",{"$error":"#VALUE!"},{"$error":"#VALUE!"},"1+276.4601532i",{"$error":"#VALUE!"},null,{"$error":"#VALUE!"},null,{"$error":"#VALUE!"},{"$error":"#VALUE!"}]

{"sheet":"Standard Value Calculator","index":12,"n_rows":159,"n_cols":20,"rows_kept":159,"cut":false,"hidden":true,"merged":[]}
[]
["Capacitors","Css","Cc1ea","Cc2ea","Cout","Cin","Cres","Cdither","Cc3ea","Cc4ea","Cin_Passive","Cdamp_Pssv","Cinj_AEF","Cdamp_AEF"]
["Inputs",{"$f":"Css","v":0},{"$f":"Cc1ea","v":7.4965313212633598E-10},{"$f":"Cc2ea","v":-5.6801906652483391E-11},{"$f":"Cout","v":5.4000000000000001E-4},{"$f":"Cin","v":3.0000000000000001E-5},{"$f":"Cres","v":6.6666666666666668E-8},{"$f":"Cdither_init","v":{"$error":"#DIV/0!"}},{"$f":"Cc3ea","v":0},{"$f":"Cc4ea","v":0},{"$f":"'Variable Management'!B292*0.000001","v":{"$error":"#VALUE!"}},{"$f":"K3*4","v":{"$error":"#VALUE!"}},{"$f":"Cinj_AEF*0.000001","v":{"$error":"#VALUE!"}},{"$f":"'Variable Management'!B295*0.000001","v":{"$error":"#VALUE!"}},null,null,"Resistors","inputs","Standard Result"]
["Standard Result",{"$f":"SUM(B6:B158)/1000000000000","v":0},{"$f":"IF(C3=\"OPEN\",\"OPEN\",SUM(C6:C158)/1000000000000)","v":6.8000000000000003E-10},{"$f":"SUM(D6:D158)/1000000000000","v":0},{"$f":"SUM(E6:E158)/1000000000000","v":5.5999999999999995E-4},{"$f":"SUM(F6:F158)/1000000000000","v":3.3000000000000003E-5},{"$f":"SUM(G6:G158)/1000000000000","v":6.8E-8},{"$f":"IF(H3=\"OPEN\",\"OPEN\",SUM(H6:H158)/1000000000000)","v":{"$error":"#DIV/0!"}},0,0,{"$error":"#VALUE!"},{"$error":"#VALUE!"},{"$error":"#VALUE!"},{"$error":"#VALUE!"},null,null,"Rt",{"$f":"Rfadj","v":10},{"$f":"IF(R4>(INT(0.5+100*POWER(10,IF(96*(LOG(R4)-INT(LOG(R4)))-ROUND(96*(LOG(R4)-INT(LOG(R4))),0)<0,ROUND(96*(LOG(R4)-INT(LOG(R4))),0)-1,ROUND(96*(LOG(R4)-INT(LOG(R4))),0))/96))*POWER(10,INT(LOG(R4))-2)+INT(0.5+100*POWER(10,(IF(96*(LOG(R4)-INT(LOG(R4)))-ROUND(96*(LOG(R4)-INT(LOG(R4))),0)<0,ROUND(96*(LOG(R4)-INT(LOG(R4))),0)-1,ROUND(96*(LOG(R4)-INT(LOG(R4))),0))+1)/96))*POWER(10,INT(LOG(R4))-2))/2,INT(0.5+100*POWER(10,(IF(96*(LOG(R4)-INT(LOG(R4)))-ROUND(96*(LOG(R4)-INT(LOG(R4))),0)<0,ROUND(96*(LOG(R4)-INT(LOG(R4))),0)-1,ROUND(96*(LOG(R4)-INT(LOG(R4))),0))+1)/96))*POWER(10,INT(LOG(R4))-2),INT(0.5+100*POWER(10,IF(96*(LOG(R4)-INT(LOG(R4)))-ROUND(96*(LOG(R4)-INT(LOG(R4))),0)<0,ROUND(96*(LOG(R4)-INT(LOG(R4))),0)-1,ROUND(96*(LOG(R4)-INT(LOG(R4))),0))/96))*POWER(10,INT(LOG(R4))-2))","v":10},"Ω"]
["(pF)"]
[0.47,{"$f":"IF(IF((B$3*10^12-$A7)*(B$3*10^12-$A6)*-1<0,0,1)*IF(ABS(B$3*10^12-$A7)>(B$3*10^12-$A6),$A6,$A7)=B7,0,IF((B$3*10^12-$A7)*(B$3*10^12-$A6)*-1<0,0,1)*IF(ABS(B$3*10^12-$A7)>(B$3*10^12-$A6),$A6,$A7))","v":0},0,0,0,0,0,{"$error":"#DIV/0!"},0,0,{"$error":"#VALUE!"},{"$error":"#VALUE!"},{"$error":"#VALUE!"},{"$error":"#VALUE!"}]
[0.56000000000000005,{"$f":"IF(IF((B$3*10^12-$A8)*(B$3*10^12-$A7)*-1<0,0,1)*IF(ABS(B$3*10^12-$A8)>(B$3*10^12-$A7),$A7,$A8)=B8,0,IF((B$3*10^12-$A8)*(B$3*10^12-$A7)*-1<0,0,1)*IF(ABS(B$3*10^12-$A8)>(B$3*10^12-$A7),$A7,$A8))","v":0},{"$f":"IF(IF((C$3*10^12-$A8)*(C$3*10^12-$A7)*-1<0,0,1)*IF(ABS(C$3*10^12-$A8)>(C$3*10^12-$A7),$A7,$A8)=C8,0,IF((C$3*10^12-$A8)*(C$3*10^12-$A7)*-1<0,0,1)*IF(ABS(C$3*10^12-$A8)>(C$3*10^12-$A7),$A7,$A8))","v":0},{"$f":"IF(IF((D$3*10^12-$A8)*(D$3*10^12-$A7)*-1<0,0,1)*IF(ABS(D$3*10^12-$A8)>(D$3*10^12-$A7),$A7,$A8)=D8,0,IF((D$3*10^12-$A8)*(D$3*10^12-$A7)*-1<0,0,1)*IF(ABS(D$3*10^12-$A8)>(D$3*10^12-$A7),$A7,$A8))","v":0},{"$f":"IF(IF((E$3*10^12-$A8)*(E$3*10^12-$A7)*-1<0,0,1)*IF(ABS(E$3*10^12-$A8)>(E$3*10^12-$A7),$A7,$A8)=E8,0,IF((E$3*10^12-$A8)*(E$3*10^12-$A7)*-1<0,0,1)*IF(ABS(E$3*10^12-$A8)>(E$3*10^12-$A7),$A7,$A8))","v":0},{"$f":"IF(IF((F$3*10^12-$A8)*(F$3*10^12-$A7)*-1<0,0,1)*IF(ABS(F$3*10^12-$A8)>(F$3*10^12-$A7),$A7,$A8)=F8,0,IF((F$3*10^12-$A8)*(F$3*10^12-$A7)*-1<0,0,1)*IF(ABS(F$3*10^12-$A8)>(F$3*10^12-$A7),$A7,$A8))","v":0},{"$f":"IF(IF((G$3*10^12-$A8)*(G$3*10^12-$A7)*-1<0,0,1)*IF(ABS(G$3*10^12-$A8)>(G$3*10^12-$A7),$A7,$A8)=G8,0,IF((G$3*10^12-$A8)*(G$3*10^12-$A7)*-1<0,0,1)*IF(ABS(G$3*10^12-$A8)>(G$3*10^12-$A7),$A7,$A8))","v":0},{"$error":"#DIV/0!"},0,0,{"$f":"IF(IF((K$3*10^12-$A8)*(K$3*10^12-$A7)*-1<0,0,1)*IF(ABS(K$3*10^12-$A8)>(K$3*10^12-$A7),$A7,$A8)=K8,0,IF((K$3*10^12-$A8)*(K$3*10^12-$A7)*-1<0,0,1)*IF(ABS(K$3*10^12-$A8)>(K$3*10^12-$A7),$A7,$A8))","v":{"$error":"#VALUE!"}},{"$error":"#VALUE!"},{"$error":"#VALUE!"},{"$error":"#VALUE!"},null,null,"Rc1ea",{"$f":"Rcea1","v":40827.842302911558},{"$f":"IF(R7>(INT(0.5+100*POWER(10,IF(96*(LOG(R7)-INT(LOG(R7)))-ROUND(96*(LOG(R7)-INT(LOG(R7))),0)<0,ROUND(96*(LOG(R7)-INT(LOG(R7))),0)-1,ROUND(96*(LOG(R7)-INT(LOG(R7))),0))/96))*POWER(10,INT(LOG(R7))-2)+INT(0.5+100*POWER(10,(IF(96*(LOG(R7)-INT(LOG(R7)))-ROUND(96*(LOG(R7)-INT(LOG(R7))),0)<0,ROUND(96*(LOG(R7)-INT(LOG(R7))),0)-1,ROUND(96*(LOG(R7)-INT(LOG(R7))),0))+1)/96))*POWER(10,INT(LOG(R7))-2))/2,INT(0.5+100*POWER(10,(IF(96*(LOG(R7)-INT(LOG(R7)))-ROUND(96*(LOG(R7)-INT(LOG(R7))),0)<0,ROUND(96*(LOG(R7)-INT(LOG(R7))),0)-1,ROUND(96*(LOG(R7)-INT(LOG(R7))),0))+1)/96))*POWER(10,INT(LOG(R7))-2),INT(0.5+100*POWER(10,IF(96*(LOG(R7)-INT(LOG(R7)))-ROUND(96*(LOG(R7)-INT(LOG(R7))),0)<0,ROUND(96*(LOG(R7)-INT(LOG(R7))),0)-1,ROUND(96*(LOG(R7)-INT(LOG(R7))),0))/96))*POWER(10,INT(LOG(R7))-2))","v":41200},"Ω"]
[0.68,0,0,0,0,0,0,{"$error":"#DIV/0!"},0,0,{"$error":"#VALUE!"},{"$error":"#VALUE!"},{"$error":"#VALUE!"},{"$error":"#VALUE!"},null,null,"Rc1ea",{"$f":"Rcea2","v":0},{"$f":"IF(R8>(INT(0.5+100*POWER(10,IF(96*(LOG(R8)-INT(LOG(R8)))-ROUND(96*(LOG(R8)-INT(LOG(R8))),0)<0,ROUND(96*(LOG(R8)-INT(LOG(R8))),0)-1,ROUND(96*(LOG(R8)-INT(LOG(R8))),0))/96))*POWER(10,INT(LOG(R8))-2)+INT(0.5+100*POWER(10,(IF(96*(LOG(R8)-INT(LOG(R8)))-ROUND(96*(LOG(R8)-INT(LOG(R8))),0)<0,ROUND(96*(LOG(R8)-INT(LOG(R8))),0)-1,ROUND(96*(LOG(R8)-INT(LOG(R8))),0))+1)/96))*POWER(10,INT(LOG(R8))-2))/2,INT(0.5+100*POWER(10,(IF(96*(LOG(R8)-INT(LOG(R8)))-ROUND(96*(LOG(R8)-INT(LOG(R8))),0)<0,ROUND(96*(LOG(R8)-INT(LOG(R8))),0)-1,ROUND(96*(LOG(R8)-INT(LOG(R8))),0))+1)/96))*POWER(10,INT(LOG(R8))-2),INT(0.5+100*POWER(10,IF(96*(LOG(R8)-INT(LOG(R8)))-ROUND(96*(LOG(R8)-INT(LOG(R8))),0)<0,ROUND(96*(LOG(R8)-INT(LOG(R8))),0)-1,ROUND(96*(LOG(R8)-INT(LOG(R8))),0))/96))*POWER(10,INT(LOG(R8))-2))","v":{"$error":"#NUM!"}},"Ω"]
[0.82,0,0,0,0,0,0,{"$error":"#DIV/0!"},0,0,{"$error":"#VALUE!"},{"$error":"#VALUE!"},{"$error":"#VALUE!"},{"$error":"#VALUE!"}]
[1,0,0,0,0,0,0,{"$error":"#DIV/0!"},0,0,{"$error":"#VALUE!"},{"$error":"#VALUE!"},{"$error":"#VALUE!"},{"$error":"#VALUE!"},null,null,"Rfb1",{"$f":"Rfb1_","v":2500000},{"$f":"IF(R10>(INT(0.5+100*POWER(10,IF(96*(LOG(R10)-INT(LOG(R10)))-ROUND(96*(LOG(R10)-INT(LOG(R10))),0)<0,ROUND(96*(LOG(R10)-INT(LOG(R10))),0)-1,ROUND(96*(LOG(R10)-INT(LOG(R10))),0))/96))*POWER(10,INT(LOG(R10))-2)+INT(0.5+100*POWER(10,(IF(96*(LOG(R10)-INT(LOG(R10)))-ROUND(96*(LOG(R10)-INT(LOG(R10))),0)<0,ROUND(96*(LOG(R10)-INT(LOG(R10))),0)-1,ROUND(96*(LOG(R10)-INT(LOG(R10))),0))+1)/96))*POWER(10,INT(LOG(R10))-2))/2,INT(0.5+100*POWER(10,(IF(96*(LOG(R10)-INT(LOG(R10)))-ROUND(96*(LOG(R10)-INT(LOG(R10))),0)<0,ROUND(96*(LOG(R10)-INT(LOG(R10))),0)-1,ROUND(96*(LOG(R10)-INT(LOG(R10))),0))+1)/96))*POWER(10,INT(LOG(R10))-2),INT(0.5+100*POWER(10,IF(96*(LOG(R10)-INT(LOG(R10)))-ROUND(96*(LOG(R10)-INT(LOG(R10))),0)<0,ROUND(96*(LOG(R10)-INT(LOG(R10))),0)-1,ROUND(96*(LOG(R10)-INT(LOG(R10))),0))/96))*POWER(10,INT(LOG(R10))-2))","v":2490000},"Ω"]
[1.2,0,0,0,0,0,0,{"$error":"#DIV/0!"},0,0,{"$error":"#VALUE!"},{"$error":"#VALUE!"},{"$f":"IF(IF((M$3*10^12-$A12)*(M$3*10^12-$A11)*-1<0,0,1)*IF(ABS(M$3*10^12-$A12)>(M$3*10^12-$A11),$A11,$A12)=M12,0,IF((M$3*10^12-$A12)*(M$3*10^12-$A11)*-1<0,0,1)*IF(ABS(M$3*10^12-$A12)>(M$3*10^12-$A11),$A11,$A12))","v":{"$error":"#VALUE!"}},{"$error":"#VALUE!"},null,null,"Rfb2",{"$f":"Rfb2_","v":476190.47619047615},{"$f":"IF(R11=\"OPEN\",\"OPEN\",IF(R11>(INT(0.5+100*POWER(10,IF(96*(LOG(R11)-INT(LOG(R11)))-ROUND(96*(LOG(R11)-INT(LOG(R11))),0)<0,ROUND(96*(LOG(R11)-INT(LOG(R11))),0)-1,ROUND(96*(LOG(R11)-INT(LOG(R11))),0))/96))*POWER(10,INT(LOG(R11))-2)+INT(0.5+100*POWER(10,(IF(96*(LOG(R11)-INT(LOG(R11)))-ROUND(96*(LOG(R11)-INT(LOG(R11))),0)<0,ROUND(96*(LOG(R11)-INT(LOG(R11))),0)-1,ROUND(96*(LOG(R11)-INT(LOG(R11))),0))+1)/96))*POWER(10,INT(LOG(R11))-2))/2,INT(0.5+100*POWER(10,(IF(96*(LOG(R11)-INT(LOG(R11)))-ROUND(96*(LOG(R11)-INT(LOG(R11))),0)<0,ROUND(96*(LOG(R11)-INT(LOG(R11))),0)-1,ROUND(96*(LOG(R11)-INT(LOG(R11))),0))+1)/96))*POWER(10,INT(LOG(R11))-2),INT(0.5+100*POWER(10,IF(96*(LOG(R11)-INT(LOG(R11)))-ROUND(96*(LOG(R11)-INT(LOG(R11))),0)<0,ROUND(96*(LOG(R11)-INT(LOG(R11))),0)-1,ROUND(96*(LOG(R11)-INT(LOG(R11))),0))/96))*POWER(10,INT(LOG(R11))-2)))","v":475000},"Ω"]
[1.5,0,0,0,0,0,0,{"$error":"#DIV/0!"},0,0,{"$error":"#VALUE!"},{"$error":"#VALUE!"},{"$error":"#VALUE!"},{"$error":"#VALUE!"},null,null,"Rt1",{"$f":"'Variable Management'!B27*1000","v":10079.545454545454},{"$f":"IF(R12>(INT(0.5+100*POWER(10,IF(96*(LOG(R12)-INT(LOG(R12)))-ROUND(96*(LOG(R12)-INT(LOG(R12))),0)<0,ROUND(96*(LOG(R12)-INT(LOG(R12))),0)-1,ROUND(96*(LOG(R12)-INT(LOG(R12))),0))/96))*POWER(10,INT(LOG(R12))-2)+INT(0.5+100*POWER(10,(IF(96*(LOG(R12)-INT(LOG(R12)))-ROUND(96*(LOG(R12)-INT(LOG(R12))),0)<0,ROUND(96*(LOG(R12)-INT(LOG(R12))),0)-1,ROUND(96*(LOG(R12)-INT(LOG(R12))),0))+1)/96))*POWER(10,INT(LOG(R12))-2))/2,INT(0.5+100*POWER(10,(IF(96*(LOG(R12)-INT(LOG(R12)))-ROUND(96*(LOG(R12)-INT(LOG(R12))),0)<0,ROUND(96*(LOG(R12)-INT(LOG(R12))),0)-1,ROUND(96*(LOG(R12)-INT(LOG(R12))),0))+1)/96))*POWER(10,INT(LOG(R12))-2),INT(0.5+100*POWER(10,IF(96*(LOG(R12)-INT(LOG(R12)))-ROUND(96*(LOG(R12)-INT(LOG(R12))),0)<0,ROUND(96*(LOG(R12)-INT(LOG(R12))),0)-1,ROUND(96*(LOG(R12)-INT(LOG(R12))),0))/96))*POWER(10,INT(LOG(R12))-2))","v":10000},"Ω"]
[1.8,0,0,0,0,0,0,{"$error":"#DIV/0!"},0,0,{"$error":"#VALUE!"},{"$error":"#VALUE!"},{"$error":"#VALUE!"},{"$error":"#VALUE!"},null,null,"Rd",{"$f":"'Variable Management'!B28*1000","v":0},{"$f":"IF(R13=\"OPEN\",\"OPEN\",IF(R13>(INT(0.5+100*POWER(10,IF(96*(LOG(R13)-INT(LOG(R13)))-ROUND(96*(LOG(R13)-INT(LOG(R13))),0)<0,ROUND(96*(LOG(R13)-INT(LOG(R13))),0)-1,ROUND(96*(LOG(R13)-INT(LOG(R13))),0))/96))*POWER(10,INT(LOG(R13))-2)+INT(0.5+100*POWER(10,(IF(96*(LOG(R13)-INT(LOG(R13)))-ROUND(96*(LOG(R13)-INT(LOG(R13))),0)<0,ROUND(96*(LOG(R13)-INT(LOG(R13))),0)-1,ROUND(96*(LOG(R13)-INT(LOG(R13))),0))+1)/96))*POWER(10,INT(LOG(R13))-2))/2,INT(0.5+100*POWER(10,(IF(96*(LOG(R13)-INT(LOG(R13)))-ROUND(96*(LOG(R13)-INT(LOG(R13))),0)<0,ROUND(96*(LOG(R13)-INT(LOG(R13))),0)-1,ROUND(96*(LOG(R13)-INT(LOG(R13))),0))+1)/96))*POWER(10,INT(LOG(R13))-2),INT(0.5+100*POWER(10,IF(96*(LOG(R13)-INT(LOG(R13)))-ROUND(96*(LOG(R13)-INT(LOG(R13))),0)<0,ROUND(96*(LOG(R13)-INT(LOG(R13))),0)-1,ROUND(96*(LOG(R13)-INT(LOG(R13))),0))/96))*POWER(10,INT(LOG(R13))-2)))","v":{"$error":"#NUM!"}},"Ω"]
[2.2000000000000002,{"$f":"IF(IF((B$3*10^12-$A15)*(B$3*10^12-$A14)*-1<0,0,1)*IF(ABS(B$3*10^12-$A15)>(B$3*10^12-$A14),$A14,$A15)=B15,0,IF((B$3*10^12-$A15)*(B$3*10^12-$A14)*-1<0,0,1)*IF(ABS(B$3*10^12-$A15)>(B$3*10^12-$A14),$A14,$A15))","v":0},0,0,0,0,0,{"$error":"#DIV/0!"},0,0,{"$error":"#VALUE!"},{"$error":"#VALUE!"},{"$error":"#VALUE!"},{"$error":"#VALUE!"},null,null,"Rd_AEF",{"$f":"'Variable Management'!B301","v":0.15055453054181619},{"$f":"IF(R14=\"OPEN\",\"OPEN\",IF(R14>(INT(0.5+100*POWER(10,IF(96*(LOG(R14)-INT(LOG(R14)))-ROUND(96*(LOG(R14)-INT(LOG(R14))),0)<0,ROUND(96*(LOG(R14)-INT(LOG(R14))),0)-1,ROUND(96*(LOG(R14)-INT(LOG(R14))),0))/96))*POWER(10,INT(LOG(R14))-2)+INT(0.5+100*POWER(10,(IF(96*(LOG(R14)-INT(LOG(R14)))-ROUND(96*(LOG(R14)-INT(LOG(R14))),0)<0,ROUND(96*(LOG(R14)-INT(LOG(R14))),0)-1,ROUND(96*(LOG(R14)-INT(LOG(R14))),0))+1)/96))*POWER(10,INT(LOG(R14))-2))/2,INT(0.5+100*POWER(10,(IF(96*(LOG(R14)-INT(LOG(R14)))-ROUND(96*(LOG(R14)-INT(LOG(R14))),0)<0,ROUND(96*(LOG(R14)-INT(LOG(R14))),0)-1,ROUND(96*(LOG(R14)-INT(LOG(R14))),0))+1)/96))*POWER(10,INT(LOG(R14))-2),INT(0.5+100*POWER(10,IF(96*(LOG(R14)-INT(LOG(R14)))-ROUND(96*(LOG(R14)-INT(LOG(R14))),0)<0,ROUND(96*(LOG(R14)-INT(LOG(R14))),0)-1,ROUND(96*(LOG(R14)-INT(LOG(R14))),0))/96))*POWER(10,INT(LOG(R14))-2)))","v":0.15},"Ω"]
[2.7,0,0,0,0,0,0,{"$error":"#DIV/0!"},0,0,{"$f":"IF(IF((K$3*10^12-$A16)*(K$3*10^12-$A15)*-1<0,0,1)*IF(ABS(K$3*10^12-$A16)>(K$3*10^12-$A15),$A15,$A16)=K16,0,IF((K$3*10^12-$A16)*(K$3*10^12-$A15)*-1<0,0,1)*IF(ABS(K$3*10^12-$A16)>(K$3*10^12-$A15),$A15,$A16))","v":{"$error":"#VALUE!"}},{"$error":"#VALUE!"},{"$error":"#VALUE!"},{"$error":"#VALUE!"}]
[3.3,0,0,0,0,0,0,{"$error":"#DIV/0!"},0,0,{"$error":"#VALUE!"},{"$error":"#VALUE!"},{"$error":"#VALUE!"},{"$error":"#VALUE!"},null,null,"Rs",{"$f":"Rs_ideal*1000","v":3.1028359503790215},{"$f":"IF(R16=0,0,IF(R16>(INT(0.5+100*POWER(10,IF(96*(LOG(R16)-INT(LOG(R16)))-ROUND(96*(LOG(R16)-INT(LOG(R16))),0)<0,ROUND(96*(LOG(R16)-INT(LOG(R16))),0)-1,ROUND(96*(LOG(R16)-INT(LOG(R16))),0))/96))*POWER(10,INT(LOG(R16))-2)+INT(0.5+100*POWER(10,(IF(96*(LOG(R16)-INT(LOG(R16)))-ROUND(96*(LOG(R16)-INT(LOG(R16))),0)<0,ROUND(96*(LOG(R16)-INT(LOG(R16))),0)-1,ROUND(96*(LOG(R16)-INT(LOG(R16))),0))+1)/96))*POWER(10,INT(LOG(R16))-2))/2,INT(0.5+100*POWER(10,(IF(96*(LOG(R16)-INT(LOG(R16)))-ROUND(96*(LOG(R16)-INT(LOG(R16))),0)<0,ROUND(96*(LOG(R16)-INT(LOG(R16))),0)-1,ROUND(96*(LOG(R16)-INT(LOG(R16))),0))+1)/96))*POWER(10,INT(LOG(R16))-2),INT(0.5+100*POWER(10,IF(96*(LOG(R16)-INT(LOG(R16)))-ROUND(96*(LOG(R16)-INT(LOG(R16))),0)<0,ROUND(96*(LOG(R16)-INT(LOG(R16))),0)-1,ROUND(96*(LOG(R16)-INT(LOG(R16))),0))/96))*POWER(10,INT(LOG(R16))-2)))","v":3.09},"mΩ"]
[3.9,0,0,0,0,0,0,{"$error":"#DIV/0!"},0,0,{"$error":"#VALUE!"},{"$error":"#VALUE!"},{"$error":"#VALUE!"},{"$error":"#VALUE!"},null,null,"Cres",{"$f":"Cres","v":6.6666666666666668E-8},{"$f":"G4*1000000000000","v":68000},"pF"]
[4.7,0,0,0,0,0,0,{"$error":"#DIV/0!"},0,0,{"$error":"#VALUE!"},{"$error":"#VALUE!"},{"$error":"#VALUE!"},{"$error":"#VALUE!"}]
[5.6,0,0,0,0,0,0,{"$error":"#DIV/0!"},0,0,{"$error":"#VALUE!"},{"$error":"#VALUE!"},{"$error":"#VALUE!"},{"$error":"#VALUE!"}]
[6.8,0,0,0,0,0,0,{"$error":"#DIV/0!"},0,0,{"$error":"#VALUE!"},{"$error":"#VALUE!"},{"$error":"#VALUE!"},{"$error":"#VALUE!"}]
[8.1999999999999993,0,0,0,0,0,0,{"$error":"#DIV/0!"},0,0,{"$error":"#VALUE!"},{"$error":"#VALUE!"},{"$error":"#VALUE!"},{"$error":"#VALUE!"},null,null,"Cdither",{"$f":"Cdither_init","v":{"$error":"#DIV/0!"}},{"$f":"H4","v":{"$error":"#DIV/0!"}}]
[10,0,0,0,0,0,0,{"$error":"#DIV/0!"},0,0,{"$f":"IF(IF((K$3*10^12-$A23)*(K$3*10^12-$A22)*-1<0,0,1)*IF(ABS(K$3*10^12-$A23)>(K$3*10^12-$A22),$A22,$A23)=K23,0,IF((K$3*10^12-$A23)*(K$3*10^12-$A22)*-1<0,0,1)*IF(ABS(K$3*10^12-$A23)>(K$3*10^12-$A22),$A22,$A23))","v":{"$error":"#VALUE!"}},{"$error":"#VALUE!"},{"$error":"#VALUE!"},{"$error":"#VALUE!"}]
[12,0,0,0,0,0,0,{"$error":"#DIV/0!"},0,0,{"$error":"#VALUE!"},{"$error":"#VALUE!"},{"$error":"#VALUE!"},{"$error":"#VALUE!"},null,null,"Cin_Passive",{"$f":"K4","v":{"$error":"#VALUE!"}},{"$f":"R23*1000000","v":{"$error":"#VALUE!"}},"uF"]
[15,0,0,0,0,0,0,{"$error":"#DIV/0!"},0,0,{"$error":"#VALUE!"},{"$error":"#VALUE!"},{"$error":"#VALUE!"},{"$error":"#VALUE!"},null,null,"Cinj_AEF",{"$f":"Cinj_AEF","v":{"$error":"#VALUE!"}},{"$f":"M4*1000000","v":{"$error":"#VALUE!"}},"uF"]
[18,0,0,0,0,0,0,{"$error":"#DIV/0!"},0,0,{"$error":"#VALUE!"},{"$error":"#VALUE!"},{"$error":"#VALUE!"},{"$error":"#VALUE!"},null,null,"Cdamp_AEF",{"$f":"'Variable Management'!B295","v":{"$error":"#VALUE!"}},{"$f":"N4*1000000","v":{"$error":"#VALUE!"}},"uF"]
[22,0,0,0,0,0,0,{"$error":"#DIV/0!"},0,0,{"$error":"#VALUE!"},{"$error":"#VALUE!"},{"$error":"#VALUE!"},{"$error":"#VALUE!"},null,null,"Rdamp_AEF",{"$f":"'Variable Management'!B296","v":{"$error":"#VALUE!"}},{"$f":"IF(R26=\"OPEN\",\"OPEN\",IF(R26>(INT(0.5+100*POWER(10,IF(96*(LOG(R26)-INT(LOG(R26)))-ROUND(96*(LOG(R26)-INT(LOG(R26))),0)<0,ROUND(96*(LOG(R26)-INT(LOG(R26))),0)-1,ROUND(96*(LOG(R26)-INT(LOG(R26))),0))/96))*POWER(10,INT(LOG(R26))-2)+INT(0.5+100*POWER(10,(IF(96*(LOG(R26)-INT(LOG(R26)))-ROUND(96*(LOG(R26)-INT(LOG(R26))),0)<0,ROUND(96*(LOG(R26)-INT(LOG(R26))),0)-1,ROUND(96*(LOG(R26)-INT(LOG(R26))),0))+1)/96))*POWER(10,INT(LOG(R26))-2))/2,INT(0.5+100*POWER(10,(IF(96*(LOG(R26)-INT(LOG(R26)))-ROUND(96*(LOG(R26)-INT(LOG(R26))),0)<0,ROUND(96*(LOG(R26)-INT(LOG(R26))),0)-1,ROUND(96*(LOG(R26)-INT(LOG(R26))),0))+1)/96))*POWER(10,INT(LOG(R26))-2),INT(0.5+100*POWER(10,IF(96*(LOG(R26)-INT(LOG(R26)))-ROUND(96*(LOG(R26)-INT(LOG(R26))),0)<0,ROUND(96*(LOG(R26)-INT(LOG(R26))),0)-1,ROUND(96*(LOG(R26)-INT(LOG(R26))),0))/96))*POWER(10,INT(LOG(R26))-2)))","v":{"$error":"#VALUE!"}},"Ω"]
[27,0,0,0,0,0,0,{"$error":"#DIV/0!"},0,0,{"$error":"#VALUE!"},{"$error":"#VALUE!"},{"$f":"IF(IF((M$3*10^12-$A28)*(M$3*10^12-$A27)*-1<0,0,1)*IF(ABS(M$3*10^12-$A28)>(M$3*10^12-$A27),$A27,$A28)=M28,0,IF((M$3*10^12-$A28)*(M$3*10^12-$A27)*-1<0,0,1)*IF(ABS(M$3*10^12-$A28)>(M$3*10^12-$A27),$A27,$A28))","v":{"$error":"#VALUE!"}},{"$error":"#VALUE!"},null,null,"Rdamp_Passive",{"$f":"SQRT(L_infilterStd/K4)","v":{"$error":"#VALUE!"}},{"$f":"IF(R27=\"OPEN\",\"OPEN\",IF(R27>(INT(0.5+100*POWER(10,IF(96*(LOG(R27)-INT(LOG(R27)))-ROUND(96*(LOG(R27)-INT(LOG(R27))),0)<0,ROUND(96*(LOG(R27)-INT(LOG(R27))),0)-1,ROUND(96*(LOG(R27)-INT(LOG(R27))),0))/96))*POWER(10,INT(LOG(R27))-2)+INT(0.5+100*POWER(10,(IF(96*(LOG(R27)-INT(LOG(R27)))-ROUND(96*(LOG(R27)-INT(LOG(R27))),0)<0,ROUND(96*(LOG(R27)-INT(LOG(R27))),0)-1,ROUND(96*(LOG(R27)-INT(LOG(R27))),0))+1)/96))*POWER(10,INT(LOG(R27))-2))/2,INT(0.5+100*POWER(10,(IF(96*(LOG(R27)-INT(LOG(R27)))-ROUND(96*(LOG(R27)-INT(LOG(R27))),0)<0,ROUND(96*(LOG(R27)-INT(LOG(R27))),0)-1,ROUND(96*(LOG(R27)-INT(LOG(R27))),0))+1)/96))*POWER(10,INT(LOG(R27))-2),INT(0.5+100*POWER(10,IF(96*(LOG(R27)-INT(LOG(R27)))-ROUND(96*(LOG(R27)-INT(LOG(R27))),0)<0,ROUND(96*(LOG(R27)-INT(LOG(R27))),0)-1,ROUND(96*(LOG(R27)-INT(LOG(R27))),0))/96))*POWER(10,INT(LOG(R27))-2)))","v":{"$error":"#VALUE!"}},"Ω"]
[33,0,0,0,0,0,0,{"$error":"#DIV/0!"},0,0,{"$error":"#VALUE!"},{"$error":"#VALUE!"},{"$error":"#VALUE!"},{"$error":"#VALUE!"},null,null,"Cdamp_Passive",{"$f":"L4","v":{"$error":"#VALUE!"}},{"$f":"R28*1000000","v":{"$error":"#VALUE!"}},"uF"]
[39,0,0,0,0,0,0,{"$error":"#DIV/0!"},0,0,{"$error":"#VALUE!"},{"$error":"#VALUE!"},{"$error":"#VALUE!"},{"$error":"#VALUE!"}]
[47,0,0,0,0,0,0,{"$error":"#DIV/0!"},0,0,{"$error":"#VALUE!"},{"$error":"#VALUE!"},{"$error":"#VALUE!"},{"$error":"#VALUE!"}]
[56,0,0,0,0,0,0,{"$error":"#DIV/0!"},0,0,{"$error":"#VALUE!"},{"$error":"#VALUE!"},{"$error":"#VALUE!"},{"$error":"#VALUE!"}]
[68,0,0,0,0,0,0,{"$error":"#DIV/0!"},0,0,{"$error":"#VALUE!"},{"$error":"#VALUE!"},{"$error":"#VALUE!"},{"$error":"#VALUE!"},null,null,"Rc1",{"$f":"S7/1000&\" kΩ\"","v":"41.2 kΩ"},{"$f":"S7/1000","v":41.2},"kΩ"]
[82,0,0,0,0,0,0,{"$error":"#DIV/0!"},0,0,{"$error":"#VALUE!"},{"$error":"#VALUE!"},{"$error":"#VALUE!"},{"$error":"#VALUE!"},null,null,"Cc1",{"$f":"C4*1000000000&\" nF\"","v":"0.68 nF"},{"$f":"C4*1000000000","v":0.68},"nF"]
[{"$f":"A22*10","v":100},0,0,0,0,0,0,{"$error":"#DIV/0!"},0,0,{"$error":"#VALUE!"},{"$error":"#VALUE!"},{"$error":"#VALUE!"},{"$error":"#VALUE!"},null,null,"Cc2",{"$f":"D4*1000000000000&\" pF\"","v":"0 pF"},{"$f":"D4*1000000000000","v":0},"pF"]
[{"$f":"A23*10","v":120},0,0,0,0,0,0,{"$error":"#DIV/0!"},0,0,{"$error":"#VALUE!"},{"$error":"#VALUE!"},{"$error":"#VALUE!"},{"$error":"#VALUE!"}]
[150,0,0,0,0,0,0,{"$error":"#DIV/0!"},0,0,{"$error":"#VALUE!"},{"$error":"#VALUE!"},{"$error":"#VALUE!"},{"$error":"#VALUE!"},null,null,"Rc2",{"$f":"S8/1000&\" kΩ\"","v":{"$error":"#NUM!"}},{"$f":"S8/1000","v":{"$error":"#NUM!"}},"kΩ"]
[180,0,0,0,0,0,0,{"$error":"#DIV/0!"},0,0,{"$error":"#VALUE!"},{"$error":"#VALUE!"},{"$error":"#VALUE!"},{"$error":"#VALUE!"},null,null,"Cc3",{"$f":"I4*1000000000&\" nF\"","v":"0 nF"},{"$f":"I4*1000000000","v":0},"nF"]
[220,0,0,0,0,0,0,{"$error":"#DIV/0!"},0,0,{"$error":"#VALUE!"},{"$error":"#VALUE!"},{"$error":"#VALUE!"},{"$error":"#VALUE!"},null,null,"Cc4",{"$f":"J4*1000000000000&\" pF\"","v":"0 pF"},{"$f":"J4*1000000000000","v":0},"pF"]
[270,0,{"$f":"IF(IF((C$3*10^12-$A40)*(C$3*10^12-$A39)*-1<0,0,1)*IF(ABS(C$3*10^12-$A40)>(C$3*10^12-$A39),$A39,$A40)=C40,0,IF((C$3*10^12-$A40)*(C$3*10^12-$A39)*-1<0,0,1)*IF(ABS(C$3*10^12-$A40)>(C$3*10^12-$A39),$A39,$A40))","v":0},0,0,0,0,{"$error":"#DIV/0!"},0,0,{"$error":"#VALUE!"},{"$error":"#VALUE!"},{"$error":"#VALUE!"},{"$error":"#VALUE!"}]
[330,0,0,0,0,0,0,{"$error":"#DIV/0!"},0,0,{"$error":"#VALUE!"},{"$error":"#VALUE!"},{"$error":"#VALUE!"},{"$error":"#VALUE!"},null,null,"Rent",{"$f":"'Variable Management'!B186/1000","v":99.999999999999986},{"$f":"IF(R40>(INT(0.5+100*POWER(10,IF(96*(LOG(R40)-INT(LOG(R40)))-ROUND(96*(LOG(R40)-INT(LOG(R40))),0)<0,ROUND(96*(LOG(R40)-INT(LOG(R40))),0)-1,ROUND(96*(LOG(R40)-INT(LOG(R40))),0))/96))*POWER(10,INT(LOG(R40))-2)+INT(0.5+100*POWER(10,(IF(96*(LOG(R40)-INT(LOG(R40)))-ROUND(96*(LOG(R40)-INT(LOG(R40))),0)<0,ROUND(96*(LOG(R40)-INT(LOG(R40))),0)-1,ROUND(96*(LOG(R40)-INT(LOG(R40))),0))+1)/96))*POWER(10,INT(LOG(R40))-2))/2,INT(0.5+100*POWER(10,(IF(96*(LOG(R40)-INT(LOG(R40)))-ROUND(96*(LOG(R40)-INT(LOG(R40))),0)<0,ROUND(96*(LOG(R40)-INT(LOG(R40))),0)-1,ROUND(96*(LOG(R40)-INT(LOG(R40))),0))+1)/96))*POWER(10,INT(LOG(R40))-2),INT(0.5+100*POWER(10,IF(96*(LOG(R40)-INT(LOG(R40)))-ROUND(96*(LOG(R40)-INT(LOG(R40))),0)<0,ROUND(96*(LOG(R40)-INT(LOG(R40))),0)-1,ROUND(96*(LOG(R40)-INT(LOG(R40))),0))/96))*POWER(10,INT(LOG(R40))-2))","v":100},"kΩ"]
[390,0,0,0,0,0,0,{"$error":"#DIV/0!"},0,0,{"$error":"#VALUE!"},{"$error":"#VALUE!"},{"$error":"#VALUE!"},{"$error":"#VALUE!"},null,null,"Renb",{"$f":"'Variable Management'!B187/1000","v":24.999999999999996},{"$f":"IF(R41>(INT(0.5+100*POWER(10,IF(96*(LOG(R41)-INT(LOG(R41)))-ROUND(96*(LOG(R41)-INT(LOG(R41))),0)<0,ROUND(96*(LOG(R41)-INT(LOG(R41))),0)-1,ROUND(96*(LOG(R41)-INT(LOG(R41))),0))/96))*POWER(10,INT(LOG(R41))-2)+INT(0.5+100*POWER(10,(IF(96*(LOG(R41)-INT(LOG(R41)))-ROUND(96*(LOG(R41)-INT(LOG(R41))),0)<0,ROUND(96*(LOG(R41)-INT(LOG(R41))),0)-1,ROUND(96*(LOG(R41)-INT(LOG(R41))),0))+1)/96))*POWER(10,INT(LOG(R41))-2))/2,INT(0.5+100*POWER(10,(IF(96*(LOG(R41)-INT(LOG(R41)))-ROUND(96*(LOG(R41)-INT(LOG(R41))),0)<0,ROUND(96*(LOG(R41)-INT(LOG(R41))),0)-1,ROUND(96*(LOG(R41)-INT(LOG(R41))),0))+1)/96))*POWER(10,INT(LOG(R41))-2),INT(0.5+100*POWER(10,IF(96*(LOG(R41)-INT(LOG(R41)))-ROUND(96*(LOG(R41)-INT(LOG(R41))),0)<0,ROUND(96*(LOG(R41)-INT(LOG(R41))),0)-1,ROUND(96*(LOG(R41)-INT(LOG(R41))),0))/96))*POWER(10,INT(LOG(R41))-2))","v":24.900000000000002},"kΩ"]
[470,0,0,0,0,0,0,{"$error":"#DIV/0!"},0,0,{"$error":"#VALUE!"},{"$error":"#VALUE!"},{"$error":"#VALUE!"},{"$error":"#VALUE!"}]
[560,0,0,0,0,0,0,{"$error":"#DIV/0!"},0,0,{"$error":"#VALUE!"},{"$error":"#VALUE!"},{"$f":"IF(IF((M$3*10^12-$A44)*(M$3*10^12-$A43)*-1<0,0,1)*IF(ABS(M$3*10^12-$A44)>(M$3*10^12-$A43),$A43,$A44)=M44,0,IF((M$3*10^12-$A44)*(M$3*10^12-$A43)*-1<0,0,1)*IF(ABS(M$3*10^12-$A44)>(M$3*10^12-$A43),$A43,$A44))","v":{"$error":"#VALUE!"}},{"$error":"#VALUE!"}]
[680,0,680,0,0,0,0,{"$error":"#DIV/0!"},0,0,{"$error":"#VALUE!"},{"$error":"#VALUE!"},{"$error":"#VALUE!"},{"$error":"#VALUE!"}]
[{"$f":"A33*10","v":820},0,0,0,0,0,0,{"$error":"#DIV/0!"},0,0,{"$error":"#VALUE!"},{"$error":"#VALUE!"},{"$error":"#VALUE!"},{"$error":"#VALUE!"}]
[1000,0,0,0,0,0,0,{"$error":"#DIV/0!"},0,0,{"$error":"#VALUE!"},{"$error":"#VALUE!"},{"$error":"#VALUE!"},{"$error":"#VALUE!"}]
[1200,0,0,0,0,0,0,{"$error":"#DIV/0!"},0,0,{"$error":"#VALUE!"},{"$error":"#VALUE!"},{"$error":"#VALUE!"},{"$error":"#VALUE!"}]
[1500,0,0,0,0,0,0,{"$error":"#DIV/0!"},0,0,{"$error":"#VALUE!"},{"$error":"#VALUE!"},{"$error":"#VALUE!"},{"$error":"#VALUE!"}]
[1800,0,0,0,0,0,0,{"$error":"#DIV/0!"},0,0,{"$error":"#VALUE!"},{"$error":"#VALUE!"},{"$error":"#VALUE!"},{"$error":"#VALUE!"}]
[2200,0,0,0,0,0,0,{"$error":"#DIV/0!"},0,0,{"$error":"#VALUE!"},{"$error":"#VALUE!"},{"$error":"#VALUE!"},{"$error":"#VALUE!"}]
[2700,0,0,0,0,0,0,{"$error":"#DIV/0!"},0,0,{"$error":"#VALUE!"},{"$error":"#VALUE!"},{"$error":"#VALUE!"},{"$error":"#VALUE!"}]
[3300,0,0,0,0,0,0,{"$error":"#DIV/0!"},0,0,{"$error":"#VALUE!"},{"$error":"#VALUE!"},{"$error":"#VALUE!"},{"$error":"#VALUE!"}]
[3900,0,0,0,0,0,0,{"$error":"#DIV/0!"},0,0,{"$error":"#VALUE!"},{"$error":"#VALUE!"},{"$error":"#VALUE!"},{"$error":"#VALUE!"}]
[4700,0,0,0,0,0,0,{"$error":"#DIV/0!"},0,0,{"$error":"#VALUE!"},{"$error":"#VALUE!"},{"$error":"#VALUE!"},{"$error":"#VALUE!"}]
[5600,0,0,0,0,0,0,{"$error":"#DIV/0!"},0,0,{"$error":"#VALUE!"},{"$error":"#VALUE!"},{"$error":"#VALUE!"},{"$error":"#VALUE!"}]
[6800,0,0,0,0,0,0,{"$error":"#DIV/0!"},0,0,{"$error":"#VALUE!"},{"$error":"#VALUE!"},{"$error":"#VALUE!"},{"$error":"#VALUE!"}]
[8200,0,0,0,0,0,0,{"$error":"#DIV/0!"},0,0,{"$error":"#VALUE!"},{"$error":"#VALUE!"},{"$error":"#VALUE!"},{"$error":"#VALUE!"}]
[10000,0,0,0,0,0,0,{"$error":"#DIV/0!"},0,0,{"$error":"#VALUE!"},{"$error":"#VALUE!"},{"$error":"#VALUE!"},{"$error":"#VALUE!"}]
[12000,0,0,0,0,0,0,{"$error":"#DIV/0!"},0,0,{"$error":"#VALUE!"},{"$error":"#VALUE!"},{"$f":"IF(IF((M$3*10^12-$A60)*(M$3*10^12-$A59)*-1<0,0,1)*IF(ABS(M$3*10^12-$A60)>(M$3*10^12-$A59),$A59,$A60)=M60,0,IF((M$3*10^12-$A60)*(M$3*10^12-$A59)*-1<0,0,1)*IF(ABS(M$3*10^12-$A60)>(M$3*10^12-$A59),$A59,$A60))","v":{"$error":"#VALUE!"}},{"$error":"#VALUE!"}]
[15000,0,0,0,0,0,0,{"$error":"#DIV/0!"},0,0,{"$error":"#VALUE!"},{"$error":"#VALUE!"},{"$error":"#VALUE!"},{"$error":"#VALUE!"}]
[18000,0,0,0,0,0,0,{"$error":"#DIV/0!"},0,0,{"$error":"#VALUE!"},{"$error":"#VALUE!"},{"$error":"#VALUE!"},{"$error":"#VALUE!"}]
[22000,0,0,0,0,0,0,{"$error":"#DIV/0!"},0,0,{"$error":"#VALUE!"},{"$error":"#VALUE!"},{"$error":"#VALUE!"},{"$error":"#VALUE!"}]
[27000,0,0,0,0,0,0,{"$error":"#DIV/0!"},0,0,{"$error":"#VALUE!"},{"$error":"#VALUE!"},{"$error":"#VALUE!"},{"$error":"#VALUE!"}]
[33000,0,0,0,0,0,0,{"$error":"#DIV/0!"},0,0,{"$error":"#VALUE!"},{"$error":"#VALUE!"},{"$error":"#VALUE!"},{"$error":"#VALUE!"}]
[39000,0,0,0,0,0,0,{"$error":"#DIV/0!"},0,0,{"$error":"#VALUE!"},{"$error":"#VALUE!"},{"$error":"#VALUE!"},{"$error":"#VALUE!"}]
[47000,0,0,0,0,0,0,{"$error":"#DIV/0!"},0,0,{"$error":"#VALUE!"},{"$error":"#VALUE!"},{"$error":"#VALUE!"},{"$error":"#VALUE!"}]
[56000,0,0,0,0,0,68000,{"$error":"#DIV/0!"},0,0,{"$error":"#VALUE!"},{"$error":"#VALUE!"},{"$error":"#VALUE!"},{"$error":"#VALUE!"}]
[68000,0,0,0,0,0,0,{"$error":"#DIV/0!"},0,0,{"$error":"#VALUE!"},{"$error":"#VALUE!"},{"$error":"#VALUE!"},{"$error":"#VALUE!"}]
[82000,0,0,0,0,0,0,{"$error":"#DIV/0!"},0,{"$f":"IF(IF((J$3*10^12-$A70)*(J$3*10^12-$A69)*-1<0,0,1)*IF(ABS(J$3*10^12-$A70)>(J$3*10^12-$A69),$A69,$A70)=J70,0,IF((J$3*10^12-$A70)*(J$3*10^12-$A69)*-1<0,0,1)*IF(ABS(J$3*10^12-$A70)>(J$3*10^12-$A69),$A69,$A70))","v":0},{"$error":"#VALUE!"},{"$error":"#VALUE!"},{"$error":"#VALUE!"},{"$error":"#VALUE!"}]
[100000,0,0,{"$f":"IF(IF((D$3*10^12-$A71)*(D$3*10^12-$A70)*-1<0,0,1)*IF(ABS(D$3*10^12-$A71)>(D$3*10^12-$A70),$A70,$A71)=D71,0,IF((D$3*10^12-$A71)*(D$3*10^12-$A70)*-1<0,0,1)*IF(ABS(D$3*10^12-$A71)>(D$3*10^12-$A70),$A70,$A71))","v":0},0,0,0,{"$error":"#DIV/0!"},0,0,{"$error":"#VALUE!"},{"$error":"#VALUE!"},{"$error":"#VALUE!"},{"$error":"#VALUE!"}]
[120000,{"$f":"IF(IF((B$3*10^12-$A72)*(B$3*10^12-$A71)*-1<0,0,1)*IF(ABS(B$3*10^12-$A72)>(B$3*10^12-$A71),$A71,$A72)=B72,0,IF((B$3*10^12-$A72)*(B$3*10^12-$A71)*-1<0,0,1)*IF(ABS(B$3*10^12-$A72)>(B$3*10^12-$A71),$A71,$A72))","v":0},{"$f":"IF(IF((C$3*10^12-$A72)*(C$3*10^12-$A71)*-1<0,0,1)*IF(ABS(C$3*10^12-$A72)>(C$3*10^12-$A71),$A71,$A72)=C72,0,IF((C$3*10^12-$A72)*(C$3*10^12-$A71)*-1<0,0,1)*IF(ABS(C$3*10^12-$A72)>(C$3*10^12-$A71),$A71,$A72))","v":0},0,0,{"$f":"IF(IF((F$3*10^12-$A72)*(F$3*10^12-$A71)*-1<0,0,1)*IF(ABS(F$3*10^12-$A72)>(F$3*10^12-$A71),$A71,$A72)=F72,0,IF((F$3*10^12-$A72)*(F$3*10^12-$A71)*-1<0,0,1)*IF(ABS(F$3*10^12-$A72)>(F$3*10^12-$A71),$A71,$A72))","v":0},{"$f":"IF(IF((G$3*10^12-$A72)*(G$3*10^12-$A71)*-1<0,0,1)*IF(ABS(G$3*10^12-$A72)>(G$3*10^12-$A71),$A71,$A72)=G72,0,IF((G$3*10^12-$A72)*(G$3*10^12-$A71)*-1<0,0,1)*IF(ABS(G$3*10^12-$A72)>(G$3*10^12-$A71),$A71,$A72))","v":0},{"$f":"IF(IF((H$3*10^12-$A72)*(H$3*10^12-$A71)*-1<0,0,1)*IF(ABS(H$3*10^12-$A72)>(H$3*10^12-$A71),$A71,$A72)=H72,0,IF((H$3*10^12-$A72)*(H$3*10^12-$A71)*-1<0,0,1)*IF(ABS(H$3*10^12-$A72)>(H$3*10^12-$A71),$A71,$A72))","v":{"$error":"#DIV/0!"}},{"$f":"IF(IF((I$3*10^12-$A72)*(I$3*10^12-$A71)*-1<0,0,1)*IF(ABS(I$3*10^12-$A72)>(I$3*10^12-$A71),$A71,$A72)=I72,0,IF((I$3*10^12-$A72)*(I$3*10^12-$A71)*-1<0,0,1)*IF(ABS(I$3*10^12-$A72)>(I$3*10^12-$A71),$A71,$A72))","v":0},0,{"$error":"#VALUE!"},{"$error":"#VALUE!"},{"$error":"#VALUE!"},{"$error":"#VALUE!"}]
[150000,0,0,0,0,0,0,{"$error":"#DIV/0!"},0,0,{"$error":"#VALUE!"},{"$error":"#VALUE!"},{"$error":"#VALUE!"},{"$error":"#VALUE!"}]
[180000,0,0,0,0,0,0,{"$error":"#DIV/0!"},0,0,{"$error":"#VALUE!"},{"$error":"#VALUE!"},{"$error":"#VALUE!"},{"$error":"#VALUE!"}]
[220000,0,0,0,0,0,0,{"$error":"#DIV/0!"},0,0,{"$error":"#VALUE!"},{"$error":"#VALUE!"},{"$error":"#VALUE!"},{"$error":"#VALUE!"}]
[270000,0,0,0,0,0,0,{"$error":"#DIV/0!"},0,0,{"$error":"#VALUE!"},{"$error":"#VALUE!"},{"$error":"#VALUE!"},{"$error":"#VALUE!"}]
[330000,0,0,0,0,0,0,{"$error":"#DIV/0!"},0,0,{"$error":"#VALUE!"},{"$error":"#VALUE!"},{"$error":"#VALUE!"},{"$error":"#VALUE!"}]
[390000,0,0,0,0,0,0,{"$error":"#DIV/0!"},0,0,{"$error":"#VALUE!"},{"$error":"#VALUE!"},{"$error":"#VALUE!"},{"$error":"#VALUE!"}]
[470000,0,0,0,0,0,0,{"$error":"#DIV/0!"},0,0,{"$error":"#VALUE!"},{"$error":"#VALUE!"},{"$error":"#VALUE!"},{"$error":"#VALUE!"}]
[560000,0,0,0,0,0,0,{"$error":"#DIV/0!"},0,0,{"$error":"#VALUE!"},{"$error":"#VALUE!"},{"$error":"#VALUE!"},{"$error":"#VALUE!"}]
[680000,0,0,0,0,0,0,{"$error":"#DIV/0!"},0,0,{"$error":"#VALUE!"},{"$error":"#VALUE!"},{"$error":"#VALUE!"},{"$error":"#VALUE!"}]
[820000,0,0,0,0,0,0,{"$error":"#DIV/0!"},0,0,{"$error":"#VALUE!"},{"$error":"#VALUE!"},{"$error":"#VALUE!"},{"$error":"#VALUE!"}]
[1000000,0,0,0,0,0,0,{"$error":"#DIV/0!"},0,0,{"$error":"#VALUE!"},{"$error":"#VALUE!"},{"$error":"#VALUE!"},{"$error":"#VALUE!"}]
[1200000,0,0,0,0,0,0,{"$error":"#DIV/0!"},0,0,{"$error":"#VALUE!"},{"$error":"#VALUE!"},{"$error":"#VALUE!"},{"$error":"#VALUE!"}]
[1500000,0,0,0,0,0,0,{"$error":"#DIV/0!"},0,0,{"$error":"#VALUE!"},{"$error":"#VALUE!"},{"$error":"#VALUE!"},{"$error":"#VALUE!"}]
[1800000,0,0,0,0,0,0,{"$error":"#DIV/0!"},0,0,{"$error":"#VALUE!"},{"$f":"IF(IF((L$3*10^12-$A86)*(L$3*10^12-$A85)*-1<0,0,1)*IF(ABS(L$3*10^12-$A86)>(L$3*10^12-$A85),$A85,$A86)=L86,0,IF((L$3*10^12-$A86)*(L$3*10^12-$A85)*-1<0,0,1)*IF(ABS(L$3*10^12-$A86)>(L$3*10^12-$A85),$A85,$A86))","v":{"$error":"#VALUE!"}},{"$error":"#VALUE!"},{"$error":"#VALUE!"}]
[2200000,0,0,0,0,0,0,{"$error":"#DIV/0!"},0,0,{"$error":"#VALUE!"},{"$error":"#VALUE!"},{"$error":"#VALUE!"},{"$error":"#VALUE!"}]
[2700000,0,0,0,0,0,0,{"$error":"#DIV/0!"},0,0,{"$error":"#VALUE!"},{"$error":"#VALUE!"},{"$error":"#VALUE!"},{"$error":"#VALUE!"}]
[3300000,0,0,0,0,0,0,{"$error":"#DIV/0!"},0,0,{"$error":"#VALUE!"},{"$error":"#VALUE!"},{"$error":"#VALUE!"},{"$error":"#VALUE!"}]
[3900000,0,0,0,0,0,0,{"$error":"#DIV/0!"},0,0,{"$error":"#VALUE!"},{"$error":"#VALUE!"},{"$error":"#VALUE!"},{"$error":"#VALUE!"}]
[4700000,0,0,0,0,0,0,{"$error":"#DIV/0!"},0,0,{"$error":"#VALUE!"},{"$error":"#VALUE!"},{"$error":"#VALUE!"},{"$error":"#VALUE!"}]
[5600000,0,0,0,0,0,0,{"$error":"#DIV/0!"},0,0,{"$error":"#VALUE!"},{"$error":"#VALUE!"},{"$error":"#VALUE!"},{"$error":"#VALUE!"}]
[6800000,0,0,0,0,0,0,{"$error":"#DIV/0!"},0,0,{"$error":"#VALUE!"},{"$error":"#VALUE!"},{"$error":"#VALUE!"},{"$error":"#VALUE!"}]
[8200000,0,0,0,0,0,0,{"$error":"#DIV/0!"},0,0,{"$error":"#VALUE!"},{"$error":"#VALUE!"},{"$error":"#VALUE!"},{"$error":"#VALUE!"}]
[10000000,0,0,0,0,0,0,{"$error":"#DIV/0!"},0,0,{"$error":"#VALUE!"},{"$error":"#VALUE!"},{"$error":"#VALUE!"},{"$error":"#VALUE!"}]
[12000000,0,0,0,0,0,0,{"$error":"#DIV/0!"},0,0,{"$error":"#VALUE!"},{"$error":"#VALUE!"},{"$error":"#VALUE!"},{"$error":"#VALUE!"}]
[15000000,0,0,0,0,0,0,{"$error":"#DIV/0!"},0,0,{"$error":"#VALUE!"},{"$error":"#VALUE!"},{"$error":"#VALUE!"},{"$error":"#VALUE!"}]
[18000000,0,0,0,0,0,0,{"$error":"#DIV/0!"},0,0,{"$error":"#VALUE!"},{"$error":"#VALUE!"},{"$error":"#VALUE!"},{"$error":"#VALUE!"}]
[22000000,0,0,0,0,0,0,{"$error":"#DIV/0!"},0,0,{"$error":"#VALUE!"},{"$error":"#VALUE!"},{"$error":"#VALUE!"},{"$error":"#VALUE!"}]
[{"$f":"A87*10","v":27000000},0,0,0,0,33000000,0,{"$error":"#DIV/0!"},0,0,{"$error":"#VALUE!"},{"$error":"#VALUE!"},{"$error":"#VALUE!"},{"$error":"#VALUE!"}]
[33000000,0,0,0,0,0,0,{"$error":"#DIV/0!"},0,0,{"$error":"#VALUE!"},{"$error":"#VALUE!"},{"$error":"#VALUE!"},{"$error":"#VALUE!"}]
[39000000,0,0,0,0,0,0,{"$error":"#DIV/0!"},0,0,{"$error":"#VALUE!"},{"$error":"#VALUE!"},{"$error":"#VALUE!"},{"$error":"#VALUE!"}]
[47000000,0,0,0,0,0,0,{"$error":"#DIV/0!"},0,0,{"$error":"#VALUE!"},{"$error":"#VALUE!"},{"$error":"#VALUE!"},{"$error":"#VALUE!"}]
[56000000,0,0,0,0,{"$f":"IF(IF((F$3*10^12-$A104)*(F$3*10^12-$A103)*-1<0,0,1)*IF(ABS(F$3*10^12-$A104)>(F$3*10^12-$A103),$A103,$A104)=F104,0,IF((F$3*10^12-$A104)*(F$3*10^12-$A103)*-1<0,0,1)*IF(ABS(F$3*10^12-$A104)>(F$3*10^12-$A103),$A103,$A104))","v":0},{"$f":"IF(IF((G$3*10^12-$A104)*(G$3*10^12-$A103)*-1<0,0,1)*IF(ABS(G$3*10^12-$A104)>(G$3*10^12-$A103),$A103,$A104)=G104,0,IF((G$3*10^12-$A104)*(G$3*10^12-$A103)*-1<0,0,1)*IF(ABS(G$3*10^12-$A104)>(G$3*10^12-$A103),$A103,$A104))","v":0},{"$f":"IF(IF((H$3*10^12-$A104)*(H$3*10^12-$A103)*-1<0,0,1)*IF(ABS(H$3*10^12-$A104)>(H$3*10^12-$A103),$A103,$A104)=H104,0,IF((H$3*10^12-$A104)*(H$3*10^12-$A103)*-1<0,0,1)*IF(ABS(H$3*10^12-$A104)>(H$3*10^12-$A103),$A103,$A104))","v":{"$error":"#DIV/0!"}},{"$f":"IF(IF((I$3*10^12-$A104)*(I$3*10^12-$A103)*-1<0,0,1)*IF(ABS(I$3*10^12-$A104)>(I$3*10^12-$A103),$A103,$A104)=I104,0,IF((I$3*10^12-$A104)*(I$3*10^12-$A103)*-1<0,0,1)*IF(ABS(I$3*10^12-$A104)>(I$3*10^12-$A103),$A103,$A104))","v":0},0,{"$error":"#VALUE!"},{"$error":"#VALUE!"},{"$error":"#VALUE!"},{"$error":"#VALUE!"}]
[68000000,0,0,0,0,0,0,{"$error":"#DIV/0!"},0,0,{"$error":"#VALUE!"},{"$error":"#VALUE!"},{"$error":"#VALUE!"},{"$error":"#VALUE!"}]
[82000000,0,0,0,0,0,0,{"$error":"#DIV/0!"},0,0,{"$error":"#VALUE!"},{"$error":"#VALUE!"},{"$error":"#VALUE!"},{"$error":"#VALUE!"}]
[100000000,0,0,0,0,0,0,{"$error":"#DIV/0!"},0,0,{"$error":"#VALUE!"},{"$error":"#VALUE!"},{"$error":"#VALUE!"},{"$error":"#VALUE!"}]
[120000000,0,0,0,0,0,0,{"$error":"#DIV/0!"},0,0,{"$error":"#VALUE!"},{"$error":"#VALUE!"},{"$error":"#VALUE!"},{"$error":"#VALUE!"}]
[150000000,0,0,0,0,0,0,{"$error":"#DIV/0!"},0,0,{"$error":"#VALUE!"},{"$error":"#VALUE!"},{"$error":"#VALUE!"},{"$error":"#VALUE!"}]
[180000000,0,0,0,0,0,0,{"$error":"#DIV/0!"},0,0,{"$error":"#VALUE!"},{"$error":"#VALUE!"},{"$error":"#VALUE!"},{"$error":"#VALUE!"}]
[220000000,0,0,0,0,0,0,{"$error":"#DIV/0!"},0,0,{"$error":"#VALUE!"},{"$error":"#VALUE!"},{"$error":"#VALUE!"},{"$error":"#VALUE!"}]
[270000000,0,0,0,0,0,0,{"$error":"#DIV/0!"},0,0,{"$error":"#VALUE!"},{"$error":"#VALUE!"},{"$error":"#VALUE!"},{"$error":"#VALUE!"}]
[330000000,0,0,0,0,0,0,{"$error":"#DIV/0!"},0,0,{"$error":"#VALUE!"},{"$error":"#VALUE!"},{"$error":"#VALUE!"},{"$error":"#VALUE!"}]
[390000000,0,0,0,0,0,0,{"$error":"#DIV/0!"},0,0,{"$error":"#VALUE!"},{"$error":"#VALUE!"},{"$error":"#VALUE!"},{"$error":"#VALUE!"}]
[470000000,0,0,0,560000000,0,0,{"$error":"#DIV/0!"},0,0,{"$error":"#VALUE!"},{"$error":"#VALUE!"},{"$error":"#VALUE!"},{"$error":"#VALUE!"}]
[560000000,0,0,0,0,0,0,{"$error":"#DIV/0!"},0,0,{"$error":"#VALUE!"},{"$error":"#VALUE!"},{"$error":"#VALUE!"},{"$error":"#VALUE!"}]
[680000000,0,0,0,0,0,0,{"$error":"#DIV/0!"},0,0,{"$error":"#VALUE!"},{"$error":"#VALUE!"},{"$error":"#VALUE!"},{"$error":"#VALUE!"}]
[820000000,0,0,0,0,0,0,{"$error":"#DIV/0!"},0,0,{"$error":"#VALUE!"},{"$error":"#VALUE!"},{"$error":"#VALUE!"},{"$error":"#VALUE!"}]
[1000000000,0,0,0,0,0,0,{"$error":"#DIV/0!"},0,0,{"$error":"#VALUE!"},{"$error":"#VALUE!"},{"$error":"#VALUE!"},{"$error":"#VALUE!"}]
[1200000000,0,0,0,0,0,0,{"$error":"#DIV/0!"},0,0,{"$error":"#VALUE!"},{"$error":"#VALUE!"},{"$error":"#VALUE!"},{"$error":"#VALUE!"}]
[1500000000,0,0,0,0,0,0,{"$error":"#DIV/0!"},0,0,{"$error":"#VALUE!"},{"$error":"#VALUE!"},{"$error":"#VALUE!"},{"$error":"#VALUE!"}]
[1800000000,0,0,0,0,0,0,{"$error":"#DIV/0!"},0,0,{"$error":"#VALUE!"},{"$error":"#VALUE!"},{"$error":"#VALUE!"},{"$error":"#VALUE!"}]
[2200000000,0,0,0,0,0,0,{"$error":"#DIV/0!"},0,0,{"$error":"#VALUE!"},{"$error":"#VALUE!"},{"$error":"#VALUE!"},{"$error":"#VALUE!"}]
[2700000000,0,0,0,0,0,0,{"$error":"#DIV/0!"},0,0,{"$error":"#VALUE!"},{"$error":"#VALUE!"},{"$error":"#VALUE!"},{"$error":"#VALUE!"}]
[3300000000,0,0,0,0,0,0,{"$error":"#DIV/0!"},0,0,{"$error":"#VALUE!"},{"$error":"#VALUE!"},{"$error":"#VALUE!"},{"$error":"#VALUE!"}]
[3900000000,0,0,0,0,0,0,{"$error":"#DIV/0!"},0,0,{"$error":"#VALUE!"},{"$error":"#VALUE!"},{"$error":"#VALUE!"},{"$error":"#VALUE!"}]
[4700000000,0,0,0,0,0,0,{"$error":"#DIV/0!"},0,0,{"$error":"#VALUE!"},{"$error":"#VALUE!"},{"$error":"#VALUE!"},{"$error":"#VALUE!"}]
[5600000000,0,0,0,0,0,0,{"$error":"#DIV/0!"},0,0,{"$error":"#VALUE!"},{"$error":"#VALUE!"},{"$error":"#VALUE!"},{"$error":"#VALUE!"}]
[6800000000,0,0,0,0,0,0,{"$error":"#DIV/0!"},0,0,{"$error":"#VALUE!"},{"$error":"#VALUE!"},{"$error":"#VALUE!"},{"$error":"#VALUE!"}]
[8200000000,0,0,0,0,0,0,{"$error":"#DIV/0!"},0,0,{"$error":"#VALUE!"},{"$error":"#VALUE!"},{"$error":"#VALUE!"},{"$error":"#VALUE!"}]
[10000000000,0,0,0,0,0,0,{"$error":"#DIV/0!"},0,0,{"$error":"#VALUE!"},{"$error":"#VALUE!"},{"$error":"#VALUE!"},{"$error":"#VALUE!"}]
[12000000000,0,0,0,0,0,0,{"$error":"#DIV/0!"},0,0,{"$error":"#VALUE!"},{"$error":"#VALUE!"},{"$error":"#VALUE!"},{"$error":"#VALUE!"}]
[15000000000,0,0,0,0,0,0,{"$error":"#DIV/0!"},0,0,{"$f":"IF(IF((K$3*10^12-$A133)*(K$3*10^12-$A132)*-1<0,0,1)*IF(ABS(K$3*10^12-$A133)>(K$3*10^12-$A132),$A132,$A133)=K133,0,IF((K$3*10^12-$A133)*(K$3*10^12-$A132)*-1<0,0,1)*IF(ABS(K$3*10^12-$A133)>(K$3*10^12-$A132),$A132,$A133))","v":{"$error":"#VALUE!"}},{"$f":"IF(IF((L$3*10^12-$A133)*(L$3*10^12-$A132)*-1<0,0,1)*IF(ABS(L$3*10^12-$A133)>(L$3*10^12-$A132),$A132,$A133)=L133,0,IF((L$3*10^12-$A133)*(L$3*10^12-$A132)*-1<0,0,1)*IF(ABS(L$3*10^12-$A133)>(L$3*10^12-$A132),$A132,$A133))","v":{"$error":"#VALUE!"}},{"$error":"#VALUE!"},{"$error":"#VALUE!"}]
[18000000000,0,0,0,0,0,0,{"$error":"#DIV/0!"},0,{"$f":"IF(IF((J$3*10^12-$A134)*(J$3*10^12-$A133)*-1<0,0,1)*IF(ABS(J$3*10^12-$A134)>(J$3*10^12-$A133),$A133,$A134)=J134,0,IF((J$3*10^12-$A134)*(J$3*10^12-$A133)*-1<0,0,1)*IF(ABS(J$3*10^12-$A134)>(J$3*10^12-$A133),$A133,$A134))","v":0},{"$error":"#VALUE!"},{"$error":"#VALUE!"},{"$f":"IF(IF((M$3*10^12-$A134)*(M$3*10^12-$A133)*-1<0,0,1)*IF(ABS(M$3*10^12-$A134)>(M$3*10^12-$A133),$A133,$A134)=M134,0,IF((M$3*10^12-$A134)*(M$3*10^12-$A133)*-1<0,0,1)*IF(ABS(M$3*10^12-$A134)>(M$3*10^12-$A133),$A133,$A134))","v":{"$error":"#VALUE!"}},{"$f":"IF(IF((N$3*10^12-$A134)*(N$3*10^12-$A133)*-1<0,0,1)*IF(ABS(N$3*10^12-$A134)>(N$3*10^12-$A133),$A133,$A134)=N134,0,IF((N$3*10^12-$A134)*(N$3*10^12-$A133)*-1<0,0,1)*IF(ABS(N$3*10^12-$A134)>(N$3*10^12-$A133),$A133,$A134))","v":{"$error":"#VALUE!"}}]
[22000000000,0,0,0,{"$f":"IF(IF((E$3*10^12-$A135)*(E$3*10^12-$A134)*-1<0,0,1)*IF(ABS(E$3*10^12-$A135)>(E$3*10^12-$A134),$A134,$A135)=E135,0,IF((E$3*10^12-$A135)*(E$3*10^12-$A134)*-1<0,0,1)*IF(ABS(E$3*10^12-$A135)>(E$3*10^12-$A134),$A134,$A135))","v":0},0,0,{"$error":"#DIV/0!"},0,0,{"$error":"#VALUE!"},{"$error":"#VALUE!"},{"$f":"IF(IF((M$3*10^12-$A135)*(M$3*10^12-$A134)*-1<0,0,1)*IF(ABS(M$3*10^12-$A135)>(M$3*10^12-$A134),$A134,$A135)=M135,0,IF((M$3*10^12-$A135)*(M$3*10^12-$A134)*-1<0,0,1)*IF(ABS(M$3*10^12-$A135)>(M$3*10^12-$A134),$A134,$A135))","v":{"$error":"#VALUE!"}},{"$f":"IF(IF((N$3*10^12-$A135)*(N$3*10^12-$A134)*-1<0,0,1)*IF(ABS(N$3*10^12-$A135)>(N$3*10^12-$A134),$A134,$A135)=N135,0,IF((N$3*10^12-$A135)*(N$3*10^12-$A134)*-1<0,0,1)*IF(ABS(N$3*10^12-$A135)>(N$3*10^12-$A134),$A134,$A135))","v":{"$error":"#VALUE!"}}]
[27000000000,{"$f":"IF(IF((B$3*10^12-$A136)*(B$3*10^12-$A135)*-1<0,0,1)*IF(ABS(B$3*10^12-$A136)>(B$3*10^12-$A135),$A135,$A136)=B136,0,IF((B$3*10^12-$A136)*(B$3*10^12-$A135)*-1<0,0,1)*IF(ABS(B$3*10^12-$A136)>(B$3*10^12-$A135),$A135,$A136))","v":0},{"$f":"IF(IF((C$3*10^12-$A136)*(C$3*10^12-$A135)*-1<0,0,1)*IF(ABS(C$3*10^12-$A136)>(C$3*10^12-$A135),$A135,$A136)=C136,0,IF((C$3*10^12-$A136)*(C$3*10^12-$A135)*-1<0,0,1)*IF(ABS(C$3*10^12-$A136)>(C$3*10^12-$A135),$A135,$A136))","v":0},0,0,0,0,{"$error":"#DIV/0!"},0,0,{"$error":"#VALUE!"},{"$error":"#VALUE!"},{"$error":"#VALUE!"},{"$error":"#VALUE!"}]
[33000000000,0,0,0,0,0,0,{"$error":"#DIV/0!"},0,0,{"$error":"#VALUE!"},{"$error":"#VALUE!"},{"$error":"#VALUE!"},{"$error":"#VALUE!"}]
[39000000000,0,0,0,0,0,0,{"$error":"#DIV/0!"},0,0,{"$error":"#VALUE!"},{"$error":"#VALUE!"},{"$error":"#VALUE!"},{"$error":"#VALUE!"}]
[47000000000,0,0,0,0,0,0,{"$error":"#DIV/0!"},0,0,{"$error":"#VALUE!"},{"$error":"#VALUE!"},{"$error":"#VALUE!"},{"$error":"#VALUE!"}]
[56000000000,0,0,0,0,0,0,{"$error":"#DIV/0!"},0,0,{"$error":"#VALUE!"},{"$error":"#VALUE!"},{"$error":"#VALUE!"},{"$error":"#VALUE!"}]
[68000000000,0,0,0,0,0,0,{"$error":"#DIV/0!"},0,0,{"$error":"#VALUE!"},{"$error":"#VALUE!"},{"$error":"#VALUE!"},{"$error":"#VALUE!"}]
[82000000000,0,0,0,0,0,0,{"$error":"#DIV/0!"},0,0,{"$error":"#VALUE!"},{"$error":"#VALUE!"},{"$error":"#VALUE!"},{"$error":"#VALUE!"}]
[100000000000,0,0,0,0,0,0,{"$error":"#DIV/0!"},0,0,{"$error":"#VALUE!"},{"$error":"#VALUE!"},{"$error":"#VALUE!"},{"$error":"#VALUE!"}]
[120000000000,0,0,0,0,0,0,{"$error":"#DIV/0!"},0,0,{"$error":"#VALUE!"},{"$error":"#VALUE!"},{"$error":"#VALUE!"},{"$error":"#VALUE!"}]
[150000000000,0,0,0,0,0,0,{"$error":"#DIV/0!"},0,0,{"$error":"#VALUE!"},{"$error":"#VALUE!"},{"$error":"#VALUE!"},{"$error":"#VALUE!"}]
[180000000000,0,0,0,0,0,0,{"$error":"#DIV/0!"},0,0,{"$error":"#VALUE!"},{"$error":"#VALUE!"},{"$error":"#VALUE!"},{"$error":"#VALUE!"}]
[220000000000,0,0,0,0,0,0,{"$error":"#DIV/0!"},0,0,{"$error":"#VALUE!"},{"$error":"#VALUE!"},{"$error":"#VALUE!"},{"$error":"#VALUE!"}]
[270000000000,0,0,0,0,0,0,{"$error":"#DIV/0!"},0,0,{"$error":"#VALUE!"},{"$error":"#VALUE!"},{"$error":"#VALUE!"},{"$error":"#VALUE!"}]
[330000000000,0,0,0,0,0,0,{"$error":"#DIV/0!"},0,0,{"$error":"#VALUE!"},{"$error":"#VALUE!"},{"$error":"#VALUE!"},{"$error":"#VALUE!"}]
[390000000000,0,0,0,0,0,0,{"$error":"#DIV/0!"},0,0,{"$error":"#VALUE!"},{"$error":"#VALUE!"},{"$error":"#VALUE!"},{"$error":"#VALUE!"}]
[470000000000,0,0,0,0,0,0,{"$error":"#DIV/0!"},0,0,{"$error":"#VALUE!"},{"$error":"#VALUE!"},{"$error":"#VALUE!"},{"$error":"#VALUE!"}]
[560000000000,0,0,0,0,0,0,{"$error":"#DIV/0!"},0,0,{"$error":"#VALUE!"},{"$error":"#VALUE!"},{"$error":"#VALUE!"},{"$error":"#VALUE!"}]
[680000000000,0,0,0,0,0,0,{"$error":"#DIV/0!"},0,0,{"$error":"#VALUE!"},{"$error":"#VALUE!"},{"$error":"#VALUE!"},{"$error":"#VALUE!"}]
[820000000000,0,0,0,0,0,0,{"$error":"#DIV/0!"},0,0,{"$error":"#VALUE!"},{"$error":"#VALUE!"},{"$error":"#VALUE!"},{"$error":"#VALUE!"}]
[1000000000000,0,0,0,0,0,0,{"$error":"#DIV/0!"},0,0,{"$error":"#VALUE!"},{"$error":"#VALUE!"},{"$error":"#VALUE!"},{"$error":"#VALUE!"}]
[1200000000000,0,0,0,0,0,0,{"$error":"#DIV/0!"},0,0,{"$error":"#VALUE!"},{"$error":"#VALUE!"},{"$error":"#VALUE!"},{"$error":"#VALUE!"}]
[1500000000000,0,0,0,0,0,0,{"$error":"#DIV/0!"},0,0,{"$error":"#VALUE!"},{"$error":"#VALUE!"},{"$error":"#VALUE!"},{"$error":"#VALUE!"}]
[1800000000000,0,0,0,0,0,0,{"$error":"#DIV/0!"},0,0,{"$error":"#VALUE!"},{"$error":"#VALUE!"},{"$error":"#VALUE!"},{"$error":"#VALUE!"}]
[2200000000000,0,0,0,0,0,0,{"$error":"#DIV/0!"},0,0,{"$error":"#VALUE!"},{"$error":"#VALUE!"},{"$error":"#VALUE!"},{"$error":"#VALUE!"}]
[2700000000000,2700000000000,2700000000000,0,2700000000000,2700000000000,2700000000000,{"$error":"#DIV/0!"},2700000000000,2700000000000,{"$error":"#VALUE!"},{"$error":"#VALUE!"},{"$error":"#VALUE!"},{"$error":"#VALUE!"}]

{"sheet":"Snubber","index":13,"n_rows":6,"n_cols":5,"rows_kept":6,"cut":false,"hidden":true,"merged":[]}
[null,null,"UNITS","STD UNITS"]
["Frequency of Ringing",85,"MHz",{"$f":"B2*1000000","v":85000000},"Hz"]
["SW capacitance",3000,"pF",{"$f":"B3*0.000000000001","v":3E-9},"F"]
["Lpar",{"$f":"1000000000*1/((D2*2*3.14159)^2*D3)","v":1.1686430773614742},"nH",{"$f":"B4/1000000000","v":1.1686430773614743E-9},"H"]
["Csnub",{"$f":"4*B3","v":12000},"pF",{"$f":"B5*0.000000000001","v":1.2E-8},"F"]
["Rsnub",{"$f":"SQRT(D4/D3)","v":0.62413755891936573},"Ω",{"$f":"B6","v":0.62413755891936573},"Ω"]

{"sheet":"Parallel Output Caps","index":14,"n_rows":17,"n_cols":5,"rows_kept":17,"cut":false,"hidden":true,"merged":[]}
[]
[]
[]
["Fsw",{"$f":"Fsw","v":2200000}]
[]
["C1",20,"uF",{"$f":"B6/1000000","v":2.0000000000000002E-5},"F"]
["R1",0.5,"mOhms",{"$f":"B7/1000","v":5.0000000000000001E-4},"Ohms"]
[]
["C2",68,"uF",{"$f":"B9/1000000","v":6.7999999999999999E-5},"F"]
["R2",20,"mOhms",{"$f":"B10/1000","v":0.02},"Ohms"]
[]
[]
["I1 ",{"$f":"(D6/(D6+D9))*SQRT((D10*D9*B4)^2+1)/SQRT((((D7+D10)*D6*D9/(D9+D6))*B4)^2+1)","v":0.5881964665933066},"%"]
["I2 ",{"$f":"1-B13","v":0.4118035334066934},"%"]
[]
["I1 ",{"$f":"B13*(Iripple1/(2*SQRT(3)))","v":{"$error":"#NAME?"}},"A"]
["I2 ",{"$f":"B14*(Iripple1/(2*SQRT(3)))","v":{"$error":"#NAME?"}},"A"]