{"text_format":"1","workbook":"xlsx","n_sheets":13,"sheets":["Design the GaN Converter","Schematic & BOM","EVM","Variable Management","GaN FET Parameters","Efficiency Calculations","Schematic Management","Stability Calculations","Bode Plot Management","Efficiency Plot Management","Standard Value Calculator","Snubber","Parallel Output Caps"],"not_rendered":{"charts":7,"images":25,"macros":1,"external_links":1,"defined_names":249,"comments":2,"pivot_tables":0},"unopened":[],"bounds":{"document_bytes":16777216,"sheet_cells":100000,"rows_first":2000,"rows_last":500,"rows_between":2000,"halvings":0,"cell_chars":16384,"cell_head_chars":4096},"cells_cut":0,"cells_raw":0,"read":"whole","date_system":"1900"}

{"sheet":"Design the GaN Converter","index":0,"n_rows":101,"n_cols":17,"rows_kept":101,"cut":false,"hidden":false,"merged":[[2,14,2,15],[0,0,0,16],[59,11,60,16],[61,11,62,16]]}
["                         LMG708B0 80V, 20A GaN Buck Converter Design Tool"]
[null,null,null,null,null,null,null,null,null,null,null,null,null,null,"http://www.ti.com/product/lm5175"]
["About",null,"xx",null,null,"= Input Box",null,null,null,null,null,null,null,null,"TERMS OF USE",null,"                "]
[]
["Step 1: Operating Specifications"]
[null,null,null,"Input Voltage – Min, VIN(min) ",36,"V"]
[null,null,null,"Input Voltage – Nom, VIN(nom)",48,"V"]
[null,null,null,"Input Voltage – Max, VIN(max)",65,"V"]
[null,null,null,"Output Voltage, VOUT ",12,"V"]
[null,null,null,"Full-Load Output Current, IOUT ",20,"A"]
[null,null,null,"Switching Frequency, FSW",400,"kHz"]
[null,null,null,"Frequency Set Resistor, RRT ",{"$f":"'Variable Management'!C436","v":54.9},"kΩ"]
[null,null,null,"Ambient Temperature, TA",25,"°C"]
[]
["Step 2: Current Sense"]
[null,null,null,"Required IOCP Setpoint at VIN(nom)",25,"A"]
[null,null,null,"Recommended Sense Resistance",{"$f":"Rs_ideal*1000","v":1.0942340996855457},"mΩ"]
[null,null,null,"Effective Sense Resistance, RS",1,"mΩ"]
[null,null,null,"Max Power Loss in the Shunt (near OCP)",{"$f":"'Variable Management'!B114","v":0.77764904126631651},"W"]
[null,null,null,"at VIN(min)",{"$f":"Iout_OCP_Vinmin","v":27.858948424457914},"A"]
[null,null,"IOUT(typ) at OCP Inception:","at VIN(nom)",{"$f":"Iout_OCP_Vinnom","v":27.583563235123805},"A"]
[null,null,null,"at VIN(max)",{"$f":"Iout_OCP_Vinmax","v":27.369018483417427},"A"]
[]
["Step 3: Buck Inductor"]
[null,null,null,"Inductance for 30% Ripple Current at VIN(nom)",{"$f":"Lopt*1000000","v":3.75},"µH"]
[null,null,null,"Inductance for Ideal Slope Comp",{"$f":"'Variable Management'!B42*1000000","v":2.666666666666667},"µH"]
[null,null,null,"Buck Inductance, LO ",4.7,"µH"]
[null,null,null,"Inductor DCR at 25°C",3.76,"mΩ"]
[null,null,null,"Slope Comp Ratio Se/Sf",{"$f":"'Variable Management'!B252","v":1.7625},"´"]
[null,null,null,"Inductor Pk-Pk Ripple Current at VIN(nom)",{"$f":"'Variable Management'!B58","v":4.8328735297523906},"APK-PK"]
[null,null,null,"DIL as a % of Full Load at VIN(nom)",{"$f":"'Variable Management'!D58*100","v":24.164367648761953},"%"]
[null,null,null,"Peak Inductor Current at VIN(max) and Full Load",{"$f":"'Variable Management'!B104","v":22.630981516582573},"APK"]
[null,null,null,"Min. Inductor Sat. Current Rating, ILO(SAT)",{"$f":"Ipk_OCP_Vinnom","v":30},"APK"]
[null,null,null,"Estimated Inductor Core Loss at VIN(nom)",0.7,"W"]
[null,null,null,"Total Inductor Loss at Full Load and VIN(nom)",{"$f":"'Variable Management'!B68","v":2.5436915735206598},"W"]
[]
["Step 4: Thermal Performance"]
[null,null,null,"IC Power Dissipation, PD",{"$f":"'Efficiency Calculations'!BF109","v":4.1721853781263842},"W"]
[null,null,null,{"$f":"CHOOSE(MODE, \"High-side FET Power Loss\",\"Low-side FET Power Loss\")","v":"High-side FET Power Loss"},{"$f":"'Efficiency Calculations'!BC109","v":1.5353828849209039},"W"]
[null,null,null,{"$f":"CHOOSE(MODE, \"Total DC/DC Regulator Power Loss\",\"Total Per-phase Power Loss \")","v":"Total DC/DC Regulator Power Loss"},{"$f":"'Efficiency Calculations'!BF109 + 'Variable Management'!B68","v":6.7158769516470436},"W"]
[null,null,null,"IC Effective Thermal Resistance, RqCA",18,"°C/W"]
[null,null,null,"Estimated Case Temperature, TC",{"$f":"'Variable Management'!B379","v":100.09933680627492},"°C"]
[null,null,null,"Estimated Junction Temperature Hotspot, TJ",{"$f":"'Variable Management'!B379","v":100.09933680627492},"°C"]
[null,null,null,null,{"$f":"CHOOSE(Ext_BIAS, IF(OR(Vout>28, Vout<4.6), \"* Tie BIAS to a 5V External Supply\", \"* Tie BIAS to VOUT\"), \"* Tie BIAS to GND\")","v":"* Tie BIAS to VOUT"}]
[]
["Step 5: Output Capacitors"]
[null,null,null,"Desired Output Voltage Ripple",60,"mVPK-PK"]
[null,null,null,"Effective COUT Value to Meet Ripple Spec",{"$f":"'Variable Management'!B137","v":25.171216300793699},"µF"]
[null,null,null,"VOUT Deviation for 50% IOUT Load Step",200,"mV"]
[null,null,null,"Effective COUT Value for Load Transient Spec",{"$f":"'Variable Management'!B142","v":97.916666666666671},"µF"]
[null,null,null,"Output Capacitance (derated), COUT ",130,"µF"]
[null,null,null,"Output Capacitor ESR",5,"mΩ"]
[null,null,null,"Resulting Output Voltage Ripple (max) ",{"$f":"'Variable Management'!B148*1000","v":26.811986288406001},"mVPK-PK"]
[null,null,null,"Output Capacitor RMS Current (max) ",{"$f":"'Variable Management'!B130","v":1.518997886831879},"ARMS"]
[]
["Step 6: Input Capacitors"]
[null,null,null,"Input Voltage Ripple Spec",500,"mVPK-PK"]
[null,null,null,"Minimum Input Capacitance",{"$f":"'Variable Management'!B196","v":22.388811548554166},"µF"]
[null,null,null,"Input Capacitance (derated), CIN ",25,"µF"]
[null,null,null,"Maximum Permitted ESR",{"$f":"'Variable Management'!B200","v":2.3586851261665096},"mΩ"]
[null,null,null,"Input Capacitor ESR",2,"mΩ"]
[null,null,null,"Resulting Input Voltage Ripple (max)",{"$f":"'Variable Management'!B209*1000","v":492.05833412216748},"mVPK-PK"]
[null,null,null,"Input Capacitor RMS Current (max)",{"$f":"'Variable Management'!B166","v":9.4633633658555389},"ARMS"]
[]
["Step 7: Output Voltage Setting"]
[null,null,null,{"$f":"CHOOSE(Fixed_Vout_Setting, \"Upper Feedback Resistance\", \"* Tie FB to AGND for a Fixed 5V Output\", \"* Tie FB to VCC for a Fixed 12V Output\", )","v":"* Tie FB to VCC for a Fixed 12V Output"},100,"kΩ"]
[null,null,null,"Lower Feedback Resistance (E96)",{"$f":"'Variable Management'!B216","v":9.09},{"$f":"IF(Vout=Vref,\"\",\"kΩ\")","v":"kΩ"}]
[null,null,null,"Actual Output Voltage Setpoint",{"$f":"'Variable Management'!B217","v":12.001100110011002},"V"]
[null,null,null,"Feedforward Capacitance, CFF",10,"pF"]
[]
["Step 8: Loop Compensation"]
[null,null,null,"Desired Crossover Freqeuncy",50,{"$f":"\"     kHz \"","v":"     kHz "}]
[]
["Compensation Components"]
[null,"Calculated /","Std Values",null,{"$f":"C75","v":"Std Values"}]
[" RCOMP",{"$f":"Rcea1/1000","v":9.8017690680000005},{"$f":"'Standard Value Calculator'!O30","v":9.76},null,{"$f":"C76","v":9.76},"kΩ"]
[" CCOMP",{"$f":"Cc1ea*1000000000","v":3.2474738421118734},{"$f":"'Standard Value Calculator'!O31","v":3.3000000000000003},null,{"$f":"C77","v":3.3000000000000003},"nF"]
[" CHF",{"$f":"IF(Cc2ea<0, \"N/A\", Cc2ea*1000000000000)","v":61.167356332827474},{"$f":"'Standard Value Calculator'!O32","v":56},null,{"$f":"C78","v":56},"pF"]
[]
["Pole/Zero Frequencies"]
[null,null,null,"Load Pole Frequency, FP-LOAD",{"$f":"Fp_dominant/1000","v":2.4863312147436161},"kHz"]
[null,null,null,"Output Cap ESR Zero Frequency, FZ-ESR",{"$f":"Fesr/1000","v":244.85375888270215},"kHz"]
[null,null,null,"Error Amp Dominant Pole Frequency, FP-EA",{"$f":"Fp1_u","v":1.9192762040715436},"Hz"]
[null,null,null,"Compensator Zero Frequency, FZ-COMP",{"$f":"Fz1_u/1000","v":4.9414724066615854},"kHz"]
[null,null,null,"Compensator Pole Frequency, FP-COMP",{"$f":"Fp2_u/1000","v":214.50892398847071},"kHz"]
[]
["Step 8: VIN UVLO, CNFG, FPWM/SYNC, DRSS"]
[null,null,null,"Desired VIN UVLO Turn-on Threshold",35,"V"]
[null,null,null,"VIN UVLO Upper Resistance, REN1",200,"kΩ"]
[null,null,null,"VIN UVLO Lower Resistance, REN2",{"$f":"Renb_u/1000","v":5.9},{"$f":"IF(Vout=Vref,\"\",\"kΩ\")","v":"kΩ"}]
[null,null,null,"Actual VIN UVLO Turn-On Threshold, VIN(on)",{"$f":"1/E90*(E89+E90)","v":34.898305084745765},"V"]
[null,null,null,"Actual VIN UVLO Turn-Off Threshold, VIN(off)",{"$f":"E91*0.9","v":31.408474576271189},"V"]
[null,null,null,"Configuration Resistor (Primary IC), RCNFG",{"$f":"RCNFG","v":23.7},"kΩ"]
[null,null,null,"* Secondary IC – Tie CNFG to GND"]
[null,null,null,null,{"$f":"CHOOSE(DEMB, \"* Tie FPWM/SYNC to VCC\", \"* Tie FPWM/SYNC to AGND\", \"*Tie a SYNC signal to FPWM/SYNC\")","v":"* Tie FPWM/SYNC to VCC"}]
[null,null,null,null,{"$f":"CHOOSE(DRSS, \"* Tie the RT Resistor to VCC\", \"* Tie the RT Resistor to AGND\")","v":"* Tie the RT Resistor to VCC"}]
[]
["Step 9: CC Loop"]
[null,null,null,"Desired CC Loop Setpoint",30,"A"]
[null,null,null,"IMON Resistance, RIMON",{"$f":"'Variable Management'!B225","v":6.98},"kΩ"]
[null,null,null,"IMON Capacitance, CIMON",{"$f":"'Variable Management'!B229","v":12},"nF"]

{"sheet":"Schematic & BOM","index":1,"n_rows":57,"n_cols":10,"rows_kept":57,"cut":false,"hidden":false,"merged":[[36,3,36,5],[34,3,34,5],[49,3,49,6],[50,3,50,6],[33,3,33,6],[35,3,35,5],[40,3,40,5],[37,3,37,5],[48,3,48,6],[45,3,45,6],[46,3,46,6],[42,3,42,6],[38,3,38,5],[39,3,39,5],[51,3,51,6],[47,3,47,6],[44,3,44,6],[43,3,43,6],[41,3,41,6],[52,0,53,0],[52,9,53,9],[52,3,53,6],[52,2,53,2],[52,1,53,1],[52,7,53,7],[52,8,53,8]]}
[]
[]
[]
[]
[]
[]
[]
[]
[]
[]
[]
[]
[]
[]
[]
[]
[]
[]
[]
[]
[]
[]
[]
[]
[]
[]
[]
[]
[]
[]
[]
[{"$f":"IF(Fsw/1000<1000, \"Vin = \"&VIN_min&\"V to \"&VIN_max&\"V, Vout = \"&Vout&\"V, Iout = \"&Iout&\"A, Fsw = \"&Fsw/1000&\"kHz\", \"VIN = \"&VIN_min&\"V to \"&VIN_max&\"V, VOUT = \"&Vout&\"V, IOUT = \"&Iout&\"A,  Fsw = \"&Fsw/1000000&\"MHz\")","v":"Vin = 36V to 65V, Vout = 12V, Iout = 20A, Fsw = 400kHz"}]
["High-Efficiency GaN Synchronous Buck Converter BOM"]
["Count","Ref Des","Value","Description",null,null,null,"Size","Part Number","MFR"]
[{"$f":"ROUNDUP('Design the GaN Converter'!E59/10,0)","v":3},"CIN",10,{"$f":"C35","v":10},null,null,null,1210,"--","Various"]
[2,"COUT",47,{"$f":"C36","v":47},null,null,null,1210,"--","Various"]
[1,"CVCC",2.2000000000000002,{"$f":"C37","v":2.2000000000000002},null,null,null,"0402","Std","Std"]
[1,"CCOMP",{"$f":"'Design the GaN Converter'!E77","v":3.3000000000000003},{"$f":"C38","v":3.3000000000000003},null,null,null,"0402","Std","Std"]
[1,"CHF",{"$f":"'Design the GaN Converter'!E78","v":56},{"$f":"C39","v":56},null,null,null,"0402","Std","Std"]
[1,"CIMON",{"$f":"'Design the GaN Converter'!E101","v":12},12,null,null,null,"0402","Std","Std"]
[1,"CFF",{"$f":"'Variable Management'!D391","v":10},10,null,null,null,"0402","Std","Std"]
[1,"LO",{"$f":"'Design the GaN Converter'!E27","v":4.7},{"$f":"\"Buck Inductor, \"&Lo*1000000&\"µH, \"&Rdcr*1000&\"mΩ, >\"&ROUNDUP(Ipk_OCP_Vinmin*1.05,0)&\"A\"","v":"Buck Inductor, 4.7µH, 3.76mΩ, >32A"},null,null,null,"--","--","Various"]
[1,"RS",{"$f":"'Design the GaN Converter'!E18","v":1},{"$f":"C43","v":1},null,null,null,"0508","--","Various"]
[1,"RRT",{"$f":"'Design the GaN Converter'!E12","v":54.9},{"$f":"C44","v":54.9},null,null,null,"0402","Std","Std"]
[1,"RCOMP",{"$f":"'Design the GaN Converter'!E76","v":9.76},{"$f":"C45","v":9.76},null,null,null,"0402","Std","Std"]
[1,"RCNFG",{"$f":"RCNFG","v":23.7},{"$f":"C46","v":23.7},null,null,null,"0402","Std","Std"]
[1,"RIMON",{"$f":"'Variable Management'!B225","v":6.98},{"$f":"C47","v":6.98},null,null,null,"0402","Std","Std"]
[1,"RFB1",{"$f":"'Variable Management'!B215","v":100},{"$f":"C48","v":100},null,null,null,"0402","Std","Std"]
[1,"RFB2",{"$f":"'Variable Management'!B216","v":9.09},{"$f":"C49","v":9.09},null,null,null,"0402","Std","Std"]
[1,"RUV1",{"$f":"'Variable Management'!D393","v":200},{"$f":"C50","v":200},null,null,null,"0402","Std","Std"]
[1,"RUV2",{"$f":"'Variable Management'!D394","v":5.9},5.9,null,null,null,"0402","Std","Std"]
[1,"RPGOOD",100,100,null,null,null,"0402","Std","Std"]
[1,"U1",{"$f":"'Variable Management'!N18","v":"LMG708B0"},{"$f":"CHOOSE(GPN, \"IC, LMG708B0 GaN Synchronous Buck Converter, 5V–80V Input, 20A Output\", \"IC, LM63440-Q1 Synchronous Buck DC/DC Converter, 3V–36V Input, 4A Output\", \"IC, LM64460-Q1 Synchronous Buck DC/DC Converter, 3V–36V Input, 6A Output\", \"IC, LM64440-Q1 Synchronous Buck DC/DC Converter, 3V–36V Input, 4A Output\")","v":"IC, LMG708B0 GaN Synchronous Buck Converter, 5V–80V Input, 20A Output"},null,null,null,"eQFN-22",{"$f":"CHOOSE(GPN, \"LMG708B0VBTR\", \"LM63440AASQRYFTQ1\", \"LM64460APPQRYFRQ1\", \"LM64460BPPQRYFRQ1\", \"LM64460CPPQRYFRQ1\", \"LM64440APPQRYFRQ1\", \"LM64440BPPQRYFRQ1\", \"LM64440CPPQRYFRQ1\")","v":"LMG708B0VBTR"},"TI"]
[]
[]
["NOTES:"]
["** Effective input and output capacitances should be appropriately derated for applied voltage and temperature, particularly with ceramics **"]

{"sheet":"EVM","index":2,"n_rows":3,"n_cols":2,"rows_kept":3,"cut":false,"hidden":false,"merged":[]}
["LMG708B0 GaN Converter Design Tool"]
[]
[null,"LMG708B0-EVM12V (SR148) PCB Layout"]

{"sheet":"Variable Management","index":3,"n_rows":441,"n_cols":27,"rows_kept":441,"cut":false,"hidden":true,"merged":[[4,4,4,7],[0,0,0,8]]}
["EXCEL Variables Names/Calculations"]
[null,"Input from user ="]
[null,"Output ="]
[null,"Constant"]
["Variable Name","Value","STD Units",null,"Notes",null,null,null,"Iteration"]
["Step 1: Operational Specs"]
["VIN_min",{"$f":"'Design the GaN Converter'!E6","v":36},"V","Minimum input voltage",null,null,null,null,1]
["VIN_nom",{"$f":"'Design the GaN Converter'!E7","v":48},"V","Nominal input voltage",null,null,null,null,null,null,"Use CFF",1,null,"5Vout",{"$f":"IF(Vout = 5, 1, 0)","v":0},null,null,null,null,"Single phase",1,null,"FPWM mode",1,null,{"$f":"CHOOSE(SCH_MODE, \"Bode Plot (Ch1)\", \"Bode Plot - 2 Ph\", \"Bode Plot - 3 Ph\", \"Bode Plot - 4 Ph\")","v":"Bode Plot (Ch1)"},1]
["VIN_max",{"$f":"'Design the GaN Converter'!E8","v":65},"V","Maximum input voltage",null,null,null,null,null,null,"No CFF",2,null,"12Vout",{"$f":"IF(Vout = 12, 1, 0)","v":1},null,null,null,null,"Two phases",2,null,"PFM mode",2,null,{"$f":"IF(MODE=1, \"Bode Plot (Ch2)\", \"N/A - Do Not Use\")","v":"Bode Plot (Ch2)"},2]
[null,null,null,null,null,null,null,null,null,null,null,2,null,"ADJ",{"$f":"IF(Vout=5, 0, IF(Vout=12, 0, 1))","v":0},null,null,null,null,"Three phases",3,null,"External SYNC",3,null,"BODE_PLOT_TYPE",1]
["Vout",{"$f":"'Design the GaN Converter'!E9","v":12},"V","Output voltage",null,null,null,null,null,null,"NO_FF_CAP",{"$f":"IF(L10=2, TRUE, FALSE)","v":true},null,"FIXED_VOUT_SETTING",{"$f":"IF(Vout=5, 2, IF(Vout=12, 3, 1))","v":3},"1 = ADJ, 2 = 5V, 3 = 12V",null,null,null,"Four phases",4,null,"FPWM/DEM",1]
["Iout",{"$f":"'Design the GaN Converter'!E10","v":20},"A","Output current",null,"Iout-max",{"$f":"Number_of_Phases*20","v":20},"A",1,null,null,null,null,null,{"$f":"OR(O8,O9)","v":true},null,null,null,null,"Five phases",5]
[null,null,null,null,null,null,null,null,1,null,null,null,null,null,null,null,null,null,null,"Six phases",6,null,"BIAS connected",1,null,"Shunt current sensing",1]
["Rout",{"$f":"Vout/Iout","v":0.6},"W","Load resistance",null,null,null,null,null,null,null,null,null,"LM63460-Q1 - 6A Out",1,null,null,null,null,"Seven phases",7,null,"No BIAS",2,null,"Inductor DCR current sensing",2]
["Pout",{"$f":"Vout*Iout","v":240},"W","Output power",null,null,null,null,null,null,null,null,null,"LM63440-Q1 - 4A Out",2,null,null,null,null,"Eight Phases",8,null,"Ext_VCC",1,null,"SENSING_TYPE",1]
[null,null,null,null,null,null,null,null,null,null,null,null,null,"LM64460-Q1 - 6A Out",3,null,null,null,null,"SCH_MODE",1,null,null,null,null,null,{"$f":"SENSING_TYPE","v":1}]
["Efficiency",0.9,null,"Estimate of efficiency",null,null,null,null,null,null,null,null,null,"LM64440-Q1 - 4A Out",4,null,null,null,null,"MODE (Single / multiphase), SINGLE = 1, MULTI = 2",{"$f":"IF(U16=1, 1, 2)","v":1}]
["Pin",{"$f":"Pout/Efficiency","v":266.66666666666669},"W","Calculate input power assuming finite efficiency",null,null,null,null,null,null,null,"GPN",null,{"$f":"CHOOSE(GPN, \"LMG708B0\", \"LMG708B0-Q1\", \"LM64460-Q1\", \"LM64440-Q1\")","v":"LMG708B0"},1,null,null,null,null,"SINGLE PHASE",{"$f":"IF(U16=1, TRUE, FALSE)","v":true}]
[null,null,null,null,null,null,null,null,null,null,null,null,null,null,null,null,null,null,null,"Number of Phases",{"$f":"SCH_MODE","v":1},null,null,null,null,"DRSS on",1]
["Iin_Vinmin",{"$f":"Pin/VIN_min","v":7.4074074074074083},"A",null,null,null,null,null,null,null,null,null,null,null,null,null,null,null,null,null,null,null,null,null,null,"DRSS off",2]
["Iin_Vinnom",{"$f":"Pin/VIN_nom","v":5.5555555555555562},"A","Input currents at min, nom, max Vin",null,null,null,{"$f":"AND(OSC=1, OR(Fsw/1000>2530, Fsw/1000<1800))","v":{"$error":"#NAME?"}},null,null,null,"VARIANT",null,{"$f":"CHOOSE(VARIANT, \"LMG708B0 Adj Vout\",  \"LMG708B0 5V out\", \"LMG708B0 12V out\", \"LMG708B0 Adj Vout, CC\",  \"LMG708B0 5V out, CC\", \"LMG708B0 12V out, CC\")","v":"LMG708B0 12V out, CC"},{"$f":"IF(CC_LOOP, CHOOSE(Fixed_Vout_Setting, \"4\", \"5\", \"6\"), CHOOSE(Fixed_Vout_Setting, \"1\", \"2\", \"3\"))","v":"6"},null,null,null,null,null,null,null,null,null,null,"DRSS",1]
["Iin_Vinmax",{"$f":"Pin/VIN_max","v":4.1025641025641031},"A",null,null,null,null,{"$f":"AND(OSC=2, OR(Fsw/1000>500, Fsw/1000<300))","v":{"$error":"#NAME?"}}]
[null,null,null,null,null,null,null,{"$f":"OR(H21,H22)","v":{"$error":"#NAME?"}},null,null,null,null,null,null,null,null,null,null,null,"MODE",{"$f":"MODE","v":1}]
["Fsw",{"$f":"'Design the GaN Converter'!E11*1000","v":400000},"Hz","Nominal switching frequency - determines RT resistor"]
["RT resistor to AGND",{"$f":"22/(Fsw/1000000)-0.5233","v":54.476700000000001},"kΩ",null,null,null,null,null,1,null,null,null,null,null,null,null,null,null,null,null,null,null,null,null,null,"CC loop – not required",1]
["Tsw",{"$f":"1/Fsw","v":2.5000000000000002E-6},"sec","Switching period",null,null,null,null,null,null,null,null,null,null,null,null,null,null,null,null,null,null,null,null,null,"CC loop – required",2]
["Max crossover frequency = 20% Fsw",{"$f":"Fsw*0.2/1000","v":80},"kHz",null,null,"Min Crossover",10,null,null,null,"Adjustable",1,null,null,null,null,null,null,null,null,null,null,null,null,null,"CC_LOOP",2]
["Vref",1,"V","Reference voltage",null,null,null,null,null,null,"5V",2,null,null,null,null,null,null,null,"Slope comp – 11.25mV",1,null,null,null,null,null,{"$f":"OR(AA27=2,0)","v":true}]
["Rt",{"$f":"'Standard Value Calculator'!O12/1000","v":54.9},"kΩ","Frequency set resistor",null,{"$f":"IF(OR((Fsw=440000),(Fsw=2200000)),\"N/A\",Rfadj/1000)","v":5.4899999999999997E-2},null,null,null,null,"3.3V",3,null,null,null,null,null,null,null,"Slope comp – 22.5mV",2]
[null,null,null,null,null,null,null,null,null,null,"Adjustable_NoRT",4,null,null,null,null,null,null,null,"Slope comp level",1]
[null,null,null,null,null,null,null,null,null,null,"5V_NoRT",5]
[null,null,null,null,null,null,null,null,null,null,"3.3V_NoRT",6]
["Step 2: Buck Inductor","Channel 1",null,null,null,null,null,null,null,null,"Schematic setting",{"$f":"IF(No_RT, IF(Vout=3.3, 6, IF(Vout=5, 5, 4)),IF(Vout=3.3, 3, IF(Vout=5, 2, 1)))","v":{"$error":"#NAME?"}}]
["Don1",{"$f":"Vout/VIN_nom","v":0.25},null,null,null,"Ideal Duty Cycle at VIN(nom)"]
["Doff1",{"$f":"1-34:34","v":0.75},null,null,null,"Ideal 1- Duty Cycle at VIN(nom)"]
[]
["D_Vinmin",{"$f":"Vout/VIN_min","v":0.33333333333333331},null,{"$f":"Vout","v":12}]
["D_Vinnom",{"$f":"Vout/VIN_nom","v":0.25}]
["D_Vinmax",{"$f":"Vout/VIN_max","v":0.18461538461538463}]
[]
["L_Vinnom",{"$f":"(VIN_nom-Vout)*D1_Vinnom/(Fsw*Iout/Number_of_Phases*30%)","v":3.7500000000000001E-6},"H",{"$f":"D1_Vinnom","v":0.25},null,"Calculated inductance for 35% ripple at VIN(nom)"]
["L_slopecomp",{"$f":"Vout/Se_ext","v":2.6666666666666668E-6},"H",{"$f":"1000*Vout*Rs/Fsw/11.25","v":2.6666666666666668E-6},null,"Calculated inductance based on ideal slope comp of one times inductor downslope"]
[]
["Lopt",{"$f":"B41","v":3.7500000000000001E-6},"H",null,null,"Min of calculated inductances at VIN(min) and VIN(nom)"]
[]
["Lo",{"$f":"'Design the GaN Converter'!E27*0.000001","v":4.6999999999999999E-6},"H",null,null,"Chosen inductance"]
["Rdcr",{"$f":"'Design the GaN Converter'!E28/1000","v":3.7599999999999999E-3},"W",null,null,"Chosen inductor DCR"]
[]
["Don2",{"$f":"(Vout+Iout*(Rdcr+Rs+Rdson2))/(Vin+Iout*(Rdson2-Rdson1))","v":0.25373042206107799}]
["Doff2",{"$f":"1-_Don2","v":0.74626957793892201}]
[]
["D_Vinmin_2",{"$f":"(Vout+Iout/Number_of_Phases*(Rdcr+Rs+Rdson2))/(VIN_min+Iout/Number_of_Phases*(Rdson2-Rdson1))","v":0.33840827832324355},null,{"$f":"Vout/VIN_min","v":0.33333333333333331},null,"Duty cycles adjusted for DCR/Rdson voltage drops"]
["D_Vinnom_2",{"$f":"(Vout+Iout*(Rdcr+Rs+Rdson2))/(VIN_nom+Iout*(Rdson2-Rdson1))","v":0.25373042206107799},null,{"$f":"Vout/VIN_nom","v":0.25}]
["D_Vinmax_2",{"$f":"(Vout+Iout*(Rdcr+Rs+Rdson2))/(VIN_max+Iout*(Rdson2-Rdson1))","v":0.1873262697930817},null,{"$f":"Vout/VIN_max","v":0.18461538461538463},null,{"$f":"(Ts-0.000000085)/Ts","v":0.96599999999999997},"Dmax = [Ts-toff(min)]/Ts"]
[]
[]
["Iripple_Vinmin",{"$f":"(VIN_min-Vout-Iout/Number_of_Phases*(Rdcr+Rs+Rdson1))*D1_Vinmin_2/(Fsw*Lo)","v":4.2821031510841712},"A",{"$f":"B57/Iout*Number_of_Phases","v":0.21410515755420856},null,"Ripple calculations include DCR and Rdson"]
["Iripple_Vinnom",{"$f":"(VIN_nom-Vout-Iout/Number_of_Phases*(Rdcr+Rdson1))*D1_Vinnom_2/(Fsw*Lo)","v":4.8328735297523906},"A",{"$f":"B58/Iout*Number_of_Phases","v":0.24164367648761953},null,"% ripple current at Vin-nom"]
["Iripple_Vinmax",{"$f":"(VIN_max-Vout-Iout/Number_of_Phases*(Rdcr+Rdson1))*D1_Vinmax_2/(Fsw*Lo)","v":5.2619630331651477},"A",{"$f":"B59/Iout*Number_of_Phases","v":0.2630981516582574},null,"Max inductor ripple current - it's at Vin-max"]
[]
["Iinductor_rms_Vinmin",{"$f":"SQRT((Iout/Number_of_Phases)^2+(Iripple_Vinmin^2)/12)","v":20.038164435639068},"A"]
["Iinductor_rms_Vinnom",{"$f":"SQRT((Iout/Number_of_Phases)^2+(Iripple_Vinnom^2)/12)","v":20.048600671357303},"A"]
["Iinudctor_rms_Vinmax",{"$f":"SQRT((Iout/Number_of_Phases)^2+(Iripple_Vinmax^2)/12)","v":20.057600917861532},"A"]
[]
[]
["Core loss estimate - Vin(nom)",{"$f":"'Design the GaN Converter'!E34","v":0.7},"W"]
["Copper loss at full load",{"$f":"'Efficiency Calculations'!S109","v":1.5113123218551214},"W",{"$f":"Core_Loss+B67","v":2.2113123218551216},"W","Copper + core loss at 25°C"]
["Total inductor loss at full load",{"$f":"'Efficiency Calculations'!U109","v":2.5436915735206598},"W",{"$f":"B68","v":2.5436915735206598},"W","Total loss including effect of the DCR tempco"]
[null,null,null,{"$f":"D68-D67","v":0.33237925166553817},"W","Impact of DCR tempco"]
["Inductor copper temperature",125,"°C"]
["Inductor DCR at hot",{"$f":"Rdcr*(1+Ltc*(B70-25))*1000","v":5.2376800000000001},"mW"]
[]
[]
["Step 2b: Sense Resistors, Slope Comp, Current Limit"]
[]
["Iout per phase",{"$f":"Iout/Number_of_Phases","v":20},"A"]
["Ilimit_DC",{"$f":"'Design the GaN Converter'!E16","v":25},"A"]
[]
["Current limit setpoint - peak - Vin(min)",{"$f":"Ilimit_DC/Number_of_Phases+Iripple_Vinmin/2","v":27.141051575542086},"A"]
["Current limit setpoint - peak - Vin(nom)",{"$f":"Ilimit_DC/Number_of_Phases+Iripple_Vinnom/2","v":27.416436764876195},"A"]
["Current limit setpoint - peak - Vin(max)",{"$f":"Ilimit_DC/Number_of_Phases+Iripple_Vinmax/2","v":27.630981516582573},"A",null,null,"Peak inductor current at desired current limit inception"]
[]
["Ilimit_inductor_Vinmin",{"$f":"Ipk_OCP_Vinmin","v":30},"A"]
["Ilimit_inductor_Vinnom",{"$f":"Ipk_OCP_Vinnom","v":30},"A"]
["Ilimit_inductor_Vinmax",{"$f":"Ipk_OCP_Vinmax","v":30},"A"]
[]
["CS threshold_min",2.7E-2,"V"]
["CS threshold_nom",0.03,"V"]
["CS threshold_max",3.3000000000000002E-2,"V"]
[]
["Shunt required to get OCP at VIN(min)",{"$f":"CS_threshold_nom/B79","v":1.1053366858870799E-3},"W",{"$f":"B91*1000","v":1.1053366858870799},"mΩ"]
["Shunt required to get OCP at VIN(nom)",{"$f":"CS_threshold_nom/B80","v":1.0942340996855458E-3},"W",{"$f":"B92*1000","v":1.0942340996855457},"mΩ"]
["Shunt required to get OCP at VIN(max)",{"$f":"CS_threshold_nom/B81","v":1.0857377607811605E-3},"W",1.0857377607811605,"mΩ"]
[]
["Rs_ideal",{"$f":"B92","v":1.0942340996855458E-3},"W",{"$f":"SENSING_TYPE","v":1},{"$f":"'Design the GaN Converter'!E18","v":1}]
["Rs",{"$f":"'Design the GaN Converter'!E18/1000","v":1E-3},"W"]
[]
["Iout_OCP_Vinmin",{"$f":"Number_of_Phases*(CS_threshold_nom/Rs-Iripple_Vinmin/2)","v":27.858948424457914},"A"]
["Iout_OCP_Vinnom",{"$f":"Number_of_Phases*(CS_threshold_nom/Rs-Iripple_Vinnom/2)","v":27.583563235123805},"A"]
["Iout_OCP_Vinmax",{"$f":"Number_of_Phases*(CS_threshold_nom/Rs-Iripple_Vinmax/2)","v":27.369018483417427},"A"]
[]
["Ipk_full-load_Vinmin",{"$f":"Iout/Number_of_Phases+Iripple_Vinmin/2","v":22.141051575542086},"A",null,"Current limit setpoints (i.e. IOUT) assuming no CS delay"]
["Ipk_full-load_Vinnom",{"$f":"Iout/Number_of_Phases+Iripple_Vinnom/2","v":22.416436764876195},"A"]
["Ipk_full-load_Vinmax",{"$f":"Iout/Number_of_Phases+Iripple_Vinmax/2","v":22.630981516582573},"A"]
[]
["Ipk_OCP_Vinmin",{"$f":"CS_threshold_nom/Rs","v":30},"A",null,"Current limit setpoints (i.e. IPK) assuming no CS delay"]
["Ipk_OCP_Vinnom",{"$f":"CS_threshold_nom/Rs","v":30},"A"]
["Ipk_OCP_Vinmax",{"$f":"CS_threshold_nom/Rs","v":30},"A"]
[]
["Irms_OCP_Vinmin",{"$f":"SQRT((Iout_OCP_Vinmin/Number_of_Phases)^2+(Iripple_Vinmin^2)/12)","v":27.886359412198583},"A"]
["Irms_OCP_Vinnom",{"$f":"SQRT((Iout_OCP_Vinnom/Number_of_Phases)^2+(Iripple_Vinnom^2)/12)","v":27.618822379414041},"A"]
["Irms_OCP_Vinmax",{"$f":"SQRT((Iout_OCP_Vinmax/Number_of_Phases)^2+(Iripple_Vinmax^2)/12)","v":27.411138745514467},"A"]
[]
["Pshunt_Vinmin",{"$f":"B110^2*Rs","v":0.77764904126631651},"W"]
["Pshunt_Vinnom",{"$f":"B111^2*Rs","v":0.7627993496256219},"W"]
["Pshunt_Vinmax",{"$f":"B112^2*Rs","v":0.75137052732584453},"W"]
[]
[]
[]
["Step 3: Output Capacitor"]
[]
["Number of phases",{"$f":"Number_of_Phases","v":1}]
["Ripple current normalization factor at Vin-min",{"$f":"Number_of_Phases*((D1_Vinmin_2-m_Vin_min/Number_of_Phases)*(((m_Vin_min+1)/Number_of_Phases)-D1_Vinmin_2))/((1-D1_Vinmin_2)*D1_Vinmin_2)","v":1}]
["Ripple current normalization factor at Vin-nom",{"$f":"Number_of_Phases*((D1_Vinnom_2-m_Vin_nom/Number_of_Phases)*(((m_Vin_nom+1)/Number_of_Phases)-D1_Vinnom_2))/((1-D1_Vinnom_2)*D1_Vinnom_2)","v":1}]
["Ripple current normalization factor at Vin-max",{"$f":"Number_of_Phases*((D1_Vinmax_2-m_Vin_max/Number_of_Phases)*(((m_Vin_max+1)/Number_of_Phases)-D1_Vinmax_2))/((1-D1_Vinmax_2)*D1_Vinmax_2)","v":1}]
[]
["Icoutrms_VINmin",{"$f":"Iripple_Vinmin*B123/SQRT(12)","v":1.2361367034880955},"A",null,null,"Output cap RMS current"]
["Icoutrms_VINnom",{"$f":"Iripple_Vinnom*B124/SQRT(12)","v":1.3951304166809799},"A"]
["Icoutrms_VINmax",{"$f":"Iripple_Vinmax*B125/SQRT(12)","v":1.518997886831879},"A"]
["Max RMS current in Cout",{"$f":"MAX(B127:B129)","v":1.518997886831879},"A"]
[]
["Vripple1",{"$f":"'Design the GaN Converter'!E47/1000","v":0.06},"V",null,null,"Output voltage ripple spec(pk-pk)"]
[]
["Output Ripple Spec (pk-pk)",{"$f":"Vo1_ripple*1000","v":60},"mV",null,null,"Vout ripple spec at Vin(nom)"]
[]
["Coutmin",{"$f":"Iripple_Vinnom*B124/(Fsw*Number_of_Phases*8*Vo1_ripple)","v":2.5171216300793699E-5},"F",null,null,"Minimum output capacitnace",null,{"$f":"Vo2_ripple","v":0},1]
["Reported Coutmin",{"$f":"IF(Cout_min*1000000<2, 2.2,Cout_min*1000000)","v":25.171216300793699},"uF"]
["Load transient deviation",{"$f":"'Design the GaN Converter'!E49/1000","v":0.2},"V"]
["Current step for load transient",{"$f":"Iout/2","v":10},"A"]
["Inductor current slope for load-on transient",{"$f":"(VIN_nom-Vout)/Lo/1000000","v":7.6595744680851068},"A/µs"]
["Inductor current slope for load-off transient",{"$f":"Vout/Lo/1000000","v":2.5531914893617018},"A/µs",null,null,"Take the min of the IL on/off slew rates - this will be the load off for D < 50%, load on for D > 50%"]
["Cout for load transient",{"$f":"0.5*(B139/Number_of_Phases)^2/MIN(B140,B141)/B138*Number_of_Phases","v":97.916666666666671},"uF"]
["Cout",{"$f":"'Design the GaN Converter'!E51/1000000","v":1.2999999999999999E-4},"F",null,null,"Chosen output capacitance",null,null,1]
["Resrmax",{"$f":"SQRT((Vo1_ripple/(Iripple_Vinnom*B124))^2-(1/(Fsw*Number_of_Phases*Cout*8))^2)","v":1.2180029027523126E-2},"W",null,null,"Max ESR before ripple exceeds Vripple1",null,null,1]
[]
["Reported Cout ESR max",{"$f":"IF(OR(CoutEsrMax>0.3, CoutEsrMax<0, (ISERROR(CoutEsrMax))), \"N/A\", CoutEsrMax*1000)","v":12.180029027523126},"mΩ"]
["CoutEsr",{"$f":"'Design the GaN Converter'!E52/1000","v":5.0000000000000001E-3},"W",null,null,"Chosen ESR",null,null,1,null,{"$f":"ISERROR(CoutEsrMax)","v":false},{"$f":"ISERROR(B146)","v":false}]
["Vripple",{"$f":"Iripple_Vinnom*B124*SQRT(Cout_ESR^2+(1/(8*Fsw*Number_of_Phases*Cout))^2)","v":2.6811986288406E-2},"Vp-p",null,null,null,null,null,null,null,null,{"$f":"OR(CoutEsrMax>0.3,CoutEsrMax<0)","v":false}]
[null,null,null,null,null,null,null,null,null,null,{"$f":"OR(TRUE, FALSE, TRUE)","v":true}]
["Step 4: Input Capacitor"]
[]
["Duty cycle at Vin-min",{"$f":"D1_Vinmin_2","v":0.33840827832324355}]
["Duty cycle at Vin-nom",{"$f":"D1_Vinnom_2","v":0.25373042206107799}]
["Duty cycle at Vin-max",{"$f":"D1_Vinmax_2","v":0.1873262697930817}]
["Number of phases",{"$f":"Number_of_Phases","v":1}]
["Floor(N*D) at Vin-min",{"$f":"FLOOR(Number_of_Phases*D1_Vinmin, 1)","v":0}]
["Floor(N*D) at Vin-nom",{"$f":"FLOOR(Number_of_Phases*D1_Vinnom, 1)","v":0},null,null,{"$f":"Number_of_Phases*D1_Vinnom","v":0.25},"N*D",{"$f":"FLOOR(Number_of_Phases*D1_Vinnom,1)","v":0},"floor(N*D)"]
["Floor(N*D) at Vin-max",{"$f":"FLOOR(Number_of_Phases*D1_Vinmax, 1)","v":0}]
[]
["Icinrms_VINmin",{"$f":"Iout*SQRT((D1_Vinmin_2-m_Vin_min/Number_of_Phases)*(((m_Vin_min+1)/Number_of_Phases)-D1_Vinmin_2))","v":9.4633633658555389},"ARMS","Calculate input cap rms current",null,null,null,null,null,null,null,null,null,"A"]
["Icinrms_VINnom",{"$f":"Iout*SQRT((D1_Vinnom_2-m_Vin_nom/Number_of_Phases)*(((m_Vin_nom+1)/Number_of_Phases)-D1_Vinnom_2))","v":8.7029028486312594},"ARMS"]
["Icinrms_VINmax",{"$f":"Iout*SQRT((D1_Vinmax_2-m_Vin_max/Number_of_Phases)*(((m_Vin_max+1)/Number_of_Phases)-D1_Vinmax_2))","v":7.8034643188391986},"ARMS"]
["Max RMS current in Cin",{"$f":"MAX(B160:B162)","v":9.4633633658555389},"ARMS"]
["Dcrit values",{"$f":"1/(2*Number_of_Phases)","v":0.5},{"$f":"3/(2*Number_of_Phases)","v":1.5}]
["Icinrms - max at Dcrit",{"$f":"Iout/(2*Number_of_Phases)","v":10},"ARMS"]
["Final result",{"$f":"IF(D1_Vinmin<0.5, B163, B165)","v":9.4633633658555389},"ARMS"]
[]
[]
["Vinripple1",{"$f":"'Design the GaN Converter'!E57/1000","v":0.5},"Vp-p",null,null,"Input voltage ripple spec (pk-pk)"]
[]
["Cinmin_Vinmin",{"$f":"Iout*D1_Vinmin_2*(1-D1_Vinmin_2)/(Vinripple1*Fsw)","v":2.2388811548554168E-5},"F","Single phase",null,"Calculate cap at Vinmin and 50% duty cycle (Vin = 2*Vout)"]
["Cinmin_Vinnom",{"$f":"Iout*D1_Vinnom_2*(1-D1_Vinnom_2)/(Vinripple1*Fsw)","v":1.8935129498178522E-5},"F"]
["Cinmin_Vinmax",{"$f":"Iout*D1_Vinmax_2*(1-D1_Vinmax_2)/(Vinripple1*Fsw)","v":1.5223513843849126E-5},"F",{"$f":"D1_Vinmin_2","v":0.33840827832324355}]
["Cinmin_50%D",{"$f":"Iout*0.5*(1-0.5)/(Vinripple1*Fsw)","v":2.5000000000000001E-5},"F",null,null,"Buck 50% typically worst case"]
["Cinmin",{"$f":"IF(D1_Vinmin<0.5, B171, B174)","v":2.2388811548554168E-5},"F",{"$f":"D1_Vinmin_2","v":0.33840827832324355}]
["Reported Cinmin single phase",{"$f":"IF(Cinmin*1000000<4.7, 4.7,Cinmin*1000000)","v":22.388811548554166},"uF",null,null,"…report this"]
[]
["Cin",{"$f":"'Design the GaN Converter'!E59/1000000","v":2.5000000000000001E-5},"F",null,null,"Input capacitance"]
["CinEsrMax_Vinmin",{"$f":"-(Iout*D1_Vinmin_2*(1-D1_Vinmin_2)/(Cin*Fsw)-Vinripple1)/(Iout+Iripple_Vinmin/2)","v":2.3586851261665097E-3},"W"]
["CinEsrMax_Vinmax",{"$f":"-(Iout*D1_Vinmax*(1-D1_Vinmax)/(Cin*Fsw)-Vinripple1)/(Iout+Iripple_Vinmax/2)","v":8.7903792903032702E-3},"W"]
["CinEsrMax_50%D",{"$f":"-(Iout*0.5*(1-0.5)/(Cin*Fsw)-Vinripple1)/(Iout+Iripple_Vinmax/2)","v":0},"W",null,null,"Calculate ESR at Vinmax and 50% duty cycle (Vin = 2*Vout)"]
["CinEsrMax",{"$f":"IF(D1_Vinmin<0.5, B179,B181)","v":2.3586851261665097E-3},"W"]
["Reported Cin ESR max - single phase",{"$f":"IF(OR(CinEsrMax>0.3, CinEsrMax<0), \"N/A\",CinEsrMax*1000)","v":2.3586851261665096},"mΩ",null,null,"…report this"]
[]
["Vinripple2_Vinmin - single phase with ESR",{"$f":"Iout*D1_Vinmin_2*(1-D1_Vinmin_2)/(Cin*Fsw)+(Iout +Iripple_Vinmin/2)*RCinEsr","v":0.49205833412216748},"Vp-p",null,null,"Calculate ripple at Vinmin and 50% duty cycle (Vin = 2*Vout)"]
["Vinripple2_Vinmax - single phase with ESR",{"$f":"Iout*D1_Vinnom_2*(1-D1_Vinnom_2)/(Cin*Fsw)+(Iout +Iripple_Vinnom/2)*RCinEsr","v":0.42353546349332283},"Vp-p"]
["Vinripple2_Vinmax - single phase with ESR",{"$f":"Iout*D1_Vinmax_2*(1-D1_Vinmax_2)/(Cin*Fsw)+(Iout +Iripple_Vinmax/2)*RCinEsr","v":0.34973223991014768},"Vp-p"]
["Vinripple2_50%D - single phase",{"$f":"Iout*0.5*(1-0.5)/(Cin*Fsw)+(Iout +Iripple_Vinmax/2)*RCinEsr","v":0.5452619630331651},"Vp-p"]
["Vinripple2 - single phase",{"$f":"IF(D1_Vinmin < 0.5, B185, B188)","v":0.49205833412216748},"Vp-p",{"$f":"SINGLEPHASE","v":true},null,"…report highest of these"]
[]
["Number of phases",{"$f":"Number_of_Phases","v":1},null,"Multiphase"]
["DmaxRipple = 1/2N or D_Vinmin",{"$f":"1/2/Number_of_Phases","v":0.5},null,{"$f":"D1_Vinmin","v":0.33333333333333331},"D_Vinmin"]
[]
["Cinmin_DmaxRipple_multiphase",{"$f":"Iout*(FLOOR(Number_of_Phases*D_Cinmaxripple, 1)/Number_of_Phases-D_Cinmaxripple)*(D_Cinmaxripple-((FLOOR(Number_of_Phases*D_Cinmaxripple, 1)+1)/Number_of_Phases))/(Vinripple1*Fsw)","v":2.5000000000000001E-5},"F"]
[null,{"$f":"B194*1000000","v":25},"uF"]
["Reported Cin-min",{"$f":"IF(SINGLEPHASE, B176, B195)","v":22.388811548554166},"uF"]
[]
["CinEsrMax_DmaxRipple",{"$f":"(Vinripple1-(Iout*(FLOOR(Number_of_Phases*D_Cinmaxripple, 1)/Number_of_Phases-D_Cinmaxripple)*(D_Cinmaxripple-((FLOOR(Number_of_Phases*D_Cinmaxripple, 1)+1)/Number_of_Phases))/(Cin*Fsw)))/(Iout/Number_of_Phases)","v":0},"W"]
[]
["Reported ESR",{"$f":"IF(SINGLEPHASE, IF(OR(B182>0.3, B182<0), \"N/A\",B182*1000), IF(OR(B198>0.3, B198<0), \"N/A\",B198*1000))","v":2.3586851261665096},"mΩ","…report this"]
["RCinEsr",{"$f":"'Design the GaN Converter'!E61/1000","v":2E-3},"W"]
[]
["Vinripple2_Vinmin",{"$f":"Iout*(FLOOR(Number_of_Phases*D1_Vinmin_2, 1)/Number_of_Phases-D1_Vinmin_2)*(D1_Vinmin_2-((FLOOR(Number_of_Phases*D1_Vinmin_2, 1)+1)/Number_of_Phases))/(Cin*Fsw)+Iout/Number_of_Phases*RCinEsr","v":0.4877762309710833},"Vp-p",null,null,"Using new expression for multiphase pkpk voltage ripple"]
["Vinripple2_Vinnom",{"$f":"Iout*(FLOOR(Number_of_Phases*D1_Vinnom_2, 1)/Number_of_Phases-D1_Vinnom_2)*(D1_Vinnom_2-((FLOOR(Number_of_Phases*D1_Vinnom_2, 1)+1)/Number_of_Phases))/(Cin*Fsw)+Iout/Number_of_Phases*RCinEsr","v":0.4187025899635704},"Vp-p",null,null,"Using new expression for multiphase pkpk voltage ripple"]
["Vinripple2_Vinmax",{"$f":"Iout*(FLOOR(Number_of_Phases*D1_Vinmax_2, 1)/Number_of_Phases-D1_Vinmax_2)*(D1_Vinmax_2-((FLOOR(Number_of_Phases*D1_Vinmax_2, 1)+1)/Number_of_Phases))/(Cin*Fsw)+Iout/Number_of_Phases*RCinEsr","v":0.34447027687698251},"Vp-p",null,null,"Using new expression for multiphase pkpk voltage ripple"]
[]
["Vinripple_D_Cinmaxripple",{"$f":"Iout*(FLOOR(Number_of_Phases*D_Cinmaxripple, 1)/Number_of_Phases-D_Cinmaxripple)*(D_Cinmaxripple-((FLOOR(Number_of_Phases*D_Cinmaxripple, 1)+1)/Number_of_Phases))/(Cin*Fsw)+Iout/Number_of_Phases*RCinEsr","v":0.54},"Vp-p"]
[]
["Reported ripple",{"$f":"IF(SINGLEPHASE, B189,B207)","v":0.49205833412216748},"Vp-p"]
[]
[]
["Step ?: Other Components - CNFG, CC Loop"]
[]
["RPG",100,"kΩ"]
["RFB1",{"$f":"'Design the GaN Converter'!E66","v":100},"kΩ",null,"Tie FB to VCC or AGND for 12V/5V fixed output, respectively. "]
["RFB2",{"$f":"IF(Vout=Vref,\"OPEN\",Rfb2_u/1000)","v":9.09},"kΩ"]
["Actual VOUT setpoint",{"$f":"1/B216*(B215+B216)","v":12.001100110011002},"V"]
[]
["gmIMON",{"$f":"4/1000","v":4.0000000000000001E-3},"S"]
["iOFFSET",2.5000000000000001E-5,"µA"]
["VREFI",1,"V"]
[]
["CC loop setpoint",{"$f":"'Design the GaN Converter'!E99","v":30},"A"]
["Calculated RIMON",{"$f":"1/(B219*B223*Rs+Number_of_Phases*B220)/1000","v":6.8965517241379315},"kΩ"]
["Standard value RIMON ",{"$f":"'Standard Value Calculator'!O13","v":6.98},"kΩ"]
[]
["Load pole",{"$f":"Fp_dominant/1000","v":2.4863312147436161},"kHz"]
["Calculated CIMON",{"$f":"1.35/(2*PI()*Fp_dominant*B225)*1000000","v":12.380537362861228},"nF"]
["Standard value CIMON",{"$f":"'Standard Value Calculator'!G4*1000000000","v":12},"nF"]
[]
["RCNFG",{"$f":"CHOOSE(SCH_MODE, 23.7, 23.7, 12.1, 6.04, 46.4, 46.4, 46.4, 46.4)","v":23.7},"kΩ"]
[]
[]
[]
[]
["Step 5: Feedback Network and Internal Compensation"]
["Pi",3.1415926500000002,null,"p"]
["CS Amp Gain (effective value)",20]
["Ri",{"$f":"CSAmp_gain*Rs","v":0.02},"W",null,null,"Current Sense effective resistance = shunt resistor Rs * CS amp gain"]
[]
["Se_ext",{"$f":"B249/Ri*1000","v":4500000},"A/s",null,null,"Slope Comp Slope - referred to inductor current"]
["Sn",{"$f":"(Vin-Vout)/Lo","v":7659574.4680851065},"A/s",null,null,"On-time Slope"]
["Sf",{"$f":"Vout/Lo","v":2553191.489361702},"A/s",null,null,"Off-time Slope"]
[null,null,null,{"$f":"22.5*10*440","v":99000}]
["Enter slope comp referenced to the shunt",{"$f":"CHOOSE(SLOPE_COMP_level, 11.25, 22.5)","v":11.25},"mV"]
["Calculate Se_int at 440kHz",{"$f":"B245*CSAmp_gain*440/1000","v":99},"mV/μs",{"$f":"CSAmp_gain","v":20}]
["Calculate Se_int at Fsw",{"$f":"B246*Fsw/440000","v":90},"mV/μs",{"$f":"(Fsw/1000)/440*99","v":90},"mV/μs","Slope Comp Slope - referred to IC",null,"This is set at 99mV/us at Fsw = 440kHz (assuming 11.25mV referred to the shunt)"]
[]
["Se_int",{"$f":"B247","v":90},"mV/μs"]
["Sn_int",{"$f":"Sn*Ri/1000","v":153.19148936170214},"mV/μs",null,null,"Upslope"]
["Sf_int",{"$f":"Sf*Ri/1000","v":51.063829787234042},"mV/μs",null,null,"Downslope"]
["Ratio Se/Sf",{"$f":"B249/B251","v":1.7625}]
["mc_buck",{"$f":"1+Se_ext/Sn","v":1.5874999999999999},null,null,null,"mc = 1 + Se/Sn for peak current-mode buck"]
["k_buck",{"$f":"mc_buck*(1-D1_Vinnom_2)","v":1.1847029549780386},null,null,null,"mc*(1-D)"]
[]
["mc",{"$f":"1+Se_ext/Sn","v":1.5874999999999999}]
["k",{"$f":"mc_buck*(1-D1_Vinnom_2)","v":1.1847029549780386},{"$f":"D1_Vinnom_2","v":0.25373042206107799}]
["Q",{"$f":"1/Pi/(k-0.5)","v":0.46488756070538989},null,null,null,"1/(Pi*(k-0.5))",null,"Q = 2/Pi = 0.636 gives ideal one-cycle damping"]
[]
["Error Amp (EA)"]
["gm",1E-3,"S",null,null,"Error Amp Transconductance"]
["GBW",7.95,"MHz",null,null,"EA gain-bandwidth product"]
["Cbw",{"$f":"gm/(2*Pi*GBW*1000000)","v":2.0019489719969353E-11},"F",null,null,"EA effective bandwidth limiting capacitance = gm/(2*Pi*GBW)"]
[]
["DC gain (dB)",88,"dB",null,null,"EA DC gain"]
["DC gain (V/V)",{"$f":"10^(B265/20)","v":25118.86431509586},"V/V"]
["RoEA",{"$f":"B266/gm","v":25118864.315095861},"W",null,null,"EA output resistance"]
["AEA",{"$f":"gm*RoEA","v":25118.86431509586},"V/V",{"$f":"20*LOG(AEA)","v":88.000000000000028},"dB","EA DC gain = gm*RoEA"]
["Afb",{"$f":"Vref/Vout","v":8.3333333333333329E-2},"V/V",null,null,"Feedback gain from Vout to FB"]
["Acs",{"$f":"1/Ri","v":50},null,null,null,"Acs = 1/Ri"]
["Am_buck",{"$f":"(Ro*Number_of_Phases)/Ri/((1+Ro*Number_of_Phases*(k-0.5)/(Fsw*Lo)))","v":24.619986008978977}]
["Am",{"$f":"Ro*Number_of_Phases/Ri/((1+Ro*Number_of_Phases*(k-0.5)/(Fsw*Lo)))","v":24.619986008978977},null,null,null,"Buck modulator gain"]
[]
["Scaling factor to calculate Rcomp",{"$f":"2*Pi*Ri/gm","v":125.663706},null,null,null,"2*Pi*Ri/gm -- scaling factor to calculate Rcomp given desired buck crossover frequency"]
["DC Gain is Adc = AEA*Afb*Am"]
[]
["Rout",{"$f":"Rout","v":0.6},"W",null,null,"Output Resistance (Load)"]
[]
["Fp_load_buck",{"$f":"1/(2*Pi*Ro*Cout)+(k-0.5)/(2*Pi*Fsw*Lo*Cout/Number_of_Phases)","v":2486.3312147436159},"Hz",null,null,"Buck dominant pole frequency -- note slope comp influence"]
["Fp_dominant",{"$f":"Fload_u","v":2486.3312147436159},"Hz"]
["Cbw",{"$f":"Cbw","v":2.0019489719969353E-11},"F",null,null,"Cbw"]
["Fp_EA",{"$f":"1/(2*Pi*(RoEA+Rcea1_u)*Cc1ea_u)","v":1.9192762040715436},"Hz",null,null,"Error Amp LF pole -- related to amplifier ouptut resistance and comp cap"]
["Fp_HF",{"$f":"1/(2*Pi*Rcea1_u*(Cc2ea_u+Cbw))","v":214508.92398847072},"Hz",null,null,"Error Amp HF pole cancels zero related to Output Cap ESR"]
["Fesr",{"$f":"1/(2*Pi*Cout*Cout_ESR)","v":244853.75888270215},"Hz",null,null,"Cout ESR zero frequency"]
["F_mod",{"$f":"Fsw/2","v":200000},"Hz",null,null,"Zero-order sample-and-hold effects of current-mode control modeled as pole at Fsw/2"]
["Fz_ff",{"$f":"IF(NO_FF_CAP=TRUE, 1000000000, 1/(2*Pi*Rfb1_*Cff_u*0.000000000001))","v":1000000000},"Hz",{"$f":"Fz_ff/1000","v":1000000},"kHz"]
["Fp_ff",{"$f":"IF(NO_FF_CAP=TRUE, 1000000000, 1/(2*Pi*Rfb4_u*Cff_u*0.000000000001))","v":1000000000},"Hz",{"$f":"Fp_ff/1000","v":1000000},"kHz"]
[]
["Desired Crossover Frequency",{"$f":"'Design the GaN Converter'!E72*1000","v":50000},"Hz",{"$f":"Fcross","v":50000}]
["Rcea1",{"$f":"Fcross*Cout/Number_of_Phases*2*Pi*Ri/(gm*Afb)","v":9801.7690679999996},"W",{"$f":"Number_of_Phases","v":1},null,"This component will largely determine the crossover frequency",null,null,null,null,{"$f":"Fcross/Fp_dominant/(gm*Afb*Am)","v":9801.7690680000014}]
["Cc1ea",{"$f":"10/(Rcea1*Fcross*2*Pi)","v":3.2474738421118735E-9},"F",{"$f":"gm","v":1E-3},null,"This along with Rcea1 will set a zero at Fcrossover/5 to optimize phase margin"]
["Cc2ea",{"$f":"MAX(1/(Rcea1*2*Pi*Fesr)-Cbw, 1/(Rcea1*2*Pi*(Fsw/2))-Cbw)","v":6.1167356332827473E-11},"F",{"$f":"Cout","v":1.2999999999999999E-4},null,"This along with Rcea1 places a pole at the output cap ESR zero"]
[null,null,null,{"$f":"Ri","v":0.02}]
["Chosen Compensation Components from the standard value sheet"]
["Rcea1_u",{"$f":"'Design the GaN Converter'!E76*1000","v":9760},"W",null,null,{"$f":"1/(Rcea1*2*Pi*(Fsw/2))-Cbw","v":6.1167356332827473E-11}]
["Cc1ea_u",{"$f":"'Design the GaN Converter'!E77*0.000000001","v":3.3000000000000006E-9},"F"]
["Cc2ea_u",{"$f":"'Design the GaN Converter'!E78*0.000000000001","v":5.6E-11},"F"]
[]
["Resulting Pole/Zero Locations",null,null,null,null,{"$f":"Cout","v":1.2999999999999999E-4},{"$f":"Cout_ESR","v":5.0000000000000001E-3}]
["Fz1",{"$f":"1/(2*Pi*Rcea1_u*Cc1ea_u)","v":4941.4724066615854},"Hz",null,null,"This zero is set at or close to the dominant load pole"]
["Fp2",{"$f":"1/(2*Pi*Rcea1_u*(Cc1ea_u*(Cc2ea_u+Cbw)/(Cc1ea_u+Cc2ea_u+Cbw)))","v":219450.39639513224},"Hz",null,null,"This pole cancels the zero from the Output Cap ESR"]
[]
["Rfb1",{"$f":"'Design the GaN Converter'!E66*1000","v":100000},"W",null,null,"Upper feedback resistance - chosen by the user"]
["Rfb2",{"$f":"IF(Vout=Vref, \"N/A\", Vref/(Vout-Vref)*B303)","v":9090.9090909090919},"W",{"$f":"Rfb2_u","v":9090},null,"Lower feedback resistance"]
["Rfb2_u",{"$f":"IF(Vout=Vref,\"N/A\",'Standard Value Calculator'!O11)","v":9090},"W",null,null,"Std value lower feedback resistance"]
["Cff",{"$f":"1/(2*Pi*200000)/Rfb1_","v":7.9577471636878189E-12},"F",{"$f":"1/(1/Rfb1_+1/Rfb2_u)","v":8332.5694380786517},"W","Based on a 200kHz zero frequency"]
["Cff_u",{"$f":"IF('Design the GaN Converter'!E69<0.1, 0.1, 'Design the GaN Converter'!E69)","v":10},"pF"]
[]
[]
["Step 6: UVLO Divider"]
["VIN UVLO turn-on voltage",{"$f":"'Design the GaN Converter'!E88","v":35},"V"]
["VIN UVLO turn-off voltage",{"$f":"'Design the GaN Converter'!E94","v":0},"V"]
["Ren1",{"$f":"'Design the GaN Converter'!E89*1000","v":200000},"W"]
["Ren2",{"$f":"B313*(1/(B311-1))","v":5882.3529411764703},"W"]
["Ren2_u",{"$f":"'Standard Value Calculator'!O7","v":5900},"W"]
[]
["Step 7: Efficiency"]
["VAR",0]
["Design"]
["Ta",{"$f":"'Design the GaN Converter'!E13","v":25},"°C","Ambient temperature"]
["Components"]
["LTc",{"$f":"3930/1000000","v":3.9300000000000003E-3},"%/°C","Inductor DCR tempco"]
["θCA (inductor core)",22,"°C/W","Inductor core-to-ambient thermal resistance"]
["RCinEsr",{"$f":"RCinEsr","v":2E-3},"W","Input capacitor ESR"]
[]
["Controller Characteristics"]
["VCC",4,"V"]
["Top Driver"]
["RdsonDRT",0.5,"W","Drain-dource resistance of pullup high-side FET driver"]
["RdsonDRT2",0.5,"W","Drain-dource resistance of pulldown high-side FET driver"]
["Bottom Driver"]
["RdsonDRB",0.5,"W","Drain-dource resistance of pullup low-side FET driver"]
["RdsonDRB2",0.5,"W","Drain-dource resistance of pulldown low-side FET driver"]
["Deadtime"]
["Deadtime",2.4999999999999999E-8,"s","Total deadtime",null,null,"4ns"]
["IQ"]
["IQ ",2E-3,"A","Quiescent current of the controller die"]
[]
["High- & low-side FETs","Q1: high-side",null,"Q2: low-side"]
["Rdson",{"$f":"'GaN FET Parameters'!E6/1000","v":5.7959999999999999E-3},"W",{"$f":"'GaN FET Parameters'!F6/1000","v":3.6479999999999998E-3},"W","Drain-Source Resistances of Channel 1 FETs"]
["RdsonTopTc",{"$f":"4000/1000000","v":4.0000000000000001E-3},"%/°C",4.0000000000000001E-3,"%/°C","Drain-Source Resistance Temp Co"]
["Qg",{"$f":"'GaN FET Parameters'!E7/1000000000","v":7.0999999999999999E-9},"C",{"$f":"'GaN FET Parameters'!F7/1000000000","v":1.31E-8},"C","Gate Charge at VCC = 5V"]
["Qgd",{"$f":"'GaN FET Parameters'!E8/1000000000","v":1.8E-9},"C",{"$f":"'GaN FET Parameters'!F8/1000000000","v":2.7000000000000002E-9},"C","Gate to Drain Charge"]
["Qgs",{"$f":"'GaN FET Parameters'!E9/1000000000","v":1.8E-9},"C",{"$f":"'GaN FET Parameters'!F9/1000000000","v":4.4000000000000005E-9},"C","Gate to Source Charge"]
["Qoss",{"$f":"'GaN FET Parameters'!E10/1000000000","v":0},"C",{"$f":"'GaN FET Parameters'!F10/1000000000","v":2.4E-8},"C","Output Charge"]
["Coss",{"$f":"'GaN FET Parameters'!E11/1000000000000","v":3.0399999999999998E-10},"F",{"$f":"'GaN FET Parameters'!F11/1000000000000","v":5.5700000000000004E-10},"F","Output Capacitance"]
["Rgate",{"$f":"'GaN FET Parameters'!E12","v":0.4},"W",{"$f":"'GaN FET Parameters'!F12","v":0.4},"W","Gate Resistance"]
["gfs",{"$f":"'GaN FET Parameters'!E13","v":80},"S",{"$f":"'GaN FET Parameters'!F13","v":80},"S","Transconductance"]
["Vth",{"$f":"'GaN FET Parameters'!E14","v":2.2000000000000002},"V",{"$f":"'GaN FET Parameters'!F14","v":2.2000000000000002},"V","Threshold Voltage"]
["Vsp",{"$f":"Vth_Q1+Iout/Gfs_Q1","v":2.4500000000000002},"V",{"$f":"Vth_Q2+Iout/Gfs_Q2","v":2.4500000000000002},"V","Switch Point Voltage of FETs"]
[]
["Vsd - Buck",{"$f":"'GaN FET Parameters'!E15","v":2},"V",{"$f":"'GaN FET Parameters'!F15","v":2},"V","Diode Forward Voltage of MOSFET Body diode"]
["QrrTop",null,"C",{"$f":"'GaN FET Parameters'!F16/1000000000","v":0},"C","Reverse Recovery Charge of Body Diode"]
["TrrTop",4.0000000000000001E-8,"s",4.0000000000000001E-8,"s","Reverse Recovery Time of Body Diode"]
["θJA FET",30,"°C/W",23,"°C/W","Junction-to-Ambient Resistance"]
[]
[]
["Thermal Impdeances"]
["θca - IC",{"$f":"'Design the GaN Converter'!E41","v":18},"°C/W","Junction-to-case thermal resistance of the IC"]
["θjc - high-side FET",18,"°C/W"]
["θjc - low-side FET",18,"°C/W"]
["θjc - controller",18,"°C/W"]
[]
["Power Losses",null,null,"Temperature rise"]
["IC",{"$f":"'Efficiency Calculations'!BF109","v":4.1721853781263842},"W",{"$f":"B377*ThetaCA_IC","v":75.09933680627492},"°C","case to ambient"]
["High-side FET die",{"$f":"'Efficiency Calculations'!BC109","v":1.5353828849209039},"W",{"$f":"B366*ThetaJA_Q1","v":46.061486547627119},"°C"]
["Low-side FET die",{"$f":"'Efficiency Calculations'!BD109","v":2.1064997605472504},"W",{"$f":"B367*ThetaJA_Q2","v":48.449494492586759},"°C"]
["Controller die",{"$f":"'Efficiency Calculations'!AQ109","v":0.13536000000000001},"W",{"$f":"B368*ThetaJA_Q2","v":3.11328},"°C"]
["HS + LS + Control",{"$f":"SUM(B366:B368)","v":3.7772426454681542},"W"]
[]
["Outputs"]
["Top FET"]
["Tr",{"$f":"(Qgd_Q1+Qgs_Q1/2)*(RdsonDRT+Rgate1)/(VCC-Vsp_Q1)","v":1.5677419354838711E-9},"s"]
["Tf",{"$f":"(Qgd_Q1+Qgs_Q1/2)*(RdsonDRT2+Rgate1)/(Vsp_Q1)","v":9.9183673469387761E-10},"s"]
[]
["IC Power Dissipation","Value","Units"]
["IC power loss",{"$f":"'Efficiency Calculations'!BF109","v":4.1721853781263842},"W"]
["IC temperature rise - ambient to case",{"$f":"B377*ThetaCA_IC","v":75.09933680627492},"°C"]
["IC case temperature",{"$f":"B378 + Ta","v":100.09933680627492},"°C"]
[]
["Current (switching)",{"$f":"(Qg_Q1+Qg_Q2)*Fsw+Iq","v":1.008E-2},"A"]
["Total Application Switching IQ",{"$f":"SUM(B381:B381)","v":1.008E-2},"A"]
[]
["Low-side MOSFET/Diode"]
["Part Power"]
["Power Dis"]
[]
["SCHEMATIC LABELS"]
[{"$f":"\"RFB1 = \"&'Design the GaN Converter'!E66&\"kΩ\"","v":"RFB1 = 100kΩ"},{"$f":"IF(VOUT_FIXED, \"\", 'Design the GaN Converter'!E66&\"kΩ\")","v":""},null,{"$f":"'Design the GaN Converter'!E66&\"kΩ\"","v":"100kΩ"}]
[{"$f":"\"RFB2 = \"&'Design the GaN Converter'!E67&\"kΩ\"","v":"RFB2 = 9.09kΩ"},{"$f":"IF(VOUT_FIXED, \"\", 'Design the GaN Converter'!E67&\"kΩ\")","v":""},null,{"$f":"'Design the GaN Converter'!E67&\"kΩ\"","v":"9.09kΩ"}]
[{"$f":"\"CFF = \"&'Design the GaN Converter'!E69&\"pF\"","v":"CFF = 10pF"},{"$f":"IF(VARIANT< 4, IF(NO_FF_CAP=TRUE,\"N/A\",IF(Cff_u>0.1,ROUND(Cff_u,1)&\" pF\",\"N/A\")), \"\")","v":""},null,{"$f":"IF(Cff_u>0, ROUND(Cff_u,1), \"N/A\")","v":10}]
[{"$f":"\"RRT = \"&'Design the GaN Converter'!E12&\"kΩ\"","v":"RRT = 54.9kΩ"},{"$f":"CHOOSE(GPN, 'Design the GaN Converter'!E12&\"kΩ\",  'Design the GaN Converter'!E12&\"kΩ\", \"\", \"\")","v":"54.9kΩ"},null,{"$f":"'Design the GaN Converter'!E12&\"kΩ\"","v":"54.9kΩ"},{"$f":"GPN","v":1}]
[{"$f":"\"REN1 = \"&'Design the GaN Converter'!E89&\"kΩ\"","v":"REN1 = 200kΩ"},{"$f":"'Design the GaN Converter'!E89&\"kΩ\"","v":"200kΩ"},null,{"$f":"'Design the GaN Converter'!E89","v":200}]
[{"$f":"\"RENB2 = \"&Renb_u/1000&\"kΩ\"","v":"RENB2 = 5.9kΩ"},{"$f":"Renb_u/1000&\"kΩ\"","v":"5.9kΩ"},null,{"$f":"Renb_u/1000","v":5.9}]
["RPG",{"$f":"100&\"kΩ\"","v":"100kΩ"}]
[{"$f":"\"RCNFG = \"&RCNFG&\"kΩ\"","v":"RCNFG = 23.7kΩ"},{"$f":"RCNFG&\"kΩ\"","v":"23.7kΩ"},null,{"$f":"RCNFG","v":23.7}]
[{"$f":"\"CIMON = \"&Cimon&\"nF\"","v":"CIMON = 12nF"},{"$f":"IF(CC_LOOP, Cimon&\"nF\",\"\")","v":"12nF"},null,{"$f":"Cimon&\"nF\"","v":"12nF"}]
[{"$f":"\"RIMON = \"&Rimon&\"kΩ\"","v":"RIMON = 6.98kΩ"},{"$f":"IF(CC_LOOP, Rimon&\"kΩ\",\"\")","v":"6.98kΩ"},null,{"$f":"Rimon&\"kΩ\"","v":"6.98kΩ"}]
[{"$f":"IF(SINGLEPHASE, \"\", \"Connect to adjacent phase\")","v":""}]
[{"$f":"\"Lo = \"&'Design the GaN Converter'!E27&\"µH\"","v":"Lo = 4.7µH"},{"$f":"'Design the GaN Converter'!E27&\"µH\"","v":"4.7µH"}]
[{"$f":"\"Rdcr = \"&Rdcr*1000&\"mΩ\"","v":"Rdcr = 3.76mΩ"},{"$f":"Rdcr*1000&\"mΩ\"","v":"3.76mΩ"},null,{"$f":"Rdcr*1000&\"mΩ\"","v":"3.76mΩ"}]
[{"$f":"\"Rs = \"&Rs*1000&\"mΩ\"","v":"Rs = 1mΩ"},{"$f":"Rs*1000&\"mΩ\"","v":"1mΩ"}]
[{"$f":"\"VOUT = \"&'Design the GaN Converter'!E9&\"V\"","v":"VOUT = 12V"},{"$f":"'Design the GaN Converter'!E9&\"V\"","v":"12V"},null,{"$f":"IF(MODE=1, 'Design the GaN Converter'!J10&\"V\", \"\")","v":"V"}]
[]
[{"$f":"\"COUT = \"&'Design the GaN Converter'!$E$51&\" µF\"","v":"COUT = 130 µF"},{"$f":"ROUND('Design the GaN Converter'!$E$51/Number_of_Phases, 0)&\"µF\"","v":"130µF"},null,{"$f":"IF(MODE=1, 'Design the GaN Converter'!$J$60&\"µF\", ROUND('Design the GaN Converter'!$E$51/Number_of_Phases, 0)&\"µF\")","v":"µF"}]
["Capacitance per component (Cout)",{"$f":"\"22µF\"","v":"22µF"}]
["# of output caps",{"$f":"ROUNDUP(Cout*1000000/22,0)&\" x\"","v":"6 x"}]
[null,{"$f":"CHOOSE(MODE,\"\",\"Tie to secondary IC\")","v":""}]
["CIN",{"$f":"Cin*1000000&\"µF\"","v":"25µF"},{"$f":"Cin*1000000&\" µF\"","v":"25 µF"}]
["Capacitance per component (Cin)",{"$f":"\"4.7µF\"","v":"4.7µF"}]
["# of input caps",{"$f":"ROUNDUP(Cin*1000000/10,0)&\" x\"","v":"3 x"}]
[]
[{"$f":"\"CVCC = 1µF\"","v":"CVCC = 1µF"},{"$f":"CHOOSE(GPN, \"\", \"\", \"1 µF\", \"1 µF\")","v":""},null,{"$f":"IF(MODE=1, 'Design the GaN Converter'!$J$60&\"µF\", ROUND('Design the GaN Converter'!$E$51/Number_of_Phases, 0)&\"µF\")","v":"µF"}]
[]
[{"$f":"\"Rcomp = \"&Rcea1_u/1000&\"kΩ\"","v":"Rcomp = 9.76kΩ"},{"$f":"ROUND(Rcea1_u/1000,2)&\"kΩ\"","v":"9.76kΩ"}]
[{"$f":"\"Ccomp = \"&Cc1ea_u*10^9&\"nF\"","v":"Ccomp = 3.3nF"},{"$f":"Cc1ea_u*10^9&\"nF\"","v":"3.3nF"}]
[{"$f":"\"Chf = \"&IF(Cc2ea_u>0, Cc2ea_u*10^12&\"pF\", \"OPEN\")","v":"Chf = 56pF"},{"$f":"IF(Cc2ea_u>0, ROUND(Cc2ea_u*10^12,1)&\"pF\", \"N/A\")","v":"56pF"}]
[]
[{"$f":"\"gm = \"&$B$261*1000&\"mS\"","v":"gm = 1mS"},{"$f":"$B$261*1000&\"mS\"","v":"1mS"}]
[{"$f":"\"RoEA = \"&RoEA/1000000&\"MΩ\"","v":"RoEA = 25.1188643150959MΩ"},{"$f":"RoEA/1000000&\"MΩ\"","v":"25.1188643150959MΩ"}]
[{"$f":"\"GBW = \"&GBW&\"MHz\"","v":"GBW = 7.95MHz"},{"$f":"GBW&\"MHz\"","v":"7.95MHz"}]
[]
[{"$f":"\"RPG = 100 kΩ\"","v":"RPG = 100 kΩ"},{"$f":"CHOOSE(GPN, \"100 kΩ\", \"100 kΩ\", \"\", \"\")","v":"100 kΩ"}]
[{"$f":"\"RFB1 = \"&'Design the GaN Converter'!E66&\"kΩ\"","v":"RFB1 = 100kΩ"},{"$f":"IF(VOUT_setting=1, 'Design the GaN Converter'!E66&\"kΩ\", \"\")","v":{"$error":"#NAME?"}}]
[{"$f":"\"RFB2 = \"&IF(Vout=Vref,\"OPEN\",'Design the GaN Converter'!E67&\"kΩ\")","v":"RFB2 = 9.09kΩ"},{"$f":"IF(VOUT_setting=1, IF(Vout=Vref,\"OPEN\",Rfb2_u/1000&\"kΩ\"), \"\")","v":{"$error":"#NAME?"}}]
[{"$f":"CHOOSE(BODE_PLOT_TYPE, \"Crossover Frequency = \"&ROUND('Stability Calculations'!Q4,1)&\" kHz\",  \"Crossover Frequency = \"&ROUND(#REF!,1)&\" kHz\")","v":"Crossover Frequency = 46.2 kHz"},{"$f":"CHOOSE(BODE_PLOT_TYPE, ROUND('Stability Calculations'!Q4,1)&\" kHz\", ROUND(#REF!,1)&\" kHz\")","v":"46.2 kHz"},null,{"$f":"'Stability Calculations'!Q4","v":46.241500000000002}]
[{"$f":"CHOOSE(BODE_PLOT_TYPE, \"Phase Margin = \"&ROUND('Stability Calculations'!Q5,0)&\"°\", \"Phase Margin = \"&ROUND(#REF!,0)&\"°\")","v":"Phase Margin = 58°"},{"$f":"CHOOSE(BODE_PLOT_TYPE, ROUND('Stability Calculations'!Q5,0)&\"°\", ROUND(#REF!,0)&\"°\")","v":"58°"}]
[]
["Full-load/high line efficiency",{"$f":"ROUND('Efficiency Calculations'!AZ109,1)&\"%\"","v":"97.1%"}]
["Half-load/mid-line efficiency",{"$f":"ROUND('Efficiency Calculations'!AZ59,1)&\"%\"","v":"97.7%"}]
[]
[]
["Rpgood","100 kΩ"]
[null,{"$f":"VARIANT>3","v":true}]
[]
["Rt",{"$f":"Rfadj&\"kΩ\"","v":"54.9kΩ"},{"$f":"Rfadj","v":54.9},{"$f":"Fsw","v":400000},null,{"$f":"OR((Fsw=440000),(Fsw=2200000))","v":false},null,{"$f":"OR(OR(AND(OSC=1, OR(Fsw/1000>2530, Fsw/1000<1800)), AND(OSC=2, OR(Fsw/1000>500, Fsw/1000<300))), OR((Fsw=440000),(Fsw=2200000)))","v":{"$error":"#NAME?"}}]
[]
["Blank out",{"$f":"IF(B75=\"y\",\"\",\"|\")","v":"|"}]
["OUTPUT CURRENT",{"$f":"'Design the GaN Converter'!$E$10&\"A\"","v":"20A"},null,{"$f":"IF(MODE=1,'Design the GaN Converter'!$J$11&\"A\",\"\")","v":"A"}]
["VIN",{"$f":"VIN_nom&\"V\"","v":"48V"}]
["VIN range",{"$f":"VIN_min&\"V\"&\"...\"&VIN_max&\"V\"","v":"36V...65V"}]

{"sheet":"GaN FET Parameters","index":4,"n_rows":17,"n_cols":7,"rows_kept":17,"cut":false,"hidden":true,"merged":[]}
[]
[]
["GaN FET Parameters"]
[null,null,null,null,"Internal GaN Power FETs"]
[null,null,null,null,"High-side","  Low-side"]
[null,null,null,"On-State Resistance, RDS(on) ",{"$f":"4.83*1.2","v":5.7960000000000003},{"$f":"3.04*1.2","v":3.6479999999999997},"mΩ"]
[null,null,null,"Total Gate Charge, QG ",7.1,13.1,"nC"]
[null,null,null,"Gate-Drain Charge, QGD ",1.8,2.7,"nC"]
[null,null,null,"Gate-Source Charge, QGS ",1.8,4.4000000000000004,"nC"]
[null,null,null,"Output Charge, QOSS ",null,24,"nC"]
[null,null,null,"Output Capacitance, COSS ",304,557,"pF"]
[null,null,null,"Gate Resistance, RGATE ",0.4,0.4,"Ω"]
[null,null,null,"Transconductance, gFS ",80,80,"S"]
[null,null,null,"Gate-Source Miller Plateau Voltage, VMP ",2.2000000000000002,2.2000000000000002,"V"]
[null,null,null,"Reverse Conduction Voltage, VDEADTIME ",2,2,"V"]
[null,null,null,"Reverse Recovery Charge, QRR ",null,0,"nC"]
[null,null,null,"Thermal Resistance, θJA ",71,53,"°C/W"]

{"sheet":"Efficiency Calculations","index":5,"n_rows":115,"n_cols":59,"rows_kept":115,"cut":false,"hidden":true,"merged":[[6,24,6,26],[0,0,3,3],[5,0,6,3],[6,6,6,13],[6,17,6,20],[6,21,6,23],[6,27,6,32],[6,33,6,36],[6,38,6,42],[6,45,6,49],[6,51,6,58]]}
["BUCK CONTROLLER POWER DESIGN TOOL",null,null,null,null,null,null,null,null,null,null,null,null,null,null,null,null,null,null,null,null,null,null,null,null,null,null,null,null,null,null,null,null,null,null,null,null,null,null,null,{"$f":"Ext_BIAS","v":1}]
[null,null,null,null,null,null,null,{"$f":"AV19","v":0.94740026807156263},"10% load"]
[null,null,null,null,null,null,null,{"$f":"AV59","v":0.97684025648842288},"50% load",null,null,null,null,null,null,null,null,null,null,null,null,null,null,null,null,null,null,null,null,null,null,null,null,null,null,null,null,null,null,{"$f":"IF(MODE=1, (Qg_Q1+Qg_Q2)*Fsw*Vin, (Qg_Q1+Qg_Q2+Qg_Q3+Qg_Q4)*Fsw*Vin)","v":0.38784000000000002}]
[null,null,null,null,null,null,null,{"$f":"AV109","v":0.97119664753998358},"100% load",null,null,null,null,null,null,null,null,null,null,null,3,null,null,null,null,null,null,null,null,null,null,null,1,null,null,null,2,null,"I_VCC",{"$f":"(Qg_Q1+Qg_Q2)*Fsw*1000","v":8.08},"mA",{"$f":"AN4*5/1000","v":4.0399999999999998E-2}]
[null,null,null,null,null,null,null,null,null,null,null,null,null,null,null,null,null,null,null,null,null,null,null,null,null,null,null,null,null,null,null,null,null,null,null,null,null,null,null,null,null,{"$f":"VCC","v":4}]
["Enter the values of your design and MOSFET datasheet specifications below. Note that thermal resistance (θJA) will change when components are placed on the PCB"]
[null,null,null,null,null,null,"Operating Point Condtions",null,null,null,null,null,null,null,null,null,null,"Buck Inductor",null,null,null,"Cout",null,null,"Cin",null,null,"High-side BUCK \"Control\" FET Losses ",null,null,null,null,null,"Low-side BUCK \"Sync\" FET Losses ",null,null,null,"Shunt Loss","\"Controller\" Losses",null,null,null,null,null,null,"RESULTS",null,null,null,null,null,"Consolidated Buck Efficiency & Losses"]
["Input Parameters",null,null,null,null,null,"Step","Vin","Mode","Iout","Iout/ phase","Iin","Duty Cycle BUCK Leg","Ripple Current pk-pk","Peak Inductor Current","Valley Inductor Current","SW node voltage at Q1 turn-on","Irms Lf","DCR    Loss","Core Loss","Total Inductor Loss","Irms Cout","Cout ESR Loss","Total Cout Loss","Irms Cin","Cin ESR Loss","Total Cin Loss","Irms","RDS(on) Loss","Transition Loss (not including capacitive loss)","FET Output Capacitance Loss","Dead Time Loss ","Total Control FET Loss","Irms","RDS(on) Loss","Deadtime Loss","Total Sync FET Loss","Shunt Loss","IQ Loss","Switching Current Loss","Switching Current Diss from VCC","LDO Loss Saved from Gate Drive Current (ext VCC = Vout)","Total \"Control\" Losses","Total Loss (not considering total loss)","Total Loss (considering total loss)","Total Loss","Pout","EFF, h","Buck ''CONTROL'' FET Temp Rise","Buck ''SYNC'' FET Temp Rise",null,"h","Inductor Cu & Core Loss","Total FET Loss","High-side FET Loss","Low-side FET Loss","Controller Loss","IC (MCM) Power Loss","Shunt Loss"]
["Design","Input Value","Units","Description",null,null,0,{"$f":"Vin","v":48},{"$f":"MODE","v":1},0,{"$f":"Iout*G9/100/Number_of_Phases","v":0},{"$f":"Vout*K9/(Vin*Efficiency)","v":0},{"$f":"(Vout+(Rdson2+Rs+Rdcr)*K9)/(Vin+(Rs+Rdson2-Rdson1)*K9)","v":0.25},{"$f":"(Vin-(Rdson1+Rdcr)*K9-Vout)*M9/(Fsw*Lo)","v":4.7872340425531918},{"$f":"K9+N9/2","v":2.3936170212765959},{"$f":"K9-N9/2","v":-2.3936170212765959},{"$f":"IF(MIN(Vin, -P9/(Coss_Q1+Coss_Q2)*0.00000002)<0, 0, MIN(Vin, -P9/(Coss_Q1+Coss_Q2)*0.00000002))","v":48},{"$f":"SQRT(K9^2+(N9^2)/12)","v":1.3819554315709128},{"$f":"R9^2*Rdcr","v":7.1808510638297881E-3},{"$f":"Core_Loss","v":0.7},{"$f":"(T9+S9*(1+Ltc*(Ta-25)))/(1-S9*Ltc*ThetaCA_Core)","v":0.70762018157028228},{"$f":"N9/SQRT(12)","v":1.3819554315709128},{"$f":"RCoutEsr*V9^2","v":9.5490040742417393E-3},{"$f":"W9","v":9.5490040742417393E-3},{"$f":"SQRT(M9*(1-M9))*SQRT(K9^2+(N9^2)/12)","v":0.59840425531914898},{"$f":"RCinEsr*Y9^2","v":7.1617530556813047E-4},{"$f":"Z9","v":7.1617530556813047E-4},{"$f":"SQRT(M9)*SQRT(K9^2+(N9^2)/12)","v":0.69097771578545641},{"$f":"Rdson1*AB9^2","v":2.767301380715256E-3},{"$f":"(Vin*K9/2)*Fsw*(Tr_buck+Tf_buck)","v":0},{"$f":"(0.5*Coss_Q1*(Vin-Q9)^2-0.5*Coss_Q2*(Vin-Q9)^2+(Qoss_Q2*(Vin-Q9)/Vin)*Vin)*Fsw","v":0},{"$f":"IF(K9>N9/2,0,ABS(K9-N9/2)*Vsd_Q1*Deadtime*Fsw)","v":4.7872340425531922E-2},{"$f":"(AF9+AE9+AD9+AC9*(1+RdsonTC*(Ta-25))/(1-AC9*RdsonTC*ThetaJA_Q1))","v":5.0640561066343348E-2},{"$f":"SQRT((1-M9))*SQRT(K9^2+(N9^2)/12)","v":1.196808510638298},{"$f":"Rdson2*AH9^2","v":5.2252150294250796E-3},{"$f":"IF(K9<N9/2,Deadtime*Fsw*Vsd_Q2*(K9+N9/2),2*Deadtime*Fsw*Vsd_Q2*K9)","v":4.7872340425531922E-2},{"$f":"(AJ9+AI9*(1+RdsonTC*(Ta-25)))/(1-AI9*RdsonTC*ThetaJA_Q2)","v":5.3123092776573289E-2},{"$f":"CHOOSE(SENSING_TYPE, R9^2*Rs, 0)","v":1.909800814848348E-3},{"$f":"IF(Ext_BIAS=1,  0.0008*Vin, 0.002*Vin)","v":3.8400000000000004E-2},{"$f":"IF(Ext_BIAS=1,  (Qg_Q1+Qg_Q2)*Fsw*Vout, (Qg_Q1+Qg_Q2)*Fsw*Vin)","v":9.6960000000000005E-2},{"$f":"(Vin-VCC)*Fsw*(Qg_Q1+Qg_Q2)","v":0.35552},{"$f":"(Qg_Q1+Qg_Q2)*Fsw*(Vin-Vout)","v":0.29088000000000003},{"$f":"SUM(AM9:AN9)","v":0.13536000000000001},{"$f":"SUM(S9,T9,AC9,AD9,AE9,AF9,AI9,AJ9,AQ9, AL9)","v":0.9481878491398823},{"$f":"U9 + AL9 + ((AF9+AE9+AD9+AC9*(1+RdsonTC*(Ta-25))) + (AJ9+AI9*(1+RdsonTC*(Ta-25))) + AQ9) / (1-AC9*RdsonTC*ThetaJA_Q1 -AI9*RdsonTC*ThetaJA_Q2)","v":0.9488216749645475},{"$f":"AS9","v":0.9488216749645475},{"$f":"Vout*K9","v":0},{"$f":"AU9/(AU9+AT9)","v":0},{"$f":"ThetaJA_Q1*BC9","v":1.5192168319903003},{"$f":"ThetaJA_Q2*BD9","v":1.2218311338611856},null,{"$f":"AV9*100","v":0},{"$f":"U9","v":0.70762018157028228},{"$f":"AG9+AK9","v":0.10376365384291664},{"$f":"AG9","v":5.0640561066343348E-2},{"$f":"AK9","v":5.3123092776573289E-2},{"$f":"AQ9","v":0.13536000000000001},{"$f":"AS9-BA9-BG9","v":0.23929169257941688},{"$f":"AL9","v":1.909800814848348E-3}]
[null,null,null,null,null,null,1,48,1,{"$f":"Iout*G10/100","v":0.2},0.2,5.5555555555555559E-2,0.25003622933996367,4.787673610104882,{"$f":"K10+N10/2","v":2.5938368050524412},{"$f":"K10-N10/2","v":-2.1938368050524408},48,{"$f":"SQRT(K10^2+(N10^2)/12)","v":1.396478266834549},7.3325698270270091E-3,0.7,0.70778128475021729,{"$f":"N10/SQRT(12)","v":1.3820823237930606},9.5507577487061318E-3,{"$f":"W10","v":9.5507577487061318E-3},{"$f":"SQRT(M10*(1-M10))*SQRT(K10^2+(N10^2)/12)","v":0.60472203479658082},7.3137747873703424E-4,{"$f":"Z10","v":7.3137747873703424E-4},{"$f":"SQRT(M10)*SQRT(K10^2+(N10^2)/12)","v":0.69828972507031972},2.8261790986443846E-3,4.9143910467412781E-3,0,4.3876736101048815E-2,{"$f":"(AF10+AE10+AD10+AC10*(1+RdsonTopTc*Ta-RdsonTopTc*25))/(1-AC10*RdsonTopTc*ThetaJA_Q1)","v":5.1634817755558844E-2},1.2093564443961273,5.335356899029713E-3,5.1876736101048822E-2,{"$f":"(AJ10+AI10*(1+RdsonBotTc*Ta-RdsonBotTc*25))/(1-AI10*RdsonBotTc*ThetaJA_Q2)","v":5.724018950935858E-2},1.9501515497412259E-3,3.8400000000000004E-2,9.6960000000000005E-2,0.35552,0.29088000000000003,0.13536000000000001,{"$f":"SUM(S10,T10,AC10,AD10,AE10,AF10,AI10,AJ10,AQ10, AL10)","v":0.95347212062328124},0.9541236797219641,{"$f":"AS10","v":0.9541236797219641},2.4000000000000004,{"$f":"AU10/(AU10+AT10)","v":0.71553712062250041},1.5490445326667652,1.3165243587152473,null,{"$f":"AV10*100","v":71.553712062250042},0.70778128475021729,{"$f":"AG10+AK10","v":0.10887500726491742},5.1634817755558844E-2,5.724018950935858E-2,{"$f":"AQ10","v":0.13536000000000001},{"$f":"AS10-BA10-BG10","v":0.24439224342200558},{"$f":"AL10","v":1.9501515497412259E-3}]
["Vin",{"$f":"Vin","v":48},"V","Vin",null,null,2,48,1,0.4,0.4,0.11111111111111112,0.2500724590265247,4.7881131106316532,2.7940565553158265,-1.9940565553158267,46.319548323248007,1.4389239949873056,7.785088510196856E-3,0.7,0.70826181865684301,1.3822091966667807,9.5525113167511354E-3,9.5525113167511354E-3,0.62313255154629632,7.7658835359319534E-4,7.7658835359319534E-4,0.71956625297186938,3.0010273336429989E-3,9.8287820934825562E-3,1.5989445854221462E-2,3.9881131106316532E-2,6.8725135909028123E-2,1.2460845360304618,5.6643468955681472E-3,5.5881131106316533E-2,6.1577567298483751E-2,2.0705022633502276E-3,3.8400000000000004E-2,9.6960000000000005E-2,0.35552,0.29088000000000003,0.13536000000000001,0.97546145516309546,0.97617245511881023,0.97617245511881023,4.8000000000000007,0.83100011942099616,2.0617540772708436,1.4162840478651262,null,83.100011942099613,0.70826181865684301,0.13030270320751186,6.8725135909028123E-2,6.1577567298483751E-2,0.13536000000000001,0.26584013419861702,2.0705022633502276E-3]
["Vout",{"$f":"Vout","v":12},"V","Vout",null,null,3,48,1,0.6,0.6,0.16666666666666663,0.25010868905968803,4.7885525441325409,2.9942762720662706,-1.7942762720662704,41.678891337195594,1.5069349540241783,8.5384071132810439E-3,0.7,0.70906185833041935,1.382336050191795,9.5542647782992634E-3,9.5542647782992634E-3,0.65261651128066678,8.5181662159229731E-4,8.5181662159229731E-4,0.75363124655722946,3.2918964833437911E-3,1.4743173140223831E-2,5.8660848577737061E-2,3.5885525441325408E-2,0.1126259339925553,1.3049493859427839,6.2121532987346921E-3,5.9885525441325416E-2,6.6135476362083542E-2,2.2708529556598523E-3,3.8400000000000004E-2,9.6960000000000005E-2,0.35552,0.29088000000000003,0.13536000000000001,1.024848382451631,1.0256756604888264,1.0256756604888264,7.1999999999999993,0.87530803513010458,3.378778019776659,1.5211159563279215,null,87.530803513010454,0.70906185833041935,0.17876141035463883,0.1126259339925553,6.6135476362083542E-2,0.13536000000000001,0.31434294920274719,2.2708529556598523E-3]
["Fsw",{"$f":"Fsw/1000","v":400},"kHz","Switching Frequency",null,null,4,48,1,0.8,0.8,0.22222222222222224,0.2501449194394586,4.7889919106065841,3.1944959553032923,-1.594495955303292,37.038233572666478,1.5972487679302207,9.5925256362213267E-3,0.7,0.71018152872487794,1.3824628843678259,9.5560181332730448E-3,9.5560181332730448E-3,0.69176259360999615,9.5707097183605745E-4,9.5707097183605745E-4,0.7988558228261039,3.6988369463437421E-3,1.9657564186965112E-2,9.9152845348106547E-2,3.1889919106065839E-2,0.15446772770006945,1.3831243620844211,6.978744387616761E-3,6.3889919106065854E-2,7.0914193560471378E-2,2.5512036266546086E-3,3.8400000000000004E-2,9.6960000000000005E-2,0.35552,0.29088000000000003,0.13536000000000001,1.0727715583440398,1.0737525946764097,1.0737525946764097,9.6000000000000014,0.89940252173242707,4.6340318310020834,1.6310264518908417,null,89.940252173242712,0.71018152872487794,0.22538192126054082,0.15446772770006945,7.0914193560471378E-2,0.13536000000000001,0.36101986232487715,2.5512036266546086E-3]
["Iout",{"$f":"Iout","v":20},"A","Max Output Current",null,null,5,48,1,1,1,0.27777777777777773,0.25018115016584147,4.7894312100528236,3.3947156050264118,-1.3947156050264118,32.397575029649524,1.7063277165653159,1.0947444078959459E-2,0.7,0.71162100475661949,1.3825896991945965,9.5577713815950243E-3,9.5577713815950243E-3,0.73903994853867794,1.0923600910721035E-3,1.0923600910721035E-3,0.85347290385797414,4.2218991222041447E-3,2.4571955233706387E-2,0.13746543506862055,2.7894312100528233E-2,0.19425201501446043,1.4775446790873168,7.9640884406948342E-3,6.7894312100528237E-2,7.5914022452183302E-2,2.9115542763190052E-3,3.8400000000000004E-2,9.6960000000000005E-2,0.35552,0.29088000000000003,0.13536000000000001,1.1192310004215607,1.1204075717561559,1.1204075717561559,12,0.91460573418709812,5.827560450433813,1.7460225164002159,null,91.460573418709814,0.71162100475661949,0.27016603746664375,0.19425201501446043,7.5914022452183302E-2,0.13536000000000001,0.40587501272321741,2.9115542763190052E-3]
["Ta",{"$f":"Ta","v":25},"°C","Ambient Temperature",null,null,6,48,1,1.2,1.2,0.33333333333333326,0.25021738123884157,4.7898704424702956,3.594935221235148,-1.1949352212351478,27.756915708133516,1.830820828108952,1.2603162441437183E-2,0.7,0.71338051137284753,1.3827164946718287,9.5595245231877464E-3,9.5595245231877464E-3,0.79299831768228202,1.2576926636938591E-3,1.2576926636938591E-3,0.91580831367706883,4.8611334114506115E-3,2.9486346280447662E-2,0.17359861664254908,2.3898704424702957E-2,0.23198012311842434,1.5853075528860363,9.1681537358424461E-3,7.1898704424702961E-2,8.1135293358093094E-2,3.3519049046375486E-3,3.8400000000000004E-2,9.6960000000000005E-2,0.35552,0.29088000000000003,0.13536000000000001,1.1642267262657704,1.1656445858429054,1.1656445858429054,14.399999999999999,0.92511427461840745,6.9594036935527299,1.8661117472361413,null,92.511427461840739,0.71338051137284753,0.31311541647651742,0.23198012311842434,8.1135293358093094E-2,0.13536000000000001,0.44891216956542035,3.3519049046375486E-3]
["Vcc",{"$f":"VCC","v":4},"V","Subregulated VCC Voltage",null,null,7,48,1,1.4,1.4,0.38888888888888878,0.25025361265846385,4.7903096078580374,3.7951548039290186,-0.99515480392901878,23.116255608107291,1.967804744275903,1.4559680723596266E-2,0.7,0.71546032363948509,1.3828432707992444,9.5612775579737627E-3,9.5612775579737627E-3,0.8523723868534302,1.4530773717404274E-3,1.4530773717404274E-3,0.98440130582666086,5.6165902155731109E-3,3.4400737327188936E-2,0.20755238897314074,1.9903096078580377E-2,0.26765320840146006,1.7038807413318331,1.0590908550326173E-2,7.5903096078580368E-2,8.6578363433626279E-2,3.872255511594752E-3,3.8400000000000004E-2,9.6960000000000005E-2,0.35552,0.29088000000000003,0.13536000000000001,1.2077587534585807,1.2094673121242847,1.2094673121242847,16.799999999999997,0.93284269372531348,8.0295962520438025,1.9913023589734045,null,93.284269372531341,0.71546032363948509,0.35423157183508636,0.26765320840146006,8.6578363433626279E-2,0.13536000000000001,0.49013473297320487,3.872255511594752E-3]
["Components","Input Value","Units","Description",null,null,8,48,1,1.6,1.6,0.44444444444444448,0.2502898444247133,4.7907487062150871,3.9953743531075436,-0.79537435310754345,18.475594729559663,2.1148536822142399,1.6816998925378485E-2,0.7,0.71786076684874234,1.382970027576566,9.5630304858756385E-3,9.5630304858756385E-3,0.91611213693970772,1.6785228948964757E-3,1.6785228948964757E-3,1.0580396420904972,6.4883199370259865E-3,3.9315128373930225E-2,0.23932675096362305,1.5907487062150869E-2,0.30127225643127525,1.8311630765554832,1.2232321160805639E-2,7.9907487062150881E-2,9.2243616749106569E-2,4.4726060971751296E-3,3.8400000000000004E-2,9.6960000000000005E-2,0.35552,0.29088000000000003,0.13536000000000001,1.2498270995822403,1.2518791077251668,1.2518791077251668,19.200000000000003,0.93878904226202364,9.0381676929382575,2.1216031852294512,null,93.878904226202366,0.71786076684874234,0.39351587318038184,0.30127225643127525,9.2243616749106569E-2,0.13536000000000001,0.52954573477924927,4.4726060971751296E-3]
["L",{"$f":"Lo*1000000","v":4.7},"uH","Filter Inductance",null,null,9,48,1,1.8,1.8,0.5,0.25032607653759492,4.7911877375404837,4.1955938687702421,-0.59559386877024179,13.834933072479485,2.2700124804421651,1.9375117046725596E-2,0.7,0.72058221664640953,1.3830967650035162,9.5647833068159584E-3,9.5647833068159584E-3,0.98337121945176809,1.9340379104921149E-3,1.9340379104921149E-3,1.1357461968271396,7.4763729792279784E-3,4.4229519420671499E-2,0.26892170151720191,1.1911877375404835E-2,0.33283808188953384,1.9654610751057571,1.4092359843333443E-2,8.3911877375404842E-2,9.8131464378271693E-2,5.152956661363191E-3,3.8400000000000004E-2,9.6960000000000005E-2,0.35552,0.29088000000000003,0.13536000000000001,1.2904317822193332,1.2928830124043795,1.2928830124043795,21.6,0.94352467482126035,9.985142456686015,2.2570236807002488,null,94.352467482126031,0.72058221664640953,0.43096954626780554,0.33283808188953384,9.8131464378271693E-2,0.13536000000000001,0.56714783909660682,5.152956661363191E-3]
["Rdcr",{"$f":"Rdcr*1000","v":3.76},"mW","Inductor DCR at 25°C",null,null,10,48,1,2,2,0.55555555555555547,0.2503623089971137,4.791626701833267,4.3958133509166331,-0.3958133509166335,9.1942706368555971,2.4317292620979547,2.2234035087579422E-2,0.7,0.72362509917897244,1.3832234830798178,9.5665360207173155E-3,9.5665360207173155E-3,1.053477834010472,2.2196310935027916E-3,2.2196310935027916E-3,1.2167453494625011,8.5807997465622635E-3,4.9143910467412774E-2,0.29633723953706248,7.9162670183326699E-3,0.36235132847187235,2.1054305874820094,1.6170992873355251E-2,8.7916267018332661E-2,0.10424234449500151,5.9133072041434639E-3,3.8400000000000004E-2,9.6960000000000005E-2,0.35552,0.29088000000000003,0.13536000000000001,1.3295728189527809,1.3324817490838448,1.3324817490838448,24,0.94740026807156263,10.870539854156171,2.3975739233850346,null,94.740026807156269,0.72362509917897244,0.46659367296687387,0.36235132847187235,0.10424234449500151,0.13536000000000001,0.6029433427007288,5.9133072041434639E-3]
["LTc",3930,"ppm","Inductor Series Resistance Temp Co",null,null,11,48,1,2.2000000000000002,2.2000000000000002,0.61111111111111116,0.25039854180327453,4.7920655990924708,4.5960327995462356,-0.1960327995462352,4.5536074226767758,2.5987800456176466,2.5393753047881721E-2,0.7,0.72698989126065472,1.3833501818051916,9.568288627502284E-3,9.568288627502284E-3,1.1259021086553564,2.5353111165491563E-3,2.5353111165491563E-3,1.3004253328445023,9.8016506443764466E-3,5.4058301514154056E-2,0.32157336392636893,3.9206559909247037E-3,0.38981246875208769,2.2500114842366301,1.8468188525709642E-2,9.1920655990924707E-2,0.11057672247830451,6.753657725500458E-3,3.8400000000000004E-2,9.6960000000000005E-2,0.35552,0.29088000000000003,0.13536000000000001,1.3672502273658405,1.3706777242101331,1.3706777242101331,26.400000000000002,0.95064298618052112,11.69437406256263,2.5432646170010038,null,95.064298618052106,0.72698989126065472,0.50038919123039216,0.38981246875208769,0.11057672247830451,0.13536000000000001,0.63693417522397799,6.753657725500458E-3]
["ThetaCa",{"$f":"ThetaCA_Core","v":22},"°C/W","Core to Ambient Thermal Resistance",null,null,12,48,1,2.4,2.4,0.66666666666666652,0.25043477495608246,4.7925044293171366,4.7962522146585682,3.7477853414316087E-3,0,2.7702000334666623,2.88542709275743E-2,0.7,0.73067712056051104,1.3834768611793613,9.5700411270934899E-3,9.5700411270934899E-3,1.2002263640449173,2.881086649896965E-3,2.881086649896965E-3,1.3863039071371968,1.1138976078982598E-2,5.8972692560895323E-2,0.34421759999999996,0,0.41488383437267395,2.3983681332261817,2.0983915074628212E-2,9.6000000000000002E-2,0.11721019171584206,7.6740082254186971E-3,3.8400000000000004E-2,9.6960000000000005E-2,0.35552,0.29088000000000003,0.13536000000000001,1.4032014628674991,1.4072096051193261,1.4072096051193261,28.799999999999997,0.95341477668692565,12.446515031180219,2.6958344094643674,null,95.341477668692562,0.73067712056051104,0.53209402608851597,0.41488383437267395,0.11721019171584206,0.13536000000000001,0.66885847633339635,7.6740082254186971E-3]
["Cin",{"$f":"Cin*1000000","v":25},"μF","Input Capacitance",null,null,13,48,1,2.6,2.6,0.72222222222222221,0.25047100845554249,4.7929431925063017,4.9964715962531514,0.20352840374684922,0,2.9452264265897634,3.2615588726598976E-2,0.7,0.73468736580970873,1.383603521202049,9.5717935194135437E-3,9.5717935194135437E-3,1.2761203629471922,3.2569663614569473E-3,3.2569663614569473E-3,1.4739997870646433,1.2592826457657294E-2,6.3887083607636619E-2,0.34421759999999996,0,0.42133420468773081,2.5498398639161817,2.3718140793735503E-2,0.10400000000000001,0.12799744003369953,8.6743587038827074E-3,3.8400000000000004E-2,9.6960000000000005E-2,0.35552,0.29088000000000003,0.13536000000000001,1.4250655982895108,1.4296720622903891,1.4296720622903891,31.200000000000003,0.95618490864507844,12.640026140631925,2.9439411207750892,null,95.618490864507848,0.73468736580970873,0.54933164472143037,0.42133420468773081,0.12799744003369953,0.13536000000000001,0.68631033777679773,8.6743587038827074E-3]
["RCinEsr",{"$f":"RCinEsr*1000","v":2},"mW","Input Capacitor ESR",null,null,14,48,1,2.8,2.8,0.77777777777777757,0.25050724230165944,4.7933818886590016,5.1966909443295002,0.40330905567049902,0,3.1232529774062505,3.6677706444897554E-2,0.7,0.739021257029149,1.3837301618729758,9.5735458043850596E-3,9.5735458043850596E-3,1.3533216389285845,3.6629589167846998E-3,3.6629589167846998E-3,1.5632099319496513,1.416325218864161E-2,6.8801474654377873E-2,0.34421759999999996,0,0.42790959782877813,2.7039016013033783,2.6670833956048988E-2,0.11199999999999999,0.13901192985315916,9.7547091608770099E-3,3.8400000000000004E-2,9.6960000000000005E-2,0.35552,0.29088000000000003,0.13536000000000001,1.4476455764048428,1.4529136268546567,1.4529136268546567,33.599999999999994,0.95855084566375226,12.837287934863344,3.1972743866226607,null,95.855084566375226,0.739021257029149,0.56692152768193727,0.42790959782877813,0.13901192985315916,0.13536000000000001,0.70413766066463068,9.7547091608770099E-3]
["Cout",{"$f":"Cout*1000000","v":130},"μF","Output Capcitance",null,null,15,48,1,3,3,0.83333333333333326,0.25054347649443848,4.7938205177742779,5.3969102588871394,0.60308974111286107,0,3.3037947267326002,4.1040624082411874E-2,0.7,0.74367947577759586,1.3838567831918653,9.5752979819306878E-3,9.5752979819306878E-3,1.4316202323033447,4.0990729790805654E-3,4.0990729790805654E-3,1.6536919233710266,1.5850303681141188E-2,7.3715865701119168E-2,0.34421759999999996,0,0.4346104142280805,2.860133321886162,2.9841962833979111E-2,0.12,0.15025448058750959,1.0915059596386136E-2,3.8400000000000004E-2,9.6960000000000005E-2,0.35552,0.29088000000000003,0.13536000000000001,1.4709414158950371,1.4769373536875312,1.4769373536875312,36,0.96059076706965196,13.038312426842415,3.4558530535127208,null,96.0590767069652,0.74367947577759586,0.58486489481559012,0.4346104142280805,0.15025448058750959,0.13536000000000001,0.72234281831354918,1.0915059596386136E-2]
["RCoutEsr",{"$f":"Cout_ESR*1000","v":5},"mW","Output Capacitor ESR",null,null,16,48,1,3.2,3.2,0.88888888888888895,0.25057971103388443,4.794259079851166,5.5971295399255832,0.8028704600744172,0,3.4864609578187755,4.5704341639083747E-2,0.7,0.74866275542049587,1.3839833851584391,9.5770500519730614E-3,9.5770500519730614E-3,1.510846982521644,4.5653172091895131E-3,4.5653172091895131E-3,1.7452504484752518,1.7654031345326178E-2,7.863025674786045E-2,0.34421759999999996,0,0.44143706534782329,3.0181966275396217,3.3231495699329157E-2,0.128,0.16172594002833715,1.2155410010394612E-2,3.8400000000000004E-2,9.6960000000000005E-2,0.35552,0.29088000000000003,0.13536000000000001,1.494953135441994,1.5017464319385745,1.5017464319385745,38.400000000000006,0.96236389215444151,13.243111960434698,3.7196966206517543,null,96.236389215444149,0.74866275542049587,0.60316300537616041,0.44143706534782329,0.16172594002833715,0.13536000000000001,0.74092826650768395,1.2155410010394612E-2]
["Top Driver","Input Value","Units","Description",null,null,17,48,1,3.4,3.4,0.94444444444444431,0.25061594592000241,4.7946975748887066,5.7973487874443528,1.0026512125556466,0,3.6709345408066008,5.0668859114855004E-2,0.7,0.75397188141968619,1.3841099677724205,9.5788020144348535E-3,9.5788020144348535E-3,1.5908645865693647,5.0617002656010313E-3,5.0617002656010313E-3,1.8377269765557751,1.9574485592331374E-2,8.3544647794601704E-2,0.34421759999999996,0,0.44838997375665846,3.1778168547803598,3.683940082329535E-2,0.13600000000000001,0.17342718455130676,1.347576040288697E-2,3.8400000000000004E-2,9.6960000000000005E-2,0.35552,0.29088000000000003,0.13536000000000001,1.51968075372797,1.52734418638018,1.52734418638018,40.799999999999997,0.96391589844014747,13.451699212699754,3.9888252446800556,null,96.391589844014746,0.75397188141968619,0.62181715830796525,0.44838997375665846,0.17342718455130676,0.13536000000000001,0.7598965445576068,1.347576040288697E-2]
["RdsonDRT",0.5,"W","Drain to Source Resistance of pullup Top FET Driver",null,null,18,48,1,3.6,3.6,1,0.25065218115279725,4.7951360028859327,5.997568001442966,1.2024319985570338,0,3.8569561539960162,5.5934176509667505E-2,0.7,0.75960769164420805,1.3842365310335298,9.5805538692387022E-3,9.5805538692387022E-3,1.6715607683313518,5.5882308044489983E-3,5.5882308044489983E-3,1.9309918727264399,2.1611716834256126E-2,8.8459038841342999E-2,0.34421759999999996,0,0.45546957320873582,3.3387694082269559,4.0665646476466817E-2,0.14400000000000002,0.18535911933091365,1.4876110773847741E-2,3.8400000000000004E-2,9.6960000000000005E-2,0.35552,0.29088000000000003,0.13536000000000001,1.545124289435581,1.5537340788237697,1.5537340788237697,43.2,0.96528258231844488,13.664087196262075,4.2632597446110143,null,96.52825823184449,0.75960769164420805,0.64082869253964947,0.45546957320873582,0.18535911933091365,0.13536000000000001,0.77925027640571387,1.4876110773847741E-2]
["RdsonDRT2",0.5,"W","Drain to Source Resistance of pulldown Top FET Driver",null,null,19,48,1,3.8,3.8,1.0555555555555554,0.25068841673227399,4.7955743638418884,6.197787181920944,1.4022128180790556,0,4.0443121940895539,6.1500293823463094E-2,0.7,0.76557107670245195,1.3843630749414915,9.5823056163073083E-3,9.5823056163073083E-3,1.7528430448148486,6.1449174795115795E-3,6.1449174795115795E-3,2.0249383551934135,2.3765775484164423E-2,9.3373429888084253E-2,0.34421759999999996,0,0.46267630872524934,3.5008692893234463,4.4710200928825529E-2,0.152,0.19752267856431366,1.6356461123261463E-2,3.8400000000000004E-2,9.6960000000000005E-2,0.35552,0.29088000000000003,0.13536000000000001,1.5712837612477986,1.5809197096047134,1.5809197096047134,45.599999999999994,0.9664923931255438,13.880289261757481,4.543021606979214,null,96.649239312554386,0.76557107670245195,0.66019898728956306,0.46267630872524934,0.19752267856431366,0.13536000000000001,0.79899217177899995,1.6356461123261463E-2]
["Bottom Driver","Input Value","Units","Description",null,null,20,48,1,4,4,1.1111111111111109,0.25072465265843769,4.7960126577556066,6.3980063288778037,1.6019936711221967,0,4.2328254690115283,6.7367211056183623E-2,0.7,0.77186298029588563,1.384489599496026,9.5840572555633326E-3,9.5840572555633326E-3,1.8346346969098641,6.7317689422110982E-3,6.7317689422110982E-3,2.1194778432026466,2.6036711956084958E-2,9.8287820934825548E-2,0.34421759999999996,0,0.47001063667852988,3.6639630351964145,4.8973032449746309E-2,0.16,0.2099188257043452,1.7916811451112666E-2,3.8400000000000004E-2,9.6960000000000005E-2,0.35552,0.29088000000000003,0.13536000000000001,1.5981591878479529,1.6089048191372608,1.6089048191372608,48,0.96756822540221443,14.100319100355897,4.8281329911999391,null,96.756822540221449,0.77186298029588563,0.6799294623828751,0.47001063667852988,0.2099188257043452,0.13536000000000001,0.81912502739026249,1.7916811451112666E-2]
["RdsonDRB",0.5,"W","Drain to Source Resistance of pullup Bottom FET Driver",null,null,21,48,1,4.2,4.2,1.1666666666666667,0.25076088893129317,4.7964508846261271,6.5982254423130637,1.8017745576869366,0,4.4223479914391515,7.353492820777098E-2,0.7,0.77848439959462623,1.3846161046968566,9.5858087869294829E-3,9.5858087869294829E-3,1.9168716495391558,7.3487938416139289E-3,7.3487938416139289E-3,2.2145363549183785,2.8424576665011015E-2,0.10320221198156684,0.34421759999999996,0,0.47747302487871457,3.8279224770272866,5.345410930799685E-2,0.16800000000000001,0.22254855370186113,1.9557161757385901E-2,3.8400000000000004E-2,9.6960000000000005E-2,0.35552,0.29088000000000003,0.13536000000000001,1.6257505879197314,1.6376932895408154,1.6376932895408154,50.400000000000006,0.96852871090137316,14.324190746361436,5.1186167351428065,null,96.852871090137313,0.77848439959462623,0.70002157858057568,0.47747302487871457,0.22254855370186113,0.13536000000000001,0.83965172818880329,1.9557161757385901E-2]
["RdsonDRB2",0.5,"W","Drain to Source Resistance of pulldown Bottom FET Driver",null,null,22,48,1,4.4000000000000004,4.4000000000000004,1.2222222222222223,0.25079712555084543,4.7968890444524872,6.7984445222262444,2.0015554777737568,0,4.6127553633447436,8.0003445278167024E-2,0.7,0.78543638563513707,1.3847425905437052,9.587560210328458E-3,9.587560210328458E-3,1.9995000405639369,7.9960008244303708E-3,7.9960008244303708E-3,2.310051700508795,3.0929420026900644E-2,0.10811660302830811,0.34421759999999996,0,0.48506395266302749,3.9926398764529365,5.8153399771737647E-2,0.17600000000000002,0.23541288525749501,2.12775120420657E-2,3.8400000000000004E-2,9.6960000000000005E-2,0.35552,0.29088000000000003,0.13536000000000001,1.6540579801471789,1.6672891463389792,1.6672891463389792,52.800000000000004,0.96938916600274672,14.551918579890824,5.4144963609223851,null,96.938916600274666,0.78543638563513707,0.72047683792052253,0.48506395266302749,0.23541288525749501,0.13536000000000001,0.86057524866177637,2.12775120420657E-2]
["Deadtime","Input Value","Units","Description",null,null,23,48,1,4.5999999999999996,4.5999999999999996,1.2777777777777777,0.25083336251709959,4.7973271372337258,6.9986635686168626,2.2013364313831367,0,4.8039423711298399,8.6772762267313563E-2,0.7,0.79272004374034888,1.3848690570362943,9.5893115256829742E-3,9.5893115256829742E-3,2.0824743137689041,8.6733985350145367E-3,8.6733985350145367E-3,2.4059712803157134,3.3551292458676572E-2,0.11303099407504938,0.34421759999999996,0,0.49278391098770341,4.1580241104919722,6.3070872108521955E-2,0.184,0.24851287308299153,2.3077862305136587E-2,3.8400000000000004E-2,9.6960000000000005E-2,0.35552,0.29088000000000003,0.13536000000000001,1.683081383214698,1.6976965602328451,1.6976965602328451,55.199999999999996,0.97016229719535951,14.783517329631103,5.7157960809088051,null,97.016229719535957,0.79272004374034888,0.74129678407069499,0.49278391098770341,0.24851287308299153,0.13536000000000001,0.88189865418735969,2.3077862305136587E-2]
["Deadtime",15,"ns","Total Deadtime",null,null,24,48,1,4.8,4.8,1.333333333333333,0.25086959983006052,4.7977651629688793,7.1988825814844395,2.4011174185155602,0,4.9958195070061473,9.3842879175152619E-2,0.7,0.80033653396251947,1.3849955041743456,9.5910627329157481E-3,9.5910627329157481E-3,2.1657557128360816,9.380995615364247E-3,9.380995615364247E-3,2.5022503459955621,3.6290244378226338E-2,0.11794538512179065,0.34421759999999996,0,0.50063340252259059,4.3239976587121598,6.8206494585295971E-2,0.192,0.26184960017223646,2.4958212546583144E-2,3.8400000000000004E-2,9.6960000000000005E-2,0.35552,0.29088000000000003,0.13536000000000001,1.7128208158070486,1.7289198489501052,1.7289198489501052,57.599999999999994,0.97085873376168164,15.019002075677717,6.022540803961439,null,97.085873376168166,0.80033653396251947,0.76248300269482705,0.50063340252259059,0.26184960017223646,0.13536000000000001,0.90362510244100258,2.4958212546583144E-2]
["IQ","Input Value","Units","Description",null,null,25,48,1,5,5,1.3888888888888888,0.25090583748973316,4.7982031216569867,7.3991015608284929,2.6008984391715066,0,5.1883102033696771,0.10121379600162603,0.7,0.8082870715491659,1.385121931957582,9.5928138319495235E-3,9.5928138319495235E-3,2.249311083990039,1.0118800705120888E-2,1.0118800705120888E-2,2.5988506180465638,3.914632620440215E-2,0.12285977616853194,0.34421759999999996,0,0.50861294174846994,4.4904942079317829,7.3560235468398502E-2,0.2,0.27542418008212749,2.69185627663899E-2,3.8400000000000004E-2,9.6960000000000005E-2,0.35552,0.29088000000000003,0.13536000000000001,1.7432762966093482,1.7609634791716089,1.7609634791716089,60,0.97148743510509716,15.258388252454099,6.3347561418889322,null,97.148743510509718,0.8082870715491659,0.78403712183059748,0.50861294174846994,0.27542418008212749,0.13536000000000001,0.92575784485605306,2.69185627663899E-2]
["IQ ",{"$f":"Iq*1000","v":2},"mA","Quiescent Current Of Controller (Not Switching!)",null,null,26,48,1,5.2,5.2,1.4444444444444444,0.25094207549612252,4.7986410132970843,7.5993205066485423,2.800679493351458,0,5.3813486194950615,0.10888551274667568,0.7,0.81657292743242282,1.3852483403857252,9.5945648227070308E-3,9.5945648227070308E-3,2.3331119177580533,1.0886822441569322E-2,1.0886822441569322E-2,2.6957391794150989,4.2119588357021093E-2,0.12777416721527324,0.34421759999999996,0,0.5167230550571249,4.6574567352910341,7.9132063023561308E-2,0.20800000000000002,0.28923775722343392,2.8958912964541405E-2,3.8400000000000004E-2,9.6960000000000005E-2,0.35552,0.29088000000000003,0.13536000000000001,1.7744478443070724,1.7938320685370923,1.7938320685370923,62.400000000000006,0.97205600583835083,15.501691651713747,6.65246841613898,null,97.205600583835079,0.81657292743242282,0.80596081228055882,0.5167230550571249,0.28923775722343392,0.13536000000000001,0.94830022814012804,2.8958912964541405E-2]
["High-side FET","Input Value","Units","Description",null,null,27,48,1,5.4,5.4,1.5000000000000002,0.25097831384923364,4.7990788378882119,7.7995394189441063,3.0004605810558944,0,5.5748778588433856,0.11685802941024351,0.7,0.82519542874219598,1.3853747294584979,9.5963157051110314E-3,9.5963157051110314E-3,2.4171335771568097,1.1685069459637749E-2,1.1685069459637749E-2,2.7928875843489278,4.5210081256865015E-2,0.13268855826201451,0.34421759999999996,0,0.52496428085420388,4.8248359642802177,8.4921945515908703E-2,0.21600000000000003,0.30329150716179887,3.1079263141022211E-2,3.8400000000000004E-2,9.6960000000000005E-2,0.35552,0.29088000000000003,0.13536000000000001,1.8063354775860536,1.8275303877318763,1.8275303877318763,64.800000000000011,0.97257094211511719,15.748928425626117,6.9757046647213743,null,97.257094211511713,0.82519542874219598,0.82825578801600275,0.52496428085420388,0.30329150716179887,0.13536000000000001,0.97125569584865823,3.1079263141022211E-2]
["RdsonTop",{"$f":"Rdson1*1000","v":5.7960000000000003},"mW","Drain-Source Resistance of Top FET ",null,null,28,48,1,5.6,5.6,1.5555555555555551,0.2510145525490714,4.7995165954294041,7.9997582977147017,3.2002417022852976,0,5.7688485242565397,0.12513134599227138,0.7,0.83415595934350384,1.3855010991756214,9.5980664790842746E-3,9.5980664790842746E-3,2.5013546721624258,1.2513550391897594E-2,1.2513550391897594E-2,2.8902711361489248,4.8417855325680638E-2,0.13760294930875575,0.34421759999999996,0,0.53333716966491362,4.9925891134121239,9.0929851209957863E-2,0.22399999999999998,0.31758663692904293,3.3279613295816857E-2,3.8400000000000004E-2,9.6960000000000005E-2,0.35552,0.29088000000000003,0.13536000000000001,1.8389392151324824,1.8620633626564189,1.8620633626564189,67.199999999999989,0.97303782609450273,16.000115089947407,7.3044926493679876,null,97.30378260945028,0.83415595934350384,0.85092380659395661,0.53333716966491362,0.31758663692904293,0.13536000000000001,0.99462779001709811,3.3279613295816857E-2]
["RdsonTopTc",{"$f":"RdsonTopTc*1000000","v":4000},"ppm","Drain to Source Resistance Temp Co",null,null,29,48,1,5.8,5.8,1.6111111111111109,0.25105079159564081,4.7999542859197026,8.1999771429598507,3.4000228570401485,0,5.9632175399619554,0.13370546249270129,0.7,0.8434559603984163,1.3856274495368193,9.599817144549553E-3,9.599817144549553E-3,2.5857565496932819,1.3372273868563411E-2,1.3372273868563411E-2,2.9878682982922573,5.174296098617949E-2,0.14251734035549704,0.34421759999999996,0,0.54184228424258363,5.1606788759784346,9.7155748369618697E-2,0.23199999999999998,0.33212438534493749,3.5559963428909915E-2,3.8400000000000004E-2,9.6960000000000005E-2,0.35552,0.29088000000000003,0.13536000000000001,1.8722590756329061,1.8974360766806928,1.8974360766806928,69.599999999999994,0.97346148084742923,16.255268527277508,7.6388608629335621,null,97.346148084742921,0.8434559603984163,0.87396666958752112,0.54184228424258363,0.33212438534493749,0.13536000000000001,1.0184201528533665,3.5559963428909915E-2]
["QgTop",{"$f":"Qg_Q1*1000000000","v":7.1},"nC","Gate Charge Of Top FET",null,null,30,48,1,6,6,1.6666666666666665,0.25108703098894691,4.800391909358142,8.4001959546790701,3.599804045320929,0,6.1579471855713352,0.1425803789114751,0.7,0.85309693095302108,1.3857537805418125,9.6015677014296297E-3,9.6015677014296297E-3,2.6703228753741324,1.4261248517492747E-2,1.4261248517492747E-2,3.0856602115269198,5.5185448662038054E-2,0.14743173140223834,0.34421759999999996,0,0.55048019968014639,5.3290725834131374,0.10359960525819376,0.24,0.34690602334961912,3.7920313540285931E-2,3.8400000000000004E-2,9.6960000000000005E-2,0.35552,0.29088000000000003,0.13536000000000001,1.9062950777742309,1.9336537729854486,1.9336537729854486,72,0.97384609478488959,16.514405990404391,7.9788385370412396,null,97.384609478488954,0.85309693095302108,0.89738622302976556,0.55048019968014639,0.34690602334961912,0.13536000000000001,1.0426365284921415,3.7920313540285931E-2]
["QgdTop",{"$f":"Qgd_Q1*1000000000","v":1.8},"nC","Gate to Drain Charge",null,null,31,48,1,6.2,6.2,1.7222222222222223,0.2511232707289946,4.8008294657437611,8.6004147328718812,3.7995852671281196,0,6.3530042995365159,0.15175609524853476,0.7,0.86308042854987266,1.385880092190324,9.6033181496473063E-3,9.6033181496473063E-3,2.7550392886659534,1.5180482964186006E-2,1.5180482964186006E-2,3.1836302956751528,5.8745368777897669E-2,0.15234612244897963,0.34421759999999996,0,0.55925150352457476,5.4977415154214739,0.11026139013837835,0.24800000000000003,0.36193285434682532,4.0360663629929454E-2,3.8400000000000004E-2,9.6960000000000005E-2,0.35552,0.29088000000000003,0.13536000000000001,1.9410472402437198,1.970721856992526,1.970721856992526,74.400000000000006,0.97419532238175266,16.777545105737243,8.3244556499769828,null,97.419532238175265,0.86308042854987266,0.92118435787140007,0.55925150352457476,0.36193285434682532,0.13536000000000001,1.067280764812724,4.0360663629929454E-2]
["QgsTop",{"$f":"Qgs_Q1*1000000000","v":1.8},"nC",null,null,null,32,{"$f":"Vin","v":48},{"$f":"MODE","v":1},6.4,{"$f":"Iout*G41/100/Number_of_Phases","v":6.4},{"$f":"Vout*K41/(Vin*Efficiency)","v":1.7777777777777779},{"$f":"(Vout+(Rdson2+Rs+Rdcr)*K41)/(Vin+(Rs+Rdson2-Rdson1)*K41)","v":0.25115951081578886},{"$f":"(Vin-(Rdson1+Rdcr)*K41-Vout)*M41/(Fsw*Lo)","v":4.8012669550755973},8.800633477537799,3.9993665224622017,{"$f":"IF(MIN(Vin, -P41/(Coss_Q1+Coss_Q2)*0.00000002)<0, 0, MIN(Vin, -P41/(Coss_Q1+Coss_Q2)*0.00000002))","v":0},6.548359618853036,{"$f":"R41^2*Rdcr","v":0.16123261150382229},{"$f":"Core_Loss","v":0.7},{"$f":"(T41+S41*(1+Ltc*(Ta-25)))/(1-S41*Ltc*ThetaCA_Core)","v":0.87340806986639241},1.3860063844820756,9.6050684891253752E-3,9.6050684891253752E-3,2.8398931169840171,1.6129985831786393E-2,1.6129985831786393E-2,3.2817639195455368,{"$f":"Rdson1*AB41^2","v":6.2422771759364608E-2},{"$f":"(Vin*K41/2)*Fsw*(Tr_buck+Tf_buck)","v":0.1572605134957209},{"$f":"(0.5*Coss_Q1*(Vin-Q41)^2-0.5*Coss_Q2*(Vin-Q41)^2+(Qoss_Q2*(Vin-Q41)/Vin)*Vin)*Fsw","v":0.34421759999999996},{"$f":"IF(K41>N41/2,0,ABS(K41-N41/2)*Vsd_Q1*Deadtime*Fsw)","v":0},{"$f":"(AF41+AE41+AD41+AC41*(1+RdsonTopTc*Ta-RdsonTopTc*25))/(1-AC41*RdsonTopTc*ThetaJA_Q1)","v":0.56815679589432266},{"$f":"SQRT((1-M41))*SQRT(K41^2+(N41^2)/12)","v":5.6666603281116279},{"$f":"Rdson2*AH41^2","v":0.11714107127226038},{"$f":"IF(K41<N41/2,Deadtime*Fsw*Vsd_Q2*(K41+N41/2),2*Deadtime*Fsw*Vsd_Q2*K41)","v":0.25600000000000001},{"$f":"(AJ41+AI41*(1+RdsonBotTc*Ta-RdsonBotTc*25))/(1-AI41*RdsonBotTc*ThetaJA_Q2)","v":0.37720621455813869},{"$f":"CHOOSE(SENSING_TYPE, R41^2*Rs, 0)","v":4.2881013697825078E-2},{"$f":"IF(Ext_BIAS=1,  0.0008*Vin, 0.002*Vin)","v":3.8400000000000004E-2},{"$f":"IF(Ext_BIAS=1,  (Qg_Q1+Qg_Q2)*Fsw*Vout, (Qg_Q1+Qg_Q2)*Fsw*Vin)","v":9.6960000000000005E-2},{"$f":"(Vin-VCC)*Fsw*(Qg_Q1+Qg_Q2)","v":0.35552},{"$f":"(Qg_Q1+Qg_Q2)*Fsw*(Vin-Vout)","v":0.29088000000000003},{"$f":"SUM(AM41:AN41)","v":0.13536000000000001},1.976515581728993,{"$f":"U41 + AL41 + ((AF41+AE41+AD41+AC41*(1+RdsonTC*(Ta-25))) + (AJ41+AI41*(1+RdsonTC*(Ta-25))) + AQ41) / (1-AC41*RdsonTC*ThetaJA_Q1 -AI41*RdsonTC*ThetaJA_Q2)","v":2.0086458988864537},2.0086458988864537,{"$f":"Vout*K41","v":76.800000000000011},0.97451236630225058,{"$f":"ThetaJA_Q1*BC41","v":17.044703876829679},{"$f":"ThetaJA_Q2*BD41","v":8.6757429348371904},null,97.451236630225054,{"$f":"U41","v":0.87340806986639241},0.94536301045246129,0.56815679589432266,0.37720621455813869,0.13536000000000001,1.0923568153222363,4.2881013697825078E-2]
["RGateTop",{"$f":"Rgate1","v":0.4},"W","Gate Resistance",null,null,33,48,1,{"$f":"Iout*G42/100","v":6.6},6.6,1.833333333333333,0.25119575124933469,4.8017043773526886,9.000852188676344,4.1991478113236553,0,6.7439872289289902,0.17100992767727952,0.7,0.88408153137971834,1.3861326574167896,9.6068187197866552E-3,9.6068187197866552E-3,2.9248731375120975,1.7109765741079724E-2,1.7109765741079724E-2,3.3800481259159034,6.6217708033010109E-2,0.16217490454246214,0.34421759999999996,0,0.57719668959981707,5.8358065775391932,0.12423861692132056,0.26400000000000001,0.39272747338843267,4.5481363743957316E-2,3.8400000000000004E-2,9.6960000000000005E-2,0.35552,0.29088000000000003,0.13536000000000001,2.0127001209180295,2.0474316362297049,2.0474316362297049,79.199999999999989,0.9748000448137647,17.315900687994514,9.0327318879339522,null,97.480004481376469,0.88408153137971834,0.96992416298824979,0.57719668959981707,0.39272747338843267,0.13536000000000001,1.1178687411060293,4.5481363743957316E-2]
["GfsTop",{"$f":"Gfs_Q1","v":80},"S","Transconductance of Top FET",null,null,34,48,1,6.8,6.8,1.8888888888888886,0.25123199202963709,4.8021417325740723,9.2010708662870364,4.3989291337129632,0,6.9398641030146111,0.18108804376884857,0.7,0.89510255005852335,1.3862589109941883,9.6085688415539633E-3,9.6085688415539633E-3,3.0099693777922707,1.811983131049438E-2,1.811983131049438E-2,3.4784714012873414,7.013022802637045E-2,0.16708929558920341,0.34421759999999996,0,0.58637181026704555,6.0051603208188267,0.13155399534643211,0.27200000000000002,0.40849803380271982,4.8161713768310792E-2,3.8400000000000004E-2,9.6960000000000005E-2,0.35552,0.29088000000000003,0.13536000000000001,2.0496008764991651,2.0870849766740567,2.0870849766740567,81.599999999999994,0.97506084747418564,17.591154308011365,9.3954547774625556,null,97.506084747418569,0.89510255005852335,0.99486984406976542,0.58637181026704555,0.40849803380271982,0.13536000000000001,1.1438207128472226,4.8161713768310792E-2]
["VthTop",{"$f":"Vth_Q1","v":2.2000000000000002},"V","Threshold Voltage of Top FET",null,null,35,48,1,7,7,1.9444444444444444,0.25126823315670099,4.8025790207387864,9.4012895103693932,4.5987104896306068,0,7.1359697148229282,0.19146695977847128,0.7,0.90647292408234026,1.3863851452139939,9.6103188543501354E-3,9.6103188543501354E-3,3.0951729480031576,1.9160191156101115E-2,1.9160191156101115E-2,3.5770234822264397,7.4160382167946723E-2,0.1720036866359447,0.34421759999999996,0,0.59568279646429101,6.1747037806254852,0.13908717480786095,0.28000000000000003,0.42451933271461156,5.0922063770870024E-2,3.8400000000000004E-2,9.6960000000000005E-2,0.35552,0.29088000000000003,0.13536000000000001,2.0872178671610935,2.1276120007706165,2.1276120007706165,84,0.97529698140531784,17.870483893928728,9.7639446524360665,null,97.529698140531778,0.90647292408234026,1.0202021291789025,0.59568279646429101,0.42451933271461156,0.13536000000000001,1.1702170129174061,5.0922063770870024E-2]
["VspTop",{"$f":"Vsp_Q1","v":2.4500000000000002},"V",null,null,null,36,48,1,7.2,7.2,2,0.2513044746305314,4.8030162418458682,9.6015081209229347,4.7984918790770656,0,7.3322857112649125,0.20214667570608971,0.7,0.91819451358896131,1.3865113600759285,9.6120687580980042E-3,9.6120687580980042E-3,3.1804758992651569,2.0230853891613016E-2,2.0230853891613016E-2,3.6756951917589715,7.8308220887205252E-2,0.176918077682686,0.34421759999999996,0,0.60513029983206601,6.344421061759661,0.14683812356526565,0.28800000000000003,0.44079284138660513,5.3762413751619609E-2,3.8400000000000004E-2,9.6960000000000005E-2,0.35552,0.29088000000000003,0.13536000000000001,2.1255511115928658,2.1690189648812064,2.1690189648812064,86.4,0.97551040995789684,18.153908994961981,10.138235351891918,null,97.551040995789691,0.91819451358896131,1.0459231412186711,0.60513029983206601,0.44079284138660513,0.13536000000000001,1.1970620375406256,5.3762413751619609E-2]
["VsdTop",{"$f":"Vsd_Q1","v":2},"V",null,null,null,37,48,1,7.4,7.4,2.0555555555555558,0.25134071645113321,4.8034533958943539,9.8017266979471778,4.9982733020528229,0,7.5287956347973806,0.21312719155164578,0.7,0.93026924145050294,1.3866375555797137,9.6138185527204177E-3,9.6138185527204177E-3,3.2658711034259542,2.133182812838532E-2,2.133182812838532E-2,3.7744783005653173,8.2573794614577228E-2,0.18183246872942732,0.34421759999999996,0,0.61471498521629497,6.5142979106812149,0.15480680987769735,0.29600000000000004,0.4573200658424208,5.6682763710544093E-2,3.8400000000000004E-2,9.6960000000000005E-2,0.35552,0.29088000000000003,0.13536000000000001,2.1646006284838917,2.2113123041938829,2.2113123041938829,88.800000000000011,0.97570288518857029,18.441449556488848,10.518361514375679,null,97.570288518857026,0.93026924145050294,1.0720350510587158,0.61471498521629497,0.4573200658424208,0.13536000000000001,1.2243602990328359,5.6682763710544093E-2]
["θJATop",{"$f":"ThetaJA_Q1","v":30},"°C/W","Junction to Ambient Resistance",null,null,38,48,1,7.6,7.6,2.1111111111111107,0.25137695861851161,4.8038904828832845,10.001945241441643,5.1980547585583574,0,7.7254846869065794,0.22440850731508144,0.7,0.94269909407875052,1.3867637317250729,9.6155682381402503E-3,9.6155682381402503E-3,3.3513521506561612,2.2463122475415355E-2,2.2463122475415355E-2,3.8733654087400176,8.6957153781459101E-2,0.18674685977616851,0.34421759999999996,0,0.62443753080480047,6.6843215106698999,0.16299320200359979,0.30399999999999999,0.47410254729162327,5.9683113647628051E-2,3.8400000000000004E-2,9.6960000000000005E-2,0.35552,0.29088000000000003,0.13536000000000001,2.2043664365239364,2.254498635845517,2.254498635845517,91.199999999999989,0.97587597527401659,18.733125924144012,10.904358587707335,null,97.587597527401655,0.94269909407875052,1.0985400780964238,0.62443753080480047,0.47410254729162327,0.13536000000000001,1.2521164281191384,5.9683113647628051E-2]
["Low-side FET","Input Value","Units","Description",null,null,39,48,1,7.8,7.8,2.1666666666666665,0.25141320113267129,4.8043275028116925,10.202163751405847,5.3978362485941531,0,7.9223395258506857,0.2359906229963388,0.7,0.95548612226042384,1.3868898885117267,9.6173178142803482E-3,9.6173178142803482E-3,3.4369132618777534,2.3624745539342358E-2,2.3624745539342358E-2,3.9723498446777592,9.1458348820212171E-2,0.19166125082290983,0.34421759999999996,0,0.63429862826715067,6.8544803066567086,0.17139726820080928,0.312,0.49114186256676534,6.2763463562856073E-2,3.8400000000000004E-2,9.6960000000000005E-2,0.35552,0.29088000000000003,0.13536000000000001,2.2448485544031258,2.2985847621544737,2.2985847621544737,93.6,0.97603108775947656,19.028958848014518,11.296262839035602,null,97.603108775947661,0.95548612226042384,1.125440490833916,0.63429862826715067,0.49114186256676534,0.13536000000000001,1.2803351763311939,6.2763463562856073E-2]
["RdsonBot",{"$f":"Rdson2*1000","v":3.6479999999999997},"mW","Drain-Source Resistance of Low-side FET",null,null,40,48,1,8,8,2.2222222222222219,0.25144944399361741,4.8047644556786189,10.402382227839309,5.5976177721606906,0,8.119348093056038,0.24787353859535985,0.7,0.96863244202303733,1.3870160259393982,9.6190672810636067E-3,9.6190672810636067E-3,3.5225492135985439,2.481670592444744E-2,2.481670592444744E-2,4.071425578283808,9.6077430164163091E-2,0.1965756418696511,0.34421759999999996,0,0.6442989828979202,7.024763854871499,0.18001897672655473,0.32,0.50843962457330338,6.5923813456212732E-2,3.8400000000000004E-2,9.6960000000000005E-2,0.35552,0.29088000000000003,0.13536000000000001,2.2860470008119416,2.343577673966561,2.343577673966561,96,0.97616948936171399,19.328969486937606,11.694111365185979,null,97.616948936171397,0.96863244202303733,1.1527386074712236,0.6442989828979202,0.50843962457330338,0.13536000000000001,1.309021418487311,6.5923813456212732E-2]
["RdsonBotTc",{"$f":"RdsonBotTc*1000000","v":4000},"ppm","Drain To Source Resitance Temp Co",null,null,41,48,1,8.1999999999999993,8.1999999999999993,2.2777777777777772,0.25148568720135495,4.8052013414831007,10.60260067074155,5.7973993292584485,0,8.3164994635773635,0.26005725411208647,0.7,0.98214023553204666,1.3871421440078096,9.6208166384129136E-3,9.6208166384129136E-3,3.6082552731655086,2.60390122326534E-2,2.60390122326534E-2,4.1705871462144275,0.10081444824760354,0.20149003291639239,0.34421759999999996,0,0.65443931376342801,7.1951626933317891,0.18885829583745747,0.32799999999999996,0.52599748275254177,6.9164163327682576E-2,3.8400000000000004E-2,9.6960000000000005E-2,0.35552,0.29088000000000003,0.13536000000000001,2.3279617944412223,2.3894845541175531,2.3894845541175531,98.399999999999991,0.97629232290760892,19.633179412902841,12.09794210330846,null,97.629232290760896,0.98214023553204666,1.1804367965159699,0.65443931376342801,0.52599748275254177,0.13536000000000001,1.3381801552578241,6.9164163327682576E-2]
["QgBot",{"$f":"Qg_Q2*1000000000","v":13.1},"nC","Gate Charge Of Top FET",null,null,42,48,1,8.4,8.4,2.3333333333333335,0.25152193075588886,4.8056381602241762,10.802819080112089,5.9971809198879118,0,8.5137837168470654,0.27254176954646087,0.7,0.9960117520200138,1.3872682427166831,9.622565886251171E-3,9.622565886251171E-3,3.6940271428025961,2.7291673063524625E-2,2.7291673063524625E-2,4.2698295872602037,0.10566945350579035,0.20640442396313369,0.34421759999999996,0,0.66472035385201012,7.3656682299033518,0.19791519378953162,0.33600000000000002,0.54381712355787371,7.2484513177250243E-2,3.8400000000000004E-2,9.6960000000000005E-2,0.35552,0.29088000000000003,0.13536000000000001,2.3705929539821664,2.4363127810157477,2.4363127810157477,100.80000000000001,0.97640062188017473,19.941610615560304,12.507793841831095,null,97.640062188017467,0.9960117520200138,1.2085374774098838,0.66472035385201012,0.54381712355787371,0.13536000000000001,1.3678165158184836,7.2484513177250243E-2]
["RGateBot",{"$f":"Rgate2","v":0.4},"W","Gate Resistance",null,null,43,48,1,8.6,8.6,2.3888888888888884,0.25155817465722408,4.8060749119008817,11.003037455950441,6.1969625440495584,0,8.7111918245955451,0.28532708489842501,0.7,1.0102493087485414,1.3873943220657405,9.6243150245012791E-3,9.6243150245012791E-3,3.7798609110830381,2.8574697014266993E-2,2.8574697014266993E-2,4.3691483863135412,0.11064249637494557,0.2113188150098749,0.34421759999999996,0,0.67514285022788956,7.5362726452321267,0.20718963883818367,0.34399999999999997,0.56190027094459172,7.5884863004900271E-2,3.8400000000000004E-2,9.6960000000000005E-2,0.35552,0.29088000000000003,0.13536000000000001,2.4139404981263293,2.4840699323481328,2.4840699323481328,103.19999999999999,0.97649532295701458,20.254285506836688,12.92370623172561,null,97.649532295701462,1.0102493087485414,1.2370431211724813,0.67514285022788956,0.56190027094459172,0.13536000000000001,1.3979357605946912,7.5884863004900271E-2]
["VsdBot",{"$f":"Vsd_Q2","v":2},"V","Diode Forward Voltage of Bottom FET Body Diode",null,null,44,48,1,8.8000000000000007,8.8000000000000007,2.4444444444444446,0.2515944189053656,4.8065115965122542,11.203255798256128,6.3967442017438731,0,8.9087155533565685,0.29841320016792078,0.7,1.0248552920037679,1.387520382054704,9.6260640530861589E-3,9.6260640530861589E-3,3.8657530107165239,2.9888092679727737E-2,2.9888092679727737E-2,4.4685394256275632,0.11573362729225634,0.21623320605661622,0.34421759999999996,0,0.68570756418870815,7.7069688083077974,0.21668159923821251,0.35200000000000004,0.58024868687355502,7.9365212810617244E-2,3.8400000000000004E-2,9.6960000000000005E-2,0.35552,0.29088000000000003,0.13536000000000001,2.4580044455656229,2.5327637889139427,2.5327637889139427,105.60000000000001,0.97657727685701112,20.571226925661243,13.345719798091766,null,97.657727685701119,1.0248552920037679,1.2659562510622631,0.68570756418870815,0.58024868687355502,0.13536000000000001,1.4285432840995576,7.9365212810617244E-2]
["QrrBot",{"$f":"Qrr_Q2*1000000000","v":0},"nC","Reverse Recovery Charge of Body Diode",null,null,45,48,1,9,9,2.5,0.25163066350031843,4.8069482140573303,11.403474107028664,6.5965258929713348,0,9.1063473794044203,0.31180011535489044,0.7,1.0398321581262429,1.3876464226832954,9.6278129719287349E-3,9.6278129719287349E-3,3.9517001817189614,3.1231868652395346E-2,3.1231868652395346E-2,4.5679989422899911,0.12094289669587532,0.22114759710335749,0.34421759999999996,0,0.69641527142678472,7.8777502027941502,0.22639104324380968,0.36,0.59886417182900686,8.2925562594385757E-2,3.8400000000000004E-2,9.6960000000000005E-2,0.35552,0.29088000000000003,0.13536000000000001,2.5027848149923182,2.582402338589481,2.582402338589481,108,0.97664725775551087,20.892458142803541,13.773875952067158,null,97.664725775551091,1.0398321581262429,1.2952794432557915,0.69641527142678472,0.59886417182900686,0.13536000000000001,1.4596446178688525,8.2925562594385757E-2]
["TrrBot",{"$f":"Trr_Q2*1000000000","v":40},"ns","Reverse Recovery Time of Body Diode",null,null,46,48,1,9.1999999999999993,9.1999999999999993,2.5555555555555554,0.25166690844208756,4.8073847645351515,11.603692382267575,6.796307617732424,0,9.3040804143230833,0.32548783045927587,0.7,1.0551824345760299,1.3877724439512378,9.6295617809519576E-3,9.6295617809519576E-3,4.0376994391856025,3.2606033522399457E-2,3.2606033522399457E-2,4.6675234910122461,0.12627035502492004,0.22606198815009876,0.34421759999999996,0,0.70726676219416873,8.0486108625674806,0.23631793910855917,0.36799999999999999,0.61774856535084943,8.6565912356190391E-2,3.8400000000000004E-2,9.6960000000000005E-2,0.35552,0.29088000000000003,0.13536000000000001,2.5482816250990439,2.632993780428313,2.632993780428313,110.39999999999999,0.97670597148348548,21.218002865825063,14.208217003069537,null,97.670597148348548,1.0551824345760299,1.3250153275450183,0.70726676219416873,0.61774856535084943,0.13536000000000001,1.4912454334960927,8.6565912356190391E-2]
["θJABot",{"$f":"ThetaJA_Q2","v":23},"°C/W","Junction to Ambient Resistance",null,null,47,48,1,9.4,9.4,2.6111111111111112,0.25170315373067786,4.8078212479447497,11.803910623972374,6.9960893760276255,0,9.5019083396976498,0.33947634548101918,0.7,1.0709087210339312,1.387898445858252,9.6313104800787551E-3,9.6313104800787551E-3,4.1237480450138211,3.4010595877510624E-2,3.4010595877510624E-2,4.7671099114790429,0.13171605271947354,0.23097637919684008,0.34421759999999996,0,0.71826284147155828,8.2195453151554574,0.2464622550854374,0.376,0.63690374658168691,9.0286262096015743E-2,3.8400000000000004E-2,9.6960000000000005E-2,0.35552,0.29088000000000003,0.13536000000000001,2.5944948945787858,2.6845465289010617,2.6845465289010617,112.80000000000001,0.97675406268985754,21.547885244146748,14.648786171378799,null,97.675406268985753,1.0709087210339312,1.3551665880532453,0.71826284147155828,0.63690374658168691,0.13536000000000001,1.5233515457711149,9.0286262096015743E-2]
[null,null,null,null,null,null,48,48,1,9.6,9.6,2.6666666666666661,0.25173939936609441,4.8082576642851658,12.004128832142582,7.1958711678574172,0,9.6998253496568907,0.35376566042006252,0.7,1.0870136905397496,1.3880244284040608,9.6330590692320986E-3,9.6330590692320986E-3,4.2098434830252565,3.5445564303140442E-2,3.5445564303140442E-2,4.8667552996230024,0.13728004022058413,0.23589077024358129,0.34421759999999996,0,0.72940432914115327,8.3905485319755968,0.25682395942681324,0.38400000000000001,0.65633163482896739,9.4086611813846421E-2,3.8400000000000004E-2,9.6960000000000005E-2,0.35552,0.29088000000000003,0.13536000000000001,2.6414246421248873,2.7370692182792475,2.7370692182792475,115.19999999999999,0.97679212111661473,21.882129874234597,15.09562760106625,null,97.679212111661471,1.0870136905397496,1.3857359639701206,0.72940432914115327,0.65633163482896739,0.13536000000000001,1.5559689159256516,9.4086611813846421E-2]
[null,null,null,null,null,null,49,48,1,9.8000000000000007,9.8000000000000007,2.7222222222222223,0.25177564534834224,4.8086940135554377,12.20434700677772,7.3956529932222814,0,9.8978261001932655,0.368355775276348,0.7,1.1035000906685524,1.388150391588387,9.6348075483349612E-3,9.6348075483349612E-3,4.2959834370223771,3.6910947382341193E-2,3.6910947382341193E-2,4.9664569822875366,0.14296236797026557,0.24080516129032259,0.34421759999999996,0,0.74069206016351818,8.5616158844434516,0.26740302038444813,0.39200000000000002,0.67603419014255728,9.7966961509667036E-2,3.8400000000000004E-2,9.6960000000000005E-2,0.35552,0.29088000000000003,0.13536000000000001,2.6890708864310509,2.7905707071677894,2.7905707071677894,117.60000000000001,0.97682068711215397,22.220761804905546,15.548786373278817,null,97.682068711215393,1.1035000906685524,1.4167262503060756,0.74069206016351818,0.67603419014255728,0.13536000000000001,1.5891036549895701,9.7966961509667036E-2]
[null,null,null,null,null,null,50,48,1,10,10,2.7777777777777777,0.25181189167742618,4.8091302957546,12.4045651478773,7.5954348521227004,0,10.095905664350379,0.38324669004981737,0.7,1.1203707447459286,1.3882763354109515,9.6365559173103039E-3,9.6365559173103039E-3,4.3821657713855249,3.8406753695805783E-2,3.8406753695805783E-2,5.0662124948230574,0.14876308641149655,0.24571955233706388,0.34421759999999996,0,0.75212688475852951,8.7327431051623634,0.2781994062094954,0.4,0.69601341390809845,0.10192731118346207,3.8400000000000004E-2,9.6960000000000005E-2,0.35552,0.29088000000000003,0.13536000000000001,2.7374336461913349,2.8450600831909849,2.8450600831909849,120,0.97684025648842288,22.563806542755884,16.008308519886263,null,97.684025648842294,1.1203707447459286,1.4481402986666279,0.75212688475852951,0.69601341390809845,0.13536000000000001,1.6227620272615944,0.10192731118346207]
[null,null,null,null,null,null,51,48,1,10.199999999999999,10.199999999999999,2.833333333333333,0.25184813835335129,4.809566510881691,12.604783255440845,7.7952167445591538,0,10.294059492504219,0.39843840474041298,0.7,1.1376285531032835,1.3884022598714767,9.638304176081117E-3,9.638304176081117E-3,4.4683885138754311,3.9932991821867769E-2,3.9932991821867769E-2,5.1660195612297617,0.1546822459882215,0.25063394338380518,0.34421759999999996,0,0.76370966859048628,8.9039262535247712,0.28921308515250155,0.40799999999999997,0.7162713494565065,0.10596766083521622,3.8400000000000004E-2,9.6960000000000005E-2,0.35552,0.29088000000000003,0.13536000000000001,2.7865129401001569,2.9005466678370029,2.9005466678370029,122.39999999999999,0.97685128481102201,22.911290057714588,16.474241037499649,null,97.685128481102197,1.1376285531032835,1.4799810180469928,0.76370966859048628,0.7162713494565065,0.13536000000000001,1.6569504538985032,0.10596766083521622]
["Controller","Input Value","Units","Std Units",null,null,52,48,1,10.4,10.4,2.8888888888888888,0.25188438537612257,4.8100026589357485,12.805001329467874,7.9949986705321265,0,10.492283377078323,0.41393091934807696,0.7,1.1552764943742384,1.3885281649696852,9.6400523245704067E-3,9.6400523245704067E-3,4.5546498403555162,4.1489670336501056E-2,4.1489670336501056E-2,5.2658760765170918,0.16071989714535029,0.25554833443054648,0.34421759999999996,0,0.77544129295746234,9.0751616851535513,0.30044402546340515,0.41600000000000004,0.73681008268998227,0.11008801046491409,3.8400000000000004E-2,9.6960000000000005E-2,0.35552,0.29088000000000003,0.13536000000000001,2.8363087868522925,2.9570400214661081,2.9570400214661081,124.80000000000001,0.976854191197845,23.263238788723871,16.946631901869591,null,97.685419119784498,1.1552764943742384,1.5122513756474447,0.77544129295746234,0.73681008268998227,0.13536000000000001,1.6916755166269557,0.11008801046491409]
["θJA",23,"°C/W","Junction to Ambient Resistance",null,null,53,48,1,10.6,10.6,2.9444444444444442,0.25192063274574494,4.8104387399158108,13.005219369957905,8.1947806300420947,0,10.690573421128551,0.42972423387275122,0.7,1.1733176268332677,1.3886540507052989,9.6418003627011736E-3,9.6418003627011736E-3,4.640948061189647,4.3076797813319884E-2,4.3076797813319884E-2,5.3657800909977542,0.16687609032875783,0.26046272547728766,0.34421759999999996,0,0.78732265498498366,9.2464460246946967,0.3118921953915369,0.42399999999999999,0.75763174272492184,0.11428836007254022,3.8400000000000004E-2,9.6960000000000005E-2,0.35552,0.29088000000000003,0.13536000000000001,2.8868212051428737,3.0145499484881135,3.0145499484881135,127.19999999999999,0.97684936169052816,23.619679649549511,17.425530082673202,null,97.684936169052818,1.1733176268332677,1.5449543977099056,0.78732265498498366,0.75763174272492184,0.13536000000000001,1.7269439615823057,0.11428836007254022]
["Theta JC",2,"°C/W","Junction to Ambient Resistance",null,null,54,48,1,10.8,10.8,3.0000000000000004,0.25195688046222342,4.8108747538209125,13.205437376910456,8.3945626230895449,0,10.888926010313382,0.44581834831437817,0.7,1.1917550897777256,1.3887799170780393,9.6435482903964292E-3,9.6435482903964292E-3,4.7272816091057415,4.4694382823578738E-2,4.4694382823578738E-2,5.4657297962743057,0.17315087598528489,0.26537711652402901,0.34421759999999996,0,0.79935466782411446,9.4177761415420438,0.32355756318562029,0.43200000000000005,0.77873850255212207,0.11856870965807931,3.8400000000000004E-2,9.6960000000000005E-2,0.35552,0.29088000000000003,0.13536000000000001,2.9380502136673914,3.0730865027147347,3.0730865027147347,129.60000000000002,0.97683715225354417,23.980640034723432,17.910985558698808,null,97.683715225354419,1.1917550897777256,1.5780931703762366,0.79935466782411446,0.77873850255212207,0.13536000000000001,1.7627627032789297,0.11856870965807931]
[null,null,null,null,null,null,55,48,1,11,11,3.0555555555555554,0.25199312852556294,4.8113107006500924,13.405655350325047,8.5943446496749534,0,11.087337787833283,0.46221326267289953,0.7,1.2105921049544814,1.388905764087629,9.6452961075792036E-3,9.6452961075792036E-3,4.8136490283449245,4.6342433936172073E-2,4.6342433936172073E-2,5.5657235127100932,0.17954430456273734,0.27029150757077025,0.34421759999999996,0,0.81153826085403868,9.5891491281334158,0.33544009709377054,0.44,0.80013257971468987,0.12292905922151583,3.8400000000000004E-2,9.6960000000000005E-2,0.35552,0.29088000000000003,0.13536000000000001,2.9899958311216932,3.1326599928928029,3.1326599928928029,132,0.97681789144787379,24.346147825621159,18.403049333437867,null,97.681789144787373,1.2105921049544814,1.6116708405687286,0.81153826085403868,0.80013257971468987,0.13536000000000001,1.7991388287168057,0.12292905922151583]
[null,null,null,null,null,null,56,48,1,11.2,11.2,3.1111111111111103,0.25202937693576855,4.8117465804023878,13.605873290201194,8.794126709798805,0,11.285805631980134,0.47890897694825774,0.7,1.229831978032417,1.3890315917337901,9.6470438141725325E-3,9.6470438141725325E-3,4.9000489649407779,4.8020959717634377E-2,4.8020959717634377E-2,5.6657596782050677,0.18605642650988677,0.27520589861751149,0.34421759999999996,0,0.82387437988922685,9.7605622805072105,0.34753976536349607,0.44799999999999995,0.82181623700408468,0.12736940876283451,3.8400000000000004E-2,9.6960000000000005E-2,0.35552,0.29088000000000003,0.13536000000000001,3.0426580762019864,3.1932809884245499,3.1932809884245499,134.39999999999998,0.976791882819531,24.716231396676804,18.901773451093948,null,97.679188281953103,1.229831978032417,1.6456906168933116,0.82387437988922685,0.82181623700408468,0.13536000000000001,1.8360796016292984,0.12736940876283451]
["Outputs",null,null,null,null,null,57,48,1,11.4,11.4,3.1666666666666665,0.25206562569284519,4.812182393076835,13.806091196538418,8.9939088034615828,0,11.484326635986104,0.49590549114039478,0.7,1.2494781001220918,1.3891574000162441,9.6487914100994564E-3,9.6487914100994564E-3,4.9864801579942135,4.9729968732139994E-2,4.9729968732139994E-2,5.7658368381211984,0.1926872922764703,0.28012028966425284,0.34421759999999996,0,0.83636398739128048,9.9320130808504494,0.35985653624169683,0.45600000000000002,0.84379178317472325,0.1318897582820199,3.8400000000000004E-2,9.6960000000000005E-2,0.35552,0.29088000000000003,0.13536000000000001,3.0960369676048347,3.2549603252814219,3.2549603252814219,136.80000000000001,0.9767594070376252,25.090919621738415,19.407211013018635,null,97.675940703762521,1.2494781001220918,1.6801557705660037,0.83636398739128048,0.84379178317472325,0.13536000000000001,1.8735924668773101,0.1318897582820199]
["Design","Value","Units",null,null,null,58,48,1,11.6,11.6,3.2222222222222219,0.2521018747967978,4.8126181386724713,14.006309069336236,9.1936909306637631,0,11.68289808990289,0.51320280524925288,0.7,1.2695339493439404,1.3892831889347137,9.6505388952830371E-3,9.6505388952830371E-3,5.0729414318274424,5.1469469541502923E-2,5.1469469541502923E-2,5.865953636222943,0.19943695231319028,0.28503468071099408,0.34421759999999996,0,0.84900806268554396,10.103499181805253,0.37239037797466534,0.46399999999999997,0.86606157367761005,0.13649010777905662,3.8400000000000004E-2,9.6960000000000005E-2,0.35552,0.29088000000000003,0.13536000000000001,3.1501325240271592,3.3177091121181888,3.3177091121181888,139.19999999999999,0.97672072381188668,25.47024188056632,19.919416194585033,null,97.67207238118867,1.2695339493439404,1.7150696363631539,0.84900806268554396,0.86606157367761005,0.13536000000000001,1.9116850549951918,0.13649010777905662]
["Dmax",{"$f":"D1_Vinmin","v":0.33333333333333331},"index",null,null,null,59,48,1,11.8,11.8,3.2777777777777781,0.25213812424763143,4.8130538171883348,14.206526908594167,9.3934730914058342,0,11.881517464277417,0.53080091927477402,0.7,1.2900030924464048,1.3894089584889207,9.652286269646336E-3,9.652286269646336E-3,5.1594316889157881,5.3239470705176845E-2,5.3239470705176845E-2,5.9661088065158649,0.20630545707171499,0.28994907175773543,0.34421759999999996,0,0.86180760218258934,10.275018392331136,0.38514125880808686,0.47200000000000003,0.88862801141345416,0.14117045725392927,3.8400000000000004E-2,9.6960000000000005E-2,0.35552,0.29088000000000003,0.13536000000000001,3.2049447641662403,3.3815387365944023,3.3815387365944023,141.60000000000002,0.9766760736155653,25.854228065477681,20.438444262509446,null,97.667607361556534,1.2900030924464048,1.7504356135960435,0.86180760218258934,0.88862801141345416,0.13536000000000001,1.9503651868940683,0.14117045725392927]
["Dprime",{"$f":"1-B68","v":0.66666666666666674},"index",null,null,null,60,48,1,12,12,3.333333333333333,0.25217437404535104,4.8134894286234626,14.406744714311731,9.5932552856882687,0,12.080182395420298,0.54869983321690052,0.7,1.3108891864754779,1.3895347086785872,9.6540335331124303E-3,9.6540335331124303E-3,5.245949903509131,5.5039980780254925E-2,5.5039980780254925E-2,6.0663011658815327,0.21329285700467804,0.29486346280447667,0.34421759999999996,0,0.87476361960466253,10.446568664946728,0.39810914698703814,0.48,0.91149354750575495,0.14593080670662251,3.8400000000000004E-2,9.6960000000000005E-2,0.35552,0.29088000000000003,0.13536000000000001,3.2604737067197158,3.4464608719105514,3.4464608719105514,144,0.97662567923617682,26.242908588139876,20.964351592632365,null,97.662567923617686,1.3108891864754779,1.7862571671104175,0.87476361960466253,0.91149354750575495,0.13536000000000001,1.9896408787284512,0.14593080670662251]
["Ipp",{"$f":"Iripple_Vinnom","v":4.8328735297523906},"A",null,null,null,61,48,1,12.2,12.2,3.388888888888888,0.25221062418996154,4.8139249729768894,14.606962486488444,9.793037513511555,0,12.278890672089268,0.56689954707557433,0.7,1.3321959804971741,1.3896604395034347,9.6557806856043954E-3,9.6557806856043954E-3,5.3324951158660072,5.6871008321469643E-2,5.6871008321469643E-2,6.1665296074198324,0.22039920256567852,0.29977785385121791,0.34421759999999996,0,0.88787714621720382,10.618148084196953,0.41129401075598843,0.48799999999999999,0.93466068209436404,0.15077115613712083,3.8400000000000004E-2,9.6960000000000005E-2,0.35552,0.29088000000000003,0.13536000000000001,3.3167193703855795,3.5124874835666056,3.5124874835666056,146.39999999999998,0.97656974717365252,26.636314386516116,21.497195688170372,null,97.656974717365259,1.3321959804971741,1.8225378283115679,0.88787714621720382,0.93466068209436404,0.13536000000000001,2.0295203469323106,0.15077115613712083]
["Top FET","Value","Units",null,null,null,62,48,1,12.4,12.4,3.4444444444444446,0.25224687468146806,4.8143604502476558,14.807180225123828,9.9928197748761729,0,12.477640223432036,0.58540006085073815,0.7,1.353927317374521,1.3897861509631861,9.6575277270453397E-3,9.6575277270453397E-3,5.4190664270330196,5.8732561881192837E-2,5.8732561881192837E-2,6.2667930944209331,0.22762454420928185,0.30469224489795926,0.34421759999999996,0,0.90114923106554168,10.789754856210923,0.42469581835879994,0.49600000000000005,0.95813196515003085,0.15569150554540909,3.8400000000000004E-2,9.6960000000000005E-2,0.35552,0.29088000000000003,0.13536000000000001,3.3736817738621885,3.5796308363509803,3.5796308363509803,148.80000000000001,0.97650846890293785,27.03447693196625,22.03703519845071,null,97.650846890293792,1.353927317374521,1.8592811962155724,0.90114923106554168,0.95813196515003085,0.13536000000000001,2.0700120134310502,0.15569150554540909]
["Tr",{"$f":"(Qgd_Q1+Qgs_Q1/2)*(RdsonDRT+Rgate1)/(VCC-Vsp_Q1)*1000000000","v":1.5677419354838711},"ns","Turn on of MOSFET -> Rise time of current",null,null,63,48,1,12.6,12.6,3.4999999999999996,0.25228312551987542,4.8147958604347982,15.007397930217399,10.1926020697826,0,12.676429108052144,0.60420137454233347,0.7,1.3760871356007081,1.3899118430575634,9.6592746573583646E-3,9.6592746573583646E-3,5.50566299411049,6.0624650009435371E-2,6.0624650009435371E-2,6.3670906548986785,0.2349689323910181,0.30960663594470045,0.34421759999999996,0,0.91458094121686651,10.96138729923241,0.438314538038726,0.504,0.98190999731046646,0.16069185493147167,3.8400000000000004E-2,9.6960000000000005E-2,0.35552,0.29088000000000003,0.13536000000000001,3.4313609358482497,3.647903501568269,3.647903501568269,151.19999999999999,0.97644202201593699,27.437428236505994,22.583929938140727,null,97.6442022015937,1.3760871356007081,1.896490938527333,0.91458094121686651,0.98190999731046646,0.13536000000000001,2.1111245110360892,0.16069185493147167]
["Tf",{"$f":"(Qgd_Q1+Qgs_Q1/2)*(RdsonDRT2+Rgate1)/(Vsp_Q1)*1000000000","v":0.99183673469387756},"ns","Turn off of MOSFET -> Fall time of current",null,null,64,{"$f":"Vin","v":48},{"$f":"MODE","v":1},12.8,{"$f":"Iout*G73/100/Number_of_Phases","v":12.8},{"$f":"Vout*K73/(Vin*Efficiency)","v":3.5555555555555558},{"$f":"(Vout+(Rdson2+Rs+Rdcr)*K73)/(Vin+(Rs+Rdson2-Rdson1)*K73)","v":0.25231937670518872},{"$f":"(Vin-(Rdson1+Rdcr)*K73-Vout)*M73/(Fsw*Lo)","v":4.8152312035373512},15.207615601768676,10.392384398231325,{"$f":"IF(MIN(Vin, -P73/(Coss_Q1+Coss_Q2)*0.00000002)<0, 0, MIN(Vin, -P73/(Coss_Q1+Coss_Q2)*0.00000002))","v":0},12.875255504078098,{"$f":"R73^2*Rdcr","v":0.6233034881503029},{"$f":"Core_Loss","v":0.7},{"$f":"(T73+S73*(1+Ltc*(Ta-25)))/(1-S73*Ltc*ThetaCA_Core)","v":1.3986794711901174},1.3900375157862879,9.6610214764665733E-3,9.6610214764665733E-3,5.5922840259525115,6.2547281253847259E-2,6.2547281253847259E-2,6.4674213766255892,{"$f":"Rdson1*AB73^2","v":0.24243241756738373},{"$f":"(Vin*K73/2)*Fsw*(Tr_buck+Tf_buck)","v":0.3145210269914418},{"$f":"(0.5*Coss_Q1*(Vin-Q73)^2-0.5*Coss_Q2*(Vin-Q73)^2+(Qoss_Q2*(Vin-Q73)/Vin)*Vin)*Fsw","v":0.34421759999999996},{"$f":"IF(K73>N73/2,0,ABS(K73-N73/2)*Vsd_Q1*Deadtime*Fsw)","v":0},{"$f":"(AF73+AE73+AD73+AC73*(1+RdsonTopTc*Ta-RdsonTopTc*25))/(1-AC73*RdsonTopTc*ThetaJA_Q1)","v":0.92817336200760348},{"$f":"SQRT((1-M73))*SQRT(K73^2+(N73^2)/12)","v":11.133043835019231},{"$f":"Rdson2*AH73^2","v":0.45215013803841297},{"$f":"IF(K73<N73/2,Deadtime*Fsw*Vsd_Q2*(K73+N73/2),2*Deadtime*Fsw*Vsd_Q2*K73)","v":0.51200000000000001},{"$f":"(AJ73+AI73*(1+RdsonBotTc*Ta-RdsonBotTc*25))/(1-AI73*RdsonBotTc*ThetaJA_Q2)","v":1.0059974307384849},{"$f":"CHOOSE(SENSING_TYPE, R73^2*Rs, 0)","v":0.16577220429529335},{"$f":"IF(Ext_BIAS=1,  0.0008*Vin, 0.002*Vin)","v":3.8400000000000004E-2},{"$f":"IF(Ext_BIAS=1,  (Qg_Q1+Qg_Q2)*Fsw*Vout, (Qg_Q1+Qg_Q2)*Fsw*Vin)","v":9.6960000000000005E-2},{"$f":"(Vin-VCC)*Fsw*(Qg_Q1+Qg_Q2)","v":0.35552},{"$f":"(Qg_Q1+Qg_Q2)*Fsw*(Vin-Vout)","v":0.29088000000000003},0.13536000000000001,3.4897568750428345,{"$f":"U73 + AL73 + ((AF73+AE73+AD73+AC73*(1+RdsonTC*(Ta-25))) + (AJ73+AI73*(1+RdsonTC*(Ta-25))) + AQ73) / (1-AC73*RdsonTC*ThetaJA_Q1 -AI73*RdsonTC*ThetaJA_Q2)","v":3.7173183645145436},3.7173183645145436,{"$f":"Vout*K73","v":153.60000000000002},0.97637057125585325,{"$f":"ThetaJA_Q1*BC73","v":27.845200860228104},{"$f":"ThetaJA_Q2*BD73","v":23.137940906985154},null,97.637057125585329,{"$f":"U73","v":1.3986794711901174},1.9341707927460883,{"$f":"AG73","v":0.92817336200760348},{"$f":"AK73","v":1.0059974307384849},0.13536000000000001,2.1528666890291328,0.16577220429529335]
["Part Power","Value","Units",null,null,null,65,48,1,{"$f":"Iout*G74/100","v":13},13,3.6111111111111107,0.25235562823741281,4.8156664795543529,{"$f":"K74+N74/2","v":15.407833239777176},{"$f":"K74-N74/2","v":10.592166760222824},0,{"$f":"SQRT(K74^2+(N74^2)/12)","v":13.074117700130232},0.64270640167458848,0.7,1.4217084596290042,{"$f":"N74/SQRT(12)","v":1.3901631691490817},{"$f":"RCoutEsr*V74^2","v":9.6627681842930916E-3},{"$f":"W74","v":9.6627681842930916E-3},{"$f":"SQRT(M74*(1-M74))*SQRT(K74^2+(N74^2)/12)","v":5.6789287792557017},{"$f":"RCinEsr*Y74^2","v":6.4500464159717316E-2},{"$f":"Z74","v":6.4500464159717316E-2},{"$f":"SQRT(M74)*SQRT(K74^2+(N74^2)/12)","v":6.5677844026166641},0.25001505019584042,0.31943541803818304,0.34421759999999996,0,0.94192759729628894,11.304722981020097,0.46620258659989905,0.52,1.0303969700027786,0.17093255363685864,3.8400000000000004E-2,9.6960000000000005E-2,0.35552,0.29088000000000003,0.13536000000000001,{"$f":"SUM(S74,T74,AC74,AD74,AE74,AF74,AI74,AJ74,AQ74, AL74)","v":3.5488696101453696},3.7878886322093201,{"$f":"AS74","v":3.7878886322093201},156,{"$f":"AU74/(AU74+AT74)","v":0.97629426945537734},28.257827918888669,23.699130310063907,null,{"$f":"AV74*100","v":97.62942694553773},1.4217084596290042,{"$f":"AG74+AK74","v":1.9723245672990677},0.94192759729628894,1.0303969700027786,{"$f":"AQ74","v":0.13536000000000001},{"$f":"AS74-BA74-BG74","v":2.1952476189434575},{"$f":"AL74","v":0.17093255363685864}]
["Power Dis",{"$f":"AQ9","v":0.13536000000000001},"W",null,null,null,66,48,1,13.2,13.2,3.6666666666666661,0.25239188011655278,4.8161016884848422,15.60805084424242,10.791949155757578,0,13.273014087092358,0.66241011511513215,0.7,1.4451783378876855,1.3902888031456675,9.6645147807610642E-3,9.6645147807610642E-3,5.7655965549964208,6.64842072699732E-2,6.64842072699732E-2,6.6681789270155498,0.25771688073481586,0.32434980908492428,0.34421759999999996,0,0.95584476972207555,11.476423343248451,0.48047185196461456,0.52800000000000002,1.0551113729819253,0.17617290295615218,3.8400000000000004E-2,9.6960000000000005E-2,0.35552,0.29088000000000003,{"$f":"SUM(AM75:AN75)","v":0.13536000000000001},3.608699159855639,3.8596278413937735,3.8596278413937735,158.39999999999998,0.97621325838879347,28.675343091662267,24.267561578584282,null,97.621325838879343,1.4451783378876855,2.0109561427040008,0.95584476972207555,1.0551113729819253,0.13536000000000001,2.2382766005499355,0.17617290295615218]
["Temp rise",{"$f":"B75*B62","v":3.11328},"°C",null,null,null,67,48,1,13.4,13.4,3.7222222222222223,0.25242813234261363,4.8165368303278546,15.808268415163928,10.991731584836073,0,13.471943150605956,0.68241462847187673,0.7,1.4690934464961563,1.3904144177757669,9.6662612657936239E-3,9.6662612657936239E-3,5.8522866951808359,6.8498519125181262E-2,6.8498519125181262E-2,6.768604191341943,0.26553795964370375,0.32926420013166563,0.34421759999999996,0,0.96992602096898206,11.648143609782077,0.49495790237338244,0.53600000000000003,1.0801434517922341,0.18149325225315871,3.8400000000000004E-2,9.6960000000000005E-2,0.35552,0.29088000000000003,0.13536000000000001,3.6692455428737869,3.9325498668051737,3.9325498668051737,160.80000000000001,0.97612766954688157,29.097780629069462,24.843299391221386,null,97.612766954688155,1.4690934464961563,2.0500694727612161,0.96992602096898206,1.0801434517922341,0.13536000000000001,2.2819631680558592,0.18149325225315871]
["Current (switching)",{"$f":"(Qg_Q1+Qg_Q2)*Fsw+Iq","v":1.008E-2},"A",null,null,null,68,48,1,13.6,13.6,3.7777777777777772,0.25246438491560019,4.8169719050824256,16.008485952541214,11.191514047458787,0,13.670903464214161,0.70271994174476393,0.7,1.4934582316851346,1.3905400130391015,9.6680076393139223E-3,9.6680076393139223E-3,5.9389985798763378,7.0543408263546312E-2,7.0543408263546312E-2,6.8690594810638492,0.27347833738286276,0.33417859117840681,0.34421759999999996,0,0.98417251203601241,11.819882544825461,0.50966070606641711,0.54400000000000004,1.1054960737400497,0.18689360152786277,3.8400000000000004E-2,9.6960000000000005E-2,0.35552,0.29088000000000003,0.13536000000000001,3.730508777900313,4.0066689297379767,4.0066689297379767,163.19999999999999,0.97603762484245404,29.525175361080372,25.426409696021143,null,97.603762484245408,1.4934582316851346,2.089668585776062,0.98417251203601241,1.1054960737400497,0.13536000000000001,2.3263170965249795,0.18689360152786277]
["Qrr Current",{"$f":"Qrr_Q2*Fsw","v":0},"A",null,null,null,69,48,1,13.8,13.8,3.8333333333333335,0.25250063783551757,4.8174069127475949,16.208703456373797,11.391296543626204,0,13.869893683091052,0.72332605493373647,0.7,1.5182772475946145,1.390665588935394,9.669753901245132E-3,9.669753901245132E-3,6.0257316244963901,7.2618883220911812E-2,7.2618883220911812E-2,6.9695441224624837,0.28153806441361806,0.33909298222514817,0.34421759999999996,0,0.99858542351327584,11.991638983279046,0.52458023128332598,0.55200000000000005,1.1311721622991813,0.19237395078024908,3.8400000000000004E-2,9.6960000000000005E-2,0.35552,0.29088000000000003,0.13536000000000001,3.7924888836360777,4.0819996069025049,4.0819996069025049,165.60000000000002,0.97594323725345544,29.957562705398274,26.016959732881169,null,97.594323725345546,1.5182772475946145,2.1297575858124569,0.99858542351327584,1.1311721622991813,0.13536000000000001,2.3713484085276413,0.19237395078024908]
["Diode Current",{"$f":"Deadtime*Fsw*(Iripple_Vinnom/2)*(Vsd_Q2)/Vin","v":1.0068486520317481E-3},null,null,null,null,70,48,1,14,14,3.8888888888888888,0.25253689110237076,4.8178418533223981,16.4089209266612,11.5910790733388,0,14.068912538298832,0.74423296803873584,0.7,1.543555158552089,1.390791145464366,9.671500051510417E-3,9.671500051510417E-3,6.1124852773139384,7.4724952530759309E-2,7.4724952530759309E-2,7.0700574797610836,0.28971719119826023,0.34400737327188941,0.34421759999999996,0,1.0131659558642319,12.163411825765682,0.53971644626310755,0.56000000000000005,1.1571746981141069,0.19793430001030207,3.8400000000000004E-2,9.6960000000000005E-2,0.35552,0.29088000000000003,0.13536000000000001,3.855185878782295,4.1585568395925936,4.1585568395925936,168,0.97584461140977563,30.394978675926957,26.615018056624457,null,97.584461140977567,1.543555158552089,2.1703406539783385,1.0131659558642319,1.1571746981141069,0.13536000000000001,2.4170673810302024,0.19793430001030207]
["Total",{"$f":"SUM(B77:B79)","v":1.1086848652031748E-2},"A",null,null,null,71,48,1,14.2,14.2,3.9444444444444438,0.25257314471616471,4.8182767268058724,16.609138363402934,11.790861636597063,0,14.267958831521998,0.76544068105970475,0.7,1.5692967414226981,1.3909166826257398,9.6732460900329637E-3,9.6732460900329637E-3,6.1992590171813546,7.6861624724208669E-2,7.6861624724208669E-2,7.1705989524921865,0.29801576820004588,0.34892176431863065,0.34421759999999996,0,1.0279153297142023,12.335200034070162,0.55506931924415337,0.56799999999999995,1.1835067200296663,0.20357464921800658,3.8400000000000004E-2,9.6960000000000005E-2,0.35552,0.29088000000000003,0.13536000000000001,3.9185997820405412,4.2363559431741784,4.2363559431741784,170.39999999999998,0.97574184412922205,30.837459891426068,27.220654560682323,null,97.574184412922207,1.5692967414226981,2.2114220497438684,1.0279153297142023,1.1835067200296663,0.13536000000000001,2.4634845525334739,0.20357464921800658]
[null,null,null,null,null,null,72,48,1,14.4,14.4,4,0.25260939867690435,4.8187115331970549,16.809355766598529,11.990644233401472,0,14.467031430232922,0.78694919399658558,0.7,1.5955068880336301,1.3910422004192371,9.6749920167359654E-3,9.6749920167359654E-3,6.286052351437184,7.9028908330017897E-2,7.9028908330017897E-2,7.27116797308061,0.30643384588319744,0.353836155365372,0.34421759999999996,0,1.0428347861452829,12.507002626952392,0.57063881846424702,0.57600000000000007,1.2101713261479456,0.20929499840334723,3.8400000000000004E-2,9.6960000000000005E-2,0.35552,0.29088000000000003,0.13536000000000001,3.982730612112749,4.3154126169072793,4.3154126169072793,172.8,0.97563502490750864,31.285043584358487,27.833940501402751,null,97.563502490750864,1.5955068880336301,2.2530061122932286,{"$f":"AG81","v":1.0428347861452829},{"$f":"AK81","v":1.2101713261479456},0.13536000000000001,2.5106107304703018,0.20929499840334723]
[null,null,null,null,null,null,73,48,1,14.6,14.6,4.0555555555555554,0.25264565298459468,4.8191462724949821,17.009573136247489,12.190426863752508,0,14.666129263248314,0.80875850684932005,0.7,1.6221906076752195,1.3911676988445798,9.6767378315426172E-3,9.6767378315426172E-3,6.3728648139821242,8.1226811874582833E-2,8.1226811874582833E-2,7.3717640046218493,0.31497147471290315,0.35875054641211329,0.34421759999999996,0,1.0579255869978019,12.678818676299072,0.58642491216056303,0.58399999999999996,1.2371716749131005,0.21509534756630855,3.8400000000000004E-2,9.6960000000000005E-2,0.35552,0.29088000000000003,0.13536000000000001,4.0475783877012086,4.3957429541144739,4.3957429541144739,175.2,0.97552423636657382,31.737767609934057,28.454948523001313,null,97.55242363665738,1.6221906076752195,2.2950972619109025,{"$f":"AG82","v":1.0579255869978019},{"$f":"AK82","v":1.2371716749131005},0.13536000000000001,2.5584569988729462,0.21509534756630855]
[null,null,null,null,null,null,74,48,1,14.8,14.8,4.1111111111111116,0.2526819076392407,4.8195809446986901,17.209790472349347,12.390209527650656,0,14.865251316640268,0.83086861961785086,0.7,1.6493530296812731,1.3912931779014899,9.6784835343761335E-3,9.6784835343761335E-3,6.4596959635085494,8.3455343881937302E-2,8.3455343881937302E-2,7.4723865388377435,0.32362870515531716,0.36366493745885464,0.34421759999999996,0,1.073189015178466,12.850647303582482,0.60242756856966961,0.59200000000000008,1.2645109862248904,0.22097569670687522,3.8400000000000004E-2,9.6960000000000005E-2,0.35552,0.29088000000000003,0.13536000000000001,4.1131431275085673,4.4773634527095219,4.4773634527095219,177.60000000000002,0.97540955466508383,32.195670455353977,29.083752683172481,null,97.540955466508379,1.6493530296812731,2.3377000014033564,1.073189015178466,1.2645109862248904,0.13536000000000001,2.6070347263213733,0.22097569670687522]
[null,null,null,null,null,null,75,48,1,15,15,4.1666666666666661,0.2527181626408474,4.8200155498072164,17.410007774903608,12.589992225096392,0,15.064396629969352,0.85327953230212017,0.7,1.6769994060912556,1.3914186375896893,9.680229125159737E-3,9.680229125159737E-3,6.5465453818694632,8.5714512873752799E-2,8.5714512873752799E-2,7.5730350941931626,0.33240558767755968,0.36857932850559583,0.34421759999999996,0,1.0886263749753524,13.022487676598152,0.61864675592752583,0.6,1.2921925425817016,0.22693604582503196,3.8400000000000004E-2,9.6960000000000005E-2,0.35552,0.29088000000000003,0.13536000000000001,4.1794248502378331,4.5602910261004723,4.5602910261004723,180,0.97529104987456083,32.658791249260574,29.720428479379137,null,97.52910498745608,1.6769994060912556,2.380818917557054,1.0886263749753524,1.2921925425817016,0.13536000000000001,2.6563555741841847,0.22693604582503196]
[null,null,null,null,null,null,76,48,1,15.2,15.2,4.2222222222222214,0.25275441798941972,4.8204500878195997,17.6102250439098,12.789774956090199,0,15.263564292810619,0.87599124490207014,0.7,1.7051351143970759,1.3915440779089006,9.681974603816661E-3,9.681974603816661E-3,6.6334126725742957,8.8004327369338525E-2,8.8004327369338525E-2,7.6737092141591301,0.34130217274771635,0.37349371955233701,0.34421759999999996,0,1.1042389923798941,13.194339006456239,0.63508244246948342,0.60799999999999998,1.3202196902538965,0.23297639492076336,3.8400000000000004E-2,9.6960000000000005E-2,0.35552,0.29088000000000003,0.13536000000000001,4.2464235745923702,4.6445430144822417,4.6445430144822417,182.39999999999998,0.97516878632421455,33.127169771396822,30.36505287583962,null,97.516878632421452,1.7051351143970759,2.4244586826337908,1.1042389923798941,1.3202196902538965,0.13536000000000001,2.7064315051644021,0.23297639492076336]
[null,null,null,null,null,null,77,48,1,15.4,15.4,4.2777777777777777,0.25279067368496272,4.8208845587348739,17.810442279367436,12.989557720632563,0,15.462753441546369,0.89900375741764327,0.7,1.733765660377335,1.3916694988588449,9.6837199702701424E-3,9.6837199702701424E-3,6.7202974594001805,9.0324795885641046E-2,9.0324795885641046E-2,7.7744084656093282,0.35031851083483978,0.37840811059907836,0.34421759999999996,0,1.1200282154160233,13.366200544803899,0.65173459643028575,0.61599999999999999,1.3485958404883218,0.23909674399405406,3.8400000000000004E-2,9.6960000000000005E-2,0.35552,0.29088000000000003,0.13536000000000001,4.3141393192759008,4.7301371965343835,4.7301371965343835,184.8,0.97504282291723654,33.600846462480696,31.017704331231403,null,97.504282291723655,1.733765660377335,2.4686240559043453,1.1200282154160233,1.3485958404883218,0.13536000000000001,2.7572747921629945,0.23909674399405406]
[null,null,null,null,null,null,78,48,1,15.6,15.6,4.333333333333333,0.25282692972748133,4.8213189625520778,18.01065948127604,13.189340518723961,0,15.661963256402075,0.92231706984878137,0.7,1.7628966810219993,1.3917949004392447,9.6854652244434368E-3,9.6854652244434368E-3,6.8071993851085493,9.2675926937244427E-2,9.2675926937244427E-2,7.8751324373381504,0.35945465240894753,0.38332250164581966,0.34421759999999996,0,1.1359954144766298,13.538071581258285,0.66860318604406854,0.624,1.3773244707448644,0.24529709304488867,3.8400000000000004E-2,9.6960000000000005E-2,0.35552,0.29088000000000003,0.13536000000000001,4.3825721029925058,4.8170918015404887,4.8170918015404887,187.2,0.97491321342102599,34.079862434298896,31.678462827131881,null,97.491321342102594,1.7628966810219993,2.5133198852214944,1.1359954144766298,1.3773244707448644,0.13536000000000001,2.8088980274736008,0.24529709304488867]
[null,null,null,null,null,null,79,48,1,15.8,15.8,4.3888888888888893,0.2528631861169805,4.8217532992702461,18.210876649635125,13.389123350364878,0,15.861192958704335,0.94593118219542738,0.7,1.7925339475505975,1.3919202826498214,9.6872103662597932E-3,9.6872103662597932E-3,6.8941181102578302,9.5057729036369998E-2,9.5057729036369998E-2,7.9758807386897779,0.36871064794102387,0.38823689269256101,0.34421759999999996,0,1.1521419826675121,13.709951441031778,0.68568817954435912,0.63200000000000001,1.4064091259659504,0.251577442073252,3.8400000000000004E-2,9.6960000000000005E-2,0.35552,0.29088000000000003,0.13536000000000001,4.4517219444466232,4.9054255219464826,4.9054255219464826,189.60000000000002,0.97478000673357568,34.564259480025363,32.347409897216856,null,97.47800067335757,1.7925339475505975,2.5585511086334627,1.1521419826675121,1.4064091259659504,0.13536000000000001,2.861314132322633,0.251577442073252]
[null,null,null,null,null,null,80,48,1,16,16,4.4444444444444438,0.25289944285346527,4.8221875688884186,18.411093784444208,13.588906215555792,0,16.060441808341654,0.96984609445752334,0.7,1.8226833685271591,1.3920456454902979,9.6889553956425005E-3,9.6889553956425005E-3,6.9810533121039917,9.747021069287623E-2,9.747021069287623E-2,8.0766529982886563,0.37808654790301877,0.39315128373930219,0.34421759999999996,0,1.1684693361589868,13.88183948273295,0.70298954516407763,0.64,1.4358534198799364,0.25793779107912856,3.8400000000000004E-2,9.6960000000000005E-2,0.35552,0.29088000000000003,0.13536000000000001,4.5215888623430507,4.9951575263758894,4.9951575263758894,192,0.97464324712800576,35.054080084769609,33.024628657238537,null,97.464324712800575,1.8226833685271591,2.6043227560389233,1.1684693361589868,1.4358534198799364,0.13536000000000001,2.9145363667696018,0.25793779107912856]
[null,null,null,null,null,null,81,48,1,16.2,16.2,4.4999999999999991,0.25293569993694059,4.8226217714056299,18.611310885702814,13.788689114297185,0,16.259709101410852,0.99406180663501087,0.7,1.8533509930752481,1.3921709889603953,9.6907003125148248E-3,9.6907003125148248E-3,7.0680046835814458,9.9913380414258512E-2,9.9913380414258512E-2,8.1774488628627751,0.38758240276784806,0.39806567478604343,0.34421759999999996,0,1.1849789145453375,14.053735096328207,0.72050725113553471,0.64800000000000002,1.4656610363393527,0.26437814006250288,3.8400000000000004E-2,9.6960000000000005E-2,0.35552,0.29088000000000003,0.13536000000000001,4.5921728753869395,5.0863074731210229,5.0863074731210229,194.39999999999998,0.97450297447705092,35.549367436360129,33.71020383580511,null,97.450297447705097,1.8533509930752481,2.6506399508846901,1.1849789145453375,1.4656610363393527,0.13536000000000001,2.9685783399832721,0.26437814006250288]
[null,null,null,null,null,null,82,48,1,16.399999999999999,16.399999999999999,4.5555555555555545,0.2529719573674114,4.8230559068209153,18.811527953410454,13.988472046589541,0,16.458994168033477,1.0185783187278337,0.7,1.8845430141965964,1.3922963130598351,9.6924451168000532E-3,9.6924451168000532E-3,7.1549719323575767,0.10238724670564943,0.10238724670564943,8.2782679961519499,0.39719826300939459,0.40298006583278478,0.34421759999999996,0,1.201672181212287,14.22563770125074,0.73824126569043502,0.65599999999999992,1.4958357306950154,0.27089848902336,3.8400000000000004E-2,9.6960000000000005E-2,0.35552,0.29088000000000003,0.13536000000000001,4.6634740022838086,5.1788955241299988,5.1788955241299988,196.79999999999998,0.97435922445911538,36.050165436368609,34.404221805985351,null,97.435922445911544,1.8845430141965964,2.6975079119073024,1.201672181212287,1.4958357306950154,0.13536000000000001,3.0234540209100422,0.27089848902336]
[null,null,null,null,null,null,83,48,1,16.600000000000001,16.600000000000001,4.6111111111111116,0.25300821514488275,4.8234899751333158,19.011744987566658,14.188255012433343,0,16.658296370328038,1.0433956307359329,0.7,1.9162657721969554,1.3924216177883406,9.6941898084214988E-3,9.6941898084214988E-3,7.2419547799547219,0.10489181806981809,0.10489181806981809,8.3791100778939995,0.4069341791025059,0.40789445687952602,0.34421759999999996,0,1.2185506237126755,14.397546744644364,0.75619155705987284,0.66400000000000003,1.5263813312070289,0.27749883796168429,3.8400000000000004E-2,9.6960000000000005E-2,0.35552,0.29088000000000003,0.13536000000000001,4.7354922617395223,5.2729423595103944,5.2729423595103944,199.20000000000002,0.97421202874735702,36.556518711380264,35.106770617761661,null,97.421202874735698,1.9162657721969554,2.7449319549197044,1.2185506237126755,1.5263813312070289,0.13536000000000001,3.0791777493517545,0.27749883796168429]
[null,null,null,null,null,null,84,48,1,16.8,16.8,4.666666666666667,0.25304447326935958,4.823923976341864,19.211961988170934,14.388038011829069,0,16.857615100525354,1.0685137426592513,0.7,1.9485257582229858,1.3925469031456326,9.695934387302459E-3,9.695934387302459E-3,7.3289529609341342,0.10742710300717043,0.10742710300717043,8.4799748028824879,0.41679020152299689,0.41280884792626737,0.34421759999999996,0,1.2356157541505521,14.569461699731345,0.77435809347433593,0.67200000000000004,1.5573017404937741,0.28417918687746047,3.8400000000000004E-2,9.6960000000000005E-2,0.35552,0.29088000000000003,0.13536000000000001,4.8082276724603119,5.36846919257151,5.36846919257151,201.60000000000002,0.97406141518311906,37.068472624516566,35.817940031356805,null,97.406141518311912,1.9485257582229858,2.7929174946443265,1.2356157541505521,1.5573017404937741,0.13536000000000001,3.1357642474710636,0.28417918687746047]
[null,null,null,null,null,null,85,48,1,17,17,4.7222222222222223,0.253080731740847,4.8243579104455998,19.412178955222799,14.587821044777201,0,17.056949779215312,1.0939326544977315,0.7,1.9813296179141167,1.3926721691314339,9.697678853366266E-3,9.697678853366266E-3,7.4159662221368361,0.109993110015749,0.109993110015749,8.5808618800901542,0.42676638074764839,0.41772323897300861,0.34421759999999996,0,1.2528691095738609,14.741382064294005,0.79274084316370363,0.68,1.5886009370199796,0.29093953577067327,3.8400000000000004E-2,9.6960000000000005E-2,0.35552,0.29088000000000003,0.13536000000000001,4.8816802531527648,5.4654977854281448,5.4654977854281448,204,0.97390740793490072,37.586073287215825,36.53782155145953,null,97.390740793490068,1.9813296179141167,2.8414700465938405,1.2528691095738609,1.5886009370199796,0.13536000000000001,3.1932286317433545,0.29093953577067327]
[null,null,null,null,null,null,86,48,1,17.2,17.2,4.7777777777777768,0.25311699055934977,4.8247917774435578,19.612395888721778,14.78760411127822,0,17.256299853714502,1.1196523662513149,0.7,2.0146841551735037,1.3927974157454657,9.6994232065362382E-3,9.6994232065362382E-3,7.5029943219768125,0.11258984759123257,0.11258984759123257,8.6817710318527759,0.43686276725420636,0.4226376300197498,0.34421759999999996,0,1.2703122523759414,14.913307359261029,0.8113397743572468,0.68799999999999994,1.6202829766250322,0.29777988464130717,3.8400000000000004E-2,9.6960000000000005E-2,0.35552,0.29088000000000003,0.13536000000000001,4.9558500225238244,5.5640504651900589,5.5640504651900589,206.39999999999998,0.97375002764393848,38.109367571278241,37.266508462375739,null,97.375002764393841,2.0146841551735037,2.8905952290009735,1.2703122523759414,1.6202829766250322,0.13536000000000001,3.251586425375248,0.29777988464130717]
[null,null,null,null,null,null,87,48,1,17.399999999999999,17.399999999999999,4.833333333333333,0.25315324972487296,4.8252255773347734,19.812612788667387,14.987387211332612,0,17.455664796545189,1.1456728779199448,0.7,2.0485963360623844,1.3929226429874495,9.7011674467357093E-3,9.7011674467357093E-3,7.5900370297824153,0.11521732422693655,0.11521732422693655,8.7827019931087129,0.44707941152138442,0.42755202106649115,0.34421759999999996,0,1.287946770706051,15.085237127390185,0.83015485528362898,0.69599999999999995,1.6523519940927256,0.30470023348934699,3.8400000000000004E-2,9.6960000000000005E-2,0.35552,0.29088000000000003,0.13536000000000001,5.0307369992807969,5.6641501407624633,5.6641501407624633,208.79999999999998,0.97358929155737761,38.638403121181533,38.004095864132687,null,97.358929155737755,2.0485963360623844,2.9402987647987766,1.287946770706051,1.6523519940927256,0.13536000000000001,3.3108535712107319,0.30470023348934699]
[null,null,null,null,null,null,88,48,1,17.600000000000001,17.600000000000001,4.8888888888888893,0.25318950923742167,4.8256593101182874,20.012829655059146,15.187170344940858,0,17.655044104016781,1.1719941895035642,0.7,2.0830732928223035,1.3930478508571085,9.7029115738880428E-3,9.7029115738880428E-3,7.6770941251821485,0.11787554841381251,0.11787554841381251,8.8836545106896807,0.45741636402886204,0.43246641211323245,0.34421759999999996,0,1.3057742788891187,15.257170932039813,0.8491860541709052,0.70400000000000007,1.6848122047636718,0.31170058231477771,3.8400000000000004E-2,9.6960000000000005E-2,0.35552,0.29088000000000003,0.13536000000000001,5.1063412021313415,5.7658203202841509,5.7658203202841509,211.20000000000002,0.97342521364990731,39.173228366673563,38.750680709564449,null,97.342521364990731,2.0830732928223035,2.9905864836527902,1.3057742788891187,1.6848122047636718,0.13536000000000001,3.3710464451470696,0.31170058231477771]
[null,null,null,null,null,null,89,48,1,17.8,17.8,4.9444444444444446,0.25322576909700073,4.8260929757931317,20.213046487896566,15.386953512103435,0,17.854437294901885,1.1986163010021134,0.7,2.1181223280298753,1.3931730393541635,9.7046555879165882E-3,9.7046555879165882E-3,7.7641653975313982,0.1205645286404478,0.1205645286404478,8.984628342658814,0.46787367525728402,0.4373808031599738,0.34421759999999996,0,1.3237964178549653,15.429108356022239,0.86843333924652089,0.71200000000000008,1.7176679061916562,0.31878093111758338,3.8400000000000004E-2,9.6960000000000005E-2,0.35552,0.29088000000000003,0.13536000000000001,5.1826626497834756,5.8690851292312587,5.8690851292312587,213.60000000000002,0.97325780473466084,39.713892535648959,39.50636184240809,null,97.325780473466082,2.1181223280298753,3.0414643240466215,1.3237964178549653,1.7176679061916562,0.13536000000000001,3.4321818700838,0.31878093111758338]
[null,null,null,null,null,null,90,48,1,18,18,5,0.25326202930361519,4.826526574358347,20.413263287179173,15.586736712820827,0,18.053843909199749,1.2255392124155358,0.7,2.1537509188889796,1.393298208478337,9.7063994887447175E-3,9.7063994887447175E-3,7.8512506453770197,0.12328427339306613,0.12328427339306613,9.0856232576924238,0.47845139568826173,0.44229519420671498,0.34421759999999996,0,1.3420148555772125,15.601049000532861,0.88789667873731581,0.72,1.7509234798452735,0.3259412798977489,3.8400000000000004E-2,9.6960000000000005E-2,0.35552,0.29088000000000003,0.13536000000000001,5.2597013609455772,5.973969329216116,5.973969329216116,216,0.97308707256409899,40.260445667316375,40.271240036441291,null,97.308707256409903,2.1537509188889796,3.092938335422486,1.3420148555772125,1.7509234798452735,0.13536000000000001,3.4942771304293876,0.3259412798977489]
[null,null,null,null,null,null,91,48,1,18.2,18.2,5.0555555555555545,0.25329828985727004,4.826960105812967,20.613480052906482,15.786519947093517,0,18.253263506980311,1.2527629237437743,0.7,2.1899667216654408,1.3934233582293505,9.7081432762958046E-3,9.7081432762958046E-3,7.9383496759568057,0.12603479115552704,0.12603479115552704,9.1866390345020719,0.48914957580437457,0.44720958525345617,0.34421759999999996,0,1.3604312875221243,15.772992484149036,0.90757604086952015,0.72799999999999998,1.7845833928561925,0.33318162865525913,3.8400000000000004E-2,9.6960000000000005E-2,0.35552,0.29088000000000003,0.13536000000000001,5.3374573543263848,6.080498337512072,6.080498337512072,218.39999999999998,0.97291302192153062,40.812938625663726,41.045418035692428,null,97.291302192153069,2.1899667216654408,3.145014680378317,1.3604312875221243,1.7845833928561925,0.13536000000000001,3.5573499871913721,0.33318162865525913]
[null,null,null,null,null,null,92,48,1,18.399999999999999,18.399999999999999,5.1111111111111107,0.25333455075797023,4.8273935701560289,20.813696785078012,15.986303214921984,0,18.452695667302883,1.2802874349867708,0.7,2.2267775762695203,1.393548488606926,9.7098869504932388E-3,9.7098869504932388E-3,8.025462304731283,0.12881609040932551,0.12881609040932551,9.287675461293917,0.49996826608916556,0.45212397630019752,0.34421759999999996,0,1.3790474371076109,15.944938441893633,0.92747139386875577,0.73599999999999999,1.8186521998154881,0.34050197739009863,3.8400000000000004E-2,9.6960000000000005E-2,0.35552,0.29088000000000003,0.13536000000000001,5.4159306486349879,6.1886982473368883,6.1886982473368883,220.79999999999998,0.97273565470385925,41.371423113228325,41.829000595756227,null,97.273565470385932,2.2267775762695203,3.1976996369230992,1.3790474371076109,1.8186521998154881,0.13536000000000001,3.6214186936772692,0.34050197739009863]
[null,null,null,null,null,null,93,48,1,18.600000000000001,18.600000000000001,5.166666666666667,0.25337081200572076,4.8278269673865699,21.013913483693287,16.186086516306716,0,18.652139987203938,1.3081127461444679,0.7,2.2641915109917541,1.3936735996107854,9.7116305112604183E-3,9.7116305112604183E-3,8.1125883549454372,0.13162817963359263,0.13162817963359263,9.3887323352626613,0.51090751702714576,0.45703836734693881,0.34421759999999996,0,1.3978650561726673,16.116886524358403,0.94758270596003791,0.74400000000000011,1.8531345446195069,0.34790232610225214,3.8400000000000004E-2,9.6960000000000005E-2,0.35552,0.29088000000000003,0.13536000000000001,5.4951212625808425,6.298595848928942,6.298595848928942,223.20000000000002,0.97255496999609048,41.935951685180022,42.622094526248659,null,97.255496999609051,2.2641915109917541,3.2509996007921744,1.3978650561726673,1.8531345446195069,0.13536000000000001,3.6865020118349356,0.34790232610225214]
[null,null,null,null,null,null,94,48,1,18.8,18.8,5.2222222222222223,0.25340707360052656,4.8282602975036255,21.214130148751813,16.385869851248188,0,18.85159608074882,1.336238857216808,0.7,2.302216747397908,1.3937986912406504,9.7133739585207497E-3,9.7133739585207497E-3,8.199727657218089,0.1344710673050945,0.1344710673050945,9.4898094621174245,0.52196737910379254,0.46195275839368016,0.34421759999999996,0,1.4168859254574842,16.288836396882708,0.96790994536777064,0.752,1.8880351623667864,0.35538267479170432,3.8400000000000004E-2,9.6960000000000005E-2,0.35552,0.29088000000000003,0.13536000000000001,5.575029214873755,6.4102186514523005,6.4102186514523005,225.60000000000002,0.97237096413808244,42.506577763724522,43.424808734436084,null,97.237096413808246,2.302216747397908,3.3049210878242707,1.4168859254574842,1.8880351623667864,0.13536000000000001,3.7526192292626877,0.35538267479170432]
[null,null,null,null,null,null,95,48,1,19,19,5.2777777777777777,0.25344333554239268,4.8286935605062329,21.414346780253116,16.585653219746884,0,19.051063578142809,1.3646657682037324,0.7,2.3408617053890985,1.3939237634962431,9.715117292197652E-3,9.715117292197652E-3,8.2868800491570074,0.13734476189823289,0.13734476189823289,9.5909066556372942,0.53314790280554836,0.46686714944042135,0.34421759999999996,0,1.4361118550945082,16.460787738783701,0.98845308031575252,0.76,1.9233588813076208,0.36294302345843948,3.8400000000000004E-2,9.6960000000000005E-2,0.35552,0.29088000000000003,0.13536000000000001,5.6556545242238938,6.523594905768638,6.523594905768638,228,0.97218363078397374,43.083355652835245,44.237254270075276,null,97.218363078397374,2.3408617053890985,3.359470736402129,1.4361118550945082,1.9233588813076208,0.13536000000000001,3.8197901769210998,0.36294302345843948]
[null,null,null,null,null,null,96,48,1,19.2,19.2,{"$f":"Vout*K105/(Vin*Efficiency)","v":5.3333333333333321},0.25347959783132418,{"$f":"(Vin-(Rdson1+Rdcr)*K105-Vout)*M105/(Fsw*Lo)","v":4.8291267563934301},21.614563378196713,16.785436621803285,{"$f":"IF(MIN(Vin, -P105/(Coss_Q1+Coss_Q2)*0.00000002)<0, 0, MIN(Vin, -P105/(Coss_Q1+Coss_Q2)*0.00000002))","v":0},19.250542124897233,{"$f":"R105^2*Rdcr","v":1.3933934791051852},0.7,{"$f":"(T105+S105*(1+Ltc*(Ta-25)))/(1-S105*Ltc*ThetaCA_Core)","v":2.380135008433379},1.3940488163772857,9.7168605122145563E-3,9.7168605122145563E-3,8.3740453749978272,0.14024927188504502,0.14024927188504502,9.6920237372544218,{"$f":"Rdson1*AB105^2","v":0.54444913861982436},0.47178154048716259,0.34421759999999996,0,{"$f":"(AF105+AE105+AD105+AC105*(1+RdsonTopTc*Ta-RdsonTopTc*25))/(1-AC105*RdsonTopTc*ThetaJA_Q1)","v":1.4555446851107308},16.632740242634096,{"$f":"Rdson2*AH105^2","v":1.0092120790271719},0.76800000000000002,{"$f":"(AJ105+AI105*(1+RdsonBotTc*Ta-RdsonBotTc*25))/(1-AI105*RdsonBotTc*ThetaJA_Q2)","v":1.9591106248478927},0.37058337210244285,3.8400000000000004E-2,9.6960000000000005E-2,0.35552,0.29088000000000003,0.13536000000000001,5.7369972093417871,6.6387536281160084,6.6387536281160084,230.39999999999998,0.97199296095468268,43.666340553321923,45.059544371501531,null,97.19929609546827,2.380135008433379,3.4146553099586234,1.4555446851107308,1.9591106248478927,0.13536000000000001,3.888035247580186,0.37058337210244285]
[null,null,null,null,null,null,97,48,1,19.399999999999999,19.399999999999999,5.3888888888888884,0.25351586046732583,4.8295598851642509,21.814779942582124,16.985220057417873,0,19.450031381046635,1.4224219899211077,0.7,2.42004548897537,1.3941738498834992,9.71860361849489E-3,9.71860361849489E-3,8.4612234852650872,0.14318460573520295,0.14318460573520295,9.7931605356626044,0.55587113703499591,0.47669593153390394,0.34421759999999996,0,1.4751862859414655,16.804693613584256,1.0301869097246112,0.77599999999999991,1.9952954136088865,0.37830372072369889,3.8400000000000004E-2,9.6960000000000005E-2,0.35552,0.29088000000000003,0.13536000000000001,5.8190572889383185,6.7557246247365939,6.7557246247365939,232.79999999999998,0.97179894308382986,44.255588578243966,45.891794513004392,null,97.179894308382984,2.42004548897537,3.4704816995503522,1.4751862859414655,1.9952954136088865,0.13536000000000001,3.9573754150375247,0.37830372072369889]
[null,null,null,null,null,null,98,48,1,19.600000000000001,19.600000000000001,5.4444444444444446,0.25355212345040279,4.8299929468177316,22.014996473408868,17.185003526591135,0,19.649531020413502,1.4517513006514435,0.7,2.4606021940308298,1.3942988640146057,9.7203466109620999E-3,9.7203466109620999E-3,8.5484142364538567,0.14615077191601394,0.14615077191601394,9.8943168864496869,0.56741394854040594,0.48161032258064518,0.34421759999999996,0,1.4950385589559323,16.976647568725372,1.0513775406300427,0.78400000000000003,2.0319183675448298,0.38610406932219249,3.8400000000000004E-2,9.6960000000000005E-2,0.35552,0.29088000000000003,0.13536000000000001,5.9018347817247303,6.8745385174979008,6.8745385174979008,235.20000000000002,0.97160156305740097,44.851156768677967,46.734122453531086,null,97.160156305740102,2.4606021940308298,3.5269569265007621,1.4950385589559323,2.0319183675448298,0.13536000000000001,4.0278322541448786,0.38610406932219249]
[null,null,null,null,null,null,99,48,1,19.8,19.8,5.5,0.25358838678055995,4.8304259413529103,22.215212970676454,17.384787029323547,0,19.8490407299171,1.4813814112961339,0.7,2.5018143909733448,1.3944238587703273,9.7220894895396481E-3,9.7220894895396481E-3,8.635617490730473,0.14914777889242015,0.14914777889242015,9.995492631751997,0.57907762362636339,0.48652471362738658,0.34421759999999996,0,1.515103436994929,17.148601836490911,1.07278393996483,0.79200000000000004,2.0689847081199937,0.393984417897908,3.8400000000000004E-2,9.6960000000000005E-2,0.35552,0.29088000000000003,0.13536000000000001,5.9853297064126219,6.9952267705542299,6.9952267705542299,237.60000000000002,0.97140080424743447,45.453103109847873,47.586648286759853,null,97.140080424743445,2.5018143909733448,3.5840881451149227,1.515103436994929,2.0689847081199937,0.13536000000000001,4.0994279616829772,0.393984417897908]
[null,null,null,null,null,null,100,48,1,20,20,5.5555555555555554,0.2536246504578023,4.8308588687688232,22.415429434384411,17.584570565615589,0,20.048560208923487,1.5113123218551214,0.7,2.5436915735206598,1.3945488341503856,9.7238322541509988E-3,9.7238322541509988E-3,8.7228331156510883,0.15217563512699855,0.15217563512699855,10.096687619929359,0.59086221278414397,0.49143910467412777,0.34421759999999996,0,1.5353828849209039,17.320556156093701,1.0944060759497305,0.8,{"$f":"(AJ109+AI109*(1+RdsonBotTc*(Ta-25)))/(1-AI109*RdsonBotTc*ThetaJA_Q2)","v":2.1064997605472504},0.40194476645083016,3.8400000000000004E-2,9.6960000000000005E-2,0.35552,0.29088000000000003,0.13536000000000001,6.069542081713954,7.1178217180978738,7.1178217180978738,240,0.97119664753998358,46.061486547627119,48.449494492586759,null,97.119664753998364,2.5436915735206598,3.6418826454681543,1.5353828849209039,2.1064997605472504,0.13536000000000001,4.1721853781263842,0.40194476645083016]
[]
[null,null,null,null,null,null,null,null,null,null,null,null,null,null,null,null,null,null,null,null,null,null,null,null,null,null,null,null,null,null,null,null,null,null,null,null,null,null,null,null,null,null,null,null,null,null,null,null,null,null,null,null,null,null,null,"IC loss",{"$f":"SUM(BC109:BE109)","v":3.7772426454681542}]
[]
[null,null,null,null,null,null,null,null,null,null,null,null,null,null,null,null,null,null,null,null,null,null,null,null,null,null,null,null,null,null,null,null,null,null,null,null,null,null,null,null,null,null,null,null,null,null,null,null,null,null,null,null,null,null,{"$f":"BF109*BC109/(BC109+BD109+BE109)","v":1.695920178699176},{"$f":"BF109*BD109/(BC109+BD109+BE109)","v":2.3267521641815754},{"$f":"BC113+BD113","v":4.0226723428807514},{"$f":"BE113+BE109","v":4.1580323428807517}]
[]
[null,null,null,null,null,null,null,null,null,null,null,null,null,null,null,null,null,null,null,null,null,null,null,null,null,null,null,null,null,null,null,null,null,null,null,null,null,null,null,null,null,null,null,null,null,null,null,null,null,null,null,null,null,null,{"$f":"(AF109+AE109+AD109+AC109*(1+RdsonTopTc*(Ta-25))) + AC109*RdsonTopTc*(ThetaJA_Q1*BF109)","v":1.7223413196181205},null,{"$f":"MAX(BC113:BD113)","v":2.3267521641815754},"W"]

{"sheet":"Schematic Management","index":6,"n_rows":15,"n_cols":2,"rows_kept":15,"cut":false,"hidden":true,"merged":[]}
[{"$f":"VARIANT","v":"6"}]
[{"$f":"CHOOSE(VARIANT, \"LMG708B5_sch\", \"LMG708B5_5V_sch\", \"LMG708B5_12V_sch\", \"LMG708B5_sch_cc\", \"LMG708B5_5V_sch_cc\", \"LMG708B5_12V_sch_cc\")","v":"LMG708B5_12V_sch_cc"}]
[]
[]
[]
[]
[]
[]
[]
[]
[]
[]
[]
[]
[null," "]

{"sheet":"Stability Calculations","index":7,"n_rows":687,"n_cols":35,"rows_kept":687,"cut":false,"hidden":true,"merged":[[9,1,10,1],[1,0,1,3],[1,9,1,11],[1,12,1,14],[9,0,11,0],[10,6,10,7],[1,4,1,6],[9,2,9,7],[9,8,9,13],[10,2,10,3],[10,4,10,5],[10,8,10,9],[10,10,10,11],[10,12,10,13],[9,20,9,22],[10,14,10,15],[10,16,10,17],[9,27,9,28],[9,30,9,31],[10,18,10,19],[9,18,9,19]]}
[]
["Divider Network & EA Poles/Zeros",null,null,null,"Modulator",null,null,null,null,"Power Stage Poles/Zeros",null,null,"Complex Pole Pair",null,null,"Total System"]
[null,"Afb1",{"$f":"Afb","v":8.3333333333333329E-2},"V/V","Acs",{"$f":"Acs","v":50},"A/V","gm",{"$f":"gm","v":1E-3},"z_ESR",{"$f":"Fesr","v":244853.75888270215},"Hz","p3",{"$f":"Fsw/2","v":200000},"Hz","Adc",{"$f":"Am*Afb*AEA","v":51535.507333258443},"V/V"]
[null,"EA zero, z1",{"$f":"Fz1_u","v":4941.4724066615854},"Hz","Am",{"$f":"Am","v":24.619986008978977},"V/V",null,null,"p_dom",{"$f":"Fp_dominant","v":2486.3312147436159},"Hz","pterm1",{"$f":"Q*pole3","v":92977.512141077983},null,"Crossover",{"$f":"AI7","v":46.241500000000002},"kHz"]
[null,"EA pole, p1",{"$f":"Fp1_u","v":1.9192762040715436},"Hz","Q",{"$f":"Q","v":0.46488756070538989},null,null,null,null,null,null,"pterm2",{"$f":"pole3^2.00001","v":40004882727.046875},null,"Phase Margin",{"$f":"AI9","v":57.794115213474001},"°"]
[null,"Aea",{"$f":"AEA","v":25118.86431509586},"V/V","mc",{"$f":"mc","v":1.5874999999999999},null,"FF zero, z5",{"$f":"Fz_ff","v":1000000000},null,null,null,null,null,null,"radconv",{"$f":"180/Pi","v":57.295779578552292},null,null,null,null,null,null,null,null,null,null,null,null,null,null,null,null,"XOVER SEARCH"]
[null,"EA pole, p2",{"$f":"Fp2_u","v":214508.92398847072},"Hz","k",{"$f":"k","v":1.1847029549780386},null,"FF pole, p5",{"$f":"Fp_ff","v":1000000000},null,null,null,null,null,null,null,null,null,null,null,null,null,null,null,null,null,null,null,null,null,null,null,null,"xover",{"$f":"SUM(AH12:AH613)/1000","v":46.241500000000002}]
[]
[null,null,null,null,null,null,null,null,null,null,null,null,null,null,null,null,null,null,null,null,null,null,null,null,null,null,null,null,null,null,null,null,null,"phase margin",{"$f":"SUM(AI13:AI613)","v":57.794115213474001}]
["Freq (Hz)",null,"Power Stage",null,null,null,null,null,"Error Amplifier",null,null,null,null,null,null,"FF Network",null,null,"Sampling Double Pole",null,"System Response",null,null,null,null,null,null,"ERROR AMP Response",null,null,"PLANT Response"]
[null,null,"p_dom",null,"z_ESR",null,"z_RHP",null,"p1",null,"z1",null,"p2",null,"z3",null,"p3",null,"p3"]
[null,null,"Gain(V/V)","Phase(rad)","Gain(V/V)","Phase(rad)","Gain(V/V)","Phase(rad)","Gain(V/V)","Phase(rad)","Gain(V/V)","Phase(rad)","Gain(V/V)","Phase(rad)","Gain(V/V)","Phase(rad)","Gain(V/V)","Phase(rad)","Gain(V/V)","Phase(rad)","Gain (dB)","Phase (°)","Phase Margin (°)",null,null,"Fsquare",null,"Gain(dB)","Phase(Deg)",null,"Gain(dB)","Phase(Deg)"]
[1,{"$f":"A13/1000","v":1E-3},{"$f":"SQRT(1+(A13/pole1)^2)","v":1.0000000808820262},{"$f":"ATAN(A13/pole1)","v":4.021990071752245E-4},{"$f":"SQRT(1+(A13/Zero1)^2)","v":1.0000000000083398},{"$f":"ATAN(A13/Zero1)","v":4.0840704449772926E-6},{"$f":"IF(VIN_nom>Vout, 1, SQRT(1+(A13/z_RHP)^2))","v":1},{"$f":"IF(VIN_nom>Vout, 0, -ATAN(A13/z_RHP))","v":0},{"$f":"SQRT(1+(A13/Pole2)^2)","v":1.1275956721968363},{"$f":"ATAN(A13/Pole2)","v":0.48032952145616431},{"$f":"SQRT(1+(A13/Zero2)^2)","v":1.000000020476572},{"$f":"ATAN(A13/Zero2)","v":2.0236882937985345E-4},{"$f":"SQRT(1+(A13/pole4)^2)","v":1.0000000000108662},{"$f":"ATAN(A13/pole4)","v":4.6618107135090712E-6},{"$f":"SQRT(1+(A13/Zero3)^2)","v":1},{"$f":"ATAN(A13/Zero3)","v":1.0000000000000001E-9},{"$f":"SQRT(1+(A13/pole5)^2)","v":1},{"$f":"ATAN(A13/pole5)","v":1.0000000000000001E-9},{"$f":"SQRT((1-(Z13/pterm2))^2+(A13/pterm1)^2)","v":1.0000000000328413},{"$f":"IF((ATAN((A13/pterm1)/(1-A13^2/pterm2))>0),ATAN((A13/pterm1)/(1-A13^2/pterm2)),PI()+ATAN((A13/pterm1)/(1-A13^2/pterm2)))","v":1.0755288853815573E-5},{"$f":"20*LOG10(((E13*K13*G13*O13)/(C13*I13*S13*M13*Q13))*Adc)","v":93.199062583053859},{"$f":"((F13+L13+H13+R13)-(D13+J13+T13+N13))*radconv","v":-27.532953089686771},{"$f":"IF(V13>0,V13,V13+180)","v":152.46704691031323},null,{"$f":"IF(U13<0,A13,1000000000)","v":1000000000},{"$f":"A13^2","v":1},null,{"$f":"20*LOG10((K13/(I13*M13))*AEA*Afb)","v":65.373307249900307},{"$f":"(L13-(J13+N13))*radconv","v":-27.509526608661254},null,{"$f":"20*LOG10((E13*G13/(C13*S13))*Am)","v":27.825755333153538},{"$f":"(F13+H13-(D13+T13))*radconv","v":-2.3426538321297416E-2},null,{"$f":"SUM((U14<0)*(U13>0))*A13","v":0},{"$f":"IF(AH13>0,W11,0)","v":0}]
[1.0965,{"$f":"A14/1000","v":1.0965E-3},1.0000000972454501,4.4101120655666516E-4,1.0000000000100271,4.4781832429125651E-6,1,0,1.1516918472752782,0.51905606193314247,1.0000000246192333,2.2189742080217878E-4,1.0000000000130647,5.1116754473552051E-6,1,1.0965000000000001E-9,1,1.0965000000000001E-9,1.0000000000394853,1.179317422817642E-5,93.015404633439104,-29.752987941319933,150.24701205868007,null,1000000000,1.2023122500000001,null,65.189649442459498,{"$f":"(L14-(J14+N14))*radconv","v":-29.727300805151099},null,27.825755190979599,-2.5687198993652859E-2,null,0,0]
[1.2022999999999999,1.2022999999999999E-3,1.0000001169170123,4.8356385470996194E-4,1.0000000000120555,4.9102778959840356E-6,1,0,1.1800083226252149,0.55962989060764667,1.0000000295994025,2.4330804208362583E-4,1.0000000000157074,5.6048950208338663E-6,1,1.2022999999999999E-9,1,1.2022999999999999E-9,1.0000000000474727,1.2931083788864333E-5,92.804428947957717,-32.0789771281772,147.9210228718228,null,1000000000,1.4455252899999997,null,64.978673927894889,-32.050811470705824,null,27.825755020062843,-2.816572635809789E-2,null,0,0]
[1.3183,1.3183000000000001E-3,1.0000001405660734,5.3021893006202539E-4,1.0000000000144937,5.3840300675914758E-6,1,0,1.2131756801648352,0.60186181277756945,1.000000035586539,2.6678282508407444E-4,1.0000000000188844,6.1456650635861573E-6,1,1.3183000000000001E-9,1,1.3183000000000001E-9,1.0000000000570752,1.4178697295843178E-5,92.563656289088328,-34.500091481108171,145.49990851889183,null,1000000000,1.7379148900000001,null,64.737901474500831,-34.469208352381017,null,27.825754814587501,-3.0883204260186262E-2,null,0,0]
[1.4454,1.4454000000000001E-3,1.0000001689771978,5.813384108290002E-4,1.0000000000174234,5.9031154211344311E-6,1,0,1.2518602908383023,0.64547986127843049,1.0000000427792677,2.925039016365566E-4,1.0000000000227014,6.7381812052528466E-6,1,1.4454E-9,1,1.4454E-9,1.0000000000686113,1.55456945090754E-5,92.291012742648945,-37.0007593181926,142.99924068180741,null,1000000000,2.0891811599999999,null,64.465258174912051,-36.966898684474522,null,27.825754567736894,-3.3860716533395695E-2,null,0,0]
[1.5849,1.5849E-3,1.0000002031681969,6.3744515450486533E-4,1.0000000000209488,6.4728432481901007E-6,1,0,1.2968857664354236,0.69026400991754011,1.0000000514352643,3.2073435106445245E-4,1.0000000000272951,7.3885037997596043E-6,1,1.5849E-9,1,1.5849E-9,1.000000000082494,1.7046057304062787E-5,91.984095319917998,-39.568389795446102,140.43161020455389,null,1000000000,2.51190801,null,64.158341049250268,-39.531261168646274,null,27.825754270667744,-3.7128717607909104E-2,null,0,0]
[1.7378,1.7378000000000001E-3,1.000000244259561,6.9894135854156603E-4,1.0000000000251859,7.0972976192018324E-6,1,0,1.3490113236599344,0.73581553136816158,1.0000000618381983,3.5167654199903369E-4,1.0000000000328155,8.10129465781752E-6,1,1.7377999999999999E-9,1,1.7377999999999999E-9,1.0000000000991787,1.8690540969648694E-5,91.641817626046048,-42.180149618469535,137.81985038153047,null,1000000000,3.0199488400000001,null,63.816063712401395,-42.139439084105199,null,27.825753913644654,-4.0710633932939173E-2,null,0,0]
[1.9055,1.9055000000000001E-3,1.0000002936769641,7.6639009944977506E-4,1.0000000000302813,7.7821962327903975E-6,1,0,1.4091472232069997,0.78179634625491057,1.0000000743490023,3.856137905340096E-4,1.0000000000394547,8.8830803144222333E-6,1,1.9055000000000001E-9,1,1.9055000000000001E-9,1.0000000001192439,2.0494202910214337E-5,91.263001825133983,-44.81668520397043,135.18331479602958,null,1000000000,3.63093025,null,63.437248340853365,-44.772046050605688,null,27.825753484280632,-4.4639262541849849E-2,null,0,0]
[2.0893000000000002,2.0893000000000001E-3,1.0000003530641091,8.4031423321222155E-4,1.0000000000364047,8.5328483805314086E-6,1,0,1.4781822110151814,0.82778776452289449,1.0000000893838064,4.2280917580025425E-4,1.0000000000474332,9.7399211234970654E-6,1,2.0893000000000002E-9,1,2.0893000000000002E-9,1.0000000001433573,2.2471025001251353E-5,90.847569392997912,-47.45402310702984,132.54597689297015,null,1000000000,4.3651744900000002,null,63.021816424703559,-47.405078168959676,null,27.825752968294353,-4.894505777823533E-2,null,0,0]
[2.2909000000000002,2.2909000000000002E-3,1.0000004244868215,9.2139749447333848E-4,1.0000000000437692,9.3561969821774904E-6,1,0,1.557159446701214,0.87343798127132544,1.0000001074656071,4.6360672434050574E-4,1.0000000000570286,1.0679742163249267E-5,1,2.2909E-9,1,2.2909E-9,1.0000000001723577,2.4639291233786543E-5,90.395466663568712,-50.07202695920973,129.92797304079028,null,1000000000,5.2482228100000006,null,62.569714315831845,-50.018359245921538,null,27.825752347736874,-5.3667844547093189E-2,null,0,0]
[2.5118999999999998,2.5118999999999996E-3,1.0000005103364882,1.0102833968763259E-3,1.0000000000526212,1.0258776550435613E-5,1,0,1.6470856161350045,0.91834885867280525,1.0000001291998231,5.0833022567437804E-4,1.000000000068562,1.1710002330813022E-5,1,2.5119E-9,1,2.5119E-9,1.000000000207216,2.7016210069953949E-5,89.907804311530356,-52.647904500996439,127.35209549900355,null,1000000000,6.309641609999999,null,62.082052709699759,-52.58905953988117,null,27.825751601830603,-5.8845105036533597E-2,null,0,0]
[2.7542,2.7542000000000001E-3,1.0000006135399608,1.1077361121990805E-3,1.0000000000632627,1.1248346819144599E-5,1,0,1.7490805560751526,0.96218466972291572,1.0000001553274345,5.5736417977063303E-4,1.0000000000824272,1.2839559066534144E-5,1,2.7541999999999999E-9,1,2.7541999999999999E-9,1.0000000002491205,2.962221655853321E-5,89.385930894423893,-55.162442979165675,124.83755702083432,null,1000000000,7.5856176399999997,null,61.560180189278299,-55.09792178766336,null,27.82575070514558,-6.4521349306354031E-2,null,0,0]
[3.02,3.0200000000000001E-3,1.000000737676189,1.2146404698233743E-3,1.0000000000760625,1.2333892743274569E-5,1,0,1.8643854827819657,1.0046664403562355,1.0000001867545107,6.1115379697956299E-4,1.0000000000991045,1.4078668353969211E-5,1,3.0199999999999999E-9,1,3.0199999999999999E-9,1.0000000002995246,3.2480972334945992E-5,88.831412074947934,-57.599684973882425,122.40031502611757,null,1000000000,9.1204000000000001,null,61.005662448361811,-57.52893703165806,null,27.825749626586106,-7.0748115257625213E-2,null,0,0]
[3.3113000000000001,3.3113000000000001E-3,1.0000008868474166,1.3318008568691175E-3,1.0000000000914437,1.3523582463704068E-5,1,0,1.9941442088145436,1.0455013346020097,1.0000002245196025,6.7010381357216885E-4,1.0000000001191451,1.543665381452828E-5,1,3.3112999999999999E-9,1,3.3112999999999999E-9,1.0000000003600937,3.5613987976826651E-5,88.246994126425847,-59.942876416775462,120.05712358322454,null,1000000000,10.964707690000001,null,60.421245795916001,-59.865304351156205,null,27.825748330509846,-7.7572255342780741E-2,null,0,0]
[3.6307999999999998,3.6308E-3,1.0000010662436594,1.4603031959673988E-3,1.0000000001099414,1.4828442970619157E-5,1,0,2.1397981865941671,1.0845237576481959,1.0000002699366477,7.3476062351674767E-4,1.0000000001432463,1.6926102337114948E-5,1,3.6307999999999999E-9,1,3.6307999999999999E-9,1.0000000004329355,3.9050302763981719E-5,87.634667891596024,-62.182562089759109,117.8174379102409,null,1000000000,13.182708639999998,null,59.808921119772656,-62.097505277414903,null,27.825746771823372,-8.5057020373706632E-2,null,0,0]
[3.9811000000000001,3.9811000000000004E-3,1.0000012819111779,1.601193185412285E-3,1.0000000001321792,1.6259092847156759E-5,1,0,2.3027380236214809,1.1215734557588057,1.0000003245363578,8.0565038333355E-4,1.0000000001722209,1.8559134629554564E-5,1,3.9810999999999998E-9,1,3.9810999999999998E-9,1.0000000005205048,4.2817880447302461E-5,86.997232149496213,-64.309591585771798,115.6904084142282,null,1000000000,15.849157210000001,null,59.17148725150237,-64.216328495617745,null,27.825744897993843,-9.3263318254273822E-2,null,0,0]
[4.3651999999999997,4.3651999999999996E-3,1.0000015412035403,1.7556773968858247E-3,1.0000000001589151,1.7827784304625264E-5,1,0,2.4845303575026376,1.156560446873762,1.0000003901804124,8.8338019628290813E-4,1.0000000002070559,2.0349736123948192E-5,1,4.3651999999999998E-9,1,4.3651999999999998E-9,1.0000000006257874,4.6948986893179914E-5,86.337234959681822,-66.318845607376232,113.68115439262377,null,1000000000,19.054971039999998,null,58.511492314551887,-66.216584430336169,null,27.825742645129932,-0.10226142714759287,null,0,0]
[4.7862999999999998,4.7862999999999994E-3,1.0000018528978172,1.9250428339055129E-3,1.0000000001910541,1.9547586368413732E-5,1,0,2.6868311882504661,1.1894335949952959,1.0000004690908759,9.6859763837629765E-4,1.0000000002489311,2.2312824614527201E-5,1,4.7862999999999995E-9,1,4.7862999999999995E-9,1.0000000007523473,5.1478039025722274E-5,85.657311470974079,-68.207432991900916,111.79256700809908,null,1000000000,22.908667689999998,null,57.831571534001768,-68.095306956067702,null,27.825739936972305,-0.11212631006801844,null,0,0]
[5.2481,5.2481000000000003E-3,1.0000022276951497,2.1107775885933389E-3,1.0000000002296998,2.1433610099122301E-5,1,0,2.9115343227292643,1.220196167832015,1.000000563976926,1.0620514686515222E-3,1.0000000002992839,2.4465648800862739E-5,1,5.2480999999999997E-9,1,5.2480999999999997E-9,1.0000000009045296,5.6444831413391364E-5,84.959678372219116,-69.975585728249939,110.02441427175006,null,1000000000,27.542553609999999,null,57.133941691674593,-69.85264138626934,null,27.825736680544516,-0.12294464267459035,null,0,0]
[5.7544000000000004,5.7544000000000007E-3,1.0000026782527074,2.3144099593026485E-3,1.0000000002761573,2.3501374964381282E-5,1,0,3.1605829743063572,1.24886703571475,1.0000006780429465,1.1645106812880699E-3,1.0000000003598151,2.6825923563576017E-5,1,5.7544000000000007E-9,1,5.7544000000000007E-9,1.0000000010874734,6.1890234153442423E-5,84.246769805587164,-71.624430978917985,108.37556902108201,null,1000000000,33.113119360000006,null,56.421037039711777,-71.489625866123845,null,27.825732765875387,-0.13480544249697926,null,0,0]
[6.3095999999999997,6.3095999999999994E-3,1.0000032199935074,2.5377095449048881E-3,1.0000000003320169,2.5768850874068202E-5,1,0,3.4362168078089952,1.2755058929551695,1.0000008151935482,1.2768656893572582E-3,1.0000000004325964,2.9414160869686943E-5,1,6.3095999999999998E-9,1,6.3095999999999998E-9,1.0000000013074415,6.7861570516315972E-5,83.520499058985024,-73.157442206485044,106.84255779351496,null,1000000000,39.811052159999996,null,55.694771000021973,-73.009630786092742,null,27.825728058963037,-0.14781178190574273,null,0,0]
[6.9183000000000003,6.9183000000000005E-3,1.0000038712389612,2.7825263601629372E-3,1.0000000003991676,2.8254824552124561E-5,1,0,3.7407793800332114,1.3001814657633606,1.000000980067129,1.4000473766505211E-3,1.0000000005200893,3.2251805048320901E-5,1,6.9183E-9,1,6.9183E-9,1.0000000015718729,7.4408314830062461E-5,82.782864076597335,-74.578612781737263,105.42138721826274,null,1000000000,47.862874890000008,null,54.957141675973944,-74.416541760917511,null,27.825722400623395,-0.16207141720915264,null,0,0]
[7.5857999999999999,7.5858000000000002E-3,1.0000046542939192,3.0509919263366136E-3,1.0000000004799092,3.098094157176897E-5,1,0,4.076969823369029,1.3229876089645836,1.0000011783105767,1.5351282809606059E-3,1.0000000006252907,3.5363563696051622E-5,1,7.5858E-9,1,7.5858E-9,1.0000000018898241,8.1587470124709388E-5,82.035350966680213,-75.89338430650885,104.10661569349115,null,1000000000,57.544361639999998,null,54.209635369617146,-75.715676239730627,null,27.825715597063066,-0.17770850141253025,null,0,0]
[8.3176000000000005,8.3176000000000014E-3,1.0000055956028984,3.3453181630863724E-3,1.0000000005769689,3.3969664320265701E-5,1,0,4.4475952409942057,1.344016878271022,1.0000014166188276,1.6832214085722762E-3,1.0000000007517533,3.8775076771531088E-5,1,8.3176000000000003E-9,1,8.3176000000000003E-9,1.0000000022720332,8.9458190487776509E-5,81.279589658504236,-77.107126366608199,102.8928736333918,null,1000000000,69.182469760000004,null,53.453882239981958,-76.912274972714812,null,27.825707418522285,-0.19485187045675664,null,0,0]
[9.1201000000000008,9.1201000000000008E-3,1.0000067274391673,3.6680789119459397E-3,1.0000000006936742,3.7247130848219579E-5,1,0,4.8559258520769308,1.3633783065955549,1.0000017031624986,1.8456218904260282E-3,1.0000000009038128,4.2516179862964303E-5,1,9.1201000000000004E-9,1,9.1201000000000004E-9,1.0000000027316045,9.8089309766367087E-5,80.516646516750839,-78.226163507874276,101.77383649212572,null,1000000000,83.176224010000013,null,52.690948932151009,-78.01251258952955,null,27.825697584599837,-0.21365144088796351,null,0,0]
[10,0.01,1.0000080881702316,4.021968601718085E-3,1.0000000008339816,4.0840704427293069E-5,1,0,5.3053934817036437,1.3811745819630736,1.0000020476551146,2.0236855588841324E-3,1.0000000010866239,4.6618107101657526E-5,1,1E-8,1,1E-8,1.000000003284117,1.0755288839375331E-4,79.747726627820867,-79.256460366831973,100.74353963316803,null,1000000000,100,null,51.922040865873697,-79.022196786726113,null,27.82568576194717,-0.2342641530636437,null,0,0]
[10.965,1.0964999999999999E-2,1.0000097244981934,4.4100837609170954E-3,1.0000000010027061,4.4781832399489645E-5,1,0,5.7999492332290528,1.3975151583012773,1.0000024619203183,2.2189706024891742E-3,1.0000000013064612,5.1116754429475892E-5,1,1.0964999999999999E-8,1,1.0964999999999999E-8,1.0000000039485342,1.1793174209139336E-4,78.973584152169678,-80.204381331420777,99.795618668579223,null,1000000000,120.23122499999999,null,51.147912607365541,-79.947511591478658,null,27.825671544804138,-0.25687036819035713,null,0,0]
[12.023,1.2022999999999999E-2,1.0000116916335546,4.8356012333081568E-3,1.0000000012055414,4.9102778920771373E-5,1,0,6.3436554246331287,1.4124982232192878,1.0000029599359033,2.4330756676831998E-3,1.0000000015707424,5.6048950150233282E-5,1,1.2023E-8,1,1.2023E-8,1.0000000047472741,1.2931083763767837E-4,78.19526353062929,-81.075647690587871,98.924352309412129,null,1000000000,144.55252899999999,null,50.369609077138819,-80.793993253808964,null,27.825654453490483,-0.28165512564606726,null,0,0]
[13.183,1.3183E-2,1.0000140565095317,5.3021401111268121E-3,1.0000000014493888,5.3840300624411303E-5,1,0,6.9411471021972346,1.4262248338770556,1.0000035586476248,2.6678219849084308E-3,1.0000000018884598,6.1456650559262997E-5,1,1.3183E-8,1,1.3183E-8,1.0000000057075158,1.4178697262759234E-4,77.413414910952596,-81.876158446484311,98.123841553515689,null,1000000000,173.79148899999998,null,49.587781004471942,-81.567329977579092,null,27.825633906480665,-0.30882922423548409,null,0,0]
[14.454000000000001,1.4454E-2,1.0000168975784383,5.8133192758674885E-3,1.0000000017423385,5.9031154143461827E-5,1,0,7.59706645869153,1.438783465276406,1.0000042779177174,2.9250307577601718E-3,1.0000000022701543,6.7381811951570172E-5,1,1.4453999999999998E-8,1,1.4453999999999998E-8,1.0000000068611155,1.5545694465470165E-4,76.629102926876158,-82.611091686166148,97.388908313833852,null,1000000000,208.91811600000003,null,48.80349370470006,-82.272489063630672,null,27.825609222176098,-0.33860345068867248,null,0,0]
[15.849,1.5848999999999999E-2,1.0000203166153714,6.3743660714685266E-3,1.0000000020948849,6.4728432392405918E-5,1,0,8.3181289433549672,1.4502855014984133,1.0000051435133224,3.2073326226547344E-3,1.0000000027294993,7.3885037864494392E-5,1,1.5849000000000002E-8,1,1.5849000000000002E-8,1.0000000082493998,1.7046057246574399E-4,75.841486281754527,-83.28698646837924,96.71301353162076,null,1000000000,251.19080099999999,null,48.015906765399635,-82.915705097684167,null,27.825579516354896,-0.37128227877587361,null,0,0]
[17.378,1.7378000000000001E-2,1.0000244256607826,6.9893009114669292E-3,1.0000000025185816,7.0972976074042498E-5,1,0,9.1095090502327754,1.460799245247715,1.0000061838008998,3.516751067048008E-3,1.0000000032815488,8.1012946402715558E-5,1,1.7377999999999995E-8,1,1.7377999999999995E-8,1.0000000099178654,1.8690540893865322E-4,75.052073144877809,-83.907877158043448,96.092122841956552,null,1000000000,301.99488400000001,null,47.22652932925137,-83.5007782701785,null,27.825543815626435,-0.40709988355099985,null,0,0]
[19.055,1.9054999999999999E-2,1.000029367269508,7.6637524527962469E-3,1.0000000030281289,7.7821962172371697E-5,1,0,9.9784562767594345,1.4704119132227631,1.0000074348728709,3.8561189833085591E-3,1.0000000039454557,8.8830802912906858E-5,1.0000000000000002,1.9054999999999998E-8,1.0000000000000002,1.9054999999999998E-8,1.0000000119243999,2.0494202810306082E-4,74.260673330773557,-84.478930179282457,95.521069820717543,null,1000000000,363.09302500000001,null,46.435172449263391,-84.032547156495966,null,27.825500881510173,-0.44638411455757898,null,0,{"$f":"IF(AH45>0,W43,0)","v":0}]
[20.893000000000001,2.0893000000000002E-2,1.000035305793898,8.4029465284547415E-3,1.000000003640475,8.5328483600294176E-5,1,0,10.931709147986563,1.4791912595296948,1.0000089383410753,4.2280668153564811E-3,1.0000000047433031,9.7399210930054612E-5,1.0000000000000002,2.0892999999999997E-8,1.0000000000000002,2.0892999999999997E-8,1.0000000143357439,2.2471024869554033E-4,73.468140596774319,-85.004184701873214,94.995815298126786,null,1000000000,436.51744900000006,null,45.642691310589605,-84.514746539959049,null,27.825449286184721,-0.48943935899487084,null,0,0]
[22.909000000000002,2.2909000000000002E-2,1.000042447790259,9.2137168179635531E-3,1.000000004376921,9.3561969551496089E-5,1,0,11.978086418334238,1.4872132510152896,1.0000107465035388,4.6360343614556933E-3,1.0000000057028446,1.0679742123052025E-4,1.0000000000000002,2.2909E-8,1.0000000000000002,2.2909E-8,1.0000000172357779,2.4639291060169275E-4,72.674106765864281,-85.488198798311444,94.511801201688556,null,1000000000,524.82228100000009,null,44.848719530652829,-84.951536455088004,null,27.825387235211458,-0.5366636558124348,null,0,0]
[25.119,2.5118999999999999E-2,1.0000510323596752,1.0102493703849511E-2,1.0000000052621247,1.0258776514806857E-4,1,0,13.125894357638366,1.494537149750333,1.0000129198996806,5.0832589111403483E-3,1.0000000068562076,1.1710002277824128E-4,1.0000000000000004,2.5118999999999992E-8,1.0000000000000004,2.5118999999999992E-8,1.0000000207216015,2.7016209841087803E-4,71.879221799835804,-85.934561274331642,94.065438725668358,null,1000000000,630.96416099999999,null,44.053909148350591,-85.34613115903322,null,27.825312651485213,-0.58843155451112261,null,0,0]
[27.542000000000002,2.7542000000000001E-2,1.0000613521328623,1.107691259237764E-2,1.0000000063262653,1.1248346772178983E-4,1,0,14.385001882655994,1.5012233648440945,1.0000155326240303,5.5735846599658488E-3,1.0000000082427138,1.2839558996684489E-4,1.0000000000000004,2.7541999999999996E-8,1.0000000000000004,2.7541999999999996E-8,1.000000024912056,2.9622216256843193E-4,71.083534452714375,-86.346962873584999,93.653037126415001,null,1000000000,758.56176400000004,null,43.258311459758389,-85.701776657561624,null,27.825222992955993,-0.64518779406374349,null,0,0]
[30.2,3.0199999999999998E-2,1.0000737649254701,1.2145813383098517E-2,1.0000000076062454,1.2333892681356921E-4,1,0,15.766842513351058,1.5073294877802212,1.0000186752784455,6.1114626419034824E-3,1.0000000099104451,1.4078668261882136E-4,1.0000000000000004,3.0199999999999992E-8,1.0000000000000004,3.0199999999999992E-8,1.000000029952461,3.2480971937209587E-4,70.286757760160526,-86.728969092599201,93.271030907400799,null,1000000000,912.04,null,42.461642608730443,-86.021523550409555,null,27.825115151430072,-0.70744727252219264,null,0,0]
[33.113,3.3112999999999997E-2,1.0000886808488378,1.3317229122923935E-2,1.0000000091443642,1.3523582382085459E-4,1,0,17.281814504121325,1.5128996928300666,1.0000224517107297,6.7009388404460444E-3,1.000000011914514,1.5436653693140929E-4,1.0000000000000004,3.3112999999999987E-8,1.0000000000000004,3.3112999999999987E-8,1.0000000360093833,3.561398745253844E-4,69.489768765366492,-87.083352358139905,92.916647641860095,null,1000000000,1096.470769,null,41.664783200728252,-86.307676361153739,null,27.824985564638247,-0.77567789422130318,null,0,0]
[36.308,3.6308E-2,1.0001066187390133,1.4602004445421432E-2,1.000000010994136,1.4828442863022056E-4,1,0,18.943960196726785,1.5179845076740055,1.0000269933040897,7.3474753357878749E-3,1.000000014324647,1.692610217709106E-4,1.0000000000000007,3.6307999999999983E-8,1.0000000000000007,3.6307999999999983E-8,1.0000000432935578,3.9050302072817113E-4,68.692023687536675,-87.413333621120927,92.586666378879073,null,1000000000,1318.2708640000001,null,40.867193961422473,-86.562824370243519,null,27.82482972611421,-0.8505113311725786,null,0,0]
[39.811,3.9810999999999999E-2,1.0001281829845179,1.6010577354824466E-2,1.000000013217905,1.6259092705315405E-4,1,0,20.766806219137703,1.5226239281356397,1.0000324531144491,8.0563312745823758E-3,1.0000000172220738,1.8559134418600888E-4,1.0000000000000009,3.9810999999999978E-8,1.0000000000000009,3.9810999999999978E-8,1.0000000520504868,4.2817879536165287E-4,67.893904987784154,-87.721518081323396,92.278481918676604,null,1000000000,1584.9157210000001,null,40.069262601085697,-86.788964787316957,null,27.824642386698464,-0.93255557500872477,null,0,0]
[43.652000000000001,4.3652000000000003E-2,1.0001541085980743,1.7554988434058099E-2,1.0000000158914946,1.7827784117640575E-4,1,0,22.765963843756285,1.5268569681438939,1.0000390172876836,8.8335744862342094E-3,1.0000000207055879,2.0349735845855054E-4,1.0000000000000009,4.3651999999999973E-8,1.0000000000000009,4.3651999999999973E-8,1.0000000625787544,4.6948985692058415E-4,67.095410120064457,-88.010502764101417,91.989497235898583,null,1000000000,1905.497104,null,39.270992956829296,-86.987993297890242,null,27.824417163235154,-1.0225119672865319,null,0,0]
[47.863,4.7863000000000003E-2,1.0001852727903788,1.9248074703445306E-2,1.0000000191054066,1.9547586121927113E-4,1,0,24.958088536896032,1.5307184275987922,1.0000469079984129,9.6856765228393021E-3,1.0000000248931069,2.2312824247939763E-4,1.0000000000000011,4.7862999999999957E-8,1.0000000000000011,4.7862999999999957E-8,1.0000000752347451,5.1478037442382056E-4,66.296702309228721,-88.282667048184862,91.717332951815138,null,1000000000,2290.8667689999997,null,38.472555870815881,-87.161541544005644,null,27.824146438412839,-1.1211282465271155,null,0,0]
[52.481000000000002,5.2481E-2,1.0002227449554506,2.1104673283982689E-2,1.0000000229699819,2.1433609774184747E-4,1,0,27.362441616987613,1.5342417402187285,1.0000563961182514,1.0620119391409848E-2,1.000000029928398,2.446564831759908E-4,1.0000000000000013,5.2480999999999952E-8,1.0000000000000013,5.2480999999999952E-8,1.0000000904529682,5.6444829326110957E-4,65.497588624303049,-88.540371984770005,91.459628015229995,null,1000000000,2754.255361,null,37.673767697209996,-87.311106331971132,null,27.823820927093045,-1.2292686597386679,null,0,0]
[57.544000000000004,5.7544000000000005E-2,1.0002677897737082,2.3140009848388526E-2,1.0000000276157308,2.3501374536036244E-4,1,0,29.998807872105882,1.5374554921578538,1.0000678020190839,1.1644585727042673E-2,1.0000000359815082,2.6825922926519496E-4,1.0000000000000018,5.7543999999999936E-8,1.0000000000000018,5.7543999999999936E-8,1.0000001087473573,6.189023140191006E-4,64.698313386409851,-88.785712296583768,91.214287703416232,null,1000000000,3311.3119360000005,null,36.874883736249217,-87.437895495080724,null,27.823429650160641,-1.3478200985313951,null,0,0]
[63.095999999999997,6.3095999999999999E-2,1.000321948043889,2.5371704403121746E-2,1.0000000332016832,2.5768850309392525E-4,1,0,32.890098738479089,1.5403873534990042,1.0000815160656038,1.2767969971623567E-2,1.0000000432596421,2.9414160029872559E-4,1.000000000000002,6.3095999999999919E-8,1.000000000000002,6.3095999999999919E-8,1.0000001307441515,6.7861566889045348E-4,63.898738402153661,-89.020801868793384,90.979198131206616,null,1000000000,3981.1052159999995,null,36.075779168624436,-87.542996550804332,null,27.822959233529218,-1.4778089331235509,null,0,0]
[69.183000000000007,6.9183000000000008E-2,1.0003870497416936,2.7818157499247723E-2,1.0000000399167548,2.8254823807749585E-4,1,0,36.060269508257505,1.5430614199480792,1.0000980019587222,1.399956826035486E-2,1.0000000520089452,3.2251803941248585E-4,1.0000000000000024,6.9182999999999899E-8,1.0000000000000024,6.9182999999999899E-8,1.0000001571872783,7.4408310048469152E-4,63.09904025137304,-89.247572794977884,90.752427205022116,null,1000000000,4786.2874890000012,null,35.276646454975996,-87.627269738769144,null,27.822393796397048,-1.6203070201026493,null,0,0]
[75.858000000000004,7.5858000000000009E-2,1.0004653222126676,3.0500552355139255E-2,1.0000000479909359,3.0980940590478111E-4,1,0,39.536923173992299,1.5455008163838266,1.0001178241858029,1.5350089132223939E-2,1.0000000625290799,3.5363562236625959E-4,1.0000000000000029,7.5857999999999858E-8,1.0000000000000029,7.5857999999999858E-8,1.0000001889824117,8.1587463821254994E-4,62.299054521296597,-89.467984599663112,90.532015400336888,null,1000000000,5754.4361640000006,null,34.477340507356061,-87.691440619239543,null,27.821714013940536,-1.7765483267668276,null,0,0]
[83.176000000000002,8.3176E-2,1.0005594053881768,3.3440835334791322E-2,1.000000057696903,3.3969663026702434E-4,1,0,43.348706356377349,1.5477255410722648,1.0001416519504505,1.6830640594401803E-2,1.0000000751753262,3.8775074847678014E-4,1.0000000000000036,8.3175999999999818E-8,1.0000000000000036,8.3175999999999818E-8,1.0000002272033177,8.9458182178398264E-4,61.498978871351383,-89.683839801381197,90.316160198618803,null,1000000000,6918.2469760000004,null,33.678081882680992,-87.736033257125527,null,27.820896988670384,-1.9478113098894245,null,0,0]
[91.201000000000008,9.1201000000000004E-2,1.0006725200380491,3.6664515585313168E-2,1.0000000693674356,3.7247129142952621E-4,1,0,47.528955259787757,1.5497549681506566,1.0001703018935215,1.8454144688255458E-2,1.0000000903812736,4.2516177326804586E-4,1.000000000000004,9.1200999999999759E-8,1.000000000000004,9.1200999999999759E-8,1.0000002731604396,9.8089298812354948E-4,60.698602823509617,-89.897011198126449,90.102988801873551,null,1000000000,8317.6224010000005,null,32.878688029203282,-87.761434424803753,null,27.819914794306328,-2.1355819987550881,null,0,0]
[100,0.1,1.0008084934632491,4.0198236795331084E-2,1.0000000833981535,4.0840702179307235E-4,1,0,52.112570456372147,1.551605920862267,1.0002047447609048,2.0234121346195028E-2,1.0000001086623898,4.6618103758338728E-4,1.0000000000000049,9.9999999999999665E-8,1.0000000000000049,9.9999999999999665E-8,1.0000003284116823,1.0755287395351387E-3,59.898036697565928,-90.109258128042512,89.890741871957488,null,1000000000,10000,null,32.079302437534743,-87.767851283856913,null,27.818734260031192,-2.3414125737635545,null,0,0]
[109.65,0.10965000000000001,1.0009719821729595,4.4072565940408641E-2,1.0000001002706207,4.4781829435890449E-4,1,0,57.139663201697545,1.5532944550936243,1.0002461620370005,2.2186101556982175E-2,1.0000001306461208,5.1116750021860556E-4,1.000000000000006,1.0964999999999957E-7,1.000000000000006,1.0964999999999957E-7,1.0000003948533831,1.1793172305431597E-3,59.097073341226178,-90.322412018446002,89.677587981553998,null,1000000000,12023.122500000001,null,31.279758293587207,-87.755334475535804,null,27.817315047638971,-2.5670838253924231,null,0,0]
[120.23,0.12023,1.001168487508642,4.831875080037791E-2,1.0000001205541378,4.9102775013873206E-4,1,0,62.651387970640613,1.5548343106611531,1.0002959502351236,2.4326005211176189E-2,1.0000001570742285,5.6048944339695832E-4,1.0000000000000071,1.2022999999999943E-7,1.0000000000000071,1.2022999999999943E-7,1.0000004747273779,1.2931081254119465E-3,58.29593952182212,-90.538189618894251,89.461810381105749,null,1000000000,14455.252900000001,null,30.480329990694447,-87.723780191810434,null,27.81560953112767,-2.8144163157553863,null,0,0]
[131.83000000000001,0.13183,1.0014046742775187,5.2972294415518019E-2,1.0000001449388884,5.3840295474066652E-4,1,0,68.694630863220368,1.5562386341575538,1.000355802098118,2.6671956590935842E-2,1.0000001888459775,6.1456642899408807E-4,1.0000000000000087,1.3182999999999924E-7,1.0000000000000087,1.3182999999999924E-7,1.0000005707515236,1.4178693954366543E-3,57.494567516438273,-90.758398337839452,89.241601662160548,null,1000000000,17379.148900000004,null,29.681007463760785,-87.672927271207527,null,27.813560052677492,-3.0854786199345479,null,0,0]
[144.54,0.14454,1.0016883468626721,5.8068491468445567E-2,1.0000001742338431,5.9031147355214243E-4,1,0,75.316278969274535,1.5575185945792474,1.0004277012225962,2.9242053208755826E-2,1.000000227015404,6.7381801855743669E-4,1.0000000000000104,1.4453999999999899E-7,1.0000000000000104,1.4453999999999899E-7,1.0000006861114477,1.5545690104948971E-3,56.69340933193525,-90.984721871500014,89.015278128499986,null,1000000000,20891.811599999997,null,28.882310170953524,-87.602402778103254,null,27.811099160981723,-3.3823273749287313,null,0,0]
[158.49,0.15849000000000002,1.0020296224916436,6.3658394896071183E-2,1.0000002094884766,6.4728423442899188E-4,1,0,82.584059671512648,1.5586871565377891,1.0005142204437059,3.2062444951463209E-2,1.0000002729499047,7.3885024554333695E-4,1.0000000000000124,1.5848999999999869E-7,1.0000000000000124,1.5848999999999869E-7,1.0000008249398493,1.7046051497740112E-3,55.891052938799454,-91.219414282622338,88.780585717377662,null,1000000000,25119.080100000003,null,28.0829134595946,-87.511485975031306,null,27.808139479204858,-3.7079373883991344,null,0,0]
[173.78,0.17377999999999999,1.0024396200359427,6.9780664243430296E-2,1.0000002518581357,7.0972964276464444E-4,1,0,90.550071858763772,1.5597524887560326,1.0006181909219403,3.5153168368393564E-2,1.000000328154822,8.1012928856758881E-4,1.0000000000000151,1.7377999999999826E-7,1.0000000000000151,1.7377999999999826E-7,1.0000009917863406,1.8690533315535453E-3,55.088549266600388,-91.4640755506977,88.5359244493023,null,1000000000,30199.488400000002,null,27.283964121882278,-87.399523595688677,null,27.804585144718111,-4.0645619118695908,null,0,0]
[190.55,0.19055000000000002,1.0029324703813531,7.6489504063978531E-2,1.0000003028128452,7.7821946619151771E-4,1,0,99.287254805035147,1.5607243703333318,1.0007432138675272,3.8542284663933883E-2,1.0000003945455016,8.8830779781369463E-4,1.0000000000000182,1.9054999999999772E-7,1.0000000000000182,1.9054999999999772E-7,1.000001192439695,2.0494192819491362E-3,54.285269135460325,-91.720854778371901,88.279145221628099,null,1000000000,36309.302500000005,null,26.484954667063747,-87.26550554671627,null,27.800314468396579,-4.455360149366439,null,0,0]
[208.93,0.20893,1.0035244309081386,8.3834486941598993E-2,1.0000003640474413,8.532846309831281E-4,1,0,108.86333859301445,1.5616103687239742,1.0008934389856201,4.2255752224286847E-2,1.0000004743302049,9.7399180438468951E-4,1.0000000000000218,2.0892999999999696E-7,1.0000000000000218,2.0892999999999696E-7,1.0000014335739644,2.2471011699839493E-3,53.481682574703918,-91.991622947628471,88.008377052371529,null,1000000000,43651.744900000005,null,25.686494826529923,-87.108412828357288,null,27.795187748173991,-4.8832220900784078,null,0,0]
[229.09,0.22909000000000002,1.0042358977019583,9.1880348202433917E-2,1.0000004376920142,9.3561942523628678E-4,1,0,119.36689417300053,1.562418696594563,1.0010740793050765,4.6327504000008825E-2,1.0000005702843009,1.0679738103330724E-3,1.0000000000000262,2.29089999999996E-7,1.0000000000000262,2.29089999999996E-7,1.0000017235771763,2.4639273698470045E-3,52.677046604888957,-92.278725831354265,87.721274168645735,null,1000000000,52482.2281,null,24.888016572631784,-86.926817183914551,null,27.789030032257173,-5.3519217733298525,null,0,0]
[251.19,0.25119000000000002,1.0050904100453817,0.10068674061698812,1.000000526212343,1.0258772951933595E-3,1,0,130.88128311102497,1.5631557405624279,1.0012911647610188,5.0789310580210537E-2,1.0000006856205379,1.1709996978938768E-3,1.0000000000000315,2.5118999999999472E-7,1.0000000000000315,2.5118999999999472E-7,1.0000020721592557,2.7016186954516804E-3,51.871665947605081,-92.58423076948705,87.41576923051295,null,1000000000,63096.416100000002,null,24.090025924351298,-86.719306954840235,null,27.781640023253775,-5.8649382067736751,null,0,0]
[275.42,0.27542,1.0061166945145397,0.1103238695575991,1.0000006326263307,1.124834207562085E-3,1,0,143.50549786123753,1.5638278962600367,1.0015520700054941,5.5678815113128992E-2,1.0000008242710456,1.2839552011725916E-3,1.000000000000038,2.7541999999999303E-7,1.000000000000038,2.7541999999999303E-7,1.0000024912043171,2.9622186087910648E-3,51.065240569253376,-92.910493242859928,87.089506757140072,null,1000000000,75856.176400000011,null,23.292467783070695,-86.484142539184518,null,27.772772786182681,-6.4263664840790389,null,0,0]
[302,0.30199999999999999,1.0073497551597554,0.12087199794534657,1.0000007606242618,1.2333886489597954E-3,1,0,157.35416195347815,1.5644411931339599,1.0018658046693105,6.1039466874147769E-2,1.0000009910440222,1.4078659053185761E-3,1.0000000000000457,3.0199999999999082E-7,1.0000000000000457,3.0199999999999082E-7,1.0000029952442273,3.2480932163678642E-3,50.257123780120082,-93.260110817364989,86.739889182635011,null,1000000000,91204,null,22.494992858133674,-86.219238700384494,null,27.762130921986412,-7.040889420305918,null,0,0]
[331.13,0.33112999999999998,1.0088294980802517,0.13240103581123991,1.0000009144359954,1.3523574220233381E-3,1,0,172.53147902770041,1.5650002505962766,1.0022426814668595,6.6910359770551042E-2,1.0000011914506952,1.5436641554423358E-3,1.0000000000000548,3.3112999999998785E-7,1.0000000000000548,3.3112999999998785E-7,1.0000036009356199,3.5613935023890023E-3,49.447832948360613,-93.635243650604792,86.364756349395208,null,1000000000,109647.0769,null,21.698455696663533,-85.922673614801781,null,27.749377251697087,-7.7125890081545112,null,0,0]
[363.08,0.36307999999999996,{"$f":"SQRT(1+(A77/pole1)^2)","v":1.0106061965761886},{"$f":"ATAN(A77/pole1)","v":0.14500547857333887},{"$f":"SQRT(1+(A77/Zero1)^2)","v":1.0000010994130004},{"$f":"ATAN(A77/Zero1)","v":1.482843210332571E-3},{"$f":"IF(VIN_nom>Vout, 1, SQRT(1+(A77/z_RHP)^2))","v":1},{"$f":"IF(VIN_nom>Vout, 0, -ATAN(A77/z_RHP))","v":0},{"$f":"SQRT(1+(A77/Pole2)^2)","v":189.17812451104609},{"$f":"ATAN(A77/Pole2)","v":1.5655102787401838},{"$f":"SQRT(1+(A77/Zero2)^2)","v":1.0026957333517454},{"$f":"ATAN(A77/Zero2)","v":7.334427631968099E-2},{"$f":"SQRT(1+(A77/pole4)^2)","v":1.0000014324636759},{"$f":"ATAN(A77/pole4)","v":1.6926086174729707E-3},{"$f":"SQRT(1+(A77/Zero3)^2)","v":1.0000000000000659},{"$f":"ATAN(A77/Zero3)","v":3.6307999999998406E-7},{"$f":"SQRT(1+(A77/pole5)^2)","v":1.0000000000000659},{"$f":"ATAN(A77/pole5)","v":3.6307999999998406E-7},{"$f":"SQRT((1-(Z77/pterm2))^2+(A77/pterm1)^2)","v":1.0000043293518786},{"$f":"IF((ATAN((A77/pterm1)/(1-A77^2/pterm2))>0),ATAN((A77/pterm1)/(1-A77^2/pterm2)),PI()+ATAN((A77/pterm1)/(1-A77^2/pterm2)))","v":3.9050232956631672E-3},{"$f":"20*LOG10(((E77*K77*G77*O77)/(C77*I77*S77*M77*Q77))*Adc)","v":48.63641650849911},{"$f":"((F77+L77+H77+R77)-(D77+J77+T77+N77))*radconv","v":-94.038755530891663},{"$f":"IF(V77>0,V77,V77+180)","v":85.961244469108337},null,{"$f":"IF(U77<0,A77,1000000000)","v":1000000000},{"$f":"A77^2","v":131827.0864},null,{"$f":"20*LOG10((K77/(I77*M77))*AEA*Afb)","v":20.902327663537438},-85.591793699554145,null,{"$f":"20*LOG10((E77*G77/(C77*S77))*Am)","v":27.734088844961672},{"$f":"(F77+H77-(D77+T77))*radconv","v":-8.4469826342891725},null,{"$f":"SUM((U78<0)*(U77>0))*A77","v":0},{"$f":"IF(AH77>0,W75,0)","v":0}]
[398.11,{"$f":"A78/1000","v":0.39811000000000002},1.0127379917783825,0.15877173367015923,1.0000013217896278,1.6259078521202565E-3,1,0,207.4295640797657,1.5659753945521302,1.0032401149327566,8.0391422839996993E-2,1.0000017222059083,1.8559113323276886E-3,1.0000000000000793,3.9810999999997899E-7,1.0000000000000793,3.9810999999997899E-7,1.0000052050430437,4.2817788422883944E-3,47.822825071084452,-94.473125319752029,85.526874680247971,null,1000000000,158491.57210000002,null,20.107044812110001,{"$f":"(L78-(J78+N78))*radconv","v":-85.224027675263045},null,27.715780258974448,-9.2491204545117984,null,0,0]
[436.52,0.43651999999999996,1.0152950775813216,0.17379665760889745,1.0000015891482037,1.7827765419207403E-3,1,0,227.44210466297099,1.5663995893334117,1.0038942224017433,8.8109327334211701E-2,1.0000020705566586,2.0349708036610172E-3,1.0000000000000953,4.3651999999997225E-7,1.0000000000000953,4.3651999999997225E-7,1.000006257867291,4.694886558059933E-3,47.006568752146805,-94.941029831929853,85.058970168070147,null,1000000000,190549.71039999998,null,19.312698880365659,-84.816388243241832,null,27.693869871781146,-10.124666599441717,null,0,0]
[478.63,0.47863,1.0183604424153698,0.19017809029022406,1.0000019105388396,1.9547561473321476E-3,1,0,249.3824740064027,1.5667864111667309,1.0046799588518625,9.6558580834122956E-2,1.0000024893076138,2.2312787589305158E-3,1.0000000000001146,4.7862999999996352E-7,1.0000000000001146,4.7862999999996352E-7,1.0000075234627099,5.1477879109454684E-3,46.187266520169146,-95.44501431551528,84.55498568448472,null,1000000000,229086.67689999999,null,18.519589658705399,-84.365692552940274,null,27.667676861463754,-11.079349186053999,null,0,0]
[524.80999999999995,0.52481,1.0220342228230945,0.20802450744991038,1.000002296995572,2.1433577280518938E-3,1,0,273.44345141967756,1.5671392553827266,1.0056239564084142,0.10580855239089838,1.0000029928353789,2.4465599991406912E-3,1.0000000000001377,5.2480999999995172E-7,1.0000000000001377,5.2480999999995172E-7,1.0000090452797823,5.6444620599806388E-3,45.364099410101709,-95.987754170899734,84.012245829100266,null,1000000000,275425.53609999997,null,17.727710756641258,-83.868259412427122,null,27.636388653460457,-12.119524827870679,null,0,0]
[575.44000000000005,0.57544000000000006,1.0264332057556991,0.22743694584242291,1.0000027615693139,2.3501331701674339E-3,1,0,299.82302675870676,1.5674610197477408,1.0067575991906534,0.11592897013154327,1.0000035981444035,2.6825859221141831E-3,1.0000000000001656,5.7543999999993655E-7,1.0000000000001656,5.7543999999993655E-7,1.0000108747111132,6.1889956251424821E-3,44.53661417289026,-96.57145598148368,83.42854401851632,null,1000000000,331131.19360000006,null,16.937542472206342,-83.320361217707855,null,27.599071700683918,-13.251127734059228,null,0,0]
[630.96,0.63096000000000008,1.031697617440348,0.24852514740751472,1.0000033201628666,2.5768793842050022E-3,1,0,328.75045171480821,1.5677545011885661,1.0081189798866257,0.12699941939784529,1.000004325954944,2.941407604887035E-3,1.000000000000199,6.3095999999991628E-7,1.000000000000199,6.3095999999991628E-7,1.0000130743795639,6.786120416634369E-3,43.703868926093598,-97.198293495370663,82.801706504629337,null,1000000000,398110.52160000004,null,16.149246165573857,-82.717715834740503,null,27.554622760519738,-14.480613811975253,null,0,0]
[691.83,0.69183000000000006,1.0379908135860132,0.27138830545458742,1.0000039916675878,2.8254749370608661E-3,1,0,360.46539875668589,1.5680221318620591,1.0097531144704739,0.1391006777883429,1.0000052008811233,3.2251693234707805E-3,1.0000000000002394,6.9182999999988975E-7,1.0000000000002394,6.9182999999988975E-7,1.0000157186763812,7.4407831896047974E-3,42.865146252500892,-97.869759833241673,82.130240166758327,null,1000000000,478628.74890000006,null,15.36336227393404,-82.05595725833318,null,27.501783978566856,-15.813842213847691,null,0,0]
[758.58,0.75858000000000003,1.0455075776911718,0.29612922858801949,1.0000047990821908,3.098084246195731E-3,1,0,395.24401248673826,1.5682662414924078,1.0117144979758119,0.15232381111177548,1.0000062528886424,3.5363416295154616E-3,1.0000000000002878,7.5857999999985453E-7,1.0000000000002878,7.5857999999985453E-7,1.0000188981668023,8.1586833486765892E-3,42.019264123279456,-98.587005352752101,81.412994647247899,null,1000000000,575443.61640000006,null,14.580174246425269,-81.330142837527518,null,27.439089876854183,-17.256905978657052,null,0,0]
[831.76,0.83175999999999994,1.0544725558658123,0.3228299233135305,1.00000576967383,3.3969533671270829E-3,1,0,433.37285826080875,1.5684888429080945,1.0140672544844469,0.16675912996002978,1.0000075175046443,3.8774882464106633E-3,1.0000000000003459,8.3175999999980813E-7,1.0000000000003459,8.3175999999980813E-7,1.0000227202242771,8.9457351257930372E-3,41.165313981487628,-99.350026621433855,80.649973378566145,null,1000000000,691824.69759999996,null,13.800410796036385,-80.535360373664474,null,27.364903185451244,-18.814713904106998,null,0,0]
[912.01,0.91200999999999999,1.0651522125639923,0.35157072617149043,1.0000069367197295,3.7246958617675853E-3,1,0,475.1853941449491,1.5686918834546011,1.0168890199907725,0.18250861302487403,1.000009038086918,4.2515923713583297E-3,1.0000000000004159,9.1200999999974713E-7,1.0000000000004159,9.1200999999974713E-7,1.0000273158886057,9.8088203438648873E-3,40.301851622746568,-100.15811065130966,79.841889348690344,null,1000000000,831762.24009999994,null,13.024506071708542,-79.666049417385594,null,27.277345551038028,-20.492113488248002,null,0,0]
[1000,1,1.0778515940600579,0.38240065297889209,1.0000083397809238,4.0840477382973655E-3,1,0,521.03070922646691,1.5688770529474487,1.0202711130982192,0.19967224199800945,1.0000108661805276,4.6617769430818464E-3,1.0000000000005,9.9999999999966665E-7,1.0000000000005,9.9999999999966665E-7,1.0000328409436579,1.0755142997316607E-2,39.427689947243472,-101.00886902172941,78.99113097827059,null,1000000000,1000000,null,12.253326088323131,-78.716757190227625,null,27.174363858920341,-22.292169127281358,null,0,0]
[1096.5,1.0965,1.0929276780859616,0.41535377311345795,1.0000100270123082,4.4781533079536135E-3,1,0,571.30999560688838,1.5690459626872864,1.0243234191284232,0.21835941141706935,1.0000130645275989,5.1116309267235692E-3,1.0000000000006013,1.0964999999995606E-6,1.0000000000006013,1.0964999999995606E-6,1.0000394850136864,1.1792981941567693E-2,38.541238878225798,-101.89857801581061,78.101421984189386,null,1000000000,1202312.25,null,11.487567194670241,-77.681513800157788,null,27.05367168355556,-24.217127040475141,null,0,0]
[1202.3,1.2022999999999999,1.1107808235805068,0.45041247706754373,1.0000120553418426,4.9102384329707989E-3,1,0,626.43486609924025,1.5691999909604279,1.0291738461887281,0.23867050517364419,1.0000157073007381,5.6048363296900758E-3,1.0000000000007228,1.2022999999994205E-6,1.0000000000007228,1.2022999999994205E-6,1.0000474722685229,1.2930830300234357E-2,37.64137598578926,-102.82106878981604,77.178931210183961,null,1000000000,1445525.2899999998,null,10.728495038698252,-76.554857607323868,null,26.912880947091011,-26.266280069207987,null,0,{"$f":"IF(AH90>0,W90,0)","v":0}]
[1318.3,1.3183,1.1318710909314293,0.4875295217392891,1.0000144937848496,5.3839780448556871E-3,1,0,686.87424681917628,1.5693404557123933,1.0349749171535083,0.26071084117479271,1.0000188844212268,6.1455876931344432E-3,1.0000000000008691,1.3182999999992363E-6,1.0000000000008691,1.3182999999992363E-6,1.0000570744740942,1.4178363132455423E-2,36.726709718197171,-103.76825981445184,76.231740185548162,null,1000000000,1737914.89,null,9.9772628755617436,-75.331070182358715,null,26.749446842635432,-28.437265165119349,null,0,0]
[1445.4,1.4454,1.1566997985853098,0.52658476541621568,1.0000174232340535,5.9030468544648386E-3,1,0,753.09706398163485,1.569468476320248,1.0419014048137105,0.28456553888054642,1.000022701285304,6.7380792300593207E-3,1.0000000000010445,1.4453999999989937E-6,1.0000000000010445,1.4453999999989937E-6,1.0000686101646283,1.5545254080332088E-2,35.796589534844024,-104.72903859898318,75.27096140101682,null,1000000000,2089181.1600000001,null,9.2356912830276716,-74.005578985727809,null,26.560898251816354,-30.723542428575175,null,0,0]
[1584.9,1.5849000000000002,1.1858905662305284,0.56749868830015759,1.0000209486304359,6.4727528514720301E-3,1,0,825.78065561188589,1.5695853511712676,1.0501764285145769,0.31036895093320938,1.0000272946217024,7.3883693581852806E-3,1.0000000000012559,1.584899999998673E-6,1.0000000000012559,1.584899999998673E-6,1.0000824925680141,1.7045476657905144E-2,34.848418441659021,-105.69206909256998,74.30793090743002,null,1000000000,2511908.0100000002,null,8.5040892271657285,-72.571107691929384,null,26.344329214493296,-33.121052208721679,null,0,0]
[1737.8,1.7378,1.2200488440142596,0.61001518980736136,1.0000251854995938,7.0971784554309655E-3,1,0,905.44605105038045,1.5696918985386425,1.0600360373070492,0.33816762943442091,1.0000328149491573,8.1011174330174792E-3,1.0000000000015099,1.7377999999982506E-6,1.0000000000015099,1.7377999999982506E-6,1.0000991765860849,1.8689775551637169E-2,33.882820117736053,-106.64070608114811,73.35929391885189,null,1000000000,3019948.84,null,7.7852510757717432,-71.02530290701533,null,26.097569041964313,-35.615502742738514,null,0,0]
[1905.5,1.9055,1.2599023829346296,0.65390861058764616,1.0000302808306398,7.7820391353666711E-3,1,0,992.82269145703833,1.5697890974298851,1.0717733016784554,0.36804330475265623,1.000039453779638,8.8828466737129966E-3,1.0000000000018154,1.9054999999976938E-6,1.0000000000018154,1.9054999999976938E-6,1.0001192410090838,2.0493193847526524E-2,32.898902638413389,-107.55830162995022,72.441698370049778,null,1000000000,3630930.25,null,7.0806571899167503,-69.363911671734243,null,25.818245448496647,-38.194499135323952,null,0,0]
[2089.3000000000002,2.0893000000000002,1.3061884791064249,0.69884414831116748,1.0000364040881156,8.532641298972644E-3,1,0,1088.5879151275433,1.5698777054077329,1.0857106522670434,0.40001355852357795,1.000047431906856,9.7396131453429628E-3,1.0000000000021827,2.0892999999969601E-6,1.0000000000021827,2.0892999999969601E-6,1.0001433531177768,2.2469694901922382E-2,31.897685097883532,-108.42555194921617,71.574448050783829,null,1000000000,4365174.4900000012,null,6.3929749031859497,-67.586317024681591,null,25.504710194697587,-40.839354632606835,null,0,0]
[2290.9,2.2909000000000002,1.3597697684997272,0.74451207376915807,1.0000437682531573,9.3559239878823561E-3,1,0,1193.627472225246,1.5699585443709418,1.1022391871325765,0.43411151620016414,1.0000570268203119,1.0679336158704256E-2,1.0000000000026241,2.2908999999959922E-6,1.0000000000026241,2.2908999999959922E-6,1.000172351532939,2.4637537803591476E-2,30.879352259202427,-109.22396224175749,70.776037758242509,null,1000000000,5248222.8100000005,null,5.7240205899993644,-65.691121851620949,null,25.155331669203065,-43.532971649037975,null,0,0]
[2511.9,2.5119000000000002,1.4215038644053448,0.79051368549409651,1.0000526198637345,1.0258416687101203E-2,1,0,1308.7750100299238,1.5700322534517799,1.1217841427154094,0.4702895947554282,1.000068559727082,1.170946713399065E-2,1.0000000000031548,2.5118999999947171E-6,1.0000000000031548,2.5118999999947171E-6,1.0002072069866088,2.701389873329697E-2,29.846118241713203,-109.93448837636993,70.065511623630073,null,1000000000,6309641.6100000003,null,5.0766656515304165,-63.681516013688658,null,24.769452590182791,-46.253116283949986,null,0,0]
[2754.2,2.7542,1.4923405436046968,0.83646853207218341,1.0000632606521322,1.1247872455454819E-2,1,0,1435.0204847458326,1.5700994725746509,1.1448383699147304,0.50847954910078863,1.0000824237416839,1.2838853584943593E-2,1.000000000003793,2.7541999999930355E-6,1.000000000003793,2.7541999999930355E-6,1.0002491075123308,2.9619169885390255E-2,28.800163988433283,-110.54050989868668,69.459490101313321,null,1000000000,7585617.6399999987,null,4.4533807051924139,-61.561953256602187,null,24.346783283240875,-48.978714446120627,null,0,0]
[3020,3.02,1.5733254342449103,0.88201552006551598,1.0000760595625806,1.2333267370204523E-2,1,0,1573.5101615204599,1.5701608049585785,1.1719680271101771,0.54858053640802029,1.0000990995409642,1.407773829303635E-2,1.0000000000045604,3.0199999999908185E-6,1.0000000000045604,3.0199999999908185E-6,1.0002995057474986,3.2476955905404101E-2,27.743882892092135,-111.02857500636684,68.971424993633164,null,1000000000,9120400,null,3.8564385904584904,-59.338832878873397,null,23.887444301633643,-51.689915160747773,null,0,0]
[3311.3,3.3113000000000001,1.6654415689795998,0.9267434042960816,1.0000914394607499,1.3522758124567064E-2,1,0,1725.2860996219099,1.5702167127493123,1.2037604642901703,0.59037846263689686,1.000119138043577,1.5435427856171567E-2,1.0000000000054823,3.311299999987898E-6,1.0000000000054823,3.311299999987898E-6,1.000360066571824,3.5608693893930315E-2,26.681754654939233,-111.38870827576123,68.611291724238768,null,1000000000,10964707.690000001,null,3.2889193645239367,-57.02498127322319,null,23.392835290415299,-54.363916726052963,null,0,0]
[3630.8,3.6308000000000002,1.7698837407634957,0.97035233133568388,1.0001099353175955,1.4827356275607049E-2,1,0,1891.75507911349,1.5702677171151278,1.2409163421357119,0.63367644042411186,1.0001432362118845,1.6924486213584587E-2,1.0000000000065914,3.6307999999840453E-6,1.0000000000065914,3.6307999999840453E-6,1.0004328961767055,3.9043324087576325E-2,25.61673974401479,-111.61678699032022,68.383213009679778,null,1000000000,13182708.640000001,null,2.7526829409578948,-54.632428976057128,null,22.864056803056894,-56.984566043779587,null,0,0]
[3981.1,3.9811000000000001,1.8878093121740671,1.012532380207916,1.0001321703156334,1.6257660334834806E-2,1,0,2074.2717771382236,1.5703142298730961,1.2841623032269094,0.67817691981734052,1.0001722059117004,1.8557004226691962E-2,1.0000000000079245,3.9810999999789672E-6,1.0000000000079245,3.9810999999789672E-6,1.000520447920686,4.2808681451986401E-2,24.553186738524136,-111.71380612039333,68.286193879606671,null,1000000000,15849157.209999999,null,2.2499646198468861,-52.178940694567949,null,22.303222118677247,-59.535093526053465,null,0,0]
[4365.2,4.3651999999999997,2.020497328898553,1.0530447571110344,1.0001589023216659,1.782589593234879E-2,1,0,2274.3992827452671,1.5703566502439033,1.3343016814649113,0.72355676937945368,1.0002070344485829,2.0346927802816276E-2,1.0000000000095275,4.3651999999722742E-6,1.0000000000095275,4.3651999999722742E-6,1.0006257052377661,4.6936861339680967E-2,23.49486087306099,-111.68655805118904,68.313441948810961,null,1000000000,19054971.039999999,null,1.7823234586549552,-49.683852411644722,null,21.712537414406032,-62.00295574708133,null,0,0]
[4786.3,4.7862999999999998,2.1692853817888458,1.0916956405990521,1.0001910358191217,1.9545097177652695E-2,1,0,2493.8048909558684,1.5703953331043212,1.3921860406777515,0.76944803206357304,1.0002489000955932,2.230912282040207E-2,1.0000000000114544,4.7862999999634508E-6,1.0000000000114544,4.7862999999634508E-6,1.0007522284998047,5.1462056758236542E-2,22.445459560880479,-111.54710423496232,68.452895765037681,null,1000000000,22908667.690000001,null,1.3509094784046978,-47.169118598175679,null,21.094550082475777,-64.378259871576418,null,0,0]
[5248.1,5.2481,2.3356787583399967,1.1283615499089392,1.0002296734460649,2.1430328809209215E-2,1,0,2734.4164116737152,1.5704306180396312,1.4587508938304701,0.81548137751309702,1.0002992392136896,2.4460769106864306E-2,1.0000000000137712,5.2480999999518189E-6,1.0000000000137712,5.2480999999518189E-6,1.0009043577697854,5.6423765307840934E-2,21.407742873958174,-111.31193429210961,68.688065707890388,null,1000000000,27542553.610000003,null,0.9561059728379574,-44.656904113272525,null,20.451636901120217,-66.655330872817885,null,0,0]
[5370.3,5.3703000000000003,2.3801880610740662,1.1372023892286005,1.0002404923846986,2.1929167673744088E-2,1,0,2798.0862429127105,1.5704389396615226,1.4768526261450183,0.82696043086341575,1.0003133345864166,2.503009360018461E-2,1.00000000001442,5.3702999999483734E-6,1.00000000001442,5.3702999999483734E-6,1.0009469548642393,5.7736556408488633E-2,21.150573155455493,-111.24050147338311,68.759498526616895,null,1000000000,28840122.090000004,null,0.86317518306254848,-44.032299487233793,null,20.287397972392945,-67.208509681674386,null,0,0]
[5432.85,5.4328500000000002,2.4030408176205049,1.1416008154523594,1.0002461265361688,2.2184502017218315E-2,1,0,2830.6766516921666,1.5704430543643622,1.4861921933249465,0.83272758038904293,1.0003206749799542,2.5321505077498831E-2,1.000000000014758,5.432849999946548E-6,1.000000000014758,5.432849999946548E-6,1.0009691379268297,5.8408502289305338E-2,21.021541335654696,-111.20287830661545,68.797121693384554,null,1000000000,29515859.122500002,null,0.81728443785922467,-43.71879856209469,null,20.204256897795467,-67.484391023896848,null,0,0]
[5495.4,5.4954000000000001,2.4259391873643481,1.145916290621156,1.0002518258985753,2.2439833467585713E-2,1,0,2863.2670605184571,1.5704470753980855,1.4955805729571712,0.8384225117763896,1.0003281003201223,2.5612912253319978E-2,1.0000000000150997,5.4953999999446802E-6,1.0000000000150997,5.4953999999446802E-6,1.0009915776581386,5.9080429622689806E-2,20.894221292400484,-111.16463367879017,68.835366321209833,null,1000000000,30199421.159999996,null,0.77248486508668612,-43.409429818185636,null,20.121736427313799,-67.755518723831614,null,0,0]
[5559.4,5.5593999999999992,2.4494142518375321,1.1502482083457293,1.0002577248753155,2.2701080843281037E-2,1,0,2896.6129624818718,1.5704510959916045,1.5052361590817183,0.84417573914217214,1.000335785711739,2.5911070167684156E-2,1.0000000000154534,5.559399999942725E-6,1.0000000000154534,5.559399999942725E-6,1.0010148032301223,5.9767913790467371E-2,20.765681932915051,-111.12493009041313,68.87506990958687,null,1000000000,30906928.359999996,null,0.72774242386796328,-43.097107724351517,null,20.037939509047092,-68.028140896218602,null,0,0]
[5623.4,5.6233999999999993,2.4729344076601536,1.1544978025503165,1.0002636921190289,2.2962325119774571E-2,1,0,2929.9588644910455,1.5704550250682636,1.5149409319061717,0.84985544169252603,1.0003435600299773,2.6209223474196425E-2,1.0000000000158114,5.623399999940724E-6,1.0000000000158114,5.623399999940724E-6,1.001038297493227,6.0455378091412861E-2,20.638855334043203,-111.08471590514448,68.915284094855522,null,1000000000,31622627.559999995,null,0.6840750030860363,-42.78899278459545,null,19.954780330957163,-68.296045317635887,null,0,0]
[5688.9,5.6888999999999994,2.4970511764754564,1.1587640259612797,1.0002698699044759,2.3229689062836349E-2,1,0,2964.0863111243266,1.5704589546963794,1.5249231097867848,0.8555932186547609,1.0003516086340083,2.6514359922514705E-2,1.0000000000161817,5.6888999999386289E-6,1.0000000000161817,5.6888999999386289E-6,1.0010626206059301,6.1158934029026779E-2,20.510789600658757,-111.04309848652356,68.956901513476438,null,1000000000,32363583.209999997,null,0.64046358979528506,-42.477950562286914,null,19.870326010863472,-68.565473874197096,null,0,0]
[5754.4,5.7543999999999995,2.5212125233292286,1.1629485559650774,1.0002761191918059,2.349704968426403E-2,1,0,2998.2137578023385,1.570462794865781,1.5349548373854067,0.86125618132365767,1.000359750377525,2.6819491432344307E-2,1.0000000000165565,5.7543999999364839E-6,1.0000000000165565,5.7543999999364839E-6,1.0010872251353229,6.1862468676031297E-2,20.384437617208139,-111.00108048560536,68.998919514394643,null,1000000000,33113119.359999996,null,0.5979110727758542,-42.17118947467749,null,19.786526544432284,-68.830220713761861,null,0,0]
[5821.4,5.8213999999999997,2.5459719813973538,1.1671466679614961,1.0002825855679931,2.377052959162507E-2,1,0,3033.1227491054651,1.5704666335708386,1.5452665579357769,0.86697257046567178,1.0003681749341695,2.7131605518139777E-2,1.0000000000169442,5.8213999999342396E-6,1.0000000000169442,5.8213999999342396E-6,1.0011126842756124,6.2582092522089725E-2,20.256924648982341,-110.9577507003488,69.042249299651203,null,1000000000,33888697.959999993,null,0.55544613076288507,-41.861767263873368,null,19.701478518219453,-69.096316978126652,null,0,0]
[5888.4,5.8883999999999999,2.5707754452788496,1.1712638425563855,1.0002891267556044,2.4044005942706892E-2,1,0,3068.0317404522702,1.5704703849200061,1.5556281029427754,0.87261299177692342,1.0003766969402359,2.7443714316665847E-2,1.0000000000173366,5.8883999999319428E-6,1.0000000000173366,5.8883999999319428E-6,1.0011384378509576,6.3301693575871829E-2,20.131123798118658,-110.91412976945747,69.085870230542525,null,1000000000,34673254.559999995,null,0.51402238529829269,-41.556692381093626,null,19.617101412820364,-69.357774768832314,null,0,0]
[5957,5.9569999999999999,2.5962155081648848,1.1753977570311229,1.0002959016617163,2.4324009344992396E-2,1,0,3103.7743793973423,1.5704741384219469,1.566287678544783,0.87831060257143789,1.0003855234222274,2.7763270918101358E-2,1.0000000000177429,5.9569999999295369E-6,1.0000000000177429,5.9569999999295369E-6,1.0011651114930387,6.4038455245156292E-2,20.004051753394684,-110.8692272647065,69.130772735293505,null,1000000000,35485849,null,0.47265486330579004,-41.248767633305306,null,19.531396890088896,-69.62080094236012,null,0,0]
[6025.6,6.0256000000000007,2.6216990769353195,1.179451374303053,1.000302754991867,2.4604008932480229E-2,1,0,3139.517018385146,1.5704778064584712,1.5769974118476686,0.88393100632995991,1.0003944520582002,2.8082821848008668E-2,1.0000000000181539,6.0255999999270751E-6,1.0000000000181539,6.0255999999270751E-6,1.0011920937803118,6.4775192467933979E-2,19.878692650300437,-110.82414130256664,69.175858697433355,null,1000000000,36307855.360000007,null,0.43231236731754802,-40.945261301070843,null,19.446380282982886,-69.879225242945239,null,0,0]
[6095.8,6.0958000000000006,2.6478207438863395,1.1835186902153361,1.0003098493538387,2.4890535127571285E-2,1,0,3176.0933049722512,1.5704814745785098,1.5880078021941124,0.88960383221998873,1.000403694695055,2.8409819921410364E-2,1.0000000000185794,6.0957999999244956E-6,1.0000000000185794,6.0957999999244956E-6,1.0012200249083718,6.55290874661585E-2,19.752141718535444,-110.77787237186647,69.222127628133535,null,1000000000,37158777.640000001,null,0.39205692982932866,-40.639178096621684,null,19.360084788706114,-70.139043538857962,null,0,0]
[6166,6.1660000000000004,2.6739853576657717,1.18750647466738,1.0003170258373397,2.5177057234987074E-2,1,0,3212.6695916011181,1.5704850591753561,1.5990685914463509,0.89519835798259317,1.0004130443008328,2.8736811917694435E-2,1.0000000000190097,6.1659999999218569E-6,1.0000000000190097,6.1659999999218569E-6,1.001248279224658,6.6282956272125076E-2,19.627301871437471,-110.73152649077387,69.268473509226126,null,1000000000,38019556,null,0.35280877057678417,-40.337576025294787,null,19.274493100860685,-70.394303751255975,null,0,0]
[6237.8,6.2378,2.7007894411751949,1.191505156664139,1.0003244508360072,2.5470105483376887E-2,1,0,3250.0795258302082,1.5704886420112381,1.6104325310830074,0.90084071738684635,1.0004227176536766,2.9071250363843722E-2,1.0000000000194551,6.2377999999190955E-6,1.0000000000194551,6.2377999999190955E-6,1.001277511823343,6.705397986656951E-2,19.501345052843718,-110.68409976143852,69.315900238561483,null,1000000000,38910148.840000004,null,0.31367511596909692,-40.033659837433845,null,19.18766993687462,-70.650797323618534,null,0,0]
[6309.6,6.3096000000000005,2.7276358597160768,1.195425187250811,1.000331961738534,2.5763149356279384E-2,1,0,3287.4894601000692,1.5704921433054715,1.621847021381817,0.90640383046145778,1.000432502900704,2.9405682305102241E-2,1.0000000000199054,6.3095999999162696E-6,1.0000000000199054,6.3095999999162696E-6,1.0013070824859442,6.7824975427860618E-2,19.377094938674851,-110.63670071830335,69.363299281696655,null,1000000000,39811052.160000004,null,0.2755295871054631,-39.734279085113364,null,19.101565351569388,-70.902783146640786,null,0,0]
[6383.05,6.3830499999999999,2.755141737587163,1.1993561922753919,1.000339734131062,2.6062922944468384E-2,1,0,3325.7590934572736,1.5704956435562833,1.633575024028922,0.91201416465021101,1.0004426287949968,2.9747792851415666E-2,1.0000000000203717,6.3830499999133111E-6,1.0000000000203717,6.3830499999133111E-6,1.0013376824906006,6.8613659513077033E-2,19.251713567368935,-110.58829258442142,69.411707415578576,null,1000000000,40743327.302500002,null,0.23749725631427324,-39.432632654124596,null,19.014216311054664,-71.156025652122679,null,0,0]
[6456.5,6.4565000000000001,2.7826893480644252,1.2032094248309211,1.0003475964169226,2.6362691847422171E-2,1,0,3364.0287268542979,1.5704990641684675,1.6453537108893679,0.91754434480453162,1.0004528717783423,3.0089896432475328E-2,1.0000000000208433,6.4564999999102839E-6,1.0000000000208433,6.4564999999102839E-6,1.0013686362487157,6.9402313584318365E-2,19.128034448764758,-110.54001449091787,69.459985509082131,null,1000000000,41686392.25,null,0.20043396063421923,-39.135573748988115,null,18.927600488130537,-71.404810672130608,null,0,0]
[6531.7,6.5316999999999998,2.8109352551733151,1.2070761595003954,1.0003557391567925,2.66695980537048E-2,1,0,3403.2101623122048,1.5705024865773678,1.6574644151677727,0.92312467929640019,1.0004634801113912,3.0440143582147972E-2,1.0000000000213316,6.5316999999071123E-6,1.0000000000213316,6.5316999999071123E-6,1.0014006939849214,7.0209726463132532E-2,19.003129934966331,-110.49076883762409,69.509231162375912,null,1000000000,42663104.890000001,null,0.16345914882958693,-38.836107907039057,null,18.83967078613674,-71.655035169428515,null,0,0]
[6606.9,6.6068999999999996,2.8392223537735961,1.2108659015419398,1.0003639761200505,2.6976499234783784E-2,1,0,3442.3915978090654,1.5705058310782847,1.6696259834151153,0.92862388856838529,1.0004742111717508,3.0790383261301194E-2,1.0000000000218257,6.6068999999038662E-6,1.0000000000218257,6.6068999999038662E-6,1.0014331225029174,7.1017107154252496E-2,18.879925315673841,-110.44175351628404,69.558246483715962,null,1000000000,43651127.609999992,null,0.1274355441012526,-38.541285305978832,null,18.752489771572588,-71.9008467577913,null,0,0]
[6683.85,6.6838500000000005,2.8682090983868087,1.2146663992285671,1.0003725023034797,2.7290537135975797E-2,1,0,3482.4848353677453,1.5705091755046492,1.6821220692079053,0.93416858496871402,1.0004853189980389,3.1148765642201093E-2,1.0000000000223368,6.6838499999004689E-6,1.0000000000223368,6.6838499999004689E-6,1.0014666894832067,7.1843242921548658E-2,18.755570765548192,-110.39188034820801,69.608119651791995,null,1000000000,44673850.822500005,null,9.1526170233495296E-2,-38.244323022612278,null,18.664044595314692,-72.147940281992064,null,0,0]
[6760.8,6.7608000000000006,2.8972364414769176,1.2183907956233493,1.0003811271417609,2.7604569653148763E-2,1,0,3522.5780729644907,1.5705124437999087,1.6946691060051267,0.93963134330644349,1.0004965553217282,3.1507140019325294E-2,1.0000000000228542,6.760799999896992E-6,1.0000000000228542,6.760799999896992E-6,1.0015006446710355,7.2669344207497391E-2,18.632911209722465,-110.34233511473485,69.657664885265149,null,1000000000,45708416.640000001,null,5.6548822455324589E-2,-37.952050623845921,null,18.576362387267139,-72.390671856195482,null,0,0]
[6839.55,6.83955,2.9269835605000547,1.2221257763706008,1.0003900558713994,2.7925942321310571E-2,1,0,3563.6091641103417,1.5705157124045208,1.7075612214739895,0.94513859832631619,1.0005081875201185,3.1873889040246489E-2,1.0000000000233897,6.8395499998933505E-6,1.0000000000233897,6.8395499998933505E-6,1.0015357960500557,7.3514733389041881E-2,18.509094638502987,-110.29201114957436,69.707988850425636,null,1000000000,46779444.202500001,null,2.1686467060371403E-2,-37.657708602457163,null,18.487408171442617,-72.634694424466446,null,0,0]
[6918.3,6.9183000000000003,2.9567706892647836,1.2257855533582032,1.0003990879198643,2.8247309219671658E-2,1,0,3604.6402552933982,1.5705189065970395,1.7205043499747992,0.95056315510524603,1.000519954288567,3.2240629484078812E-2,1.0000000000239315,6.9182999998896235E-6,1.0000000000239315,6.9182999998896235E-6,1.0015713539755084,7.4360085623759717E-2,18.386967914070723,-110.24211004532032,69.757889954679683,null,1000000000,47862874.890000001,null,-1.2263081678985772E-2,-37.368100086323103,null,18.399230995749708,-72.874406348389059,null,0,0]
[6998.9,6.9988999999999999,2.9872977607365003,1.2294556785329072,1.000408439134959,2.857621964579268E-2,1,0,3646.6352515128933,1.5705221013943391,1.7338031716557507,0.95603111427913479,1.0005321368269158,3.2615976433368991E-2,1.0000000000244924,6.9988999998857209E-6,1.0000000000244924,6.9988999998857209E-6,1.0016081681955979,7.5225258228173067E-2,18.263679120217446,-110.19151153078201,69.808488469217991,null,1000000000,48984601.209999993,null,-4.6096430268743875E-2,-37.076497947225327,null,18.30977555048619,-73.115414590988351,null,0,0]
[7079.5,7.0795000000000003,3.0178642561966824,1.2330515054637694,1.0004178985742782,2.8905123887477593E-2,1,0,3688.6302477687609,1.5705252234462066,1.7471530415338208,0.96141567184298038,1.0005444603221227,3.2991314189399171E-2,1.0000000000250595,7.0794999998817268E-6,1.0000000000250595,7.0794999998817268E-6,1.0016454082490207,7.6090391236502408E-2,18.142074733881767,-110.14142799161934,69.858572008380662,null,1000000000,50119320.25,null,-7.903624979700638E-2,-36.789669673651851,null,18.221110983678773,-73.352163943438981,null,0,0]
[7161.95,7.16195,3.0491718955179419,1.2366552251993728,1.0004276871103364,2.9241570947070306E-2,1,0,3731.5891490618928,1.5705283444495679,1.7608609376625322,0.96683918135979641,1.0005572125183126,3.3375257395890576E-2,1.0000000000256468,7.1619499998775462E-6,1.0000000000256468,7.1619499998775462E-6,1.0016839436538238,7.697534007566996E-2,18.01937896986859,-110.09076097611008,69.909239023889924,null,1000000000,51293527.802499995,null,-0.11183870377148539,-36.501102613484647,null,18.131217673640073,-73.590068712133956,null,0,0]
[7244.4,7.2443999999999997,3.0805183286187261,1.240185649261643,1.0004375888892079,2.9578011384811854E-2,1,0,3774.5480503905451,1.5705313944113772,1.7746198275079315,0.97217874737520016,1.0005701122052557,3.3759190759126999E-2,1.0000000000262408,7.2443999998732674E-6,1.0000000000262408,7.2443999998732674E-6,1.0017229246221051,7.7860246524747739E-2,17.898359836188941,-110.04069735248422,69.959302647515784,null,1000000000,52481331.359999992,null,-0.14376801865966651,-36.217340527313347,null,18.042127854848609,-73.823771898716458,null,0,0]
[7328.75,7.3287500000000003,3.1126260402101997,1.2437237994752417,1.0004478360311091,2.9922197914868748E-2,1,0,3818.4969082437833,1.5705344436415356,1.7887473237568516,0.97755619858794274,1.0005834617782496,3.4151961282416869E-2,1.0000000000268554,7.3287499998687894E-6,1.0000000000268554,7.3287499998687894E-6,1.0017632649388981,7.8765500626132801E-2,17.776243799172356,-109.99013394020153,70.009866059798469,null,1000000000,53710576.5625,null,-0.17556025374705164,-35.931914069280026,null,17.951804052919407,-74.05863977736611,null,0,0]
[7413.1,7.4131,3.1447719212872807,1.2471896583468636,1.0004582016879946,3.0266377353526958E-2,1,0,3862.4457661317169,1.5705374234803335,1.8029257336908997,0.98284922310494416,1.0005969657058045,3.4544721264735331E-2,1.0000000000274771,7.4130999998642073E-6,1.0000000000274771,7.4130999998642073E-6,1.0018040715447374,7.9670709338949874E-2,17.655796413830185,-109.94025905842186,70.059740941578141,null,1000000000,54954051.610000007,null,-0.20649968848286837,-35.651320324811188,null,17.862296102313053,-74.28936347295425,null,0,0]
[7499.45,7.4994499999999995,3.17771833301035,1.2506650174093548,1.0004689358817298,3.0618710107111483E-2,1,0,3907.4366835182191,1.5705404045389753,1.8174918188190494,0.98818205291011407,1.0006109497025415,3.4946782827699981E-2,1.0000000000281208,7.4994499998594059E-6,1.0000000000281208,7.4994499998594059E-6,1.0018463286842301,8.0597333655298267E-2,17.534178357500917,-109.88994059224656,70.11005940775344,null,1000000000,56241750.302499995,null,-0.23731963781436907,-35.368978916531709,null,17.77149799531529,-74.521391362549011,null,0,0]
[7585.8,7.5857999999999999,3.2107023376461066,1.2540690111628985,1.0004797942693733,3.097103525657046E-2,1,0,3952.4276009386554,1.5705433177301813,1.8321087689995128,0.99342993710321514,1.0006250954470046,3.5348833087841654E-2,1.0000000000287721,7.5857999998544936E-6,1.0000000000287721,7.5857999998544936E-6,1.0018890744361064,8.1523909309618212E-2,17.414222642460725,-109.84039333155931,70.159606668440688,null,1000000000,57544361.640000001,null,-0.26730613589671282,-35.091499997195818,null,17.681528778357439,-74.749327968688206,null,0,0]
[7674.15,7.67415,3.2444880162387477,1.2574801719849749,1.000491032691913,3.1331512841915383E-2,1,0,3998.4605778584591,1.5705462305413629,1.847115656798848,0.99871325638468289,1.0006397362323105,3.5760183622313743E-2,1.0000000000294462,7.6741499998493501E-6,1.0000000000294462,7.6741499998493501E-6,1.0019333159375832,8.2471894950573443E-2,17.293165797935846,-109.79051876444669,70.209481235553312,null,1000000000,58892578.222499996,null,-0.2971544018786858,-34.812523641541773,null,17.590320199814531,-74.978434819311758,null,0,0]
[7762.5,7.7625000000000002,3.2783106693501045,1.2608209844530822,1.0005024011194186,3.1691982282089394E-2,1,0,4044.4935548114167,1.5705490770473975,1.8621732721464401,1.0039112765085028,1.0006545463301562,3.617152205007302E-2,1.0000000000301283,7.7624999998440873E-6,1.0000000000301283,7.7624999998440873E-6,1.0019780688918074,8.3419828476375635E-2,17.173762726932114,-109.74149380332314,70.258506196676862,null,1000000000,60256406.25,null,-0.32618955358148827,-34.538430074953929,null,17.499952280513604,-75.203508486858183,null,0,0]
[7852.9,7.8529,3.3129552053316509,1.2641686694685075,1.0005141678906015,3.2060807227404044E-2,1,0,4091.5946427511558,1.5705519233049938,1.8776315056300135,1.0091434674506128,1.0006698753123657,3.6592392157003779E-2,1.000000000030834,7.8528999998385748E-6,1.000000000030834,7.8528999998385748E-6,1.0020243896178798,8.4389702502833175E-2,17.053257582417739,-109.69222912268968,70.307770877310318,null,1000000000,61668038.409999996,null,-0.35508618456156038,-34.262924775447651,null,17.408343766979296,-75.429754285269468,null,0,0]
[7943.3,7.9432999999999998,{"$f":"SQRT(1+(A141/pole1)^2)","v":3.3476361008680811},{"$f":"ATAN(A141/pole1)","v":1.2674470277884622},{"$f":"SQRT(1+(A141/Zero1)^2)","v":1.0005260707603558},{"$f":"ATAN(A141/Zero1)","v":3.2429623447354429E-2},{"$f":"IF(VIN_nom>Vout, 1, SQRT(1+(A141/z_RHP)^2))","v":1},{"$f":"IF(VIN_nom>Vout, 0, -ATAN(A141/z_RHP))","v":0},{"$f":"SQRT(1+(A141/Pole2)^2)","v":4138.6957307232879},{"$f":"ATAN(A141/Pole2)","v":1.5705547047780117},{"$f":"SQRT(1+(A141/Zero2)^2)","v":1.8931403005763903},{"$f":"ATAN(A141/Zero2)","v":1.0142900721062402},{"$f":"SQRT(1+(A141/pole4)^2)","v":1.0006853815394297},{"$f":"ATAN(A141/pole4)","v":3.7013249295204477E-2},{"$f":"SQRT(1+(A141/Zero3)^2)","v":1.0000000000315481},{"$f":"ATAN(A141/Zero3)","v":7.943299999832937E-6},{"$f":"SQRT(1+(A141/pole5)^2)","v":1.0000000000315481},{"$f":"ATAN(A141/pole5)","v":7.943299999832937E-6},{"$f":"SQRT((1-(Z141/pterm2))^2+(A141/pterm1)^2)","v":1.0020712457455716},{"$f":"IF((ATAN((A141/pterm1)/(1-A141^2/pterm2))>0),ATAN((A141/pterm1)/(1-A141^2/pterm2)),PI()+ATAN((A141/pterm1)/(1-A141^2/pterm2)))","v":8.5359520712269141E-2},{"$f":"20*LOG10(((E141*K141*G141*O141)/(C141*I141*S141*M141*Q141))*Adc)","v":16.934397371118443},{"$f":"((F141+L141+H141+R141)-(D141+J141+T141+N141))*radconv","v":-109.64388889490925},{"$f":"IF(V141>0,V141,V141+180)","v":70.356111105090747},null,{"$f":"IF(U141<0,A141,1000000000)","v":1000000000},{"$f":"A141^2","v":63096014.890000001},null,{"$f":"20*LOG10((K141/(I141*M141))*AEA*Afb)","v":-0.38318999693238576},-33.992318754010221,null,{"$f":"20*LOG10((E141*G141/(C141*S141))*Am)","v":17.31758736805083},{"$f":"(F141+H141-(D141+T141))*radconv","v":-75.652025258464931},null,{"$f":"SUM((U142<0)*(U141>0))*A141","v":0},0]
[8035.8,{"$f":"A142/1000","v":8.0358000000000001},3.3831591065923718,1.2707319331807656,1.000538391007427,3.2806998164640368E-2,1,0,4186.8909811696394,1.5705574860861213,1.9090604177055164,1.0194695361930786,1.0007014314377238,3.7443869402960746E-2,1.0000000000322871,8.0357999998270327E-6,1.0000000000322871,8.0357999998270327E-6,1.0021197445146763,8.6351809445675484E-2,16.814435412571868,-109.5953974276088,70.404602572391198,null,1000000000,64574081.640000001,null,-0.41115493548634058,{"$f":"(L142-(J142+N142))*radconv","v":-33.720389393348192},null,17.225590348058205,-75.875468451686146,null,0,0]
[8128.3,8.1282999999999994,3.4187178597624959,1.2739485387962186,1.0005508537393277,3.3184363534605195E-2,1,0,4235.0862316476423,1.5705602040916988,1.9250309010283362,1.0245631950805163,1.0007176668937918,3.7874475617963754E-2,1.0000000000330345,8.1282999998209895E-6,1.0000000000330345,8.1282999998209895E-6,1.0021688037821861,8.7344038394973886E-2,16.696109260355016,-109.54790163436117,70.452098365638832,null,1000000000,66069260.890000001,null,-0.43834730548408779,-33.453371885513654,null,17.134456565839105,-76.094995466132659,null,0,0]
[8222.9500000000007,8.2229500000000009,3.4551389657872584,1.2771713406704881,1.0005637536310152,3.3570490312167793E-2,1,0,4284.4016960873232,1.5705629219743373,1.9414234293628234,1.0296883638757388,1.0007344717824369,3.8315075971219976E-2,1.0000000000338085,8.222949999814663E-6,1.0000000000338085,8.222949999814663E-6,1.002219583501752,8.8359267370057323E-2,16.576682834257262,-109.50034378030368,70.49965621969632,null,1000000000,67616906.702500015,null,-0.46540044255061591,-33.185121607846689,null,17.04208327680788,-76.315693312787673,null,0,0]
[8270.2750000000015,8.2702750000000016,3.4733627645806595,1.27875738805733,1.0005702595175028,3.3763549952941042E-2,1,0,4309.0594283188284,1.5705642575868453,1.9496385757316237,1.032218595827731,1.0007429470766407,3.8535370577408135E-2,1.0000000000341989,8.2702749998114464E-6,1.0000000000341989,8.2702749998114464E-6,1.0022451934076628,8.8866857890347387E-2,16.517582138363707,-109.47696304615643,70.523036953843572,null,1000000000,68397448.575625017,null,-0.47864317010736546,-33.052848471801077,null,16.996225308471068,-76.424588426208757,null,0,0]
[8317.6,8.3176000000000005,3.4915952095593585,1.2803268752834354,1.0005768026967841,3.3956607075918563E-2,1,0,4333.7171605579324,1.5705655780007723,1.9578660990380321,1.0347275781876917,1.000751470935789,3.8755661441586438E-2,1.0000000000345912,8.3175999998081892E-6,1.0000000000345912,8.3175999998081892E-6,1.0022709500047267,8.9374432311298921E-2,16.458882791665793,-109.45384913324995,70.546150866750054,null,1000000000,69182469.760000005,null,-0.4917012075288687,-32.921791762480751,null,16.950583999194663,-76.532533934145405,null,0,0]
[8366.0499999999993,8.3660499999999995,3.510269888663236,1.2819167781205913,1.0005835400514962,3.415425088917718E-2,1,0,4358.9610512573672,1.5705669143277943,1.9663018648492883,1.0372744359948005,1.0007602477314181,3.8981185115382025E-2,1.0000000000349956,8.3660499998048175E-6,1.0000000000349956,8.3660499998048175E-6,1.0022974708405534,8.9894055912390372E-2,16.399198471708381,-109.43046307979884,70.569536920201159,null,1000000000,69990792.602499992,null,-0.50488178737548395,-32.788865679548756,null,16.904080259083866,-76.642076739606836,null,0,0]
[8414.5,8.4145000000000003,3.5289533470713259,1.2834898499451963,1.0005903164915528,3.4351892033093592E-2,1,0,4384.2049419644973,1.5705682352658945,{"$f":"SQRT(1+(A148/Zero2)^2)","v":1.9747502760307289},{"$f":"ATAN(A148/Zero2)","v":1.0397995180410449},1.0007690754257472,3.9206704821999373E-2,1.0000000000354019,8.4144999998014068E-6,1.0000000000354019,8.4144999998014068E-6,1.0023241454145844,9.0413662446941573E-2,16.339924019905151,-109.40735840563569,70.592641594364309,null,1000000000,70803810.25,null,-0.51787573921166952,-32.657186146788568,null,16.857799759116819,-76.750654374184364,null,0,0]
[8462.9500000000007,8.4629500000000011,3.5476454460766202,1.2850463489513158,1.00059713201616,3.4549530492281662E-2,1,0,4409.4488326791898,1.5705695410793756,1.9832111709758378,1.0423030706225862,1.0007779540174295,3.9432220538604269E-2,1.0000000000358109,8.4629499997979572E-6,1.0000000000358109,8.4629499997979572E-6,1.0023509737216834,9.0933251817514424E-2,16.281054121590696,-109.38453580159401,70.615464198405988,null,1000000000,71621522.702500015,null,-0.53068646383494333,-32.526739066304742,null,16.811740585425639,-76.858281626607038,null,0,0]
[8511.4,8.5114000000000001,3.5663460498166186,1.2865865282424913,1.0006039866245187,3.4747166251356508E-2,1,0,4434.6927234013156,1.5705708320265224,1.9916843905874062,1.0447853369331379,1.0007868835051104,3.9657732242364949E-2,1.0000000000362219,8.511399999794467E-6,1.0000000000362219,8.511399999794467E-6,1.0023779557566856,9.1452823926694876E-2,16.222583555858854,-109.36199584425569,70.638004155744312,null,1000000000,72443929.959999993,null,-0.54331728811028879,-32.397510517614336,null,16.765900843969145,-76.964972993939654,null,0,0]
[8560.9500000000007,8.5609500000000001,3.5854798865475752,1.2881450543449815,1.0006110372826742,3.4949286288013366E-2,1,0,4460.5097468408921,1.5705721371696895,2.0003625689891158,1.0473021937168729,1.0007960683672541,3.9888359748557881E-2,1.0000000000366449,8.5609499997908571E-6,1.0000000000366449,8.5609499997908571E-6,1.0024057093843375,9.1984174351487716E-2,16.16319317533214,-109.33923697547786,70.66076302452214,null,1000000000,73289864.902500018,null,-0.55605219849840637,-32.266594008057474,null,16.719245373830546,-77.073133473724553,null,0,0]
[8610.5,8.6105,3.6046223399511712,1.2896870309620643,1.0006181288177241,3.515140346801536E-2,1,0,4486.3267702879766,1.5705734272916987,2.0090533093076695,1.0497972914104849,1.0008053064598079,4.0118983009329499E-2,1.0000000000370703,8.6104999997872033E-6,1.0000000000370703,8.6104999997872033E-6,1.0024336237885361,9.2515506516180637E-2,16.104209712306833,-109.31677460861742,70.683225391382578,null,1000000000,74140710.25,null,-0.56860575645245892,-32.136923098638455,null,16.672815468759293,-77.180344855289022,null,0,0]
[8660.0499999999993,8.66005,3.623773273475611,1.2912127130847524,1.0006252612287996,3.5353517774909873E-2,1,0,4512.1437937424444,1.5705747026503885,2.0177564492256286,1.0522708803043712,1.0008145977812979,4.0349602000265355E-2,1.0000000000374982,8.6600499997835071E-6,1.0000000000374982,8.6600499997835071E-6,1.0024616989636632,9.3046820316651707E-2,16.045627873571721,-109.29460902135095,70.705390978649049,null,1000000000,74996466.002499983,null,-0.58098129256141262,-32.00848346214805,null,16.626609166133136,-77.286621743518822,null,0,0]
[8709.6,8.7096,3.6429325533806516,1.2927223506467664,1.0006324345150266,3.5555629192245718E-2,1,0,4537.960817204169,1.5705759634977297,2.0264718289843788,1.0547232074452191,1.000823942330241,4.0580216696953726E-2,1.0000000000379285,8.7095999997797719E-6,1.0000000000379285,8.7095999997797719E-6,1.0024899349040688,9.3578115648805998E-2,15.987442459974513,-109.27274038710982,70.72725961289018,null,1000000000,75857132.160000011,null,-0.59318206437552279,-31.881260956891904,null,16.580624524350036,-77.391978453539735,null,0,{"$f":"IF(AH154>0,W154,0)","v":0}]
[8760.3250000000007,8.7603249999999999,3.66255467420961,1.2942514228571249,1.0006398202440687,3.5762530352339408E-2,1,0,4564.3900506140972,1.5705772394695561,2.03540639471117,1.0572119181969117,1.0008335636045755,4.0816295583298572E-2,1.0000000000383715,8.760324999775902E-6,1.0000000000383715,8.760324999775902E-6,1.0025190069382004,9.4121990571653075E-2,15.928282577203737,-109.25066084851218,70.749339151487817,null,1000000000,76743294.105625018,null,-0.60549445465289209,-31.752267765863817,null,16.533777031856626,-77.49889501229859,null,0,0]
[8811.0499999999993,8.8110499999999998,3.6821852670399311,1.2957641948882919,1.0006472488079572,3.5969428449321252E-2,1,0,4590.8192840313714,1.5705785007499058,2.0443534568596426,1.0596788605552387,1.0008432406575334,4.1052369917554232E-2,1.0000000000388174,8.8110499997719848E-6,1.0000000000388174,8.8110499997719848E-6,1.002548247440519,9.4665845919223307E-2,15.869527410480423,-109.22889256685606,70.771107433143939,null,1000000000,77634602.102499992,null,-0.61763037595064429,-31.624520709328696,null,16.487157786431062,-77.604876693506043,null,0,0]
[8861.7749999999996,8.8617749999999997,3.7018241970917907,1.2972609191880353,1.0006547202057376,3.6176323465546376E-2,1,0,4617.248517455866,1.5705797475910619,2.0533128520748707,1.0621242892477081,1.0008529734874969,4.1288439673539762E-2,1.0000000000392655,8.8617749997680252E-6,1.0000000000392655,8.8617749997680252E-6,1.0025776564048592,9.5209681579927957E-2,15.811171675176618,-109.20743541909415,70.792564580905847,null,1000000000,78531056.15062499,null,-0.6295930971343664,-31.498005205430065,null,16.440764772310985,-77.709937955971156,null,0,0]
[8912.5,8.9124999999999996,3.7214713323737589,1.2987418431640387,1.0006622344364511,3.638321538337147E-2,1,0,4643.6777508874557,1.5705809802395638,{"$f":"SQRT(1+(A158/Zero2)^2)","v":2.0622844196174119},{"$f":"ATAN(A158/Zero2)","v":1.0645484556076565},1.0008627620928388,4.1524504825077288E-2,1.0000000000397162,8.9124999997640181E-6,1.0000000000397162,8.9124999997640181E-6,1.0026072338250227,9.5753497442208416E-2,15.753210181303583,-109.18628918754787,70.813710812452129,null,1000000000,79432656.25,null,-0.64138581470274647,-31.372706866454248,null,16.394595996006331,-77.814092969729103,null,0,0]
[8964.4,8.9643999999999995,3.7415819339751972,1.3002409707656475,1.0006699670594068,3.6594896545171854E-2,1,0,4670.7191942677564,1.5705822270029701,2.0714762392062234,1.067007027453045,1.0008728351692286,4.1766033425202555E-2,1.0000000000401803,8.964399999759873E-6,1.0000000000401803,8.964399999759873E-6,1.0026376707278157,9.630988971254005E-2,15.694308789922335,-109.16497460339606,70.835025396603939,null,1000000000,80360467.359999999,null,-0.65327900399434569,-31.24575107963885,null,16.347587793916677,-77.919737146043673,null,0,0]
[9016.2999999999993,9.0162999999999993,3.761700854426409,1.3017240659304148,1.0006777445206032,3.6806574426003213E-2,1,0,4697.760637655233,1.5705834594130346,2.0806804693159426,1.0694438621309801,1.0008829666314238,4.200755714965887E-2,1.0000000000406468,9.0162999997556754E-6,1.0000000000406468,9.0162999997556754E-6,1.0026682839678427,9.6866261020416705E-2,15.635809418302474,-109.14398476141632,70.85601523858368,null,1000000000,81293665.689999983,null,-0.66500076851124668,-31.120039639037355,null,16.30081018681372,-78.02446171831636,null,0,0]
[9068.2000000000007,9.0682000000000009,3.7818279609612233,1.3031913780580615,1.0006855668189947,3.7018249006972759E-2,1,0,4724.8020810497646,1.5705846777162025,2.089896945973003,1.0718592180920781,1.0008931564776511,4.2249075970416758E-2,1.000000000041116,9.0681999997514338E-6,1.000000000041116,9.0681999997514338E-6,1.0026990735383505,9.742261124644562E-2,15.577706801715435,-109.12331914978651,70.876680850213489,null,1000000000,82232251.24000001,null,-0.67655430871857303,-30.995557749034525,null,16.254261110434005,-78.128280970340356,null,0,0]
[9120.1,9.1201000000000008,3.8019631235714022,1.3046431515401165,1.0006934339535298,3.7229920269189434E-2,1,0,4751.8435244512284,1.5705858821533094,2.0991255078673539,1.0742533502534799,1.0009034047061276,4.2490589859450194E-2,1.0000000000415881,9.120099999747143E-6,1.0000000000415881,9.120099999747143E-6,1.0027300394325489,9.7978940271267828E-2,15.519995770358996,-109.10297717187026,70.897022828129735,null,1000000000,83176224.010000005,null,-0.68794275360832724,-30.872290816147128,null,16.207938523967321,-78.23120889896245,null,0,0]
[9173.2000000000007,9.1732000000000014,3.8225720439348998,1.3061126600842425,1.0007015293891657,3.7446482210195288E-2,1,0,4779.5102035453265,1.5705871003334584,2.1085797890321252,1.0766811347156875,1.0009139503086657,4.2737682751335625E-2,1.0000000000420739,9.173199999742699E-6,1.0000000000420739,9.173199999742699E-6,1.0027619037801525,9.8548110328307306E-2,15.461350356442324,-109.08249909703061,70.917500902969394,null,1000000000,84147598.24000001,null,-0.69942684012038359,-30.747416189186456,null,16.160777196562709,-78.335608493489374,null,0,0]
[9226.2999999999993,9.2262999999999984,3.8431891304311607,1.3075664051542917,1.0007096717560162,3.7663040637204825E-2,1,0,4807.1768826464358,1.5705883044916562,2.1180463874618294,1.0790872313117519,1.0009245570206122,4.2984770421462204E-2,1.0000000000425624,9.2262999997382042E-6,1.0000000000425624,9.2262999997382042E-6,1.0027939526849035,9.9117257939739231E-2,15.403104192030131,-109.06235827756809,70.937641722431906,null,1000000000,85124611.689999983,null,-0.71074451381577042,-30.623783082840475,null,16.1138487058459,-78.439103822778762,null,0,0]
[9279.4,9.279399999999999,3.8638142523381709,1.3090046329932343,1.0007178610529359,3.7879595529991976E-2,1,0,4834.8435617544365,1.5705894948686188,2.1275251387364187,1.0814719018727483,1.0009352248400245,4.3231852839825877E-2,1.0000000000430536,9.2793999997336586E-6,1.0000000000430536,9.2793999997336586E-6,1.0028261861394063,9.9686382977843838E-2,15.345252035424053,-109.04255382626415,70.957446173735846,null,1000000000,86107264.359999999,null,-0.72189890533319379,-30.501376507366519,null,16.067150940757248,-78.541708989354646,null,0,0]
[9332.5,9.3324999999999996,3.8844472816598636,1.3104275848720102,1.0007260972787728,3.8096146868332639E-2,1,0,4862.510240869211,1.570590671699583,2.1370158811437721,1.0838354045621588,1.000945953764949,4.3478929976426405E-2,1.0000000000435478,9.3324999997290587E-6,1.0000000000435478,9.3324999997290587E-6,1.0028586041362237,0.10025548531493902,15.287788740037108,-109.02308478084966,70.976915219150342,null,1000000000,87095556.25,null,-0.73289307480345434,-30.380181682845837,null,16.020681814840565,-78.643437810866715,null,0,0]
[9386.85,9.3868500000000008,3.9055740806142745,1.3118684608624904,1.0007345759872037,3.8317792229162942E-2,1,0,4890.8282071640133,1.5705918624455861,2.146742292153685,1.0862328897241942,1.0009569985320919,4.3731817928764766E-2,1.0000000000440563,9.386849999724299E-6,1.0000000000440563,9.386849999724299E-6,1.0028919763705255,0.10083796095759391,15.229370156541719,-109.00350368797623,70.996496312023766,null,1000000000,88112952.922499999,null,-0.74398325021785994,-30.257373538554777,null,15.97335340675958,-78.746667976309993,null,0,0]
[9441.2000000000007,9.4412000000000003,3.92670890076199,1.313293829262445,1.0007431038575534,3.853943382336289E-2,1,0,4919.1461734656714,1.5705930394820939,2.1564809311492081,1.0886087344181414,1.0009681073113386,4.3984700284156478E-2,1.0000000000445681,9.4411999997194834E-6,1.0000000000445681,9.4411999997194834E-6,1.0029255419219403,0.10142041254731916,15.17134834347898,-108.98427171460686,71.015728285393138,null,1000000000,89136257.440000013,null,-0.75491184023666269,-30.135804195575645,null,15.926260183715645,-78.849008459945381,null,0,0]
[9495.5499999999993,9.4955499999999997,3.9478516132786572,1.3147039333857375,1.000751680888565,3.8761071629252762E-2,1,0,4947.4641397740643,1.5705942030445152,2.166231633211781,1.0909632038663477,1.0009792801005577,4.4237577010445013E-2,1.0000000000450826,9.4955499997146084E-6,1.0000000000450826,9.4955499997146084E-6,1.0029593007823583,0.10200283994732651,15.113718078104423,-108.96538761052814,71.03461238947186,null,1000000000,90165469.80249998,null,-0.76568190855270446,-30.015458469432776,null,15.879399986657127,-78.950473196035134,null,0,0]
[9549.9,9.5498999999999992,3.9690020920372953,1.3160990116055613,1.0007603070789748,3.8982705625155094E-2,1,0,4975.782106089081,1.5705953533628993,2.1759942361764053,1.0932965594882789,1.0009905168976059,4.4490448075478188E-2,1.0000000000456004,9.549899999709681E-6,1.0000000000456004,9.549899999709681E-6,1.0029932529436245,0.10258524302087016,15.056474233041023,-108.94685006003165,71.05314993996835,null,1000000000,91200590.00999999,null,-0.7762964492594997,-29.896321393232746,null,15.83277068230052,-79.051075835764308,null,0,0]
[9605.5249999999996,9.6055250000000001,3.9906566539803414,1.3175115019717378,1.0007691865331654,3.9209534978904829E-2,1,0,5004.7643853280715,1.5705965171875582,2.1859980172043962,1.0956630597150046,1.0010020835749061,4.4749245362839356E-2,1.0000000000461331,9.6055249997045784E-6,1.0000000000461331,9.6055249997045784E-6,1.0030282017381984,0.10318128339218491,14.998282372436712,-108.92823504192182,71.071764958078177,null,1000000000,92266110.52562499,null,-0.78700200731592362,-29.775625592442967,null,15.785284379752637,-79.153159805521952,null,0,0]
[9661.15,9.6611499999999992,4.0123190918483562,1.3189087430809237,1.0007781174775723,3.9436360295874377E-2,1,0,5033.7466645737613,1.5705976676105529,2.1960139289505172,1.09800798599172,1.0010137172938058,4.5008036652081196E-2,1.0000000000466689,9.6611499996994166E-6,1.0000000000466689,9.6611499996994166E-6,1.0030633529918818,0.10377729799259988,14.940484704205909,-108.90998004523003,71.090019954769971,null,1000000000,93337819.32249999,null,-0.79755078563658721,-29.656164776411895,null,15.738035489842499,-79.254368811939017,null,0,0]
[9716.7749999999996,9.7167750000000002,4.0339892787606884,1.3202909751855496,1.0007870999108168,3.9663181552831925E-2,1,0,5062.7289438260377,1.5705988048620423,2.2060418061864429,1.100331606555953,1.001025418051968,4.5266821908749401E-2,1.000000000047208,9.7167749996941938E-6,1.000000000047208,9.7167749996941938E-6,1.0030987066957833,0.1043732866756579,14.883076028098481,-108.8920834706812,71.1079165293188,null,1000000000,94415716.40062499,null,-0.80794577931047251,-29.537923587474314,null,15.691021807408953,-79.354716613405486,null,0,0]
[9772.4,9.7723999999999993,4.0556670905035634,1.3216584336335551,1.0007961338315128,3.9889998726548179E-2,1,0,5091.711223084787,1.570599929166945,2.216081486478898,1.1026341857133535,1.001037185847041,4.5525601098394528E-2,1.0000000000477498,9.7723999996889117E-6,1.0000000000477498,9.7723999996889117E-6,1.0031342628409632,0.10496924929494943,14.826051239374376,-108.87454366297604,71.125456337023962,null,1000000000,95499801.75999999,null,-0.81818991481580561,-29.420886892945038,null,15.644241154190182,-79.454216687307351,null,0,0]
[9829.2999999999993,9.8292999999999999,4.0778495491357969,1.3230421909345089,1.0008054280916179,4.0122010606787772E-2,1,0,5121.3578152679611,1.5706010660764651,2.226363335279097,1.1049680442008065,1.0010492927327654,4.5790305542858546E-2,1.0000000000483076,9.8292999996834461E-6,1.0000000000483076,9.8292999996834461E-6,1.0031708434263575,0.10557884506169302,14.768111328581314,-108.8569691654415,71.143030834558502,null,1000000000,96615138.48999998,null,-0.82851575608565819,-29.302398239101137,null,15.596627084666977,-79.555134103746553,null,0,0]
[9886.2000000000007,9.8862000000000005,4.1000397314720436,1.3244109725258404,1.0008147762235888,4.0354018165292112E-2,1,0,5151.0044074576781,1.5706021898990257,2.2366571993164577,1.1072804327517647,1.0010614697587557,4.6055003566079007E-2,1.0000000000488685,9.8861999996779177E-6,1.0000000000488685,9.8861999996779177E-6,1.0032076358207613,0.10618841324638906,14.71056259670946,-108.83976430924292,71.160235690757077,null,1000000000,97736950.440000013,null,-0.83868972669081643,-29.185138604268499,null,15.549252323400278,-79.655192142510487,null,0,0]
[9943.1,9.9431000000000012,4.1222375127812088,1.3257650151641978,1.0008241782259164,4.0586021377205857E-2,1,0,5180.6509996538261,1.5706033008592997,2.2469629134571285,1.109571621881857,1.001073716922452,4.6319695131198761E-2,1.0000000000494325,9.9430999996723233E-6,1.0000000000494325,9.9430999996723233E-6,1.0032446400144437,0.1067979536924844,14.65339987617288,-108.82292716334858,71.177072836651419,null,1000000000,98865237.610000014,null,-0.84871474783357104,-29.069092499804345,null,15.502114624006451,-79.754404361210135,null,0,0]
[10000,10,4.1444427709621952,1.3271045507510115,1.0008336340970823,4.0818020217676471E-2,1,0,5210.2975918562952,1.5706043991768461,2.2572803153945875,1.111841878059751,1.0010860342212802,4.6584380201366071E-2,1.00000000005,9.9999999996666679E-6,1.00000000005,9.9999999996666679E-6,1.0032818559976198,0.10740746624347919,14.596618094760254,-108.80645575012714,71.193544249872858,null,1000000000,100000000,null,-0.85859367328758196,-28.954244668646975,null,15.455211768047835,-79.852784039275917,null,0,0]
[10058.25,10.058249999999999,4.1671824877086161,1.3284610776632353,1.0008433701162158,4.1055518870117089E-2,1,0,5240.6475742141174,1.5706055106806842,2.2678544467988306,1.1141445881654801,1.0010987164064968,4.685533837938409E-2,1.0000000000505842,1.0058249999660807E-5,1.0000000000505842,1.0058249999660807E-5,1.0033201743372184,0.1080314109295233,14.538878523839458,-108.78997028023393,71.210029719766069,null,1000000000,101168393.0625,null,-0.86855855892449929,-28.837897542517446,null,15.407437082763957,-79.952649032991417,null,0,0]
[10116.5,10.1165,4.1899297895159977,1.3298028777410826,1.0008531625874302,4.1293012888521059E-2,1,0,5270.9975565783398,1.5706066093846218,2.2784404917878383,1.1164259126624467,1.0011114720888481,4.7126289672456127E-2,1.0000000000511717,1.011649999965488E-5,1.0000000000511717,1.011649999965488E-5,1.0033587146143677,0.10865532604934826,14.481527721952974,-108.77386377364277,71.226136226357227,null,1000000000,102343572.25,null,-0.87837617791732248,-28.722774593655096,null,15.3599038998703,-80.051668812741752,null,0,0]
[10174.75,10.17475,4.2126845535128119,1.3311301847538277,1.000863011509068,4.1530502246233857E-2,1,0,5301.3475389488513,1.5706076955084958,2.2890382850724502,1.1186861246720481,1.0011243012655249,4.7397234041062539E-2,1.0000000000517628,1.0174749999648884E-5,1.0000000000517628,1.0174749999648884E-5,1.0033974768183929,0.10927921143522434,14.424560543792698,-108.75813397789148,71.241866022108525,null,1000000000,103525537.5625,null,-0.88804938402681877,-28.60886018368798,null,15.312609927819519,-80.149856764436748,null,0,0]
[10233,10.233000000000001,4.2354466594281339,1.3324432276522069,1.0008729168794628,4.1767986916604091E-2,1,0,5331.6975213255446,1.5706087692671369,2.2996476642286483,1.1209254931467536,1.0011372039337019,4.7668171445689793E-2,1.0000000000523572,1.023299999964282E-5,1.0000000000523572,1.023299999964282E-5,1.0034364609385591,0.10990306691948172,14.367971939514677,-108.74277860301476,71.257221396985244,null,1000000000,104714289,null,-0.89758096460274928,-28.496138912819625,null,15.265552904117424,-80.24722599790752,null,0,0]
[10292.5,10.2925,4.2587046800784627,1.3337699540462533,1.0008830930884858,4.2010562957525088E-2,1,0,5362.6987908839792,1.5706098535200046,2.3104965079861,1.1231916728462323,1.0011504593542431,4.7944915726887499E-2,1.0000000000529679,1.0292499999636554E-5,1.0000000000529679,1.0292499999636554E-5,1.0034765107270642,0.11054027881519997,14.310554681051684,-108.72747785580218,71.272522144197822,null,1000000000,105935556.25,null,-0.90717369938187442,-28.382214782721348,null,15.217728380433558,-80.345852789892106,null,0,0]
[10352,10.352,4.2819701154727747,1.3350822655959549,1.0008933281914087,4.2253134051569934E-2,1,0,5393.7000604486448,1.5706109253089924,2.3213571065170728,1.1254366590893903,1.0011637914482583,4.8221652658695574E-2,1.000000000053582,1.0351999999630213E-5,1.000000000053582,1.0351999999630213E-5,1.0035167920353696,0.11117745915875056,14.253522062944237,-108.71256283485957,71.287437165140432,null,1000000000,107163904,null,-0.9166243397410162,-28.269503813008214,null,15.170146402685251,-80.44365214776154,null,0,0]
[10411.5,10.4115,4.3052428454037415,1.3363803915100154,1.0009036221864251,4.2495700170344687E-2,1,0,5424.7013300194358,1.5706119848477871,2.3322292956046016,1.1276607254812516,1.0011772002126846,4.8498382199021584E-2,1.0000000000541998,1.0411499999623801E-5,1.0000000000541998,1.0411499999623801E-5,1.0035573048518422,0.11181460777163185,14.196868997666066,-108.69803099769628,71.301969002303721,null,1000000000,108399332.25,null,-0.92593565317206794,-28.157990337098681,null,15.122804650838134,-80.540637195606635,null,0,0]
[10471,10.471,4.3285227522119776,1.3376645562597302,1.0009139750717175,4.2738261285458948E-2,1,0,5455.7025995962476,1.5706130323452188,2.3431129139059919,1.1298641413793074,1.0011906856444415,4.8775104305779908E-2,1.000000000054821,1.0470999999617314E-5,1.000000000054821,1.0470999999617314E-5,1.0035980491647849,0.1124517244754089,14.140590492336628,-108.68387977347952,71.316120226520482,null,1000000000,109641841,null,-0.93511034239234481,-28.047658931499093,null,15.075700834728975,-80.63682078608835,null,0,0]
[10532,10.532,4.3523968774211204,1.338966831491438,1.0009246500881386,4.2986932162486953E-2,1,0,5487.4854137903822,1.5706140939632574,2.354282608245593,1.1321019451994452,1.0012045906327012,4.9058794839021924E-2,1.0000000000554614,1.0531999999610587E-5,1.0000000000554614,1.0531999999610587E-5,1.0036400609570686,0.11310486963221116,14.083276914720726,-108.66976420431823,71.330235795681773,null,1000000000,110923024,null,-0.94437725519229776,-27.935757313574737,null,15.027654169913024,-80.734610329894039,null,0,0]
[10593,10.593,4.3762783034079566,1.3402548958110942,1.0009353869976199,4.3235597719968294E-2,1,0,5519.2682279906312,1.5706151433545992,2.3654639809055689,1.1343186041677351,1.0012185761959835,4.9342477469608272E-2,1.0000000000561058,1.059299999960378E-5,1.0000000000561058,1.059299999960378E-5,1.0036823160399322,0.11375798087116515,14.026346688325916,-108.65604312875428,71.343956871245723,null,1000000000,112211649,null,-0.95350612007233582,-27.825066053094126,null,14.979852808398251,-80.831584009853202,null,0,0]
[10654,10.654,4.4001669112999613,1.3415289763635652,1.0009461857981699,4.3484257927322398E-2,1,0,5551.0510421968875,1.5706161807292585,2.3766568670581951,1.1365143950914067,1.0012326423309117,4.9626152152211882E-2,1.0000000000567537,1.0653999999596897E-5,1.0000000000567537,1.0653999999596897E-5,1.0037248144005593,0.11441105800021836,13.969794728649536,-108.64271370152795,71.357286298472047,null,1000000000,113507716,null,-0.96249964870870619,-27.715569299607139,null,14.932294377358241,-80.927754831156406,null,0,0]
[10715,10.715,4.4240625847567507,1.3427892955700276,1.0009570464877855,4.3732912753972654E-2,1,0,5582.8338564090509,1.5706172062924659,2.3878611047980649,1.1386895903953449,1.0012467890340904,4.9909818841513347E-2,1.0000000000574056,1.0714999999589933E-5,1.0000000000574056,1.0714999999589933E-5,1.0037675560260626,0.11506410082739336,13.913616046341165,-108.62977305755248,71.370226942447516,null,1000000000,114811225,null,-0.97136048872647196,-27.607251453479865,null,14.884976535067636,-81.023135528350764,null,0,0]
[10777.5,10.7775,4.4485530659955543,1.3440665608752069,1.0009682384320027,4.398767643080468E-2,1,0,5615.3982152390081,1.5706182450334694,2.3993524640140529,1.1408971929280931,1.001261367167837,5.0200452603271814E-2,1.0000000000580771,1.0777499999582714E-5,1.0000000000580771,1.0777499999582714E-5,1.0038116009729015,0.11573316630659364,13.856437960130098,-108.6169144280166,71.383085571983401,null,1000000000,116154506.25,null,-0.98030429832463029,-27.497476748793844,null,14.836742258454729,-81.120055184487157,null,0,0]
[10840,10.84,4.4730507251563578,1.3453298377663456,1.0009794953421389,4.4242434394080314E-2,1,0,5647.9625740749543,1.5706192717963712,2.4108554049906052,1.1430837397158446,1.0012760298736454,5.0491077877485205E-2,1.0000000000587528,1.0839999999575412E-5,1.0000000000587528,1.0839999999575412E-5,1.0038559012679389,0.11640219536841485,13.799641427327643,-108.60445779492275,71.395542205077248,null,1000000000,117505600,null,-0.98911424200239306,-27.388907276836829,null,14.788755669330037,-81.216171604336537,null,0,0]
[10902.5,10.9025,4.4975554449472552,1.3465793508237549,1.0009908172160022,4.4497186610924451E-2,1,0,5680.5269329167868,1.5706202867871695,2.4223697627351952,1.1452495099564219,1.0012907771478001,5.0781694615433276E-2,1.0000000000594322,1.0902499999568026E-5,1.0000000000594322,1.0902499999568026E-5,1.0039004568970806,0.11707118780661474,13.743221377811576,-108.59240002799622,71.40759997200378,null,1000000000,118864506.25,null,-0.99779296966834008,-27.281527049763294,null,14.741014347479915,-81.311497645469757,null,0,0]
[10965,10.965,4.5220671105852794,1.3478153199324607,1.0010022040513882,4.4751933048466482E-2,1,0,5713.0912917644055,1.5706212902071657,2.4338953752152857,1.1473947783466409,1.0013056089865646,5.1072302768404423E-2,1.0000000000601155,1.0964999999560553E-5,1.0000000000601155,1.0964999999560553E-5,1.0039452678461536,0.11774014341503576,13.687172836811911,-108.5807379855669,71.419262014433102,null,1000000000,120231225,null,-1.0063430681172085,-27.175320337347753,null,14.693515904929118,-81.406045896442166,null,0,0]
[11028.75,11.02875,4.5470760486560913,1.3490622787146878,1.0010138855445436,4.5011768426837941E-2,1,0,5746.3069377948332,1.5706223019793286,2.4456629295547376,1.1495621113699512,1.001320824576668,5.1368714189683556E-2,1.0000000000608167,1.1028749999552846E-5,1.0000000000608167,1.1028749999552846E-5,1.0039912380300215,0.11842243997987638,13.630380990924365,-108.56924711006749,71.430752889932506,null,1000000000,121633326.5625,null,-1.014934273444039,-27.068182395903857,null,14.645315264368403,-81.501696614992625,null,0,0]
[11092.5,11.092499999999999,4.5720919796497164,1.350295594074628,1.0010256346189947,4.5271597723356614E-2,1,0,5779.5225838310771,1.5706233021219267,2.4574418619323533,1.1517086776122454,1.0013361281398716,5.1665116576807606E-2,1.0000000000615219,1.1092499999545046E-5,1.0000000000615219,1.1092499999545046E-5,1.0040374738187117,0.11910469779402387,13.573965500909885,-108.55816131722908,71.441838682770921,null,1000000000,123043556.25,null,-1.0233968962376547,-26.962233119423676,null,14.597362397147542,-81.596563751240339,null,0,0]
[11156.25,11.15625,4.5971147894068531,1.351515485019219,1.0010374512723621,4.5531420903154471E-2,1,0,5812.7382298730354,1.5706242908343242,2.4692320095187954,1.1538347546223351,1.0013515196721412,5.1961509878111475E-2,1.0000000000622311,1.1156249999537158E-5,1.0000000000622311,1.1156249999537158E-5,1.0040839751969319,0.11978691663897759,13.51792137982236,-108.54747725079054,71.452522749209464,null,1000000000,124461914.0625,null,-1.0317334897701842,-26.857456613994206,null,14.549654869592544,-81.690659842837206,null,0,0]
[11220,11.22,4.6221443662092314,1.3527221659733641,1.0010493355022523,4.5791237931368411E-2,1,0,5845.9538759206116,1.5706252683113537,2.4810332124262846,1.1559406154167893,1.001366999169421,5.2257894041939645E-2,1.0000000000629443,1.1219999999529176E-5,1.0000000000629443,1.1219999999529176E-5,1.004130742149306,0.12046909629633064,13.462243734516983,-108.53719155138386,71.462808448616144,null,1000000000,125888400,null,-1.0399465462786246,-26.753837245121744,null,14.502190280795608,-81.783997164908925,null,0,0]
[11285.5,11.285500000000001,4.6478679627614934,1.3539484332481504,1.0010616163479216,4.6058180747888415E-2,1,0,5880.0813240223042,1.570626261118979,2.4931697196201199,1.1580835101437357,1.0013829952100308,5.2562404670185955E-2,1.0000000000636813,1.1285499999520885E-5,1.0000000000636813,1.1285499999520885E-5,1.0041790694937438,0.12116996140864456,13.405414341111987,-108.52703488779186,71.472965112208144,null,1000000000,127362510.25,null,-1.0482589456129627,-26.648562478708776,null,14.45367328672495,-81.879119020603497,null,0,0]
[11351,11.351000000000001,4.6735984715159571,1.3551611998944633,1.0010739685259542,4.6325116995853968E-2,1,0,5914.2087721297248,1.5706272424687773,2.5053175644921843,1.1602056334965352,1.0013990841026328,5.2866905541879047E-2,1.0000000000644227,1.1350999999512492E-5,1.0000000000644227,1.1350999999512492E-5,1.0042276771598178,0.12187078468520379,13.348961641903632,-108.5172915710852,71.482708428914805,null,1000000000,128845201,null,-1.0564460758176828,-26.544476608876014,null,14.405407717721314,-81.973465326603147,null,0,0]
[11416.5,11.416499999999999,4.6993357789324435,1.3563606841358051,1.0010863920337096,4.6592046637467834E-2,1,0,5948.3362202427752,1.5706282125579596,2.5174765829158043,1.1623072671896106,1.0014152658427511,5.3171396601023393E-2,1.0000000000651683,1.1416499999504004E-5,1.0000000000651683,1.1416499999504004E-5,1.0042765651305718,0.1225715658894292,13.292880624530357,-108.50795796020374,71.49204203979626,null,1000000000,130336472.25,null,-1.0645104498088378,-26.441563502667037,null,14.357391074339196,-82.067048574804232,null,0,0]
[11482,11.481999999999999,4.7250797739148904,1.3575470995945995,1.0010988868685322,4.6858969634938456E-2,1,0,5982.4636683613608,1.5706291715792378,2.5296466137703546,1.164388688247608,1.0014315404258851,5.3475877791634409E-2,1.0000000000659182,1.1481999999495419E-5,1.0000000000659182,1.1481999999495419E-5,1.004325733388955,0.12327230478484834,13.237166371571703,-108.49903041891803,71.500969581081975,null,1000000000,131836324,null,-1.072454519790385,-26.33980729557269,null,14.309620891362091,-82.159880993486425,null,0,0]
[11548.75,11.54875,4.7513218341847363,1.3587429278128866,1.0011116935334972,4.7130979708072694E-2,1,0,6017.2424036633765,1.5706301377106753,2.5420600630425274,1.166489318190435,1.0014482211056224,5.3786159481210898E-2,1.0000000000666867,1.1548749999486568E-5,1.0000000000666867,1.1548749999486568E-5,1.0043761283172994,0.12398637278758966,13.180761204832992,-108.49034651449604,71.509653485503961,null,1000000000,133373626.5625,null,-1.0804289019468225,-26.237283251939484,null,14.261190106779814,-82.253724957190926,null,0,0]
[11615.5,11.615500000000001,4.7775706142233272,1.3599256175424856,1.0011245742682973,4.7402982801824103E-2,1,0,6052.0211389709466,1.57063109273811,2.5544846204780809,1.1685695230597184,1.0014649981962964,5.4096430804639904E-2,1.0000000000674598,1.1615499999477612E-5,1.0000000000674598,1.1615499999477612E-5,1.0044268142973041,0.12470039635576131,13.124726914752012,-108.4820767244607,71.517923275539303,null,1000000000,134919840.25,null,-1.0882833013293665,-26.135928248668922,null,14.213010216081376,-82.346813994919458,null,0,0]
[11682.25,11.68225,{"$f":"SQRT(1+(A205/pole1)^2)","v":4.8038260038773819},{"$f":"ATAN(A205/pole1)","v":1.3610953808732755},{"$f":"SQRT(1+(A205/Zero1)^2)","v":1.0011375290700735},{"$f":"ATAN(A205/Zero1)","v":4.7674978876214184E-2},{"$f":"IF(VIN_nom>Vout, 1, SQRT(1+(A205/z_RHP)^2))","v":1},{"$f":"IF(VIN_nom>Vout, 0, -ATAN(A205/z_RHP))","v":0},{"$f":"SQRT(1+(A205/Pole2)^2)","v":6086.7998742839718},{"$f":"ATAN(A205/Pole2)","v":1.5706320368518802},2.5669201247778681,1.1706295815697576,{"$f":"SQRT(1+(A205/pole4)^2)","v":1.0014818716930618},{"$f":"ATAN(A205/pole4)","v":5.4406691702705332E-2},{"$f":"SQRT(1+(A205/Zero3)^2)","v":1.0000000000682374},{"$f":"ATAN(A205/Zero3)","v":1.1682249999468554E-5},{"$f":"SQRT(1+(A205/pole5)^2)","v":1.0000000000682374},{"$f":"ATAN(A205/pole5)","v":1.1682249999468554E-5},{"$f":"SQRT((1-(Z205/pterm2))^2+(A205/pterm1)^2)","v":1.0044777913106226},{"$f":"IF((ATAN((A205/pterm1)/(1-A205^2/pterm2))>0),ATAN((A205/pterm1)/(1-A205^2/pterm2)),PI()+ATAN((A205/pterm1)/(1-A205^2/pterm2)))","v":0.12541437523943813},{"$f":"20*LOG10(((E205*K205*G205*O205)/(C205*I205*S205*M205*Q205))*Adc)","v":13.06905858693888},{"$f":"((F205+L205+H205+R205)-(D205+J205+T205+N205))*radconv","v":-108.47421722699762},{"$f":"IF(V205>0,V205,V205+180)","v":71.525782773002376},null,{"$f":"IF(U205<0,A205,1000000000)","v":1000000000},{"$f":"A205^2","v":136474965.0625},null,{"$f":"20*LOG10((K205/(I205*M205))*AEA*Afb)","v":-1.0960201294222041},-26.03572632412067,null,{"$f":"20*LOG10((E205*G205/(C205*S205))*Am)","v":14.165078716361082},{"$f":"(F205+H205-(D205+T205))*radconv","v":-82.439160246497863},null,{"$f":"SUM((U206<0)*(U205>0))*A205","v":0},0]
[11749,{"$f":"A206/1000","v":11.749000000000001},4.8300878953612694,1.3622524254257318,1.001150557935951,4.7946967891270675E-2,1,0,6121.5786096023603,1.5706329702379982,2.5793664176125723,1.1726697677464024,1.001498841591046,5.4716942116203086E-2,1.0000000000690195,1.1748999999459394E-5,1.0000000000690195,1.1748999999459394E-5,1.0045290593388081,0.12612830918881243,13.013751399954977,-108.46676421260187,71.533235787398127,null,1000000000,138039001,null,-1.103641739311918,{"$f":"(L206-(J206+N206))*radconv","v":-25.936661785035618},null,14.117393139266897,-82.530775595680481,null,0,0]
[11817.5,11.817500000000001,4.8570449500006019,1.3634267943007103,1.0011640053817368,4.8226080323186232E-2,1,0,6157.2691469757765,1.5706339171323456,2.5921500712787044,1.1747430638220697,1.0015163566129914,5.5035315473109435E-2,1.0000000000698268,1.1817499999449883E-5,1.0000000000698268,1.1817499999449883E-5,1.0045819740124338,0.12686091352895915,12.957364718183126,-108.45953442823865,71.540465571761345,null,1000000000,139653306.25,null,-1.1113457857495508,-25.836166372813906,null,14.068710503932675,-82.624045148299842,null,0,0]
[11886,11.885999999999999,4.8840086292457778,1.3645881978300012,1.0011775308198543,4.8505185235488947E-2,1,0,6192.9596843546506,1.5706348531126326,2.6049447580581875,1.1767960018661223,1.0015339731466746,5.5353677662195247E-2,1.0000000000706386,1.188599999944026E-5,1.0000000000706386,1.188599999944026E-5,1.0046351951204695,0.12759347001514226,12.90134836442072,-108.45272463739211,71.547275362607891,null,1000000000,141276996,null,-1.1189333328059576,-25.73683612468567,null,14.020281697226675,-82.71656953034244,null,0,0]
[11954.5,11.954499999999999,4.9109788239798053,1.3657368464642834,1.0011911342471418,4.8784282585000172E-2,1,0,6228.650221738887,1.5706357783664737,2.6177503161725379,1.1788288632095405,1.0015516911867395,5.5672028619516666E-2,1.0000000000714551,1.1954499999430528E-5,1.0000000000714551,1.1954499999430528E-5,1.0046887226426477,0.12832597837777707,12.845697418845814,-108.44633077303384,71.553669226966164,null,1000000000,142910070.25,null,-1.1264067424213071,-25.63865492865887,null,13.97210416126712,-82.8083607867719,null,0,0]
[12023,12.023,4.9379554274435176,1.3668729461916767,1.001204815660421,4.9063372328548294E-2,1,0,6264.3407591283949,1.5706366930772082,2.6305665868572823,1.1808419243714021,1.0015695107277989,5.5990368281143441E-2,1.0000000000722764,1.2022999999420682E-5,1.0000000000722764,1.2022999999420682E-5,1.0047425565585888,0.12905843834741207,12.790407055171384,-108.4403487879144,71.559651212085598,null,1000000000,144552529,null,-1.1337683188195147,-25.541606948198993,null,13.924175373990904,-82.899430706873233,null,0,0]
[12093,12.093,4.9655292715268944,1.3680211697185998,1.0012188772296378,4.9348565623798982E-2,1,0,6300.8128411376247,1.5706376171126046,2.6436744106858474,1.1828788946814768,1.0015878253314532,5.6315667148323138E-2,1.0000000000731202,1.2092999999410503E-5,1.0000000000731202,1.2092999999410503E-5,1.0047978858293312,0.12980688731204326,12.734273539026884,-108.43465712766202,71.565342872337979,null,1000000000,146240649,null,-1.1411779034127842,-25.443588341824384,null,13.875451442439669,-82.991761663700061,null,0,0]
[12163,12.163,4.9931095899387525,1.3691567098999613,1.0012330202309163,4.9633750885200958E-2,1,0,6337.2849231521723,1.57063853051206,2.6567930955107761,1.1848957570304341,1.0016062459186006,5.6640954084750186E-2,1.0000000000739693,1.2162999999400208E-5,1.0000000000739693,1.2162999999400208E-5,1.0048535350160752,0.13055528517257203,12.678506668465559,-108.42938710582594,71.570612894174062,null,1000000000,147938569,null,-1.1484753911784298,-25.346720543781409,null,13.826982059643989,-83.083363450611515,null,0,0]
[12233,12.233000000000001,5.0206962759823153,1.3702797728524116,1.0012472446608063,4.9918928066707044E-2,1,0,6373.7570051719476,1.5706394334581579,2.6699224812353046,1.1868927915318335,1.0016247724833938,5.6966229022246476E-2,1.0000000000748233,1.2232999999389792E-5,1.0000000000748233,1.2232999999389792E-5,1.0049095040967115,0.13130363164189102,12.623101581455513,-108.42453447543879,71.57546552456121,null,1000000000,149646289,null,-1.1556630647604582,-25.250987511300288,null,13.778764646215976,-83.174247863410045,null,0,0]
[12303,12.303000000000001,5.0482892252686407,1.3713905603136944,1.0012615505158371,5.0204097122277941E-2,1,0,6410.2290871968589,1.5706403261293271,2.6830624107670364,1.1888702734513013,1.0016434050199521,5.72914918926491E-2,1.0000000000756819,1.2302999999379258E-5,1.0000000000756819,1.2302999999379258E-5,1.0049657930490099,0.13205192643304123,12.568053508460988,-108.4200950161772,71.5799049838228,null,1000000000,151363809,null,-1.1627431507650938,-25.156373479140104,null,13.730796659226083,-83.264426447013236,null,0,0]
[12374.5,12.374499999999999,5.0764798118488583,1.3725126827829346,1.0012762469823473,5.0495368506472828E-2,1,0,6447.4827138418032,1.5706412275029105,{"$f":"SQRT(1+(A215/Zero2)^2)","v":2.6964946350873227},{"$f":"ATAN(A215/Zero2)","v":1.1908702256758998},1.0016625462213327,5.7623712153111961E-2,1.0000000000765641,1.2374499999368371E-5,1.0000000000765641,1.2374499999368371E-5,1.005023618396593,0.13281620246324702,12.512189540571256,-108.4159826130131,71.584017386986901,null,1000000000,153128250.25,null,-1.1698661406614184,-25.060871121029031,null,13.682055681232674,-83.355820498608423,null,0,0]
[12446,12.446,5.1046767199181149,1.37362241001065,1.0012910283936545,5.0786631315675748E-2,1,0,6484.7363404919261,1.5706421185200405,2.7099375379261996,1.1928503438489031,1.0016817979722783,5.7955919680072909E-2,1.0000000000774514,1.244599999935736E-5,1.0000000000774514,1.244599999935736E-5,1.0050817774242333,0.13358042397205891,12.456688277888539,-108.41229246677922,71.58770753322078,null,1000000000,154902916,null,-1.1768814066349769,-24.966503847409328,null,13.633569684523515,-83.446501722642466,null,0,0]
[12517.5,12.5175,5.1328798452972091,1.3747199435615371,1.0013058947459967,5.1077885500849581E-2,1,0,6521.9899671471385,1.5706429993581854,2.7233909611532856,1.1948109062646286,1.0017011602664148,5.8288114400942177E-2,1.000000000078344,1.2517499999346219E-5,1.000000000078344,1.2517499999346219E-5,1.005140270107848,0.13434459065415713,12.401544922247494,-108.40902017251724,71.590979827482755,null,1000000000,156687806.25,null,-1.1837911506838259,-24.873255719200198,null,13.585336072931323,-83.5364816532379,null,0,0]
[12589,12.589,5.1610890860613914,1.3758054807124496,1.0013208460355907,5.1369131012965918E-2,1,0,6559.2435938073522,1.5706438701907819,2.7368547496249094,1.1967521863489765,1.0017206330973323,5.8620296243146894E-2,1.0000000000792415,1.2588999999334951E-5,1.0000000000792415,1.2588999999334951E-5,1.0051990964232238,0.13510870220438687,12.346754766757133,-108.40616135831236,71.59383864168764,null,1000000000,158482921,null,-1.1905975205310533,-24.781111076030619,null,13.537352287288186,-83.625771578850816,null,0,{"$f":"IF(AH218>0,W218,0)","v":0}]
[12662.25,12.66225,5.1899950002693505,1.3769053483895832,1.0013362513428796,5.1667495866422129E-2,1,0,6597.4090225237906,1.5706447521387832,2.7506586611442816,1.1987212650987991,1.0017406971573177,5.8960594978965566E-2,1.0000000000801663,1.2662249999323277E-5,1.0000000000801663,1.2662249999323277E-5,1.0052597084984787,0.13589145829425545,12.29098503930186,-108.40365682213638,71.596343177863616,null,1000000000,160332575.0625,null,-1.1974654694264686,-24.687839387264589,null,13.488450508728329,-83.716542928356716,null,0,0]
[12735.5,12.7355,5.2189071233080391,1.3779930310988611,1.0013517457879624,5.196585151292344E-2,1,0,6635.574451245303,1.5706456239414914,2.7644731311809623,1.2006706718044808,1.0017608772174567,5.9300880043833382E-2,1.0000000000810965,1.2735499999311464E-5,1.0000000000810965,1.2735499999311464E-5,1.0053206706851097,0.13667415587261103,12.235576296149098,-108.40157707431952,71.598422925680481,null,1000000000,162192960.25,null,-1.2042293174420595,-24.595693459033246,null,13.439805613591156,-83.806613305687065,null,0,0]
[12808.75,12.80875,5.2478253525575331,1.3790687276816147,1.0013673293667007,5.2264197899781574E-2,1,0,6673.7398799717994,1.5706464857729618,2.7782980022353061,1.2026006852038804,1.0017811732707385,5.9641151359772999E-2,1.0000000000820322,1.2808749999299514E-5,1.0000000000820322,1.2808749999299514E-5,1.005381982956651,0.1374567946118839,12.180523760006663,-108.39991752688339,71.600082473116615,null,1000000000,164064076.5625,null,-1.2108912067525754,-24.504657326338531,null,13.391414966759235,-83.895994087861467,null,0,0]
[12882,12.882,5.2767495876260311,1.3801326327317636,1.0013830020749335,5.2562534974318099E-2,1,0,6711.9053087031971,1.5706473378032906,2.7921331198096038,1.2045115790943985,1.0018015853101134,5.9981408848826148E-2,1.000000000082973,1.2881999999287428E-5,1.000000000082973,1.2881999999287428E-5,1.0054436452864945,0.13823937418468973,12.125822744695707,-108.39867363134225,71.601326368657752,null,1000000000,165945924,null,-1.2174532263745195,-24.414715307024057,null,13.343275971070231,-83.984696408550704,null,0,0]
[12957.25,12.95725,5.3064697137325956,1.3812135076315368,1.0013991955156152,5.2869008018497227E-2,1,0,6751.1127969271556,1.5706482030657076,2.8063564987826943,1.2064550204635023,1.0018226754469559,6.0330942164519591E-2,1.0000000000839453,1.2957249999274867E-5,1.0000000000839453,1.2957249999274867E-5,1.0055073557269689,0.13904325916230437,12.069989404697042,-108.39782386573017,71.602176134269826,null,1000000000,167890327.5625,null,-1.2240925571768271,-24.323440678412098,null,13.294081961873868,-84.075125583057968,null,0,0]
[13032.5,13.032500000000001,5.3361959702767399,1.3822823413454444,1.001415483010397,5.317547112221542E-2,1,0,6790.3202851561127,1.5706490583360286,2.8205903703408408,1.2083788542117715,1.0018438879748579,6.068046072123566E-2,1.0000000000849232,1.3032499999262159E-5,1.0000000000849232,1.3032499999262159E-5,1.005571435545124,0.13984708099857132,12.0145173030026,-108.39740315858992,71.602596841410076,null,1000000000,169846056.25,null,-1.2306307939545988,-24.233288065589502,null,13.245148096957202,-84.164861800247721,null,0,0]
[13107.75,13.107749999999999,5.3659282553739729,1.3833393315693419,1.0014318645546898,5.3481924228393325E-2,1,0,6829.5277733899775,1.5706499037863439,2.8348345764323826,1.2102833615577524,1.0018652228860452,6.1029964434517935E-2,1.0000000000859064,1.3107749999249305E-5,1.0000000000859064,1.3107749999249305E-5,1.0056358847116347,0.14065083933916955,11.959401644907858,-108.39740671241421,71.60259328758579,null,1000000000,171813110.0625,null,-1.2370700363470122,-24.144241360941468,null,13.196471681254868,-84.253916370227444,null,0,0]
[13183,13.183,5.3956664693650618,1.3843846717478694,1.0014483401438783,5.3788367279962786E-2,1,0,6868.7352616286689,1.5706507395848146,2.8490889620528015,1.2121688186590307,1.0018866801726998,6.1379453219931671E-2,1.0000000000868958,1.3182999999236302E-5,1.0000000000868958,1.3182999999236302E-5,1.005700703197016,0.14145453382998904,11.904637727611556,-108.39782977587822,71.602170224121778,null,1000000000,173791489,null,-1.2434123314070484,-24.056284746600994,null,13.148050059018605,-84.342300359539351,null,0,0]
[13259.75,13.25975,5.4260034779379112,1.3854390448503044,1.0014652410208673,5.4100908414492263E-2,1,0,6908.724294488301,1.5706515822717595,2.8636378165439966,1.2140725171809861,1.0019086912300477,6.1735893094493594E-2,1.0000000000879106,1.3259749999222886E-5,1.0000000000879106,1.3259749999222886E-5,1.005767194149489,0.14227418267043335,11.849139715492525,-108.39868853063187,71.601311469368127,null,1000000000,175820970.0625,null,-1.2497832550917742,-23.967681638594375,null,13.098922970584297,-84.43176661975069,null,0,0]
[13336.5,13.336499999999999,5.4563464515328954,1.3864816922742225,1.0014822397196377,5.4413438969690635E-2,1,0,6948.7133273527825,1.5706524152595747,2.8781969441130775,1.2159569630633795,1.0019308295736753,6.2092317262774054E-2,1.0000000000889311,1.3336499999209314E-5,1.0000000000889311,1.3336499999209314E-5,1.0058340692287913,0.14309376434681875,11.793998007380145,-108.39997385079749,71.600026149202506,null,1000000000,177862232.25,null,-1.2560574687913872,-23.880180169957569,null,13.050055476171533,-84.520557806004248,null,0,0]
[13413.25,13.41325,5.4866952911852485,1.3875128063102031,1.0014993362352078,5.4725958885045098E-2,1,0,6988.7023602220288,1.570653238714754,2.8927661896485999,1.2178224337147463,1.0019530951951459,6.2448725635258204E-2,1.0000000000899576,1.3413249999195584E-5,1.0000000000899576,1.3413249999195584E-5,1.0059013284031253,0.14391327848412036,11.73920789472955,-108.40168084586591,71.598319154134089,null,1000000000,179915275.5625,null,-1.2622369851427941,-23.793764450762851,null,13.001444879872343,-84.608684917718435,null,0,0]
[13490,13.49,5.5170499000888675,1.3885325751162529,1.0015165305625686,5.5038468100055284E-2,1,0,7028.6913930959618,1.5706540528000026,2.9073454010415634,1.2196692015133173,1.0019754880859739,6.2805118122455206E-2,1.0000000000909901,1.3489999999181696E-5,1.0000000000909901,1.3489999999181696E-5,1.0059689716405193,0.14473272470754631,11.684764759030832,-108.4038046765609,71.596195323439105,null,1000000000,181980100,null,-1.2683237662782141,-23.708418879082007,null,12.953088525309042,-84.696158717545345,null,0,0]
[13568.5,13.5685,5.5481025029945172,1.3895640516760825,1.0015342181203166,5.5358091800199412E-2,1,0,7069.592228027157,1.5706548759203511,2.9222671912770148,1.2215390093804928,1.0019985232102973,6.31696202967377E-2,1.0000000000920521,1.3568499999167328E-5,1.0000000000920521,1.3568499999167328E-5,1.0060385544969597,0.14557078472782303,11.629434461413354,-108.40640314372219,71.593596856277813,null,1000000000,184104192.25,null,-1.274455396703702,-23.622218377225735,null,12.903889858117058,-84.784962184281611,null,0,0]
[13647,13.647,5.5791609430576905,1.3905840451279816,1.0015520079904887,5.5677704178487976E-2,1,0,7110.4930629630871,1.5706556895712271,2.9371990944599835,1.2233898124975346,1.002021691455852,6.3534105663769741E-2,1.0000000000931202,1.3646999999152791E-5,1.0000000000931202,1.3646999999152791E-5,1.0061085390622044,0.14640877290952242,11.574457649875505,-108.40942759633916,71.590572403660843,null,1000000000,186240609,null,-1.2804940113910599,-23.537105261798722,null,12.854951661266565,-84.873104250044278,null,0,0]
[13725.5,13.7255,5.6102251233341454,1.3915927440798954,1.0015699001676335,5.5997305170227898E-2,1,0,7151.393897903672,1.5706564939151062,2.9521409571368737,1.2252218866575415,1.0020449928134045,6.3898574127877056E-2,1.0000000000941947,1.3725499999138087E-5,1.0000000000941947,1.3725499999138087E-5,1.006178925301485,0.14724668885239184,11.519829660849211,-108.41287302367171,71.587126976328292,null,1000000000,188389350.25,null,-1.2864415553137367,-23.453063734847834,null,12.806271216162948,-84.960595702046433,null,0,0]
[13804,13.804,5.6412949489972402,1.3925903330777751,1.0015878946462682,5.6316894710740001E-2,1,0,7192.2947328488299,1.5706572891107686,2.967092628843842,1.2270355026030266,1.0020684272736686,6.4263025593412196E-2,1.0000000000952753,1.3803999999123214E-5,1.0000000000952753,1.3803999999123214E-5,1.0062497131798449,0.14808453215643927,11.465545919956117,-108.41673447142591,71.583265528574088,null,1000000000,190550416,null,-1.2922999244157827,-23.370078287586953,null,12.757845844371897,-85.04744709478021,null,0,0]
[13884.25,13.88425,5.6730631530622091,1.3935988651348385,1.0016063960177786,5.6643596954506319E-2,1,0,7234.1073698515529,1.5706580927389089,2.982387603918248,1.2288707462107304,1.0020925217351548,6.4635584102351359E-2,1.0000000000963862,1.3884249999107834E-5,1.0000000000963862,1.3884249999107834E-5,1.0063224942648148,0.14894097799378533,11.410403204605819,-108.42110693753902,71.578893062460978,null,1000000000,192772398.0625,null,-1.2981986397210896,-23.286318649076083,null,12.708601844326907,-85.135583797390524,null,0,0]
[13964.5,13.964499999999999,5.7048370631404168,1.3945961638683657,1.0016250042911468,5.6970287094137241E-2,1,0,7275.9200068588952,1.570658887130606,2.9976925215051207,1.2306872559692863,1.0021167552802257,6.5008124644311327E-2,1.0000000000975038,1.3964499999092274E-5,1.0000000000975038,1.3964499999092274E-5,1.0063956950214639,0.14979734707300676,11.355610865195311,-108.42590388907233,71.57409611092767,null,1000000000,195007260.25,null,-1.3040080163323315,-23.203630822415363,null,12.659618881527644,-85.223073173570825,null,0,0]
[14044.75,14.044750000000001,5.7366165844186519,1.395582413967853,1.0016437194604146,5.7296965060576348E-2,1,0,7317.7326438707751,1.5706596724441872,3.0130072300920481,1.2324853054634786,1.0021411278987911,6.5380647117192117E-2,1.0000000000986276,1.4044749999076534E-5,1.0000000000986276,1.4044749999076534E-5,1.0064693154118356,0.15065363896761352,11.301164289549384,-108.43112021544313,71.56887978455687,null,1000000000,197255002.5625,null,-1.3097299301989398,-23.121999135572882,null,12.610894219748323,-85.309925784770414,null,0,0]
[14125,14.125,5.7684016241565326,1.3965577961391511,1.0016625415195903,5.7623630784782789E-2,1,0,7359.5452808871169,1.5706604488343827,3.028331581135546,1.2342651632231578,1.0021656395807046,6.5753151418923753E-2,1.0000000000997578,1.4124999999060613E-5,1.0000000000997578,1.4124999999060613E-5,1.0065433553977696,0.15150985325140606,11.247058953651404,-108.43675086726034,71.563249132739656,null,1000000000,199515625,null,-1.3153662097964844,-23.041408205938716,null,12.562425163447887,-85.396151964208144,null,0,0]
[14207.25,14.20725,5.8009844459761073,1.3975463943121713,1.0016819435770361,5.7958424934928504E-2,1,0,7402.3999773975138,1.5706612354723397,3.0440477010152227,1.2360707771204096,1.0021909064401444,6.613492035410698E-2,1.0000000001009228,1.4207249999044108E-5,1.0000000001009228,1.4207249999044108E-5,1.0066196759885397,0.15238732522705131,11.19195465749376,-108.44294657070189,71.557053429298108,null,1000000000,201845952.5625,null,-1.3210559599448484,-22.959872969873,null,12.513010617438606,-85.483887616293259,null,0,0]
[14289.5,14.2895,5.8335728739150978,1.3985239481045906,1.0017014579057721,5.8293206078225891E-2,1,0,7445.2546739124382,1.5706620130545608,3.0597736432569134,1.2378578366108024,1.0022163193590459,6.651666998411071E-2,1.0000000001020948,1.4289499999027409E-5,1.0000000001020948,1.4289499999027409E-5,1.0066964372680771,0.15326471476959502,11.137199473474615,-108.44956696416047,71.550433035839532,null,1000000000,204189810.25,null,-1.3266594967334031,-22.879399198052113,null,12.463858970208015,-85.57098649415056,null,0,0]
[14371.75,14.37175,5.866166814542157,1.3994906397286526,1.0017210844992372,5.8627974140393835E-2,1,0,7488.1093704318127,1.5706627817365244,3.0755092571871385,1.2396266149884509,1.0022418783262983,6.6898400199140812E-2,1.0000000001032736,1.4371749999010518E-5,1.0000000001032736,1.4371749999010518E-5,1.0067736391946278,0.15414202142113179,11.08278880508,-108.45660680966675,71.543393190333248,null,1000000000,206547198.0625,null,-1.3321786426274043,-22.799971234494251,null,12.414967447707401,-85.657459015792597,null,0,0]
[14454,14.454000000000001,5.898766176475351,1.4004466474508697,1.0017408233508329,5.8962729047168747E-2,1,0,7530.964066955562,1.5706635416701704,3.0912543951086198,1.2413773804421355,1.0022675833307289,6.7280110889437014E-2,1.0000000001044591,1.4453999998993431E-5,1.0000000001044591,1.4453999998993431E-5,1.0068512817262132,0.15501924472408385,11.028718143810369,-108.46406093550873,71.535939064491274,null,1000000000,208918116,null,-1.3376151736827477,-22.721573715530855,null,12.366333317493117,-85.743315373175832,null,0,0]
[14622.5,14.6225,5.9655668345348394,1.4023725233322215,1.0017816115257145,5.9648477340552772E-2,1,0,7618.7575789962866,1.5706650717979365,3.1235395260489014,1.2449089086582268,1.00232069942308,6.8062034274354241E-2,1.0000000001069087,1.4622499998957817E-5,1.0000000001069087,1.4622499998957817E-5,1.007011718445006,0.15681609044112757,10.918990460785773,-108.4806039517679,71.519396048232096,null,1000000000,213817506.25,null,-1.348501886646335,-22.564120633059002,null,12.267492347432107,-85.917321126245724,null,0,0]
[14706.75,14.70675,5.9989753223185911,1.403319375550605,1.0018021822605414,5.999133046655359E-2,1,0,7662.6543350232232,1.5706658237134425,3.1396964745779656,1.2466474262211769,1.0023474872595999,6.8452964770721228E-2,1.0000000001081442,1.4706749998939699E-5,1.0000000001081442,1.4706749998939699E-5,1.0070926300634579,0.15771438017578823,10.86464320899905,-108.48950596415132,71.51049403584868,null,1000000000,216288495.5625,null,-1.3538224306841504,-22.486952663114245,null,12.218465639683201,-86.003395935743328,null,0,0]
[14791,14.791,6.0323891287840805,1.4042557392453221,1.0018228707506336,6.0334169472438748E-2,1,0,7706.5510910544417,1.5706665670630799,3.1558628154784145,1.2483681373503877,1.0023744282733302,6.8843874312595976E-2,1.0000000001093867,1.4790999998921372E-5,1.0000000001093867,1.4790999998921372E-5,1.0071740037932357,0.15861258050731444,10.810634341639069,-108.49882125710587,71.501178742894126,null,1000000000,218773681,null,-1.3590634095598675,-22.41080323528001,null,12.169697751198935,-86.088865483701582,null,0,0]
[14877.25,14.87725,6.0666015591496292,1.405203645448651,1.0018441723360458,6.0685132379621226E-2,1,0,7751.4899065803775,1.5706673193376433,3.172422506628473,1.2501115243798155,1.0024021674982044,6.9244041776688345E-2,1.0000000001106661,1.4877249998902393E-5,1.0000000001106661,1.4877249998902393E-5,1.0072577878917521,0.15953200997852685,10.755689301136952,-108.5087803651989,71.491219634801098,null,1000000000,221332567.5625,null,-1.3643481334576391,-22.333885525296505,null,12.12003743459459,-86.175747243539092,null,0,0]
[14963.5,14.9635,6.1008193793759089,1.4061409193952121,1.0018655973183199,6.1036080319286042E-2,1,0,7796.4287221106488,1.5706680629399465,3.1889917398772467,1.2518368001692612,1.0024300672328481,6.9644187029852256E-2,1.0000000001119531,1.4963499998883192E-5,1.0000000001119531,1.4963499998883192E-5,1.0073420562034581,0.1604513447127856,10.701089661822197,-108.51916164753729,71.480838352462712,null,1000000000,223906332.25,null,-1.369552980652561,-22.258003743450558,null,12.070642642474755,-86.262015249484392,null,0,0]
[15049.75,15.04975,6.1350424992780779,1.4070677373541354,1.0018871456895391,6.1387013205947576E-2,1,0,7841.367537645182,1.5706687980190919,3.2055703672586287,1.2535442353716255,1.0024581274638593,7.0044309945808042E-2,1.0000000001132476,1.5049749998863769E-5,1.0000000001132476,1.5049749998863769E-5,1.0074268086780966,0.16137058418521796,10.646830883460455,-108.52995967246184,71.470040327538157,null,1000000000,226494975.0625,null,-1.3746796591269184,-22.183142383780851,null,12.021510542587375,-86.347679575839663,null,0,0]
[15136,15.135999999999999,6.1692708306586237,1.4079842717554116,1.0019088174417425,6.1737930954142387E-2,1,0,7886.3063531839043,1.5706695247207829,3.2221582437687353,1.2552340954872983,1.0024863481777611,7.0444410398318794E-2,1.0000000001145493,1.5135999998844122E-5,1.0000000001145493,1.5135999998844122E-5,1.0075120452651418,0.16228972787136361,10.592908512850121,-108.54116908339428,71.45883091660572,null,1000000000,229098496,null,-1.379729832922993,-22.109286235350922,null,11.972638345773115,-86.432750076962989,null,0,0]
[15224,15.224,6.2041989315847781,1.4089089788739553,1.0019310560638037,6.209595308161707E-2,1,0,7932.1569707812778,1.5706702576807412,3.239092070973542,1.2569403992561059,1.002515306871981,7.0852605548346367E-2,1.0000000001158851,1.5223999998823844E-5,1.0000000001158851,1.5223999998823844E-5,1.0075995101833899,0.16322742158470013,10.538234248459561,-108.55302444223753,71.446975557762471,null,1000000000,231770176,null,-1.3848053073792732,-22.034952085572481,null,11.923039555838834,-86.51894462761328,null,0,0]
[15312,15.311999999999999,6.2391322782165011,1.4098233317648448,1.0019534231075204,6.2453959270410704E-2,1,0,7978.007588382864,1.5706709822158724,3.2560352305984401,1.2586289499966334,1.0025444325989239,7.1260777048768459E-2,1.0000000001172287,1.5311999998803327E-5,1.0000000001172287,1.5311999998803327E-5,1.0076874789513679,0.16416501448366236,10.48390108367062,-108.56529702038196,71.434702979618038,null,1000000000,234457344,null,-1.3898045066844316,-21.961633271659629,null,11.873705590355053,-86.604541061699166,null,0,0]
[15400,15.4,6.2740707829312337,1.410727501865487,1.0019759185642927,6.2811949429823599E-2,1,0,8023.8582059885912,1.5706716984706022,3.2729875777110009,1.260300013858523,1.0025737253440321,7.1668924765646139E-2,1.00000000011858,1.5399999998782582E-5,1.00000000011858,1.5399999998782582E-5,1.007775951514547,0.16510250601255505,10.429904555066479,-108.57798136517478,71.422018634825221,null,1000000000,237160000,null,-1.3947290652304847,-21.889314544961948,null,11.824633620296963,-86.689549175218275,null,0,0]
[15488,15.488,6.3090143600345847,1.4116216568825872,1.0019985424254716,6.3169923469180586E-2,1,0,8069.7088235983865,1.5706724065860738,3.2899489702882221,1.2619538518979856,1.0026031850926667,7.2077048565087801E-2,1.0000000001199392,1.5487999998761592E-5,1.0000000001199392,1.5487999998761592E-5,1.0078649278181084,0.1660398956161391,10.376240284505682,-108.59107210188122,71.408927898118776,null,1000000000,239878144,null,-1.3995805753094386,-21.817980948475828,null,11.77582085981512,-86.773978550439438,null,0,0]
[15578.25,15.578250000000001,6.344856561664578,1.4125284432104075,1.0020218780995136,6.3537033415337202E-2,1,0,8116.7317581398611,1.5706731244971828,3.3073532843889559,1.2636323516845631,1.0026335715211685,7.2495582365290578E-2,1.0000000001213409,1.5578249998739814E-5,1.0000000001213409,1.5578249998739814E-5,1.0079567022508726,0.16700114611870298,10.321544527035284,-108.60491410670421,71.395085893295786,null,1000000000,242681873.0625,null,-1.4044818807046719,-21.745831348320682,null,11.726026407739955,-86.859975326361663,null,0,0]
[15668.5,15.6685,6.3807039218108335,1.4134250414566647,1.0020453488094561,6.390412621347763E-2,1,0,8163.7546926854702,1.5706738341380071,3.3247668189295356,1.2652932737555531,1.0026641335708728,7.2914090724272476E-2,1.0000000001227509,1.5668499998717786E-5,1.0000000001227509,1.5668499998717786E-5,1.0080490063950562,0.16796228823579679,10.267189173899315,-108.61917234732135,71.380827652678647,null,1000000000,245501892.25,null,-1.409309616382957,-21.674686945556342,null,11.676498790282272,-86.945383140687269,null,0,0]
[15758.75,15.758749999999999,6.4165563540161408,1.4143116209449667,1.0020689545458099,6.4271201765873545E-2,1,0,8210.7776272351439,1.5706745356506382,3.3421894297884673,1.2669368837691763,1.0026948712257215,7.3332573497763717E-2,1.0000000001241691,1.57587499986955E-5,1.0000000001241691,1.57587499986955E-5,1.0081418401905782,0.16892332137000363,10.213169768236888,-108.63384127541111,71.366158724588885,null,1000000000,248338201.5625,null,-1.414065370188502,-21.60453251896314,null,11.627235138425387,-87.030211666314344,null,0,0]
[15849,15.849,6.4524137737327649,1.4151883472988549,1.0020926952990332,6.4638259974824419E-2,1,0,8257.800561788812,1.5706752291739305,3.3596209757595026,1.2685634422485994,1.0027257844695652,7.375103054154801E-2,1.0000000001255955,1.584899999867296E-5,1.0000000001255955,1.584899999867296E-5,1.0082352035770381,0.16988424492442133,10.159481938474475,-108.64891542471611,71.351084575283892,null,1000000000,251190801,null,-1.4187506888097534,-21.535353141355944,null,11.578232627284228,-87.114470364170629,null,0,0]
[15941.25,15.94125,6.489070886154706,1.4160744880750999,1.0021171016912582,6.5013434411807333E-2,1,0,8305.8655558380324,1.570675929950559,3.3774479066602963,1.2702086897988489,1.0027575642234003,7.4178734130224966E-2,1.0000000001270617,1.5941249998649649E-5,1.0000000001270617,1.5941249998649649E-5,1.008331183220103,0.17086634931350275,10.104942565662988,-108.66473681162059,71.335263188379415,null,1000000000,254123451.5625,null,-1.4234686119142224,-21.46563316244972,null,11.528411177577212,-87.200017015516991,null,0,0]
[16033.5,16.0335,6.5257330368416495,1.4169506726969823,1.002141649130454,6.5388590521813186E-2,1,0,8353.9305498912836,1.5706766226632407,3.3952838837538475,1.2718366562126366,1.0027895274003913,7.4606410531659534E-2,1.0000000001285365,1.6033499998626073E-5,1.0000000001285365,1.6033499998626073E-5,1.0084277160577293,0.17184833795279331,10.050740654889943,-108.68097028742443,71.319029712575571,null,1000000000,257073122.25,null,-1.428116085055589,-21.396901299984719,null,11.478856739945533,-87.284987639321471,null,0,0]
[16125.75,16.12575,6.5624001413517936,1.4178170666964518,1.0021663376062555,6.5763728200592106E-2,1,0,8401.9955439484984,1.5706773074503695,3.4131287652221709,1.2734476038457503,1.0028216739829992,7.5034059592008789E-2,1.00000000013002,1.612574999860222E-5,1.00000000013002,1.612574999860222E-5,1.0085248020243804,0.17283021020650596,9.9968718001541745,-108.69761027319026,71.302389726809736,null,1000000000,260039813.0625,null,-1.4326946347346721,-21.329142521196378,null,11.42956643488885,-87.369391689411358,null,0,0]
[16218,16.218,6.5990721171088236,1.4186738319854639,1.00219116710824,6.6138847343925167E-2,1,0,8450.0605380096076,1.5706779844471896,3.430982412127646,1.2750417899505739,1.0028540039535867,7.5461681157489427E-2,1.0000000001315117,1.6217999998578096E-5,1.0000000001315117,1.6217999998578096E-5,1.0086224410541735,0.17381196543942692,9.9433316796118927,-108.71465127482806,71.285348725171943,null,1000000000,263023524,null,-1.4372057477770384,-21.262342085546621,null,11.38053742738893,-87.453238412234569,null,0,0]
[16312.5,16.3125,6.6366434978011171,1.4195416756891788,1.0022167484245013,6.652309640666286E-2,1,0,8499.2978490030073,1.570678670016646,3.4492804602877798,1.276657742570223,1.0028873125933457,7.5899703847604999E-2,1.0000000001330487,1.6312499998553095E-5,1.0000000001330487,1.6312499998553095E-5,1.0087230349161487,0.1748175439216931,9.8888221299219765,-108.73251806203545,71.267481937964547,null,1000000000,266097656.25,null,-1.441758477831393,-21.194890952181538,null,11.330580607753367,-87.538561747258228,null,0,0]
[16407,16.407,6.674219820621814,1.4203997479920123,1.0022424777078351,6.6907325797463668E-2,1,0,8548.535160000356,1.5706793476887031,3.4675874204912711,1.2782566366408985,1.0029208136381502,7.6337697358787163E-2,1.0000000001345948,1.6406999998527803E-5,1.0000000001345948,1.6406999998527803E-5,1.0088242090078936,0.17582299825766542,9.8346486264475175,-108.75079426181662,71.249205738183377,null,1000000000,269189649,null,-1.4462434776428459,-21.128415077361009,null,11.280892104090361,-87.623319236311076,null,0,0]
[16501.5,16.5015,6.7118010025647248,1.4212482117577738,1.0022683549468465,6.7291535404397709E-2,1,0,8597.7724710015827,1.5706800175990407,3.4859031523276607,1.2798387328110843,1.0029545070687198,7.6775661525920441E-2,1.0000000001361498,1.6501499998502217E-5,1.0000000001361498,1.6501499998502217E-5,1.0089259632574583,0.17682832776639815,9.7808067845260531,-108.7694742372336,71.230525762766405,null,1000000000,272299502.25,null,-1.4506622238074665,-21.062899525340388,null,11.231469008333516,-87.707520178199857,null,0,0]
[16596,16.596,6.7493869624617835,1.4220872262784958,1.0022943801300752,6.7675725115569935E-2,1,0,8647.0097820066276,1.5706806798802475,3.5042275182554756,1.281404286617609,1.002988392865666,7.7213596183956526E-2,1.0000000001377136,1.6595999998476335E-5,1.0000000001377136,1.6595999998476335E-5,1.009028297592514,0.17783353176758945,9.7272923032573466,-108.78855243943867,71.211447560561325,null,1000000000,275427216,null,-1.4550161543596607,-20.998329653078073,null,11.182308457617005,-87.7911736671184,null,0,0]
[16692.5,16.692499999999999,6.7877732406285434,1.4229344082970099,1.0023211087728483,6.8068025177841079E-2,1,0,8697.2891525077102,1.5706813484396105,3.5229484715575241,1.2829861629674777,1.0030231943184016,7.766076867640502E-2,1.0000000001393197,1.6692499998449604E-5,1.0000000001393197,1.6692499998449604E-5,1.0091333962888576,0.1788598797011921,9.6729786823540831,-108.80843969519789,71.19156030480211,null,1000000000,278639556.25,null,-1.4593967992572847,-20.933354216606283,null,11.132375481611366,-87.876041888392166,null,0,0]
[16789,16.789000000000001,6.8261643357049477,1.4237720616223748,1.0023479916639368,6.8460304257569909E-2,1,0,8747.5685230126364,1.5706820093134677,3.5416781472396157,1.2845513121302763,1.0030581963249616,7.8107910049832627E-2,1.0000000001409353,1.6788999998422558E-5,1.0000000001409353,1.6788999998422558E-5,1.0092390997307572,0.17988609532679542,9.6189976187303863,-108.82873079246367,71.171269207536326,null,1000000000,281870521,null,-1.4637127689375546,-20.869334954022221,null,11.082710387667941,-87.960357777284713,null,0,0]
[16885.5,16.8855,6.8645601668731038,1.4246003449608298,1.0023750287909303,6.8852562235719436E-2,1,0,8797.8478935213388,1.5706826626335864,3.5604164076487392,1.2860999904792085,1.0030933988643522,7.8555020128707589E-2,1.0000000001425602,1.6885499998395201E-5,1.0000000001425602,1.6885499998395201E-5,1.0093454078399735,0.18091217792208256,9.5653447896918955,-108.84942009825825,71.15057990174175,null,1000000000,285120110.25,null,-1.4679654777337967,-20.806257173715807,null,11.033310267425691,-88.0441303924284,null,0,0]
[16982,16.981999999999999,{"$f":"SQRT(1+(A269/pole1)^2)","v":6.9029606551033638},{"$f":"ATAN(A269/pole1)","v":1.4254194135392282},{"$f":"SQRT(1+(A269/Zero1)^2)","v":1.0024022201413481},{"$f":"ATAN(A269/Zero1)","v":6.9244798993291459E-2},{"$f":"IF(VIN_nom>Vout, 1, SQRT(1+(A269/z_RHP)^2))","v":1},{"$f":"IF(VIN_nom>Vout, 0, -ATAN(A269/z_RHP))","v":0},{"$f":"SQRT(1+(A269/Pole2)^2)","v":8848.127264033752},{"$f":"ATAN(A269/Pole2)","v":1.5706833085287384},3.5791631179521066,1.287632449335951,{"$f":"SQRT(1+(A269/pole4)^2)","v":1.0031288019154616},{"$f":"ATAN(A269/pole4)","v":7.9002098737572732E-2},{"$f":"SQRT(1+(A269/Zero3)^2)","v":1.0000000001441942},{"$f":"ATAN(A269/Zero3)","v":1.6981999998367531E-5},{"$f":"SQRT(1+(A269/pole5)^2)","v":1.0000000001441942},{"$f":"ATAN(A269/pole5)","v":1.6981999998367531E-5},{"$f":"SQRT((1-(Z269/pterm2))^2+(A269/pterm1)^2)","v":1.009452320537858},{"$f":"IF((ATAN((A269/pterm1)/(1-A269^2/pterm2))>0),ATAN((A269/pterm1)/(1-A269^2/pterm2)),PI()+ATAN((A269/pterm1)/(1-A269^2/pterm2)))","v":0.18193812676545082},{"$f":"20*LOG10(((E269*K269*G269*O269)/(C269*I269*S269*M269*Q269))*Adc)","v":9.5120159548670475},{"$f":"((F269+L269+H269+R269)-(D269+J269+T269+N269))*radconv","v":-108.87050206955216},{"$f":"IF(V269>0,V269,V269+180)","v":71.12949793044784},null,{"$f":"IF(U269<0,A269,1000000000)","v":1000000000},{"$f":"A269^2","v":288388324},null,{"$f":"20*LOG10((K269/(I269*M269))*AEA*Afb)","v":-1.472156302987234},-20.744106473340782,null,{"$f":"20*LOG10((E269*G269/(C269*S269))*Am)","v":10.984172257854283},{"$f":"(F269+H269-(D269+T269))*radconv","v":-88.127368593140076},null,{"$f":"SUM((U270<0)*(U269>0))*A269","v":0},0]
[17081,{"$f":"A270/1000","v":17.081},6.9423607332319355,1.4262502847052572,1.002430276186058,6.9647175147872151E-2,1,0,8899.7092089155685,1.5706839635728373,3.5984041369922171,1.2891880121984127,1.0031653304927206,7.9460726806489718E-2,1.0000000001458802,1.7080999998338814E-5,1.0000000001458802,1.7080999998338814E-5,1.0095626311978205,0.18299051484437664,9.4576378774457197,-108.89253254551697,71.107467454483029,null,1000000000,291760561,null,-1.4763927956031129,{"$f":"(L270-(J270+N270))*radconv","v":-20.681294270460103},null,10.934030673048831,-88.212216944267766,null,0,0]
[17180,17.18,6.9817655499033471,1.4270717776231658,1.0024584945217152,7.0049528714515169E-2,1,0,8951.291153801154,1.5706846110675341,3.617653770729008,1.2907270243677091,1.0032020700600879,7.9919321379831848E-2,1.0000000001475762,1.7179999998309761E-5,1.0000000001475762,1.7179999998309761E-5,1.0096735780090462,0.1840427606151584,9.4035920146103926,-108.91496476114563,71.085035238854374,null,1000000000,295152400,null,-1.480566978955866,-20.619428000742946,null,10.884158993566258,-88.296521101895763,null,0,0]
[17279,17.279,7.021175025335479,1.4278840490935421,1.002486875134615,7.0451859564860733E-2,1,0,9002.8730986904538,1.5706852511425915,3.6369118823735569,1.2922497414117124,1.0032390205943833,8.0377882268396553E-2,1.0000000001492819,1.7278999998280369E-5,1.0000000001492819,1.7278999998280369E-5,1.0097851608852746,0.18509486330101088,9.3498740446303881,-108.93779301693186,71.062206983068137,null,1000000000,298563841,null,-1.4846802262314469,-20.558493017823171,null,10.834554270861837,-88.380290012883933,null,0,0]
[17378,17.378,7.0605890815181347,1.4286872524650625,1.0025154180109761,7.0854167570592971E-2,1,0,9054.4550435833971,1.5706858839248157,3.6561783379593482,1.293756413817206,1.0032761820722973,8.0836409283065763E-2,1.0000000001509974,1.7377999998250642E-5,1.0000000001509974,1.7377999998250642E-5,1.0098973797397945,0.18614682212595543,9.2964797281912919,-108.96101170659358,71.038988293406419,null,1000000000,301994884,null,-1.4887338744852066,-20.498474966295067,null,10.785213602676498,-88.463532426355926,null,0,0]
[17479.25,17.47925,7.1009035703053192,1.429499487176596,1.0025447774117049,7.126559517710232E-2,1,0,9107.2093054094348,1.5706865236742618,3.6758911613501088,1.2952809888748027,1.0033144062941834,8.1305322131807287E-2,1.0000000001527622,1.747924999821989E-5,1.0000000001527622,1.747924999821989E-5,1.0100128067556065,0.18722253949573725,9.2422023413994783,-108.98515619196199,71.014843808038009,null,1000000000,305524180.5625,null,-1.4928193616792562,-20.438026632010335,null,10.735021703078733,-88.548131047206752,null,0,0]
[17580.5,17.580500000000001,7.1412226908432856,1.4303025507092704,1.0025743065059143,7.1676998617468832E-2,1,0,9159.963567239156,1.5706871560547899,3.6956124375610138,1.2967892959141685,1.0033528511072614,8.1774199149586474E-2,1.0000000001545368,1.7580499998188775E-5,1.0000000001545368,1.7580499998188775E-5,1.0101288988014203,0.18829810475202091,9.1882547727682446,-109.00969749026046,70.990302509739536,null,1000000000,309073980.25,null,-1.4968452279437736,-20.378507911341529,null,10.685100000712017,-88.632196867371718,null,0,0]
[17681.75,17.681750000000001,7.1815463651203739,1.4310965965042484,1.0026040052786109,7.2088377754571595E-2,1,0,9212.7178290724987,1.5706877811929887,3.7153420319877153,1.2982815871816922,1.0033915164861753,8.2243040134372641E-2,1.0000000001563221,1.7681749998157301E-5,1.0000000001563221,1.7681749998157301E-5,1.0102456557830204,0.18937351706735212,9.1346327416248592,-109.03462989649087,70.96537010350913,null,1000000000,312644283.0625,null,-1.5008127934807816,-20.319904347312637,null,10.635445535105639,-88.715738638828668,null,0,0]
[17783,17.783000000000001,7.2218745168585379,1.4318817746213968,1.0026338737147167,7.2499732451338769E-2,1,0,9265.4720909093994,1.570688399212564,3.7350798128137361,1.299758109880558,1.0034304024054281,8.2711844884229516E-2,1.0000000001581175,1.7782999998125464E-5,1.0000000001581175,1.7782999998125464E-5,1.0103630776057015,0.19044877561517634,9.0813320487786218,-109.05994780076435,70.940052199235652,null,1000000000,316235089,null,-1.504723343660165,-20.262201771742234,null,10.586055392438787,-88.798764919870223,null,0,0]
[17886.5,17.886500000000002,7.2631033999033034,1.4326753884887615,1.0026645812388071,7.2920202959869104E-2,1,0,9319.3986696796255,1.5706890237341131,3.755264537884949,1.3012513983582565,1.0034703803756606,8.3191029855545412E-2,1.0000000001599636,1.7886499998092542E-5,1.0000000001599636,1.7886499998092542E-5,1.0104837958697062,0.19154776900664672,9.0271747358351337,-109.0862210248836,70.913778975116401,null,1000000000,319926882.25,null,-1.5086631680504694,-20.204133703219718,null,10.5358379038856,-88.88311214262518,null,0,0]
[17990,17.989999999999998,7.3043368057751312,1.4334600428528521,1.0026954660185561,7.3340647640269443E-2,1,0,9373.325248453446,1.570689641069672,{"$f":"SQRT(1+(A279/Zero2)^2)","v":3.775457547310288},{"$f":"ATAN(A279/Zero2)","v":1.3027287164140855},1.0035105887426032,8.3670176537189972E-2,1.0000000001618199,1.7989999998059236E-5,1.0000000001618199,1.7989999998059236E-5,1.010605208649918,0.19264659997686895,8.9733445801270886,-109.11288551327662,70.887114486723377,null,1000000000,323640100,null,-1.5125460242721687,-20.146978066904932,null,10.485890604399257,-88.966938197446211,null,0,0]
[18093.5,18.093499999999999,7.3455746583091592,1.4342358876344543,1.0027265280375848,7.3761066346286111E-2,1,0,9427.2518272307952,1.5706902513425589,3.7956587088707776,1.3041903125398235,1.0035510274785622,8.4149284713772365E-2,1.0000000001636873,1.8093499998025548E-5,1.0000000001636873,1.8093499998025548E-5,1.0107273158435974,0.19374526764589459,8.9198373472471264,-109.13993557092866,70.860064429071343,null,1000000000,327374742.25,null,-1.5163731793617234,-20.090720619992343,null,10.436210526608852,-89.050251632124002,null,0,0]
[18197,18.196999999999999,7.3868168830332008,1.4350030694491567,1.0027577672794223,7.4181458931720248E-2,1,0,9481.178406011617,1.5706908546732856,3.815867893094484,1.3056364302349961,1.0035916965556906,8.4628354170007095E-2,1.0000000001655653,1.819699999799147E-5,1.0000000001655653,1.819699999799147E-5,1.0108501173474731,0.1948437711347768,8.8666488831938679,-109.16736559938545,70.832634400614552,null,1000000000,331130809,null,-1.5201458668541188,-20.03534740555666,null,10.386794750047985,-89.133060805129631,null,0,0]
[18303,18.303000000000001,7.4290597525548572,1.4357799526706885,1.0027899447706372,7.4611978700129394E-2,1,0,9536.4075591626624,1.5706914655045596,3.8365734050773588,1.3071016838558875,1.0036335867024773,8.5118954992849549E-2,1.0000000001674998,1.8302999997956168E-5,1.0000000001674998,1.8302999997956168E-5,1.010976604631697,0.19596863743043544,8.8125018270643913,-109.19584628759976,70.804153712400236,null,1000000000,334999809,null,-1.5239544798835007,-19.97953891172806,null,10.336456306947889,-89.217356060525219,null,0,{"$f":"IF(AH282>0,W282,0)","v":0}]
[18409,18.408999999999999,7.4713070551628578,1.436548050413373,1.002822308114284,7.5042470760631808E-2,1,0,9591.636712317224,1.5706920693014359,3.8572870656202656,1.3085512037151428,1.0036757183927982,8.5609514745468851E-2,1.0000000001694458,1.8408999997920449E-5,1.0000000001694458,1.8408999997920449E-5,1.0111038199518074,0.19709332965588208,8.7586805556523242,-109.22471394095911,70.775286059040894,null,1000000000,338891281,null,-1.5277084779728387,-19.924629139846353,null,10.286389033625163,-89.301139559118894,null,0,0]
[18515,18.515000000000001,7.5135587160780144,1.4373075099756505,1.0028548572923697,7.5472934956357207E-2,1,0,9646.8658654752435,1.570692666184732,3.8780087441511637,1.3099852358867163,1.0037180915962367,8.6100033196946479E-2,1.0000000001714024,1.8514999997884323E-5,1.0000000001714024,1.8514999997884323E-5,1.0112317631951446,0.19821784687022473,8.7051808559445725,-109.25396284881388,70.746037151186115,null,1000000000,342805225,null,-1.5314090836692626,-19.87060398460418,null,10.236589939613834,-89.384419695568482,null,0,0]
[18621,18.620999999999999,7.5558146621861528,1.4380584754012606,1.0028875922868001,7.5903371130496972E-2,1,0,9702.0950186366608,1.5706932562725147,3.898738312823951,1.3114040214689138,1.0037607062822065,8.6590510116482292E-2,1.0000000001733709,1.8620999997847774E-5,1.0000000001733709,1.8620999997847774E-5,1.0113604342484706,0.19934218813369442,8.6519985948761722,-109.28358739902758,70.716412600972419,null,1000000000,346741641,null,-1.5350574870683626,-19.817449625626981,null,10.187056081944538,-89.46720467811204,null,0,0]
[18729.5,18.729500000000002,7.5990715741638564,1.4388185023053057,1.0029212917557098,7.6343929916876441E-2,1,0,9758.6267461685493,1.5706938533600823,3.9199648272303698,1.3128407253232519,1.003804576092129,8.7092511634327061E-2,1.000000000175397,1.8729499997809933E-5,1.000000000175397,1.8729499997809933E-5,1.0114928936380507,0.20049286367556299,8.59788656002309,-109.31429392105539,70.685706078944605,null,1000000000,350794170.25,null,-1.5387390833402383,-19.763929337181359,null,10.136625643363326,-89.55143770517752,null,0,0]
[18838,18.838000000000001,7.6423328259835603,1.4395699250113765,1.0029551858705601,7.6784459012049791E-2,1,0,9815.1584737038793,1.5706944435696375,3.9411993457409955,1.3142619506479352,1.0038486988442026,8.7594469149122958E-2,1.000000000177435,1.8837999997771654E-5,1.000000000177435,1.8837999997771654E-5,1.0116261153311854,0.20164335288028029,8.5440985992014831,-109.34538242285427,70.654617577145729,null,1000000000,354870244,null,-1.5423684092921499,-19.711292987888982,null,10.086467008493631,-89.635168772860865,null,0,0]
[18946.5,18.9465,7.6855983443600158,1.4403128879737908,1.0029892746116178,7.7224958248052464E-2,1,0,9871.6902012425853,1.570695027019344,3.9624417396750991,1.315667940593112,1.0038930745050756,8.8096382413740904E-2,1.0000000001794849,1.8946499997732925E-5,1.0000000001794849,1.8946499997732925E-5,1.0117600992045568,0.20279365474369374,8.490630527387113,-109.37684719427048,70.623152805729518,null,1000000000,358969862.25,null,-1.545946642108627,-19.659526638883342,null,10.036577169495738,-89.718406109874792,null,0,0]
[19055,19.055,7.7288680576418063,1.4410475324498215,1.0030235579590394,7.7665427456989025E-2,1,0,9928.2219287846165,1.5706956038246747,3.9836918830494095,1.3170589333646383,1.0039377030412109,8.8598251181184695E-2,1.0000000001815466,1.9054999997693753E-5,1.0000000001815466,1.9054999997693753E-5,1.0118948451342171,0.20394376826290675,8.4374782388702698,-109.4086826251816,70.591317374818402,null,1000000000,363093025,null,-1.5494749276257336,-19.608616634438516,null,9.9869531664960025,-89.801157761822822,null,0,0]
[19165.75,19.165749999999999,7.7730393226710746,1.4417889759020184,1.0030587529323629,7.8114999678205371E-2,1,0,9985.9259732606115,1.5706961858561044,4.0053905616761547,1.3184635470395556,1.0039835178144534,8.9110481218240348E-2,1.0000000001836629,1.9165749997653307E-5,1.0000000001836629,1.9165749997653307E-5,1.0120331711295989,0.20511753677900066,8.3835452050512949,-109.44155478329402,70.558445216705977,null,1000000000,367325973.0625,null,-1.5530260268583531,-19.557520166168597,null,9.9365712319096478,-89.885132733712766,null,0,0]
[19276.5,19.276499999999999,7.8172148125462906,1.4425220398819456,1.0030941506248385,7.8564540260812624E-2,1,0,10043.63001773995,1.5706967611996003,4.0270970575285574,1.3198530213870086,1.0040295959884196,8.9622664373877295E-2,1.0000000001857918,1.9276499997612391E-5,1.0000000001857918,1.9276499997612391E-5,1.0121722908520403,0.20629110695089833,8.3299327872355882,-109.4748016317553,70.525198368244702,null,1000000000,371583452.25,null,-1.5565274025972622,-19.507288048170228,null,9.8864601898328495,-89.968618045679989,null,0,0]
[19387.25,19.387250000000002,7.8613944560454954,1.4432468648684615,1.0031297510150063,7.9014049026477406E-2,1,0,10101.334062222573,1.5706973299697768,4.0488112448774363,1.3212275945795267,1.0040759375268462,9.0134800385844843E-2,1.0000000001879328,1.9387249997571001E-5,1.0000000001879328,1.9387249997571001E-5,1.0123122041676988,0.20746447771609544,8.2766368620519355,-109.50841751401212,70.491582485987877,null,1000000000,375865462.5625,null,-1.5599801786486978,-19.457906625703718,null,9.8366170407006344,-90.051621695910924,null,0,0]
[19498,19.498000000000001,7.9055781835321781,1.4439635882349917,1.003165554081286,7.9463525796942991E-2,1,0,10159.038106708427,1.570697892278645,4.0705330006323326,1.3225874999337111,1.0041225423932694,9.0646888992039404E-2,1.0000000001900859,1.9497999997529132E-5,1.0000000001900859,1.9497999997529132E-5,1.0124529109420535,0.20863764801347673,8.2236533839559947,-109.54239687374179,70.457603126258206,null,1000000000,380172004,null,-1.5633854488800578,-19.409362522112847,null,9.7870388328360498,-90.134151504739023,null,0,0]
[19611.75,19.611750000000001,7.9509629413355309,1.4446914335552035,1.0032025379451408,7.9925144516273514E-2,1,0,10218.30524043874,1.5706984632081211,4.0928509082187148,1.323969213316988,1.0041706837796485,9.1172799448378042E-2,1.0000000001923104,1.9611749997485638E-5,1.0000000001923104,1.9611749997485638E-5,1.0125982550342354,0.20984238739034472,8.1695557753919381,-109.57766931476043,70.422330685239572,null,1000000000,384620738.0625,null,-1.5668346260234833,-19.360361338097729,null,9.7363904014154183,-90.218431647167705,null,0,0]
[19725.5,19.7255,7.9963518634172539,1.4454110164564147,1.0032397355674845,8.0386729102620777E-2,1,0,10277.572374172345,1.5706990275528994,4.1151765448352275,1.3253359371559652,1.004219102874697,9.1698659335900184E-2,1.0000000001945477,1.9725499997441631E-5,1.0000000001945477,1.9725499997441631E-5,1.0127444358639477,0.21104691302718956,8.1157793632693735,-109.61331362628684,70.386686373713161,null,1000000000,389095350.25,null,-1.5702359349545638,-19.312215717053633,null,9.6860152982239374,-90.302228097133138,null,0,0]
[19839.25,19.83925,8.0417448792657442,1.4461224761029916,1.0032771469245407,8.0848279363101613E-2,1,0,10336.839507909184,1.5706995854262418,4.137509785366384,1.3266879090323909,1.0042677996382476,9.2224468371110632E-2,1.0000000001967979,1.983924999739712E-5,1.0000000001967979,1.983924999739712E-5,1.0128914532832158,0.21225122377892786,8.0623200080873652,-109.6493241051098,70.350675894890202,null,1000000000,393595840.5625,null,-1.5735904683516788,-19.264912036795437,null,9.6359104764390473,-90.385548773609202,null,0,0]
[19953,19.952999999999999,8.087141919946232,1.4468259485678316,1.0033147719924009,8.1309795104920021E-2,1,0,10396.106641649205,1.5707001369388272,4.1598505073414005,1.3280253616425548,1.0043167740299099,9.2750226270681441E-2,1.0000000001990612,1.9952999997352091E-5,1.0000000001990612,1.9952999997352091E-5,1.0130393071433159,0.21345531850205063,8.0091736486307479,-109.68569515075271,70.314304849247293,null,1000000000,398122209,null,-1.5768992895967207,-19.218436954915738,null,9.5860729382274688,-90.468401418526739,null,0,0]
[20069,20.068999999999999,8.1334409992416106,1.4475352480750525,1.0033533613609302,8.17804039801764E-2,1,0,10456.546092323568,1.5707006929218477,4.1826407143150357,1.3293745527252816,1.0043670030234417,9.328633082066401E-2,1.0000000002013825,2.0068999997305639E-5,1.0000000002013825,2.0068999997305639E-5,1.0131909468522509,0.21468300681913818,7.9552942555796857,-109.72315125820798,70.276848741792023,null,1000000000,402764761,null,-1.5802275554750989,-19.171882383637929,null,9.5355218110547817,-90.552418743570243,null,0,0]
[20185,20.184999999999999,8.1797441241941051,1.4482365176601057,1.00339217292773,8.2250976553007088E-2,1,0,10516.985543001123,1.5707012425145752,4.2054384524898714,1.3307091182495834,1.0044175206512544,9.382238159746345E-2,1.000000000203717,2.0184999997258646E-5,1.000000000203717,2.0184999997258646E-5,1.0133434561044923,0.21591046808002015,7.9017320728005629,-109.76097089128463,70.239029108715371,null,1000000000,407434225,null,-1.5835104274297702,-19.126162348018592,null,9.4852425002303313,-90.635965058576687,null,0,0]
[20301,20.300999999999998,8.2260512264866517,1.4489298922364469,1.003431206667017,8.2721512619230803E-2,1,0,10577.42499368182,1.5707017858265526,4.2282436000462802,1.3320292900727617,1.0044683268697996,9.4358378301147502E-2,1.0000000002060654,2.0300999997211114E-5,1.0000000002060654,2.0300999997211114E-5,1.0134968347399245,0.21713770107708602,7.8484830324471311,-109.79914842710868,70.200851572891324,null,1000000000,412130601,null,-1.5867489449342784,-19.081263552704357,null,9.4352319773814095,-90.719048036025399,null,0,0]
[20417,20.417000000000002,8.2723622393260801,1.4496155037271539,1.003470462552865,8.3192011974762656E-2,1,0,10637.864444365603,1.5707023229648325,4.2510560377395148,1.3333352952783801,1.0045194216352884,9.4894320631968662E-2,1.0000000002084271,2.0416999997163034E-5,1.0000000002084271,2.0416999997163034E-5,1.0136510825976313,0.2183647046044595,7.7955431432084943,-109.83767834494691,70.162321655053091,null,1000000000,416853889,null,-1.5899441196128692,-19.037172975724832,null,9.3854872628213606,-90.80167517715357,null,0,0]
[20536,20.536000000000001,8.3198749458882553,1.4503109149126852,1.0035109644884215,8.3674641056188784E-2,1,0,10699.866984294362,1.5707028676890102,4.2744659053182756,1.3346605886524652,1.004572137608051,9.5444066726007498E-2,1.0000000002108638,2.0535999997113137E-5,1.0000000002108638,2.0535999997113137E-5,1.0138102226873671,0.21962320127138116,7.7415512618234992,-109.87756521529865,70.122434784701355,null,1000000000,421727296,null,-1.5931779212219657,-18.992768600110981,null,9.3347291830454644,-90.885973241316918,null,0,0]
[20655,20.655000000000001,8.3673916302204994,1.450998428235325,1.0035517001537204,8.4157231068744093E-2,1,0,10761.869524226258,1.5707034061365308,4.2978831987858719,1.3359714424154361,1.0046251571514604,9.5993754959965427E-2,1.0000000002133145,2.065499999706266E-5,1.0000000002133145,2.065499999706266E-5,1.0139702771948735,0.22088145388071256,7.6878764584611705,-109.91781148046172,70.082188519538278,null,1000000000,426629025,null,-1.5963681797650979,-18.949187878508315,null,9.2842446382262658,-90.969807046280422,null,0,0]
[20774,20.774000000000001,8.4149122249387052,1.4516781768417242,1.0035926695203012,8.4639781792415963E-2,1,0,10823.87206416124,1.5707039384152581,4.3213077974189753,1.3372680868445657,1.0046784802174566,9.6543385010844682E-2,1.0000000002157794,2.0773999997011598E-5,1.0000000002157794,2.0773999997011598E-5,1.0141312459438094,0.2221394611363188,7.6345146628245084,-109.95841150127785,70.041588498722149,null,1000000000,431559076,null,-1.5995159017392202,-18.906417604674704,null,9.2340305645637279,-91.053184159127952,null,0,0]
[20893,20.893000000000001,8.4624366641668587,1.4523502909166384,1.0036338725595439,8.5122293007300745E-2,1,0,10885.874604099252,1.5707044646305988,4.3447395830605178,1.3385507474429088,1.004732106757714,9.7092956555856508E-2,1.0000000002182587,2.0892999996959949E-5,1.0000000002182587,2.0892999996959949E-5,1.0142931287569548,0.22339722174402091,7.5814618812523102,-109.99935974240437,70.000640257595634,null,1000000000,436517449,null,-1.60262206653914,-18.864444845781758,null,9.1840839477914518,-91.136111977345152,null,0,0]
[21014.75,21.014749999999999,8.5110632688803349,1.453030168576225,1.0036762695749024,8.5615913573349939E-2,1,0,10949.309975845639,1.5707049968386166,4.3687201769987256,1.3398488073561856,1.0047872865909675,9.7655167397685066E-2,1.0000000002208098,2.1014749996906491E-5,1.0000000002208098,2.1014749996906491E-5,1.0144596983670189,0.22468379163694305,7.5274988115994566,-110.04160898408922,69.958391015910777,null,1000000000,441619717.5625,null,-1.6057579975496701,-18.822314292854262,null,9.1332568091491257,-91.220498747718693,null,0,0]
[21136.5,21.136500000000002,8.5596937629941365,1.4537023213170734,1.0037189111265934,8.6109492318139663E-2,1,0,11012.745347595092,1.5707055229154088,4.3927080516751227,1.3411326924188058,1.0048427839834828,9.8217316315455647E-2,1.0000000002233758,2.1136499996852412E-5,1.0000000002233758,2.1136499996852412E-5,1.0146272243980003,0.22597010061617792,7.4738509833389699,-110.0842113272996,69.915788672700401,null,1000000000,446751632.25,null,-1.6088524193553246,-18.780991999765,null,9.0827034026942979,-91.304430359779474,null,0,0]
[21258.25,21.25825,8.6083280805918196,1.454366879456642,1.0037617971834523,8.6603029006523946E-2,1,0,11076.18071934756,1.5707060429663191,4.4167030884608813,1.3424026293904285,1.0048985988826469,9.8779402964166471E-2,1.0000000002259566,2.1258249996797703E-5,1.0000000002259566,2.1258249996797703E-5,1.0147957066572688,0.2272561473021473,7.4205143563203526,-110.12716116700189,69.872838832998113,null,1000000000,451913193.0625,null,-1.6119062982708809,-18.740464960411163,null,9.0324206545912311,-91.387914214596776,null,0,0]
[21380,21.38,8.6569661572330769,1.4550239704108792,1.0038049277141408,8.709652340347887E-2,1,0,11139.616091102986,1.5707065570942924,4.4407051712561483,1.3436588403103151,1.0049547312355565,9.9341426999049617E-2,1.0000000002285523,2.1379999996742367E-5,1.0000000002285523,2.1379999996742367E-5,1.0149651449512418,0.22854193031745393,7.3674849663083499,-110.17045300237099,69.829546997629009,null,1000000000,457104400,null,-1.6149205745314441,-18.700720439024717,null,8.9824055408397925,-91.470957547113471,null,0,0]
[21504.5,21.5045,8.7067066569188576,1.4556883109715129,1.0038492852320811,8.7601120511287198E-2,1,0,11204.484294666987,1.5707070768147076,4.4652565636972721,1.3449294575275372,1.005012459699943,9.9916080511801536E-2,1.0000000002312217,2.1504499996685127E-5,1.0000000002312217,2.1504499996685127E-5,1.0151393988607471,0.22985648155542665,7.3135714591858472,-110.21507072746458,69.784929272535422,null,1000000000,462443520.25,null,-1.6179629337305632,-18.660874433805073,null,8.9315343929164079,-91.555428410751276,null,0,0]
[21629,21.629000000000001,8.7564509556381864,1.4563451037486166,1.0038938983257355,8.8105672898914286E-2,1,0,11269.35249823398,1.5707075905519341,4.489815086304727,1.3461861766363898,1.0050705200080483,0.10049066782180367,1.0000000002339067,2.1628999996627219E-5,1.0000000002339067,2.1628999996627219E-5,1.0153146520686771,0.23117075417085806,7.2599710757214808,-110.26003476180276,69.739965238197243,null,1000000000,467813641,null,-1.6209657897027765,-18.621820595589504,null,8.8809368654242551,-91.639453416629564,null,0,0]
[21753.5,21.753499999999999,8.806198989011321,1.4569944760876385,1.003938766961032,8.8610180315448206E-2,1,0,11334.220701803912,1.5707080984087016,4.5143806227128156,1.3474292205191591,1.0051289121023665,0.10106518856116077,1.0000000002366074,2.1753499996568643E-5,1.0000000002366074,2.1753499996568643E-5,1.0154909043649625,0.23248474669803054,7.2066798111451069,-110.30533954673176,69.694660453268241,null,1000000000,473214762.25,null,-1.6239300685532094,-18.583546138970817,null,8.830609879698315,-91.723039791501833,null,0,0]
[21878,21.878,8.8559506941003523,1.4576365524977355,1.0039838911037098,8.9114642510113348E-2,1,0,11399.088905376735,1.570708600485401,4.5389530590421234,1.348658807402797,1.0051876359250767,0.10163964236223864,1.0000000002393234,2.1877999996509387E-5,1.0000000002393234,2.1877999996509387E-5,1.0156681555385043,0.23379845767365387,7.1536937357469279,-110.35097962783364,69.649020372166362,null,1000000000,478646884,null,-1.6268566713497137,-18.546038545153728,null,8.7805504070966407,-91.806194599745339,null,0,0]
[22005.25,22.00525,8.9068050626488873,1.4582853986026734,1.0040302759638533,8.9630200451892392E-2,1,0,11465.389940758319,1.5707091077812882,4.5640752742327839,1.3499018701124732,1.0052479996001331,0.10222671534702431,1.0000000002421157,2.2005249996448127E-5,1.0000000002421157,2.2005249996448127E-5,1.0158503538940464,0.23514089389213019,7.0998486463532053,-110.39796873906477,69.602031260935235,null,1000000000,484231027.5625,null,-1.6298098970671238,-18.508482168383942,null,8.729658543420328,-91.890747378634202,null,0,0]
[22132.5,22.1325,8.9576631383963363,1.4589268771909507,1.004076927670537,9.014571062268513E-2,1,0,11531.69097614282,1.5707096092438173,4.589204464635789,1.3511313213824039,1.0053087096969504,0.10281371762800713,1.0000000002449236,2.2132499996386149E-5,1.0000000002449236,2.2132499996386149E-5,1.0160335952920985,0.23648303290041059,7.0463143081244244,-110.4452969236664,69.554703076333595,null,1000000000,489847556.25,null,-1.6327255907506097,-18.471701284409257,null,8.6790398988750361,-91.974863738098477,null,0,0]
[22259.75,22.25975,9.0085248585551714,1.4595611125201042,1.0041238461865678,9.0661172755174685E-2,1,0,11597.992011530188,1.5707101049730292,4.6143405162924269,1.3523473799050731,1.0053697661527714,0.10340064881350372,1.0000000002477483,2.2259749996323457E-5,1.0000000002477483,2.2259749996323457E-5,1.0162178795039478,0.23782487314401121,6.9930867563477275,-110.4929586804555,69.507041319544498,null,1000000000,495496470.0625,null,-1.6356046385216358,-18.43568334636343,null,8.6286913948693638,-92.058550723821327,null,0,0]
[22387,22.387,9.0593901617434369,1.4601882260806296,1.0041710314745469,9.1176586582196087E-2,1,0,11664.293046920373,1.5707105950666898,4.6394833176828474,1.353550259792704,1.0054311689044966,0.10398750851212153,1.0000000002505889,2.2386999996260046E-5,1.0000000002505889,2.2386999996260046E-5,1.0164032062997719,0.23916641307114297,6.9401621003969716,-110.54094861217088,69.45905138782912,null,1000000000,501177769,null,-1.6384479025170851,-18.400416069696146,null,8.5786100029140577,-92.141815223091939,null,0,0]
[22517.5,22.517499999999998,9.1115582373750623,1.4608240837872877,1.0042196989274677,9.1705113768609514E-2,1,0,11732.287428993341,1.5707110919242659,4.6652751693449943,1.3547703933250399,1.0054944995085218,0.10458928211030366,1.000000000253519,2.2517499996194256E-5,1.000000000253519,2.2517499996194256E-5,1.0165943490168738,0.24054190275472398,6.8861963336693179,-110.59049952797933,69.409500472020667,null,1000000000,507037806.25,null,-1.6413274965188678,-18.365015123050828,null,8.527523830188187,-92.226774562644948,null,0,0]
[22648,22.648,9.1637299550011964,1.4614527015086156,1.0042686468728763,9.2233589581919975E-2,1,0,11800.281811069173,1.5707115830559581,4.6910738899451676,1.355977108305596,1.0055581941877996,0.10519097969053731,1.000000000256466,2.2647999996127708E-5,1.000000000256466,2.2647999996127708E-5,1.0167865877606326,0.24191707328853576,6.8325410753473923,-110.64038442351976,69.359615576480238,null,1000000000,512931904,null,-1.6441712180762011,-18.330378319213946,null,8.4767122934235921,-92.311303739121499,null,0,0]
[22778.5,22.778500000000001,9.2159052527692857,1.4620742017097719,1.004317875269761,9.2762013734467963E-2,1,0,11868.276193147816,1.5707120685601783,4.7168793667754949,1.3571706214247119,1.0056222528731498,0.10579260083163147,1.00000000025943,2.2778499996060381E-5,1.00000000025943,2.2778499996060381E-5,1.0169799222795479,0.2432919230077345,6.7791923599442905,-110.69059780268623,69.309402197313773,null,1000000000,518860062.25,null,-1.6469799234430802,-18.296493224249684,null,8.4261722833873733,-92.395409690351443,null,0,0]
[22909,22.908999999999999,9.2680840702153819,1.4626887041203043,1.0043673840768832,9.3290385938765721E-2,1,0,11936.270575229228,1.5707125485330964,4.7426914895519303,1.358351144807679,1.0056866754950151,0.10639414511272355,1.000000000262411,2.2908999995992281E-5,1.000000000262411,2.2908999995992281E-5,1.0171743523209065,0.24466645025050834,6.7261462960979053,-110.74113427424608,69.258865725753921,null,1000000000,524822281,null,-1.6497544455944961,-18.263347665670576,null,8.3759007416924032,-92.479099197589605,null,0,0]
[23042.25,23.042249999999999,9.32136601158264,1.4633090569067957,1.0044182254659972,9.3829838522861558E-2,1,0,12005.697789119757,1.5707130330106684,4.7690542913156193,1.3595433576745657,1.0057528311300994,0.10700828587078337,1.0000000002654725,2.3042249995921944E-5,1.0000000002654725,2.3042249995921944E-5,1.0173740096774597,0.24606960816193185,6.672290720719845,-110.7930635725469,69.206936427453101,null,1000000000,530945285.0625,null,-1.6525530053742314,-18.230254332062916,null,8.3248437260940751,-92.564129464160743,null,0,0]
[23175.5,23.1755,9.3746514993843455,1.4639223577607459,1.0044693591203069,9.4369236341020013E-2,1,0,12075.12500301307,1.5707135119171298,4.7954237971410993,1.3607224605083115,1.0058193660538592,0.10762234560963298,1.0000000002685518,2.3175499995850781E-5,1.0000000002685518,2.3175499995850781E-5,1.0175748086780287,0.24747242637080016,6.6187427154758893,-110.84531868751878,69.154681312481216,null,1000000000,537103800.25,null,-1.6553176102789882,-18.197907186764407,null,8.2740603257548742,-92.648739359093753,null,0,0]
[23308.75,23.30875,9.4279404734885475,1.4645287257944544,1.00452078499518,9.4908579087752909E-2,1,0,12144.552216909124,1.5707139853480265,4.8217998970386606,1.3618886651457707,1.0058862801910302,0.1082363238823095,1.0000000002716489,2.3308749995778801E-5,1.0000000002716489,2.3308749995778801E-5,1.0177767490496965,0.24887490311788268,6.5654983653199492,-110.89789420300805,69.10210579699195,null,1000000000,543297826.5625,null,-1.6580490766830054,-18.16629407228265,null,8.2235474420029533,-92.732935623727386,null,0,0]
[23442,23.442,9.4812328751112815,1.4651282774628369,1.0045725030457389,9.5447866457762598E-2,1,0,12213.979430807864,1.5707144533967317,4.8481824833849396,1.3630421789548188,1.0059535734659384,0.10885022024221434,1.0000000002747638,2.3441999995705994E-5,1.0000000002747638,2.3441999995705994E-5,1.0179798305182457,0.2502770366473,6.512553828095462,-110.95078480673519,69.049215193264814,null,1000000000,549527364,null,-1.6607481987642627,-18.13540308707524,null,8.1733020268597265,-92.816724847324593,null,0,0]
[23578.5,23.578499999999998,9.5358285852732383,1.4657355035852744,1.0046257854169405,9.6000249440157975E-2,1,0,12285.099991389809,1.5707149273759415,4.8752151630565983,1.3642108805313793,1.0060229010821036,0.10947900428367317,1.0000000002779728,2.3578499995630548E-5,1.0000000002779728,2.3578499995630548E-5,1.0181890480890752,0.25171301084708303,6.4586248900739687,-111.00528668848236,68.994713311517643,null,1000000000,555945662.25,null,-1.6634804233941543,-18.10449524800179,null,8.1221053134681203,-92.902142389019104,null,0,0]
[23715,23.715,9.5904277714869028,1.4663358159387847,1.0046793742939846,9.6552573663643462E-2,1,0,12356.220551974478,1.5707153958988442,4.9022544281622391,1.3653666913050793,1.0060926263940024,0.11010770142033685,1.0000000002812006,2.3714999995554218E-5,1.0000000002812006,2.3714999995554218E-5,1.0183994625121688,0.25314862116344672,6.4050026330612289,-111.0601082548003,68.939891745199702,null,1000000000,562401225,null,-1.6661803254520473,-18.074320705626278,null,8.0711829585132744,-92.987146318586454,null,0,0]
[23851.5,23.851500000000001,9.6450303747199317,1.4669293315080003,1.0047332696278273,9.7104838800661772E-2,1,0,12427.341112561831,1.5707158590591177,4.9293001703303148,1.3665098203472306,1.0061627493189558,0.11073631117332655,1.0000000002844471,2.3851499995477007E-5,1.0000000002844471,2.3851499995477007E-5,1.0186110734885321,0.25458386571990349,6.3516831531895868,-111.11524411869337,68.884755881306631,null,1000000000,568894052.25,null,-1.6688486907903124,-18.044867458974501,null,8.0205318439798994,-93.071743250005241,null,0,0]
[23988,23.988,9.6996363372655772,1.4675161646626067,1.0047874713691551,9.765704452386989E-2,1,0,12498.461673151818,1.5707163169483076,4.956352283529041,1.3676404722988629,1.0062332697738368,0.11136483306417279,1.0000000002877121,2.3987999995398908E-5,1.0000000002877121,2.3987999995398908E-5,1.0188238807177576,0.25601874264371699,6.2986626192171205,-111.17068899728093,68.829311002719066,null,1000000000,575424144,null,-1.6714862838258984,-18.016123760810029,null,7.9701489030430199,-93.155939647631172,null,0,0]
[24127.75,24.127749999999999,9.7555458631118306,1.4681101638254672,1.0048432810138157,9.8222336108228003E-2,1,0,12571.275580425205,1.5707167803722082,4.9840549867060853,1.3687853274553572,1.0063058810399967,0.11200822823776736,1.0000000002910743,2.4127749995318022E-5,1.0000000002910743,2.4127749995318022E-5,1.0190429937858565,0.25748740048563518,6.2446854725952612,-111.22776872085866,68.772231279141337,null,1000000000,582148320.0625,null,-1.6741555730923734,-17.987418772396005,null,7.9188410456876355,-93.241732366708121,null,0,0]
[24267.5,24.267499999999998,9.8114587918266167,1.4686973931028819,1.0048994117250178,9.8787564722156301E-2,1,0,12644.08948770126,1.5707172384586416,5.0117641502277941,1.3699175246761073,1.0063789088136599,0.11265153030183093,1.0000000002944558,2.4267499995236196E-5,1.0000000002944558,2.4267499995236196E-5,1.019263360107608,0.25895566901960898,6.1910137751209735,-111.28516146650865,68.714838533491346,null,1000000000,588911556.25,null,-1.6767941629589231,-17.959433389680786,null,7.8678079380798973,-93.327118502158513,null,0,0]
[24407.25,24.407250000000001,9.8673750655634453,1.4692779671767866,1.0049558634489633,9.9352730015074359E-2,1,0,12716.903394979936,1.5707176912992913,5.039479667529152,1.3710372698779782,1.0064523530041611,0.11329473874424455,1.0000000002978569,2.4407249995153419E-5,1.0000000002978569,2.4407249995153419E-5,1.019484979356061,0.26042354624824571,6.137643640400773,-111.3428618884099,68.6571381115901,null,1000000000,595713852.5625,null,-1.6794028083582599,-17.932155790407883,null,7.8170464487590348,-93.412104530417835,null,0,0]
[24547,24.547000000000001,{"$f":"SQRT(1+(A333/pole1)^2)","v":9.9232946277762295},{"$f":"ATAN(A333/pole1)","v":1.4698519981622824},{"$f":"SQRT(1+(A333/Zero1)^2)","v":1.0050126361315577},{"$f":"ATAN(A333/Zero1)","v":9.9917831636642016E-2},{"$f":"IF(VIN_nom>Vout, 1, SQRT(1+(A333/z_RHP)^2))","v":1},{"$f":"IF(VIN_nom>Vout, 0, -ATAN(A333/z_RHP))","v":0},{"$f":"SQRT(1+(A333/Pole2)^2)","v":12789.717302261191},{"$f":"ATAN(A333/Pole2)","v":1.5707181389837523},5.0672014343524392,1.3721447645981526,{"$f":"SQRT(1+(A333/pole4)^2)","v":1.0065262135203457},{"$f":"ATAN(A333/pole4)","v":0.11393785305334822},{"$f":"SQRT(1+(A333/Zero3)^2)","v":1.0000000003012777},{"$f":"ATAN(A333/Zero3)","v":2.4546999995069693E-5},{"$f":"SQRT(1+(A333/pole5)^2)","v":1.0000000003012777},{"$f":"ATAN(A333/pole5)","v":2.4546999995069693E-5},{"$f":"SQRT((1-(Z333/pterm2))^2+(A333/pterm1)^2)","v":1.0197078512027344},{"$f":"IF((ATAN((A333/pterm1)/(1-A333^2/pterm2))>0),ATAN((A333/pterm1)/(1-A333^2/pterm2)),PI()+ATAN((A333/pterm1)/(1-A333^2/pterm2)))","v":0.26189103017834109},{"$f":"20*LOG10(((E333*K333*G333*O333)/(C333*I333*S333*M333*Q333))*Adc)","v":6.0845712542457502},{"$f":"((F333+L333+H333+R333)-(D333+J333+T333+N333))*radconv","v":-111.40086474474282},{"$f":"IF(V333>0,V333,V333+180)","v":68.599135255257181},null,{"$f":"IF(U333<0,A333,1000000000)","v":1000000000},{"$f":"A333^2","v":602555209},null,{"$f":"20*LOG10((K333/(I333*M333))*AEA*Afb)","v":-1.6819822435773344},-17.905574403164781,null,{"$f":"20*LOG10((E333*G333/(C333*S333))*Am)","v":7.7665534978230824},{"$f":"(F333+H333-(D333+T333))*radconv","v":-93.496696781079052},null,{"$f":"SUM((U334<0)*(U333>0))*A333","v":0},0]
[24690,{"$f":"A334/1000","v":24.69},9.9805179913422499,1.4704327199383893,1.0050710612940303,0.10049600888151007,1,0,12864.22455622603,1.5707185918333655,5.0955742562426245,1.3732655396368727,1.0066022225886007,0.11459582553342119,1.000000000304798,2.4689999994983023E-5,1.000000000304798,2.4689999994983023E-5,1.0199372024035758,0.26339223244222665,6.030568937220262,-111.46052420934471,68.539475790655288,null,1000000000,609596100,null,-1.6845921736566252,{"$f":"(L334-(J334+N334))*radconv","v":-17.879083716147765},null,7.7151611108768883,-93.582855125994456,null,0,0]
[24833,24.832999999999998,10.037744682339635,1.4710068203420257,1.0051298224015039,0.10107411871773027,1,0,12938.731810193474,1.5707190394675399,5.1239534079804203,1.3743739011705178,1.0066786673770078,0.11525369836853308,1.0000000003083389,2.4832999994895347E-5,1.0000000003083389,2.4832999994895347E-5,1.0201678644397114,0.264893018692895,5.9768705223074967,-111.5204895570707,68.479510442929296,null,1000000000,616677889,null,-1.6871730113473418,-17.853298262522962,null,7.6640435336548425,-93.66861412064172,null,0,0]
[24976,24.975999999999999,10.094974644180464,1.4715744116042322,1.0051889193950629,0.10165216077073704,1,0,13013.239064163483,1.5707194819758585,5.1523387849711666,1.375470051619434,1.0067555477863122,0.11591147101199738,1.0000000003119003,2.4975999994806651E-5,1.0000000003119003,2.4975999994806651E-5,1.0203998369542673,0.26639338680855018,5.9234721463377413,-111.58075549415518,68.419244505844816,null,1000000000,623800576,null,-1.6897254805086108,-17.828206418268746,null,7.6131976268463504,-93.753980095276873,null,0,0]
[25119,25.119,10.152207821549599,1.4721356034422286,1.0052483522154687,0.10223013466623378,1,0,13087.746318136011,1.5707199194458645,5.1807302848898225,1.3765541890855835,1.0068328637167234,0.11656914291764085,1.0000000003154821,2.5118999994716938E-5,1.0000000003154821,2.5118999994716938E-5,1.0206331195887168,0.26789333467206145,5.8703700177820846,-111.64131683039079,68.358683169609208,null,1000000000,630964161,null,-1.692250285163255,-17.803796806701186,null,7.5626203029453425,-93.83895923637651,null,0,0]
[25265.25,25.265250000000002,10.210745022576937,1.4727030421853795,1.0053094830819385,0.10282117344361565,1,0,13163.946918792291,1.5707203617361547,5.2097732750890229,1.3776507424724951,1.006912387203708,0.11724165714529432,1.0000000003191665,2.5265249994624119E-5,1.0000000003191665,2.5265249994624119E-5,1.0208730588472756,0.2694269353707518,5.8163635676971781,-111.70355480328278,68.296445196717215,null,1000000000,638332857.5625,null,-1.6948045705904526,-17.779526493866641,null,7.5111681382876334,-93.925475901610852,null,0,0]
[25411.5,25.4115,10.269285473846519,1.4732640116952962,1.0053709650872109,0.10341214013917623,1,0,13240.14751945112,1.5707207989354464,5.2388224602110469,1.3787351364099896,1.0069923660203342,0.11791406485020908,1.0000000003228722,2.5411499994530223E-5,1.0000000003228722,2.5411499994530223E-5,1.0211143676895456,0.27096009203362525,5.7626591839116976,-111.76609109515675,68.233908904843247,null,1000000000,645744332.25,null,-1.6973313484835493,-17.755946471169597,null,7.4599905323952465,-94.0116005956896,null,0,0]
[25557.75,25.557749999999999,10.327829120089042,1.4738186216290805,1.0054327981668705,0.10400303435339656,1,0,13316.34812011245,1.5707212311311365,5.2678777377720474,1.3798075695248337,1.0070728000581188,0.11858636544980285,1.0000000003265992,2.5557749994435239E-5,1.0000000003265992,2.5557749994435239E-5,1.0213570457266754,0.27249280241115548,5.7092530317016212,-111.82892047405672,68.171079525943284,null,1000000000,653198585.0625,null,-1.6998313116889818,-17.733045329762604,null,7.4090843433906048,-94.097339495504315,null,0,0]
[25704,25.704000000000001,10.386375907278335,1.4743669791871892,1.0054949822561485,0.10459385568705815,1,0,13392.54872077624,1.5707216584086336,5.2969390075155358,1.3808682361962161,1.0071536892079964,0.11925855836206617,1.0000000003303477,2.570399999433916E-5,1.0000000003303477,2.570399999433916E-5,1.0216010925680348,0.27402506425899908,5.6561413472916646,-111.89203781083823,68.107962189161768,null,1000000000,660695616,null,-1.7023051340381599,-17.710811904085357,null,7.3584464813298247,-94.18269863747085,null,0,0]
[25853.75,25.853750000000002,10.446327013601147,1.4749220906780638,1.005559018154129,0.10519874040038729,1,0,13470.572925560982,1.5707220909025967,5.3267018672043971,1.3819422928194025,1.0072369856318408,0.11994672575117366,1.0000000003342082,2.5853749994239644E-5,1.0000000003342082,2.5853749994239644E-5,1.021852397769532,0.2755935285233197,5.6020598784250852,-111.95695877355915,68.043041226440849,null,1000000000,668416389.0625,null,-1.7048117566968448,-17.688726859666616,null,7.3068716351219285,-94.269713224653515,null,0,0]
[26003.5,26.003499999999999,10.506281302209299,1.4754708668284551,1.0056234219246549,0.10580354785696225,1,0,13548.597130348217,1.5707225184152329,{"$f":"SQRT(1+(A343/Zero2)^2)","v":5.3564708034726998},{"$f":"ATAN(A343/Zero2)","v":1.3830044123768859},1.0073207589782724,0.12063477900386063,1.0000000003380909,2.6003499994138965E-5,1.0000000003380909,2.6003499994138965E-5,1.0221051372400334,0.27716151778730719,5.5482793740882332,-112.02217107752095,67.977828922479048,null,1000000000,676182012.25,null,-1.7072923437364154,-17.667318933789005,null,7.2555717178246484,-94.356342034535885,null,0,0]
[26153.25,26.15325,10.566238718932624,1.4760134151533844,1.0056881934970514,0.1064082776292006,1,0,13626.621335137897,1.5707229410321091,5.3862457155675392,1.384054790414839,1.0074050091283115,0.12132271749721002,1.0000000003419962,2.6153249994037124E-5,1.0000000003419962,2.6153249994037124E-5,1.022359310554438,0.27872902965862106,5.4947960137937173,-112.08766953554985,67.91233046445015,null,1000000000,683992485.5625,null,-1.7097475605193377,-17.64657689169422,null,7.2045435743130559,-94.442591114702552,null,0,0]
[26303,26.303000000000001,10.626199210820753,1.4765498407560276,1.0057533328002577,0.1070129292898571,1,0,13704.645539929985,1.5707233588368437,5.4160265049315806,1.3850936182834168,1.007489735962342,0.12201054060894707,1.000000000345924,2.6302999993934108E-5,1.000000000345924,2.6302999993934108E-5,1.0226149172857213,0.28029606175070526,5.4416060476609047,-112.153449062935,67.846550937065004,null,1000000000,691847809,null,-1.71217805409889,-17.626489738963233,null,7.1537841017597934,-94.528466374861679,null,0,0]
[26456,26.456,10.687464137711077,1.4770916917143795,1.0058202655255049,0.10763062249065512,1,0,13784.363091406147,1.5707237808242016,5.4464595916371374,1.3861432575498995,1.0075767937983799,0.12271317162269299,1.0000000003499598,2.6455999993827639E-5,1.0000000003499598,2.6455999993827639E-5,1.0228775513805628,0.28189660489887763,5.3875608939717301,-112.22094129343235,67.779058706567653,null,1000000000,699919936,null,-1.7146364169957495,-17.606631808697131,null,7.1021973109674814,-94.615825301879383,null,0,{"$f":"IF(AH346>0,W346,0)","v":0}]
[26609,26.609000000000002,10.748732166696634,1.4776273657018173,1.0058875819651776,0.10824823325201516,1,0,13864.080642884734,1.5707241979587605,5.4768986122491965,1.387181230765635,1.0076643489792543,0.12341568088107326,1.0000000003540195,2.6608999993719931E-5,1.0000000003540195,2.6608999993719931E-5,1.023141680878574,0.28349664219864534,5.333814311883998,-112.28871651137759,67.711283488622414,null,1000000000,708038881,null,-1.7170702815418193,-17.5874350397897,null,7.0508845934258177,-94.702806054986311,null,0,0]
[26762,26.762,10.810003245032039,1.4781569674414565,1.0059552820422435,0.1088657611193681,1,0,13943.798194365709,1.5707246103237518,5.5073434683778704,1.3882077291467227,1.0077524013753345,0.12411806772250986,1.0000000003581022,2.6761999993610975E-5,1.0000000003581022,2.6761999993610975E-5,1.0234073053181565,0.28509617112351826,5.2803625193520496,-112.35676960923858,67.643230390761417,null,1000000000,716204644,null,-1.7194802824104403,-17.568888443228619,null,6.9998428017624921,-94.789414515662671,null,0,0]
[26915,26.914999999999999,10.871277321158413,1.4786805993091998,1.0060233656792519,0.10948320563851971,1,0,14023.515745849023,1.5707250180005137,5.5377940637782679,1.3892229398014548,1.0078409508562998,0.12482033148613851,1.0000000003622085,2.6914999993500769E-5,1.0000000003622085,2.6914999993500769E-5,1.0236744242356546,0.28669518915340292,5.2272018040023411,-112.42509558063541,67.574904419364586,null,1000000000,724417225,null,-1.7218670368014031,-17.550981265294055,null,6.9490688408037418,-94.875656431248302,null,0,0]
[27071.75,27.071750000000002,10.934056269086815,1.4792109787833887,1.0060935157280564,0.11011569668977896,1,0,14105.187158890694,1.5707254308904628,5.5689968508672827,1.3902515183857154,1.007932186040071,0.12553967926701504,1.0000000003664398,2.7071749993386557E-5,1.0000000003664398,2.7071749993386557E-5,1.0239496395693652,0.28833286634221988,5.1730361859903864,-112.4953740652429,67.504625934757101,null,1000000000,732879648.0625,null,-1.7242888094897153,-17.53328730219598,null,6.8973249954801013,-94.963637860067337,null,0,0]
[27228.5,27.2285,10.996838257672746,1.479735302430615,1.0061640682032547,0.11074809929313791,1,0,14186.858571934741,1.5707258390265328,5.6002054641504877,1.3912686339883926,1.0080239426951005,0.12625889646091815,1.0000000003706955,2.722849999327101E-5,1.0000000003706955,2.722849999327101E-5,1.0242264225456568,0.28997000195083455,5.1191684167437659,-112.56592863996153,67.434071360038473,null,1000000000,741391212.25,null,-1.7266874399379597,-17.516242365104368,null,6.8458558566817267,-95.051246352991058,null,0,0]
[27385.25,27.385249999999999,11.059623235133651,1.4802536730960678,1.0062350230201975,0.11138041296141725,1,0,14268.529984981124,1.5707262424903556,5.6314198067638017,1.3922744751014886,1.0081162206789989,0.12697798235954327,1.0000000003749758,2.7385249993154127E-5,1.0000000003749758,2.7385249993154127E-5,1.0245047726592806,0.29160659329031363,5.0655947207153904,-112.63675423553354,67.363245764466456,null,1000000000,749951917.5625,null,-1.7290635384433379,-17.499835618317309,null,6.7946582591587283,-95.138487676463555,null,0,0]
[27542,27.542000000000002,11.122411150853765,1.4807661913155852,1.0063063800937779,0.11201263720785917,1,0,14350.201398029802,1.5707266413617049,5.662639783961338,1.3932692261525359,1.0082090198486193,0.12769693625538767,1.0000000003792808,2.75419999930359E-5,1.0000000003792808,2.75419999930359E-5,1.024784689402763,0.29324263767887321,5.0123113918801101,-112.70784588358687,67.29215411641313,null,1000000000,758561764,null,-1.7314176984464005,-17.484056458949318,null,6.7437290903265108,-95.225367464998314,null,0,0]
[27702.5,27.702500000000001,11.186704162687395,1.4812850092443548,1.0063798609918073,0.11265989327198743,1,0,14433.826672637008,1.5707270450982627,5.6946123921695744,1.3942764723369121,1.0083045789814717,0.12843295248960865,1.0000000003837142,2.7702499992913439E-5,1.0000000003837142,2.7702499992913439E-5,1.0250729254836561,0.29491725235706795,4.958050412978273,-112.78090887896376,67.219091121036243,null,1000000000,767428506.25,null,-1.733806048698576,-17.468539259910941,null,6.691856461676851,-95.313956855386181,null,0,0]
[27863,27.863,11.251000151254608,1.4817978975416397,1.0064537634413642,0.11330705455304441,1,0,14517.45194724654,1.5707274441835111,5.7265907133012197,1.3952724702316499,1.0084006842292816,0.12916882883090472,1.0000000003881733,2.7862999992789551E-5,1.0000000003881733,2.7862999992789551E-5,1.0253628029654864,0.29659128793394796,4.9040862128169822,-112.85424057983994,67.145759420160061,null,1000000000,776346769,null,-1.7361726056347315,-17.45365825862174,null,6.6402588184517146,-95.402178753524183,null,0,0]
[28023.5,28.023499999999999,11.315299065812054,1.4823049570202425,1.0065280873495934,0.11395412052988266,1,0,14601.077221858357,1.5707278386973689,5.7585746521818386,1.3962574052678023,1.0084973354359221,0.12990456452240923,1.0000000003926581,2.8023499992664227E-5,1.0000000003926581,2.8023499992664227E-5,1.0256543212963005,0.29826474155407867,4.8504150286237397,-112.92783596541577,67.072164034584233,null,1000000000,785316552.25,null,-1.7385179549050696,-17.439402791878713,null,6.5889329835288102,-95.490038801815658,null,0,0]
[28184,28.184000000000001,11.379600856760991,1.4828062862264924,1.0066028326231384,0.11460109068182747,1,0,14684.702496472422,1.5707282287179343,5.7905641157232282,1.3972314588657722,1.0085945324444394,0.13064015880815374,1.000000000397169,2.818399999253746E-5,1.000000000397169,2.818399999253746E-5,1.0259474799217476,0.29993761036999395,4.7970331668456883,-113.00169011520217,66.998309884797834,null,1000000000,794337856,null,-1.7408426659408622,-17.425762426219347,null,6.5378758327865487,-95.577542513234022,null,0,0]
[28348,28.347999999999999,11.44530778817162,1.4833127290001993,1.006679643006742,0.1152620696937688,1,0,14770.151375208075,1.5707286226816914,5.823256780768796,1.3982156982240281,1.0086944126347068,0.13139164724037183,1.0000000004018046,2.8347999992406431E-5,1.0000000004018046,2.8347999992406431E-5,1.026248725174286,0.3016463521645672,4.7427822973100833,-113.07741706437567,66.922582935624334,null,1000000000,803609104,null,-1.7431973294439682,-17.412449352924959,null,6.4859796267540526,-95.666591932209784,null,0,0]
[28512,28.512,11.511017621610193,1.4838133899152832,1.0067568931346678,0.11592294755837237,1,0,14855.600253945997,1.5707290121133179,5.8559550239710694,1.3991889470050438,1.0087948623568881,0.13214298643943481,1.0000000004064671,2.8511999992273874E-5,1.0000000004064671,2.8511999992273874E-5,1.0265516818630032,0.30335447738606119,4.6888259231737948,-113.15340410932141,66.846595890678586,null,1000000000,812934144,null,-1.7455315972866134,-17.399757183219663,null,6.4343575204604067,-95.755280543368656,null,0,0]
[28676,28.675999999999998,11.576730307660739,1.4843083671768202,1.0068345829056971,0.11658372372169731,1,0,14941.049132686145,1.5707293970905722,5.8886587524077401,1.4001513864640027,1.0088958814408679,0.13289417560176683,1.0000000004111564,2.8675999992139786E-5,1.0000000004111564,2.8675999992139786E-5,1.0268563493888097,0.30506198302259402,4.6351603171237281,-113.22964630920272,66.770353690797279,null,1000000000,822312976,null,-1.7478460278685386,-17.387675490360127,null,6.3830063449922667,-95.843613832617351,null,0,0]
[28840,28.84,11.642445798020834,1.4847977567839075,1.0069127122180657,0.11724439763032843,1,0,15026.498011428483,1.5707297776894444,5.9213678751939227,1.4011031939322487,1.0089974697156365,0.13364521392479023,1.0000000004158727,2.883999999200415E-5,1.0000000004158727,2.883999999200415E-5,1.0271627271500561,0.30676886607108911,4.5817818202126652,-113.30613882203957,66.693861177960429,null,1000000000,831745600,null,-1.7501411641150257,-17.376194072378382,null,6.3319229843276936,-95.931597159943777,null,0,0]
[29008,29.007999999999999,11.709766963606397,1.4852933870740441,1.0069932027693298,0.11792107893266073,1,0,15114.031009166767,1.570730163108973,5.9548802818523141,1.4020673734389062,1.0091021257576469,0.13441441301511659,1.0000000004207319,2.9007999991863606E-5,1.0000000004207319,2.9007999991863606E-5,1.0274783502217626,0.30851673173275379,4.5273953526757724,-113.38475159110112,66.615248408898879,null,1000000000,841464064,null,-1.7524728251165,-17.365044600334482,null,6.2798681777922738,-96.021369026740189,null,0,0]
[29176,29.175999999999998,11.77709097280286,1.4857833509196769,1.0070741543465194,0.11859765175749321,1,0,15201.564006907269,1.5707305440898889,5.9883981624549225,1.4030207605354328,1.0092073787282914,0.13518345211666674,1.0000000004256195,2.9175999991721418E-5,1.0000000004256195,2.9175999991721418E-5,1.0277957666861375,0.31026393771474242,4.4733026103336542,-113.46361705380558,66.536382946194422,null,1000000000,851238976,null,-1.7547853448657615,-17.354504066847152,null,6.2280879551994168,-96.110784648622953,null,0,0]
[29344,29.344000000000001,11.844417777120734,1.4862677447122403,1.0071555668384677,0.11927411551165448,1,0,15289.097004649953,1.5707309207084281,6.021921425598193,1.4039635337139242,1.0093132284408231,0.13595233036998347,1.0000000004305352,2.9343999991577584E-5,1.0000000004305352,2.9343999991577584E-5,1.0281149758881634,0.31201048081777083,4.4194998723758498,-113.54273031193696,66.457269688063036,null,1000000000,861070336,null,-1.7570792597294362,-17.344562200197316,null,6.1765791321052879,-96.199849399095115,null,0,0]
[29512,29.512,11.911747329164804,1.4867466626744017,1.0072374401334108,0.11995046960256374,1,0,15376.630002394784,1.57073129303909,6.0554499818881107,1.4048958675897147,1.0094196747075164,0.13672104691672965,1.000000000435479,2.9511999991432097E-5,1.000000000435479,2.9511999991432097E-5,1.0284359771700669,0.31375635785237871,4.3659834862136178,-113.62208656563396,66.377913434366036,null,1000000000,870958144,null,-1.7593550911625924,-17.335208950752698,null,6.1253385773762128,-96.288568527927694,null,0,0]
[29684,29.684000000000001,11.98068276404558,1.4872314066722003,1.007321740066045,0.1206428131332624,1,0,15466.24711913572,1.5707316698685594,6.0897822295315711,1.4058397631710973,1.009529273240833,0.13750789781564743,1.0000000004405698,2.9683999991281414E-5,1.0000000004405698,2.9683999991281414E-5,1.0287664772405851,0.31554311002229207,4.3114858160030618,-113.7035790853988,66.2964209146012,null,1000000000,881139856,null,-1.7616669040311139,-17.326232543980428,null,6.0731527200341766,-96.379047309338901,null,0,0]
[29856,29.856000000000002,12.049620981896689,1.4877106041527384,1.0074065227668985,0.12133504046133234,1,0,15555.864235878826,1.5707320423562099,6.1241198419630596,1.4067730748321616,1.0096394966724638,0.13829457739881645,1.0000000004456904,2.985599999112898E-5,1.0000000004456904,2.985599999112898E-5,1.0290988543398985,0.31732915729444233,4.2572807593889515,-113.78531643291497,66.214683567085032,null,1000000000,891380736,null,-1.7639608224790488,-17.317852486736509,null,6.0212415818680007,-96.46917456897306,null,0,0]
[30028,30.027999999999999,12.118561935224131,1.4881843495543274,1.0074917881140932,0.12202715095279267,1,0,15645.481352624065,1.5707324105766518,6.1584627294455689,1.407695977998026,1.0097503447977687,0.13908108474880224,1.0000000004508403,3.0027999990974777E-5,1.0000000004508403,3.0027999990974777E-5,1.0294331077532466,0.31911449627829297,4.203364608211297,-113.86729376175096,66.132706238249042,null,1000000000,901680784,null,-1.7662373606567146,-17.310058679611767,null,5.9696019688680133,-96.558955559807856,null,0,0]
[30200,30.2,12.187505577606666,1.4886527351882792,1.0075775359850987,0.12271914397432421,1,0,15735.098469371405,1.5707327746027944,6.1928108042190386,1.4086086442736903,1.0098618174110379,0.13986741894942445,1.0000000004560199,3.0199999990818795E-5,1.0000000004560199,3.0199999990818795E-5,1.0297692367629103,0.32089912359423828,4.1497337222408905,-113.94950632304652,66.050493676953479,null,1000000000,912040000,null,-1.7684970183819571,-17.302841242048085,null,5.9182307406228452,-96.648395413541195,null,0,0]
[30375.75,30.37575,12.257955082154661,1.4891258902761644,1.0076656516496421,0.12342610205524684,1,0,15826.669447677863,1.5707331423072208,6.2279130157700004,1.4095308093488208,1.0099763652306895,0.14067071725928004,1.000000000461343,3.0375749990657574E-5,1.000000000461343,3.0375749990657574E-5,1.0301146307974878,0.32272192132006328,4.095224502273962,-114.03374944920392,65.966250550796076,null,1000000000,922686188.0625,null,-1.7707890109217108,-17.296051745977444,null,5.8660135131956697,-96.739438105502487,null,0,0]
[30551.5,30.551500000000001,12.328407299597421,1.4895936376605301,1.0077542708469096,0.12413293615340586,1,0,15918.240425986436,1.5707335057811478,6.2630204640971234,1.4104426367738203,1.010091564628085,0.14147383285739218,1.0000000004666971,3.0551499990494468E-5,1.0000000004666971,3.0551499990494468E-5,1.0304619815802341,0.3245439689086283,4.0410056476805343,-114.11822845348416,65.881771546515836,null,1000000000,933394152.25,null,-1.7730643902261645,-17.289843842628521,null,5.8140700379066992,-96.830135082864871,null,0,0]
[30727.25,30.727250000000002,12.398862183689712,1.4900560693206035,1.0078433934440756,0.12483964559531104,1,0,16009.811404297088,1.5707338650971665,6.2981330616269107,1.4113442979193176,1.010207415380316,0.1422767647704351,1.0000000004720819,3.0727249990329482E-5,1.0000000004720819,3.0727249990329482E-5,1.0308112883360014,0.32636526279000883,3.9870734841708275,-114.20293856953322,65.797061430466783,null,1000000000,944163892.5625,null,-1.7753236461443758,-17.284207661579266,null,5.762397130315204,-96.920491449696442,null,0,0]
[30903,30.902999999999999,12.469319689229744,1.4905132751659209,1.0079330193076061,0.12554622970820775,1,0,16101.382382609783,1.5707342203262171,6.3332507227152481,1.4122359604219248,1.0103239172633154,0.14307951202647565,1.0000000004774976,3.0902999990162592E-5,1.0000000004774976,3.0902999990162592E-5,1.0311625502864969,0.32818579940634202,3.9334244045826665,-114.28787512699009,65.712124873009913,null,1000000000,954995409,null,-1.7775672548586641,-17.279133546336194,null,5.7109916594413299,-97.010512192129653,null,0,0]
[31083,31.082999999999998,12.541483674716924,1.4909762121324435,1.0080253340389302,0.12626976987847291,1,0,16195.167737356021,1.5707345799814734,6.3692227629731137,1.4131389922749169,1.0104439111081434,0.14390147895512279,1.0000000004830765,3.108299998998969E-5,1.0000000004830765,3.108299998998969E-5,1.0315243323513248,0.33004957171918248,3.8787677135151064,-114.37509556634326,65.624904433656738,null,1000000000,966152889,null,-1.7798493830189777,-17.274509475027656,null,5.6586170965340852,-97.102367016031664,null,0,0]
[31263,31.263000000000002,12.613650317223044,1.4914338519814692,1.0081181763851703,0.126993177158954,1,0,16288.95309210433,1.5707349354952242,6.4051999387780354,1.414031880424061,1.0105645874764266,0.14472325012883958,1.0000000004886875,3.1262999989814776E-5,1.0000000004886875,3.1262999989814776E-5,1.0318881636530164,0.33191254218431521,3.8244005129295799,-114.46254391295183,65.53745608704817,null,1000000000,977375169,null,-1.782116067103886,-17.270455141916791,null,5.6065165800334675,-97.193880008991428,null,0,0]
[31443,31.443000000000001,12.685819571402641,1.4918862849250893,1.0082115462005683,0.12771645082932376,1,0,16382.738446854672,1.5707352869385951,6.4411821640763325,1.4149147934301927,1.0106859461236841,0.14554482450804831,1.000000000494331,3.144299998963783E-5,1.000000000494331,3.144299998963783E-5,1.0322540433453118,0.3337747070190546,3.7703191361062451,-114.55021544681502,65.449784553184983,null,1000000000,988662249,null,-1.7843677769830162,-17.266960833690881,null,5.5546869130892613,-97.285056164320864,null,0,0]
[31623,31.623000000000001,12.757991392934665,1.4923335991427173,1.0083054433385921,0.12843959017008016,1,0,16476.523801607018,1.570735634381093,6.4771693547145741,1.4157878961710479,1.0108079868041706,0.1463662010547318,1.0000000005000069,3.162299998945885E-5,1.0000000005000069,3.162299998945885E-5,1.0326219705785793,0.3356360624541424,3.7165199832933578,-114.63810554321297,65.361894456787027,null,1000000000,1000014129,null,-1.7866049693738562,-17.264017048059944,null,5.5031249526672141,-97.375900359589991,null,0,0]
[31807,31.806999999999999,12.831769641181403,1.4927856528093175,1.0084019719565489,0.12917865968522604,1,0,16572.393275355887,1.5707359854800369,6.5139613070890903,1.4166704294233485,1.0109334441786517,0.14720562485859359,1.0000000005058425,3.180699998927378E-5,1.0000000005058425,3.180699998927378E-5,1.0330001893823166,0.33753794085326189,3.6618133151405945,-114.72816993656905,65.271830063430954,null,1000000000,1011685249,null,-1.7888773343970583,-17.261567175092143,null,5.4506906495376501,-97.468425168337333,null,0,0]
[31991,31.991,12.905550481651106,1.4932325377981728,1.0084990512819929,0.12991758731649536,1,0,16668.26274910678,1.5707363325402073,6.550758275967417,1.4175430486040488,1.0110596137124404,0.14804483975126634,1.000000000511712,3.1990999989086549E-5,1.000000000511712,3.1990999989086549E-5,1.0333805459339438,0.33943896555799052,3.6073941542542705,-114.81845323609303,65.181546763906965,null,1000000000,1023424081,null,-1.7911354544200664,-17.259673135451369,null,5.3985296086743384,-97.560613049925564,null,0,0]
[32175,32.174999999999997,12.979333870137408,1.4936743420761234,1.008596681155904,0.13065637229804519,1,0,16764.132222859655,1.5707366756308936,6.5875601772855941,1.4184059185300764,1.0111864951389598,0.14888384462908488,1.0000000005176153,3.2174999988897156E-5,1.0000000005176153,3.2174999988897156E-5,1.0337630393151453,0.34133913258591436,3.5532588621644217,-114.90895079503798,65.091049204962019,null,1000000000,1035230625,null,-1.7933797774317122,-17.258325426557892,null,5.3466386395961365,-97.652468860187398,null,0,0]
[32359,32.359000000000002,13.053119763431953,1.4941111516290322,1.0086948614184224,0.13139501386495114,1,0,16860.001696614483,1.5707370148198103,6.6243669288365972,1.4192592004141007,1.0113140881902638,0.14972263839011912,1.0000000005235523,3.2358999988705574E-5,1.0000000005235523,3.2358999988705574E-5,1.0341476686040252,0.3432384379694452,3.4994038667126413,-114.99965806047004,65.00034193952996,null,1000000000,1047104881,null,-1.7956107388622591,-17.257514752349948,null,5.2950146055749014,-97.743997342250807,null,0,0]
[32547.5,32.547499999999999,13.128712756324108,1.4945535524427807,1.0087960134047527,0.13215157051801704,1,0,16958.215804240303,1.5707373583272157,6.6620787910774331,1.4201235728098462,1.0114455393856459,0.15058172605414433,1.0000000005296699,3.2547499988507043E-5,1.0000000005296699,3.2547499988507043E-5,1.0345439185217,0.3451832961128351,3.4445187620742752,-115.09279650868876,64.907203491311236,null,1000000000,1059339756.25,null,-1.7978828485478482,-17.257231641050744,null,5.2424016106221236,-97.837429702023201,null,0,0]
[32736,32.735999999999997,13.204308289327191,1.4949908877938249,1.008897742687721,0.13290797503356014,1,0,17056.429911868101,1.5707376978786616,6.6997955747844351,1.4209782137959324,1.0115777368654861,0.15144058981310327,1.0000000005358227,3.2735999988306202E-5,1.0000000005358227,3.2735999988306202E-5,1.0349424081281797,0.34712724156879443,3.3899204486679717,-115.18614566420078,64.813854335799221,null,1000000000,1071645696,null,-1.8001418216215226,-17.257493042979281,null,5.190062270289495,-97.93052825586112,null,0,0]
[32924.5,32.924500000000002,13.279906319062647,1.4954232440213429,1.0090000490927153,0.13366422659217791,1,0,17154.644019497842,1.570738033542094,6.7375171973061461,1.4218232855642441,1.0117106803372395,0.15229922848794009,1.0000000005420113,3.2924499988103029E-5,1.0000000005420113,3.2924499988103029E-5,1.0353431364207422,0.34907027012012615,3.3356052919892107,-115.2797009226249,64.720299077375103,null,1000000000,1084022700.25,null,-1.8023880878991971,-17.258289601563138,null,5.1379933798884068,-98.023297755955838,null,0,0]
[33113,33.113,13.355506803132673,1.495850705517122,1.0091029324442031,0.13442032437549914,1,0,17252.858127129493,1.5707383653839124,6.7752435778212892,1.4226589467495212,1.0118443695068646,0.15315764090154443,1.0000000005482352,3.3112999987897518E-5,1.0000000005482352,3.3112999987897518E-5,1.0357461023928358,0.35101237756613812,3.2815697237823178,-115.37345777272159,64.626542227278406,null,1000000000,1096470769,null,-1.8046220651015816,-17.259612164062208,null,5.0861917888838999,-98.115742843807894,null,0,0]
[33305.75,33.305750000000003,13.432814302190273,1.4962828291653076,1.0092087318682657,0.13519330958978631,1,0,17353.286611195101,1.5707387008233467,6.81382539090046,1.4235038795120067,1.0119818436872579,0.15403517224605315,1.0000000005546363,3.3305749987684939E-5,1.0000000005546363,3.3305749987684939E-5,1.0361604666777411,0.35299731573054988,3.2266013122865371,-115.46953235978118,64.530467640218816,null,1000000000,1109272983.0625,null,-1.8068941256268669,-17.261499144496259,null,5.0334954379134036,-98.209941494194922,null,0,0]
[33498.5,33.4985,13.51012428086222,1.4967100073465791,1.0093151341741151,0.13596613228909005,1,0,17453.71509526264,1.5707390324025516,6.8524120136672737,1.4243392970622135,1.012120096943617,0.15491246452848698,1.0000000005610747,3.3498499987469887E-5,1.0000000005610747,3.3498499987469887E-5,1.0365771685422447,0.35498128195562328,3.1719178979706002,-115.56580847894173,64.434191521058267,null,1000000000,1122149502.25,null,-1.8091541830581013,-17.263917388012896,null,4.9810720810287004,-98.303810413600303,null,0,0]
[33691.25,33.691249999999997,13.587436696822888,1.4971323243226988,1.0094221391711038,0.1367387916018043,1,0,17554.143579332078,1.5707393601877806,6.8910033653252531,1.4251653580868675,1.0122591289567262,0.15578951649667483,1.00000000056755,3.3691249987252348E-5,1.00000000056755,3.3691249987252348E-5,1.0369962068979386,0.3569642718038914,3.1175158704216699,-115.66228159370998,64.337718406290023,null,1000000000,1135100326.5625,null,-1.8114026473219005,-17.266857734584335,null,4.9289185177435693,-98.39735422555863,null,0,0]
[33884,33.884,13.664751508703208,1.4975498624554517,1.009529746667585,0.13751128665747189,1,0,17654.572063403375,1.5707396842437804,6.9295993668679694,1.4259822177890551,1.0123989394057473,0.1566663269006103,1.0000000005740626,3.3883999987032308E-5,1.0000000005740626,3.3883999987032308E-5,1.0374175806523573,0.35894628085611446,3.063391684931184,-115.7589472593462,64.241052740653799,null,1000000000,1148125456,null,-1.8136399167843809,-17.270311223818407,null,4.877031601715565,-98.490577445722295,null,0,0]
[34081.5,34.081499999999998,13.743974057188627,1.4979728173599256,1.0096406307224259,0.13830264726849381,1,0,17757.475438783131,1.5707400124835533,6.9691512444286277,1.4268098221273442,1.0125430023583706,0.15756449295225192,1.0000000005807743,3.4081499986804232E-5,1.0000000005807743,3.4081499986804232E-5,1.0378517597443058,0.36097611124103912,3.0082182571023259,-115.85819026071697,64.141809739283033,null,1000000000,1161548642.25,null,-1.8159211128242567,-17.274372918947016,null,4.8241393699265842,-98.585770067880929,null,0,0]
[34279,34.279000000000003,13.823199036163079,1.4983909241708002,1.0097521469272459,0.13909383358046359,1,0,17860.378814164782,1.57074033694099,7.0087078414861104,1.4276280851529453,1.012687881898936,0.1584624027369699,1.0000000005875249,3.4278999986573493E-5,1.0000000005875249,3.4278999986573493E-5,1.0382883884220819,0.36300490255920431,2.9533292038643428,-115.95762625731328,64.042373742686721,null,1000000000,1175049841,null,-1.8181913667194969,-17.278954932143296,null,4.7715205705838386,-98.680635367197382,null,0,0]
[34476.5,34.476500000000001,13.902426404075094,1.498804265625808,1.009864295072626,0.13988484466076098,1,0,17963.282189548288,1.5707406576810918,7.0482690785795326,1.4284371630563788,1.0128335776770192,0.15936005491718347,1.0000000005943144,3.4476499986340077E-5,1.0000000005943144,3.4476499986340077E-5,1.0387274654974108,0.36503265011637465,2.8987209164140673,-116.05725075216218,63.942749247837824,null,1000000000,1188629052.25,null,-1.8204510717006197,-17.284048241436189,null,4.7191719881146827,-98.775177868669843,null,0,0]
[34674,34.673999999999999,13.981656120313763,1.4992129225938837,1.009977074948053,0.14067567957805607,1,0,18066.185564933621,1.5707409747673799,7.0878348780128562,1.4292372085893272,1.0129800893404255,0.16025744815773957,1.0000000006011431,3.4673999986103978E-5,1.0000000006011431,3.4673999986103978E-5,1.039168989777693,0.36705934923859751,2.8443898516581134,-116.15705933939,63.842940660609997,null,1000000000,1202286276,null,-1.8227006098596235,-17.289644021939822,null,4.6670904615177315,-98.869401991310525,null,0,0]
[34875.75,34.875749999999996,14.062593163207744,1.4996256188644694,1.0100929337797353,0.14148334960471182,1,0,18171.303316753147,1.5707412949689965,7.1282567250418936,1.4300452996307238,1.0131305958281258,0.1611738836483925,1.0000000006081589,3.4875749985859997E-5,1.0000000006081589,3.4875749985859997E-5,1.0396225407323083,0.36912857351472877,2.7891722551432609,-116.25920129460761,63.740798705392393,null,1000000000,1216317938.0625,null,-1.8249884445405442,-17.295870047824224,null,4.614160699683806,-98.965329480067211,null,0,0]
[35077.5,35.077500000000001,14.143532573804878,1.5000335917173355,1.0102094513748323,0.14229083384463256,1,0,18276.421068574524,1.5707416114873018,7.1686831744060333,1.4308442770320808,1.0132819529444324,0.16209004612658662,1.0000000006152154,3.5077499985613184E-5,1.0000000006152154,3.5077499985613184E-5,1.040078642818463,0.3711966939533079,2.7342366697632654,-116.36152633709845,63.638473662901546,null,1000000000,1230431006.25,null,-1.8272664421595806,-17.302602393319631,null,4.5615031119228462,-99.060933736486149,null,0,0]
[35279.25,35.279249999999998,14.224474311687402,1.5004369216487039,1.0103266275054246,0.14309813130927065,1,0,18381.538820397702,1.5707419243854865,7.2091141486799257,1.4316342931011017,1.0134341603082191,0.16300593417702305,1.0000000006223126,3.5279249985363517E-5,1.0000000006223126,3.5279249985363517E-5,1.0405372947511611,0.37326370563796102,2.6795795210693067,-116.46403004984971,63.535969950150289,null,1000000000,1244625480.5625,null,-1.8295349763449056,-17.309832254367361,null,4.5091144974142132,-99.156219147613214,null,0,0]
[35481,35.481000000000002,{"$f":"SQRT(1+(A397/pole1)^2)","v":14.305418337351149},{"$f":"ATAN(A397/pole1)","v":1.5008356873390387},{"$f":"SQRT(1+(A397/Zero1)^2)","v":1.0104444619424111},{"$f":"ATAN(A397/Zero1)","v":0.14390524101150939},{"$f":"IF(VIN_nom>Vout, 1, SQRT(1+(A397/z_RHP)^2))","v":1},{"$f":"IF(VIN_nom>Vout, 0, -ATAN(A397/z_RHP))","v":0},{"$f":"SQRT(1+(A397/Pole2)^2)","v":18486.656572222666},{"$f":"ATAN(A397/Pole2)","v":1.5707422337253045},7.2495495721568615,1.4324154967927327,{"$f":"SQRT(1+(A397/pole4)^2)","v":1.0135872175364486},{"$f":"ATAN(A397/pole4)","v":0.16392154638709239},{"$f":"SQRT(1+(A397/Zero3)^2)","v":1.0000000006294507},{"$f":"ATAN(A397/Zero3)","v":3.5480999985110978E-5},{"$f":"SQRT(1+(A397/pole5)^2)","v":1.0000000006294507},{"$f":"ATAN(A397/pole5)","v":3.5480999985110978E-5},{"$f":"SQRT((1-(Z397/pterm2))^2+(A397/pterm1)^2)","v":1.0409984952408613},{"$f":"IF((ATAN((A397/pterm1)/(1-A397^2/pterm2))>0),ATAN((A397/pterm1)/(1-A397^2/pterm2)),PI()+ATAN((A397/pterm1)/(1-A397^2/pterm2)))","v":0.37532960367459622},{"$f":"20*LOG10(((E397*K397*G397*O397)/(C397*I397*S397*M397*Q397))*Adc)","v":2.6251972995425725},{"$f":"((F397+L397+H397+R397)-(D397+J397+T397+N397))*radconv","v":-116.56670810517869},{"$f":"IF(V397>0,V397,V397+180)","v":63.433291894821309},null,{"$f":"IF(U397<0,A397,1000000000)","v":1000000000},{"$f":"A397^2","v":1258901361},null,{"$f":"20*LOG10((K397/(I397*M397))*AEA*Afb)","v":-1.8317944101238628},-17.317551019079307,null,{"$f":"20*LOG10((E397*G397/(C397*S397))*Am)","v":4.4569917096664389},{"$f":"(F397+H397-(D397+T397))*radconv","v":-99.251189997653753},null,{"$f":"SUM((U398<0)*(U397>0))*A397","v":0},0]
[35687.75,{"$f":"A398/1000","v":35.687750000000001},14.388370743881399,1.5012396808276733,1.0105658994276503,0.14473215760137578,1,0,18594.379472793553,1.5707425471029233,7.2909916512295396,1.4332070708714775,1.0137449493207626,0.16485956269539176,1.0000000006368077,3.5687749984849173E-5,1.0000000006368077,3.5687749984849173E-5,1.0414737684582045,0.37744554068135899,2.5697489429002167,-116.67210728775154,63.327892712248456,null,1000000000,1273615500.0625,null,-1.8341007672349676,{"$f":"(L398-(J398+N398))*radconv","v":-17.325959495999822},null,4.4038497101351837,-99.348192549208491,null,0,0]
[35894.5,35.894500000000001,14.471325471825818,1.501639042715301,1.0106880277624719,0.14555887491247593,1,0,18702.102373366248,1.5707428568704724,7.3324382471187484,1.4339896966934784,1.0139035727955201,0.16579728632647095,1.0000000006442076,3.5894499984584326E-5,1.0000000006442076,3.5894499984584326E-5,1.0419517153638906,0.3795602978219102,2.5145820492495146,-116.77768063694663,63.222319363053373,null,1000000000,1288415130.25,null,-1.8363983065742864,-17.334863694255105,null,4.3509803558238014,-99.444873546050701,null,0,0]
[36101.25,36.10125,14.554282481490462,1.5020338520715166,1.0108108466964667,0.14638539188718852,1,0,18809.825273940714,1.570743163089976,7.3738892836611498,1.4347635241950474,1.0140630875422769,0.16673471576893473,1.0000000006516501,3.6101249984316415E-5,1.0000000006516501,3.6101249984316415E-5,1.0424323345555242,0.3816738699023296,2.4596930438223401,-116.88342377236482,63.116576227635178,null,1000000000,1303300251.5625,null,-1.8386873864348727,-17.344254940084415,null,4.2983804302572128,-99.54123728154201,null,0,0]
[36308,36.308,14.637241734080179,1.5024241861791015,1.0109343559779307,0.14721170746949955,1,0,18917.548174516927,1.5707434658220454,7.4153446863883214,1.4355287000023165,1.0142234931405014,0.16767184951440425,1.0000000006591354,3.6307999984045408E-5,1.0000000006591354,3.6307999984045408E-5,1.0429156246258822,0.38378625175347381,2.4050784168457202,-116.98933240230889,63.010667597691111,null,1000000000,1318270864,null,-1.8409683548919256,-17.354124749478252,null,4.2460467717376469,-99.63728794799465,null,0,0]
[36519.5,36.519500000000001,14.722109224174883,1.5028189361620212,1.0110614168931618,0.14805679784230416,1,0,19027.745966401981,1.5707437719624837,7.4577569525895671,1.4363026527951455,1.0143885053406787,0.16863020600454309,1.0000000006668368,3.6519499983764969E-5,1.0000000006668368,3.6519499983764969E-5,1.043412780250623,0.38594592782296477,2.3494893538042843,-117.09784109872555,62.902158901274447,null,1000000000,1333673880.25,null,-1.8432936871857473,-17.364707843627858,null,4.1927830409900348,-99.735225668319117,null,0,0]
[36731,36.731000000000002,14.806978982081793,1.5032091609964111,1.0111891997041824,0.14890167523218639,1,0,19137.943758288799,1.5707440745773604,7.5001736354847051,1.4370678519753057,1.0145544488995404,0.16958824987104995,1.0000000006745831,3.6730999983481256E-5,1.0000000006745831,3.6730999983481256E-5,1.0439127278942948,0.38810434748136868,2.2941801929491232,-117.20651417024693,62.793485829753067,null,1000000000,1349166361,null,-1.8456112366586861,-17.375774368824942,null,4.139791429607814,-99.832844332700731,null,0,0]
[36942.5,36.942500000000003,14.891850969027617,1.5035949379318989,1.0113177041373524,0.14974633851393171,1,0,19248.141550177348,1.5707443737272282,7.542594660560316,1.4378244443351389,1.0147213233601546,0.17054597950905642,1.0000000006823742,3.6942499983194264E-5,1.0000000006823742,3.6942499983194264E-5,1.0444154660350664,0.39026150527581471,2.2391473781645042,-117.31534729592966,62.684652704070345,null,1000000000,1364748306.25,null,-1.8479213448985898,-17.387315826005079,null,4.087068723063096,-99.930148119260693,null,0,0]
[37154,37.154000000000003,14.976725147116968,1.5039763424723598,1.0114469299176252,0.15059078656411795,1,0,19358.339342067604,1.5707446694712608,7.5850199549623758,1.4385725734226928,1.0148891282633272,0.17150339331705255,1.0000000006902099,3.7153999982903958E-5,1.0000000006902099,3.7153999982903958E-5,1.0449209931460308,0.39241739578077095,2.1843874179440768,-117.42433624226777,62.575663757732229,null,1000000000,1380419716,null,-1.8502243437155315,-17.399323902101585,null,4.0346117616596082,-100.02714110755966,null,0,0]
[37370.25,37.370249999999999,15.063507709800268,1.5043618689148142,1.0115798034734771,0.1514539760547304,1,0,19471.012025266817,1.5707449683961066,7.6284024033324176,1.4393289001727492,1.0150616633757483,0.17248198111235657,1.0000000006982677,3.7370249982603705E-5,1.0000000006982677,3.7370249982603705E-5,1.0454407557351633,0.39462038870595006,2.1286761684149349,-117.53592971937904,62.464070280620959,null,1000000000,1396535585.0625,null,-1.8525720497481495,-17.412075649091076,null,3.9812482181630844,-100.12599522789374,null,0,0]
[37586.5,37.586500000000001,15.150292485732811,1.5047429786239348,1.0117134305551831,0.15231693816810365,1,0,19583.68470846775,1.5707452638812867,{"$f":"SQRT(1+(A407/Zero2)^2)","v":7.6717891660257571},{"$f":"ATAN(A407/Zero2)","v":1.4400766727399037},1.0152351702148672,0.17346023535682584,1.0000000007063725,3.7586499982299949E-5,1.0000000007063725,3.7586499982299949E-5,1.0459634307297199,0.39682204539561089,2.0732429849220479,-117.64767741385579,62.352322586144211,null,1000000000,1412744982.25,null,-1.854912995084165,-17.425298206525142,null,3.9281559800062116,-100.22453275514874,null,0,0]
[37802.75,37.802750000000003,15.237079437097048,1.5051197469581925,1.0118478108642066,0.15317967170927543,1,0,19696.357391670372,1.5707455559858305,7.7151801702568523,1.440816034609705,1.0154096482825561,0.17443815434958543,1.000000000714524,3.7802749981992689E-5,1.000000000714524,3.7802749981992689E-5,1.0464890164814715,0.39902236013936454,2.0180843350311344,-117.75957506951826,62.240424930481737,null,1000000000,1429047907.5625,null,-1.8572475047513028,-17.438983259216617,null,3.8753318397824366,-100.32275774833209,null,0,0]
[38019,38.018999999999998,15.323868526931209,1.5054922475738364,1.0119829441004859,0.15404217548527741,1,0,19809.030074874656,1.570745844767425,7.7585753448613826,1.4415471260947899,1.0155850970782423,0.17541573639349078,1.0000000007227221,3.8018999981681886E-5,1.0000000007227221,3.8018999981681886E-5,1.0470175113368752,0.40122132725690635,1.9631967504180992,-117.8716185161974,62.128381483802599,null,1000000000,1445444361,null,-1.8595758944395335,-17.453122673909569,null,3.8227726448576327,-100.42067417053057,null,0,0]
[38240.5,38.240499999999997,15.412766814351977,1.5058694424055019,1.0121221382807382,0.1549253792145916,1,0,19924.438164262472,1.5707461371738807,7.8030282946911429,1.4422875360201399,1.0157658111630257,0.17641670055479405,1.0000000007311678,3.8240499981359848E-5,1.0000000007311678,3.8240499981359848E-5,1.0475618508689881,0.40347227669974783,1.9072540922246111,-117.98652896576456,62.013471034235437,null,1000000000,1462335840.25,null,-1.8619547872944842,-17.468068085636837,null,3.7692088795190966,-100.52065189938564,null,0,{"$f":"IF(AH410>0,W410,0)","v":0}]
[38462,38.462000000000003,15.501667269487367,1.5062423109431806,1.0122621217481917,0.15580833935995814,1,0,20039.846253651973,1.5707464262124391,7.8474854737304538,1.4430195572770526,1.0159475426106335,0.17741730761585914,1.0000000007396628,3.8461999981034064E-5,1.0000000007396628,3.8461999981034064E-5,1.048109238942077,0.40572180032156835,1.8515886543683511,-118.10158378174521,61.898416218254795,null,1000000000,1479325444,null,-1.8643279011510825,-17.48347347935902,null,3.7159165555194322,-100.62031401265925,null,0,0]
[38683.5,38.683500000000002,15.590569855255183,1.5066109270921724,1.0124028941754462,0.15669105464595945,1,0,20155.254343043129,1.5707467119409537,7.8919468105069415,1.443743330853551,1.0161302908752097,0.17841755576517981,1.0000000007482066,3.8683499980704505E-5,1.0000000007482066,3.8683499980704505E-5,1.0486596737622689,0.40796989211670143,1.7961969090867198,-118.21677874908221,61.783221250917791,null,1000000000,1496413172.25,null,-1.8666955467681552,-17.499330676580513,null,3.6628924558548719,-100.71966447378992,null,0,0]
[38905,38.905000000000001,15.679474535413386,1.5069753630862488,1.0125444552334377,0.15757352379941164,1,0,20270.662432435907,1.5707469944159604,7.93641223514323,1.4444589946130064,1.0163140554082384,0.1794174431954218,1.0000000007567995,3.8904999980371144E-5,1.0000000007567995,3.8904999980371144E-5,1.0492131535301052,0.41021654611279751,1.7410753926952858,-118.33210973792079,61.667890262079212,null,1000000000,1513599025,null,-1.8690580259240348,-17.515631677998627,null,3.6101334186193186,-100.81870715222556,null,0,0]
[39131.5,39.131500000000003,15.770388222162644,1.5073437764243787,1.012690026990787,0.15847565739628924,1,0,20388.675670575096,1.5707472799604403,7.9818855501062398,1.4451825672840291,1.0165030184888526,0.18043952654440482,1.0000000007656371,3.9131499980026316E-5,1.0000000007656371,3.9131499980026316E-5,1.0497822741427583,0.41251242160914497,1.6849855027220388,-118.45018058100329,61.549819418996705,null,1000000000,1531274292.25,null,-1.8714687967913901,-17.532751440498458,null,3.5564542995134278,-100.91967121030224,null,0,0]
[39358,39.357999999999997,15.861304024863426,1.5077079663763322,1.0128364226835755,0.15937753093763218,1,0,20506.688908715932,1.5707475622183797,8.0273629966972848,1.4458979418086884,1.0166930430684138,0.1814612288962773,1.000000000774526,3.9357999979677469E-5,1.000000000774526,3.9357999979677469E-5,1.0503545749007566,0.41480678113769509,1.6291710524576,-118.56838518476577,61.431614815234227,null,1000000000,1549052164,null,-1.8738747760777585,-17.550318904353933,null,3.5030458285353596,-101.02032132770334,null,0,0]
[39584.5,39.584499999999998,15.952221907337677,1.5080680050567994,1.0129836419545797,0.16027914306938473,1,0,20624.702146858384,1.5707478412461953,8.0728445050912043,1.4466052560108604,1.0168841285518373,0.18248254833216934,1.0000000007834662,3.9584499979324583E-5,1.0000000007834662,3.9584499979324583E-5,1.0509300538623294,0.41709961842083054,1.5736285364249629,-118.68671939553923,61.313280604460772,null,1000000000,1566932640.25,null,-1.8762762592270446,-17.56832606612787,null,3.4499047956520092,-101.12066135419693,null,0,0]
[39811,39.811,16.043141834226628,1.5084239629500744,1.0131316844447742,0.16118049243997587,1,0,20742.715385002422,1.570748117099019,8.1183300070214006,1.4473046446582909,1.0170762743411639,0.18350348293784441,1.0000000007924579,3.9810999978967646E-5,1.0000000007924579,3.9810999978967646E-5,1.0515087090798942,0.41939092721755827,1.5183545127769404,-118.80517914349112,61.194820856508883,null,1000000000,1584915721,null,-1.8786735331041968,-17.586765097678413,null,3.3970280458811382,-101.22069504809231,null,0,0]
[40042.75,40.042749999999998,16.136171256638836,1.5087840196132205,1.0132840100692462,0.16210246063992259,1,0,20863.464029330225,1.5707483961157449,8.1648738725076715,1.4480121785092239,1.017273970669814,0.18454768128548513,1.0000000008017109,4.0042749978598193E-5,1.0000000008017109,4.0042749978598193E-5,1.0521040623401685,0.42173375730999196,1.4620736778607288,-118.92651042348126,61.073489576518739,null,1000000000,1603421827.5625,null,-1.881122306689496,-17.606070538954533,null,3.343195984550225,-101.32273416510321,null,0,0]
[40274.5,40.274500000000003,16.229202746974504,1.509139948379558,1.0134371967514759,0.16302415090186573,1,0,20984.212673659629,1.5707486719214006,8.2114217790265602,1.4487116911437932,1.0174727757515927,0.18559147271681528,1.0000000008110177,4.0274499978224445E-5,1.0000000008110177,4.0274499978224445E-5,1.0527027366631596,0.42407497413666767,1.4060668337594482,-119.04796476703775,60.952035232962245,null,1000000000,1622035350.25,null,-1.8835672549140845,-17.625812063507368,null,3.2896340886735325,-101.42446026240377,null,0,0]
[40506.25,40.506250000000001,16.322236269874132,1.5094918197427138,1.0135912441010622,0.1639455617862027,1,0,21104.961317990612,1.5707489445711007,8.2579736582435253,1.449403317523267,1.0176726889367067,0.18663485519655809,1.000000000820378,4.0506249977846374E-5,1.000000000820378,4.0506249977846374E-5,1.0533047299442921,0.42641457113181658,1.3503304908460223,-119.16953807327424,60.830461926725761,null,1000000000,1640756289.0625,null,-1.8860086589842822,-17.645981825170903,null,3.2363391498303047,-101.52587708527359,null,0,0]
[40738,40.738,16.415271790779062,1.5098397026022632,1.0137461517256476,0.16486669185610106,1,0,21225.709962323148,1.570749214118706,8.304529443350491,1.4500871896130714,1.0178737095722523,0.18767782669459285,1.0000000008297922,4.0737999977463952E-5,1.0000000008297922,4.0737999977463952E-5,1.0539100400729529,0.42875254176999289,1.2948612228393841,-119.29122632399613,60.708773676003872,null,1000000000,1659584644,null,-1.8884467918915231,-17.666572149651849,null,3.1833080147309074,-101.62698828981149,null,0,0]
[40975.25,40.975250000000003,16.510517308853792,1.5101917802784142,1.0139056264210808,0.16580939023066754,1,0,21349.324270276808,1.5707494869048979,8.3521940900869698,1.4507793938830342,1.0180806474252397,0.18874512264073839,1.0000000008394856,4.0975249977067908E-5,1.0000000008394856,4.0975249977067908E-5,1.0545331493534731,0.43114430674513826,1.2383486773702537,-119.41591749553902,60.58408250446098,null,1000000000,1678971112.5625,null,-1.8909396758649484,-17.688078949149684,null,3.1292883532352023,-101.73018625528019,null,0,0]
[41212.5,41.212499999999999,16.605764850072894,1.5105398190947492,1.0140660018705285,0.16675179126531692,1,0,21472.938578232031,1.5707497565503667,8.3998626933314924,1.4514637420611209,1.0182887445227742,0.18981198357737347,1.0000000008492351,4.1212499976667263E-5,1.0000000008492351,4.1212499976667263E-5,1.0551597302881539,0.43353435354199554,1.1821089640034272,-119.54072086616723,60.459279133832766,null,1000000000,1698470156.25,null,-1.8934296853481991,-17.710010765396802,null,3.0755386493516252,-101.83307140308499,null,0,0]
[41449.75,41.449750000000002,16.701014379821789,1.5108838880697193,1.0142272776466936,0.16769389342756935,1,0,21596.552886188801,1.5707500231090432,8.4475351861055135,1.452140366505132,1.0184980001542929,0.19087840734330011,1.0000000008590408,4.1449749976261984E-5,1.0000000008590408,4.1449749976261984E-5,1.0557897805934009,0.43592267529099593,1.1261386033303076,-119.66563238027331,60.334367619726692,null,1000000000,1718081775.0625,null,-1.8959170882214549,-17.732359894112314,null,3.0220556915517589,-101.93564738189919,null,0,0]
[41687,41.686999999999998,16.79626586427036,1.5112240546599713,1.0143894533201523,0.16863569518803903,1,0,21720.167194147085,1.5707502866336303,8.4952115029285302,1.4528093966302802,1.0187084136058637,0.19194439178306863,1.0000000008689029,4.1686999975852028E-5,1.0000000008689029,4.1686999975852028E-5,1.0564232979793593,0.43830926516702517,1.07043417915011,-119.79064806399136,60.209351936008645,null,1000000000,1737805969,null,-1.8984021444820296,-17.755118799872207,null,2.968836323632142,-102.03791775328108,null,0,0]
[41929.75,41.929749999999999,16.893727485645964,1.5115681367282909,1.014556319579768,0.16959901755632051,1,0,21846.647165726605,1.5707505531806316,8.5439969575763453,1.4534862079539856,1.0189249025689713,0.19303463122762038,1.0000000008790519,4.1929749975427719E-5,1.0000000008790519,4.1929749975427719E-5,1.057075087933423,0.44074938204501962,1.0137101554373826,-119.91866565699742,60.081334343002581,null,1000000000,1758103935.0625,null,-1.9009426444052697,-17.778821758374029,null,2.9146527998426519,-102.14224629633577,null,0,0]
[42172.5,42.172499999999999,16.991191084166481,1.511908271440884,1.0147241270273286,0.17056202220399266,1,0,21973.127137307656,1.5707508166590796,8.5927862815614091,1.4541553337932818,1.0191426021333052,0.19412440619384941,1.0000000008892598,4.2172499974998464E-5,1.0000000008892598,4.2172499974998464E-5,1.0577305027115156,0.44318767150828042,0.95725750165499313,-120.04678414143596,59.953215858564036,null,1000000000,1778519756.25,null,-1.9034812141910171,-17.802938274233767,null,2.8607387158460087,-102.24626217346507,null,0,0]
[42415.25,42.41525,17.088656626002511,1.5122445262598672,1.0148928751959725,0.17152470750296248,1,0,22099.607108890214,1.5707510771216597,8.6415794093462779,1.4548169037279883,1.0193615115232404,0.19521371439172272,1.0000000008995267,4.2415249974564228E-5,1.0000000008995267,4.2415249974564228E-5,1.0583895398410725,0.44562412639067223,0.90107275432836786,-120.17499951272782,59.825000487272177,null,1000000000,1799053432.5625,null,-1.9060181083851999,-17.827460794884065,null,2.807090862713566,-102.34996893265708,null,0,0]
[42658,42.658000000000001,17.186124078091403,1.5125769671205245,1.0150625636165316,0.17248707182858414,1,0,22226.087080474252,1.5707513346198585,8.6903762768603237,1.4554710444543357,1.01958162995951,0.19630255353759946,1.0000000009098524,4.2657999974125004E-5,1.0000000009098524,4.2657999974125004E-5,1.0590521968430833,0.44805873957492187,0.84515251292475702,-120.30330784692974,59.696692153070259,null,1000000000,1819704964,null,-1.9085535739860293,-17.852381933272603,null,2.7537060869107854,-102.45337003702093,null,0,0]
[42906.5,42.906500000000001,17.285902178914938,1.5129133992193768,1.0152372448642284,0.17347189744149594,1,0,22355.562973116896,1.5707515951993856,8.7403328001663514,1.4561331138300968,1.0198082138497568,0.19741669570344195,1.0000000009204839,4.290649997367017E-5,1.0000000009204839,4.290649997367017E-5,1.0597342970576347,0.45054910621854938,0.7881781857327208,-120.43474768839097,59.565252311609029,null,1000000000,1840967742.25,null,-1.9111478674077143,-17.878298726313716,null,2.6993260531404371,-102.55890732344227,null,0,0]
[43155,43.155000000000001,17.385682213812647,1.5132459696483731,1.0154129104323963,0.17445638326098414,1,0,22485.038865761031,1.5707518527779158,8.7902931111261324,1.4567876576450196,1.0200360630776446,0.19853034151104168,1.0000000009311769,4.3154999973210038E-5,1.0000000009311769,4.3154999973210038E-5,1.0604201853854438,0.45303752794583468,0.73147402775572135,-120.5662768773965,59.433723122603496,null,1000000000,1862354025,null,-1.9137411644004032,-17.904618091052903,null,2.6452151921561207,-102.66413138570979,null,0,0]
[43403.5,43.403500000000001,17.485464149674407,1.5135747444439183,1.0155895598102642,0.17544052755551579,1,0,22614.514758406644,1.5707521074069943,8.8402571455224024,1.4574348029340491,1.020265176795434,0.19964348853157066,1.0000000009419319,4.3403499972744572E-5,1.0000000009419319,4.3403499972744572E-5,1.0611098591468302,0.45552399728095833,0.67503658643492404,-120.69789145365571,59.302108546344286,null,1000000000,1883863812.25,null,-1.916333706956481,-17.931332612715664,null,2.5913702933914062,-102.76904567830744,null,0,0]
[43652,43.652000000000001,17.585247954140961,1.5138997881469041,1.0157671924845568,0.17642432859740509,1,0,22743.990651053711,1.5707523591369923,8.8902248405768098,1.4580746739012282,1.0204955541514451,0.20075613434332043,1.0000000009527485,4.3651999972273747E-5,1.0000000009527485,4.3651999972273747E-5,1.0618033156554987,0.45800850680186572,0.61886247201933131,-120.82958753659101,59.170412463408994,null,1000000000,1905497104,null,-1.9189257298274116,-17.958435039066952,null,2.537788201846745,-102.87365357289259,null,0,0]
[43906,43.905999999999999,17.687242151448004,1.5142282357705759,1.0159497723116766,0.17742954738080499,1,0,22876.332207322197,1.5707526134936884,8.9413021796648096,1.4587213158208334,1.0207323354113884,0.2018928856337566,1.0000000009638683,4.3905999971786935E-5,1.0000000009638683,4.3905999971786935E-5,1.0625160267506888,0.46054597243804474,0.5617137362174891,-120.96427869609444,59.035721303905561,null,1000000000,1927736836,null,-1.9215748214127983,-17.986530811112658,null,2.4832885576302903,-102.98026351347835,null,0,0]
[44160,44.16,17.789238234936782,1.5145529170651637,1.0161333783507629,0.17843440391152951,1,0,23008.673763592153,1.5707528649243607,8.9923832150467078,1.4593606115347839,1.020970435052434,0.2030291081902639,1.0000000009750527,4.4159999971294444E-5,1.0000000009750527,4.4159999971294444E-5,1.0632326841959365,0.46308137503946478,0.50483314577218097,-121.09904705791003,58.900952942089972,null,1000000000,1950105600,null,-1.9242238438741239,-18.015017027866847,null,2.4290569896463046,-103.08656021166773,null,0,0]
[44414,44.414000000000001,17.89123617234851,1.5148738963771469,1.0163180100456357,0.1794388963571816,1,0,23141.015319863545,1.5707531134792105,9.0434678840881695,1.4599926850076059,1.0212098521524227,0.20416479944997221,1.0000000009863017,4.4413999970796261E-5,1.0000000009863017,4.4413999970796261E-5,1.0639532851019442,0.46561470685452622,0.44821727478955692,-121.23388872306455,58.766111276935447,null,1000000000,1972603396,null,-1.9268730259714379,-18.043886442720009,null,2.3750903007609971,-103.19254701509708,null,0,0]
[44668,44.667999999999999,17.993235932155287,1.5151912365970315,1.0165036668374128,0.18044302288963071,1,0,23273.356876136349,1.5707533592072973,9.0945561255577445,1.4606176574417471,1.0214505857849592,0.20529995685788957,1.0000000009976151,4.4667999970292352E-5,1.0000000009976151,4.4667999970292352E-5,1.0646778265727106,0.46814596019037441,0.39186275967967754,-121.36879987092662,58.631200129073378,null,1000000000,1995230224,null,-1.9295225895599137,-18.073131967704068,null,2.3213853492395922,-103.29822719110304,null,0,0]
[44928.25,44.928249999999998,18.09774738655975,1.5155126751518242,1.0166949546114898,0.18147147582314707,1,0,23408.954868342509,1.5707536081000242,9.146905102353081,1.4612507667689425,1.0216986075316996,0.20646248990756996,1.0000000010092738,4.4928249969770063E-5,1.0000000010092738,4.4928249969770063E-5,1.0654242804941558,0.47073733449647087,0.33438919663659628,-121.50709883615538,58.492901163844621,null,1000000000,2018547648.0625,null,-1.9322379697649761,-18.103479973114048,null,2.2666271664015709,-103.40619306214846,null,0,0]
[45188.5,45.188499999999998,18.202260689400209,1.5158304224828012,1.0168873173542716,0.18249954074254249,1,0,23544.552860550095,1.5707538541259007,9.1992577037509555,1.4618766703457866,1.021948009415514,0.20762445710491229,1.0000000010210002,4.5188499969241689E-5,1.0000000010210002,4.5188499969241689E-5,1.066174865115308,0.47332651061572212,0.27718305475384331,-121.64546286845521,58.354537131544788,null,1000000000,2042000532.25,null,-1.934954200766221,-18.134208252398594,null,2.2121372555200649,-103.51384372639033,null,0,0]
[45448.75,45.448749999999997,18.306775809018532,1.5161445417458852,1.0170807544558247,0.18352721569543445,1,0,23680.150852759092,1.5707540973341758,9.251613868219172,1.4624954900126848,1.0221987904262009,0.20878585572754788,1.0000000010327943,4.5448749968707189E-5,1.0000000010327943,4.5448749968707189E-5,1.0669295773000389,0.47591348046523152,0.22024091002770155,-121.7838881010418,58.216111898958204,null,1000000000,2065588876.5625,null,-1.9376715001154432,-18.165309671458203,null,2.1579124101431422,-103.62118245114394,null,0,0]
[45709,45.709000000000003,18.411292714474886,1.5164550946658115,1.0172752653032737,0.18455449873421614,1,0,23815.748844969476,1.5707543377729765,9.3039735356064348,1.4631073448893164,1.0224509495489671,0.20994668306190706,1.0000000010446564,4.5708999968166536E-5,1.0000000010446564,4.5708999968166536E-5,1.0676884139054097,0.47849823602684938,0.16355940086528814,-121.92237074489202,58.077629255107979,null,1000000000,2089312681,null,-1.9403900787159793,-18.196777252519379,null,2.1039494795812699,-103.7282124251596,null,0,0]
[45975.25,45.975250000000003,18.51822104812311,1.5167691795925033,1.0174753710721613,0.18560505793438803,1,0,23954.473015676031,1.5707545809380943,9.3575439059698731,1.4637262198755099,1.0227103472118992,0.21113367896918434,1.0000000010568617,4.597524996760701E-5,1.0000000010568617,4.597524996760701E-5,1.0684690101663963,0.4811402827501931,0.10583738999672379,-122.06410161235246,57.935898387647541,null,1000000000,2113723612.5625,null,-1.9431728704999522,-18.229342115922758,null,2.0490102604966793,-103.83739368421794,null,0,0]
[46241.5,46.241500000000002,18.625151187605837,1.5170796581202806,1.0176765993604668,0.18665520283266734,1,0,24093.197186383983,1.5707548213030122,9.4111178195283287,1.4643380490540931,1.0229711851001109,0.21232007122528468,1.0000000010691381,4.6241499967040966E-5,1.0000000010691381,4.6241499967040966E-5,1.0692539165391584,0.48377999513868847,4.8381246854469345E-2,-122.205884786526,57.794115213474001,null,1000000000,2138276322.25,null,-1.9459574274031568,-18.262275927261499,null,1.9943386742576275,-103.94625830205398,null,46241.5,57.794115213474001]
[46507.75,46.507750000000001,18.732083101997816,1.517386591950046,1.0178789495024454,0.18770493135924987,1,0,24231.921357093317,1.570755058915823,9.4646952161141549,1.4649429516170154,1.0232334621121952,0.21350585695337293,1.0000000010814853,4.6507749966468363E-5,1.0000000010814853,4.6507749966468363E-5,1.0700431296371491,0.48641736481703785,-8.8124347083242197E-3,-122.34771645006509,57.652283549934907,null,46507.75,2162970810.0625,null,-1.9487439550593044,-18.295571695264982,null,1.9399315203509793,-104.05480945259089,null,0,0]
[46774,46.774000000000001,18.839016761075417,1.5176900413845065,1.0180824208291708,0.1887542414496429,1,0,24370.645527803998,1.5707552938235239,9.5182760369105388,1.4655410440929162,1.0234971771418013,0.21469103328637715,1.0000000010939034,4.6773999965889173E-5,1.0000000010939034,4.6773999965889173E-5,1.0708366460670034,0.48905238348080143,-6.5746998695128817E-2,-122.48959286236013,57.510407137639874,null,46774,2187807076,null,-1.9515326527394898,-18.329222581755552,null,1.8857856540443607,-104.16305023339665,null,0,0]
[47046.25,47.046250000000001,18.948361966082459,1.517996787454998,1.0182916360936445,0.18982676313259525,1,0,24512.495877010948,1.5707555312755299,9.5730677937503827,1.4661456913823538,1.0237683208792361,0.21590228469262032,1.0000000011066748,4.7046249965290067E-5,1.0000000011066748,4.7046249965290067E-5,1.0716524909042788,0.4917443431868217,-0.12370007312884232,-122.63470894360219,57.365291056397808,null,47046.25,2213349639.0625,null,-1.9543866394001264,-18.363992042521286,null,1.8306865662712866,-104.27341245264893,null,0,0]
[47318.5,47.3185,19.057708933541299,1.5183000135343483,1.01850202221979,0.19089884295902476,1,0,24654.346226219262,1.5707557659951457,9.6278630106516871,1.4667434564099133,1.0240409658211762,0.21711289289693461,1.0000000011195203,4.7318499964683989E-5,1.0000000011195203,4.7318499964683989E-5,1.0724728280146487,0.49443382738816016,-0.1813890988630372,-122.77986414000029,57.220135859999715,null,47318.5,2239040442.25,null,-1.9572432969298135,-18.399118818536209,null,1.7758541980667777,-104.38345647180802,null,0,0]
[47590.75,47.59075,19.167057633287872,1.5185997798113124,1.0187135784821835,0.19197047873905551,1,0,24796.196575428919,1.570755998029264,9.6826616288718803,1.467334455594355,1.0243151107688822,0.21832285486588385,1.0000000011324397,4.7590749964070897E-5,1.0000000011324397,4.7590749964070897E-5,1.0732976537490666,0.49712082743582803,-0.23881745891594147,-122.9250546886161,57.0749453113839,null,47590.75,2264879485.5625,null,-1.9601028190835665,-18.434596068380376,null,1.7212853601676228,-104.49318536935566,null,0,0]
[47863,47.863,19.276408035842096,1.5188961451114202,1.0189263041519701,0.19304166828870489,1,0,24938.046924639893,1.5707562274237112,9.737463590987101,1.4679188027527941,1.0245907545183051,0.21953216757683819,1.0000000011454333,4.7862999963450744E-5,1.0000000011454333,4.7862999963450744E-5,1.0741269644517419,0.49980533475814271,-0.29598847454572014,-123.07027690211747,56.92972309788253,null,47863,2290866769,null,-1.9629653935390277,-18.470417100255172,null,1.6669769189933104,-104.60260214975816,null,0,0]
[48141.75,48.141750000000002,19.388370925994952,1.5191961224651929,1.0191453195270654,0.19413796799892988,1,0,25083.2839672218,1.5707564596067896,9.7935773622165669,1.4685103253249083,1.0248745309358798,0.22076967692759658,1.0000000011588139,4.814174996280844E-5,1.0000000011588139,4.814174996280844E-5,1.074980718083058,0.50255134342333685,-0.35426122595504772,-123.21899534710225,56.781004652897749,null,48141.75,2317628093.0625,null,-1.9658996645982216,-18.507442719445503,null,1.6116384386431708,-104.71431094675116,null,0,0]
[48420.5,48.420499999999997,19.500335540803086,1.519492655099657,1.0193655592582569,0.19523379530214235,1,0,25228.521009805052,1.5707566891165772,9.849694521163233,1.4690951078772221,1.0251598760061087,0.22200649926988089,1.0000000011722723,4.8420499962158656E-5,1.0000000011722723,4.8420499962158656E-5,1.0758391656201534,0.50529472097587058,-0.41227105243512552,-123.36773939832035,56.632260601679647,null,48420.5,2344544820.25,null,-1.9688375149749766,-18.544814997470304,null,1.5565664625398543,-104.82569869114295,null,0,0]
[48699.25,48.699249999999999,19.612301850728858,1.5197858019597505,1.0195870225521293,0.19632914787350977,1,0,25373.75805238961,1.5707569159989794,9.9058150102521072,1.4696732645612383,1.0254467884194927,0.22324263139477912,1.0000000011858083,4.8699249961501343E-5,1.0000000011858083,4.8699249961501343E-5,1.0767023031182881,0.50803545846687292,-0.47002132696040155,-123.51650533191211,56.483494668087886,null,48699.25,2371616950.5625,null,-1.9717791275985386,-18.582527212703283,null,1.5017578006381382,-104.9367683807003,null,0,0]
[48978,48.978000000000002,19.72426982690488,1.5200756206543269,1.0198097086115514,0.19742402339477017,1,0,25518.995094975468,1.5707571402988558,9.9619387732022187,1.470244906973972,1.0257352668608082,0.22447807010539705,1.0000000011994221,4.897799996083646E-5,1.0000000011994221,4.897799996083646E-5,1.0775701266261011,0.51077354703216371,-0.52751536079835926,-123.66528949893211,56.334710501067889,null,48978,2398844484,null,-1.9747246795623596,-18.620572790508195,null,1.4472093187639976,-105.04752294111383,null,0,0]
[49263.25,49.263249999999999,19.838850411080692,1.5203688107121538,1.0200388523822206,0.19854393336809786,1,0,25667.618830932348,1.5707573672012218,10.01937458356616,1.4708232490919335,1.0260320920050849,0.22574159607290284,1.0000000012134338,4.9263249960148207E-5,1.0000000012134338,4.9263249960148207E-5,1.0784630334369185,0.51357273194449427,-0.58608818106362193,-123.81755821835799,56.182441781642012,null,49263.25,2426867800.5625,null,-1.9777431740831446,-18.65984393387042,null,1.3916549930195239,-105.16053686079862,null,0,0]
[49548.5,49.548499999999997,19.953432681026467,1.5206586335161647,1.0202692749083444,0.19966333889313248,1,0,25816.242566890538,1.5707575914910406,10.076813707002707,1.4713949981516401,1.0263305542584005,0.22700438917565874,1.000000001227527,4.9548499959451925E-5,1.000000001227527,4.9548499959451925E-5,1.0793608389533376,0.5163691244434272,-0.64439949521410611,-123.96983853227461,56.030161467725392,null,49548.5,2455053852.25,null,-1.9807661511342931,-18.699450691900065,null,1.3363666559201868,-105.27322676030666,null,0,0]
[49833.75,49.833750000000002,20.068016607866504,1.5209451466960675,1.0205009753237184,0.20078223750714752,1,0,25964.866302850009,1.570757813213175,10.134256087178178,1.4719602658871982,1.0266306521929334,0.22826644602718676,1.0000000012417012,4.9833749958747578E-5,1.0000000012417012,4.9833749958747578E-5,1.0802635389208499,0.51916271530499436,-0.70245266023259756,-124.12212676187711,55.877873238122888,null,49833.75,2483402639.0625,null,-1.9837937827442813,-18.739386471243954,null,1.2813411225116822,-105.38559555418637,null,0,0]
[50119,50.119,20.182602163380437,1.5212284065750152,1.0207339527581236,0.20190062675472334,1,0,26113.490038810742,1.5707580324114665,10.191701669025759,1.4725191615303379,1.0269323843747105,0.22952776325433819,1.0000000012559571,5.011899995803512E-5,1.0000000012559571,5.011899995803512E-5,1.0811711290785617,0.52195349539769931,-0.76025097157928445,-124.27441930246108,55.725580697538916,null,50119,2511914161,null,-1.9868262353498003,-18.779644822629699,null,1.2265752637705125,-105.49764608700569,null,0,0]
[50410.75,50.41075,20.2998004392811,1.5215148131344662,1.0209735591446254,0.20304397130973309,1,0,26265.500468142593,1.5707582540385272,10.250459520841368,1.4730843124982917,1.0272426811663919,0.23081705355464671,1.0000000012706218,5.0410749957297998E-5,1.0000000012706218,5.0410749957297998E-5,1.0821044546810363,0.5248049520839535,-0.81910607572137373,-124.43018291555082,55.569817084449184,null,50410.75,2541243715.5625,null,-1.9899329433816249,-18.821147648495675,null,1.1708268676602549,-105.61192359027309,null,0,0]
[50702.5,50.702500000000001,20.417000361231395,1.5217979315917471,1.0212144995579922,0.20418677784769884,1,0,26417.510897475717,1.5707584731150355,10.309220609288147,1.4736430210830327,1.0275546844792935,0.23210556304402125,1.0000000012853716,5.070249995655229E-5,1.0000000012853716,5.070249995655229E-5,1.083042886843089,0.52765344941685344,-0.8777013615666408,-124.58594363997334,55.414056360026663,null,50702.5,2570743506.25,null,-1.9930450296899525,-18.86297471242311,null,1.1153436681233111,-105.72587396681179,null,0,0]
[50994.25,50.994250000000001,20.534201901046607,1.5220778182028476,1.0214567730542161,0.20532904376537611,1,0,26569.521326810096,1.5707586896847683,10.367984879334774,1.4741953964763004,1.0278683927594026,0.23339328815693608,1.0000000013002066,5.0994249955797949E-5,1.0000000013002066,5.0994249955797949E-5,1.0839864209865646,0.53049897792573941,-0.93604016457191963,-124.74169784747825,55.25830215252175,null,50994.25,2600413533.0625,null,-1.9961626553777825,-18.905119556404841,null,1.0601224908058622,-105.83950004637869,null,0,0]
[51286,51.286000000000001,{"$f":"SQRT(1+(A461/pole1)^2)","v":20.651405031181454},{"$f":"ATAN(A461/pole1)","v":1.5223545279487283},{"$f":"SQRT(1+(A461/Zero1)^2)","v":1.021700378684965},{"$f":"ATAN(A461/Zero1)","v":0.20647076646762577},{"$f":"IF(VIN_nom>Vout, 1, SQRT(1+(A461/z_RHP)^2))","v":1},{"$f":"IF(VIN_nom>Vout, 0, -ATAN(A461/z_RHP))","v":0},{"$f":"SQRT(1+(A461/Pole2)^2)","v":26721.531756145709},{"$f":"ATAN(A461/Pole2)","v":1.5707589037905061},10.426752277187591,1.4747415454237829,{"$f":"SQRT(1+(A461/pole4)^2)","v":1.0281838044461153},{"$f":"ATAN(A461/pole4)","v":0.23468022534261046},{"$f":"SQRT(1+(A461/Zero3)^2)","v":1.0000000013151269},{"$f":"ATAN(A461/Zero3)","v":5.1285999955034941E-5},{"$f":"SQRT(1+(A461/pole5)^2)","v":1.0000000013151269},{"$f":"ATAN(A461/pole5)","v":5.1285999955034941E-5},{"$f":"SQRT((1-(Z461/pterm2))^2+(A461/pterm1)^2)","v":1.0849350525272843},{"$f":"IF((ATAN((A461/pterm1)/(1-A461^2/pterm2))>0),ATAN((A461/pterm1)/(1-A461^2/pterm2)),PI()+ATAN((A461/pterm1)/(1-A461^2/pterm2)))","v":0.53334152824058889},{"$f":"20*LOG10(((E461*K461*G461*O461)/(C461*I461*S461*M461*Q461))*Adc)","v":-0.99412575897753541},{"$f":"((F461+L461+H461+R461)-(D461+J461+T461+N461))*radconv","v":-124.89744198299948},{"$f":"IF(V461>0,V461,V461+180)","v":55.102558017000518},null,{"$f":"IF(U461<0,A461,1000000000)","v":51286},{"$f":"A461^2","v":2630253796},null,{"$f":"20*LOG10((K461/(I461*M461))*AEA*Afb)","v":-1.9992859762006432},-18.947575863369821,null,{"$f":"20*LOG10((E461*G461/(C461*S461))*Am)","v":1.0051602172231084},{"$f":"(F461+H461-(D461+T461))*radconv","v":-105.95280459097854},null,{"$f":"SUM((U462<0)*(U461>0))*A461","v":0},0]
[51584.75,{"$f":"A462/1000","v":51.58475},20.771421852883091,1.5226346408467597,1.0219512086468732,0.20763931706380956,1,0,26877.189393727127,1.5707591205236016,10.486932876076009,1.4752944548802021,1.0285085474160913,0.2359972199937497,1.0000000013304933,5.1584749954244559E-5,1.0000000013304933,5.1584749954244559E-5,1.0859117222457311,0.53624918435914515,-1.0533459724170078,-125.05690883420935,54.943091165790648,null,51584.75,2660986432.5625,null,-2.0024902943169058,{"$f":"(L462-(J462+N462))*radconv","v":-18.991367138157408},null,0.94914432189989795,-106.06849728451493,null,0,0]
[51883.5,51.883499999999998,20.891440285652003,1.5229115353466547,1.0222034334079189,0.20880729258350214,1,0,27032.847031309797,1.5707593347607587,10.547116644326705,1.4758410544980447,1.0288350731803748,0.23731338096614174,1.0000000013459487,5.1883499953444974E-5,1.0000000013459487,5.1883499953444974E-5,1.0868937271537966,0.53915369809356284,-1.1123074392590306,-125.21635780673572,54.783642193264285,null,51883.5,2691897572.25,null,-2.0057008982650477,-19.035472030784781,null,0.8933934590060133,-106.18385848152806,null,0,0]
[52182.25,52.182250000000003,21.011460301880717,1.5231852665572299,1.0224570519358744,0.20997469026684873,1,0,27188.504668893693,1.5707595465448461,10.607303527992649,1.4763814513558169,1.0291633800420685,0.23862870449555856,1.0000000013614936,5.2182249952636133E-5,1.0000000013614936,5.2182249952636133E-5,1.0878810623113095,0.5420550597100483,-1.1710134848230871,-125.37578531013931,54.624214689860693,null,52182.25,2722987215.0625,null,-2.0089179389839353,-19.07988419288726,null,0.83790445416084713,-106.29889093994325,null,0,0]
[52481,52.481000000000002,21.131481874588612,1.5234558883372062,1.0227120631938345,0.21114150736302456,1,0,27344.162306478796,1.570759755917756,10.667493474341548,1.4769157501299979,1.0294934662971889,0.23994318683415153,1.0000000013771275,5.2480999951817975E-5,1.0000000013771275,5.2480999951817975E-5,1.0888737227725438,0.5449532595847103,-1.2294673732266763,-125.53518782664358,54.464812173356421,null,52481,2754255361,null,-2.012141562274067,-19.124597414608708,null,0.78267418904739217,-106.41359735184015,null,0,0]
[52786.5,52.786499999999997,21.254216813938047,1.5237294638220054,1.0229742754139723,0.21233408442180579,1,0,27503.336894872486,1.5707599675704127,10.729046474457077,1.4774559212346021,1.0298328489387094,0.24128649497137705,1.0000000013932073,5.2786499950971639E-5,1.0000000013932073,5.2786499950971639E-5,1.0898943135307879,0.54791366218298987,-1.288984548043802,-125.69816247509893,54.301837524901075,null,52786.5,2786414582.25,null,-2.0154449746193297,-19.170625903805121,null,0.72646042657552412,-106.53056101495974,null,0,0]
[53092,53.091999999999999,21.376953325762017,1.5239998978407645,1.0232379418022137,0.21352604857225407,1,0,27662.51148326739,1.5707601767873016,10.79060256942944,1.477989929571019,1.030174088663298,0.24262891560218769,1.0000000014093802,5.3091999950115457E-5,1.0000000014093802,5.3091999950115457E-5,1.0909204624756759,0.55087073854777302,-1.3482447563577615,-125.86110377940457,54.138896220595427,null,53092,2818760464,null,-2.0187555630001413,-19.216956503678045,null,0.67051080664238361,-106.64718922325305,null,0,0]
[53397.5,53.397500000000001,21.499691383129889,1.5242672441558605,1.0235030612347267,0.21471739690232647,1,0,27821.686071663495,1.5707603836102297,10.852161706594311,1.4785178797073997,1.030517183626122,0.24397044477231367,1.0000000014256465,5.3397499949249362E-5,1.0000000014256465,5.3397499949249362E-5,1.0919521643023409,0.55382447874314389,-1.4072512992260311,-126.02400820199813,53.975991798001871,null,53397.5,2851293006.25,null,-2.0220734677372976,-19.263582998746148,null,0.61482216851126703,-106.7634846546391,null,0,0]
[53703,53.703000000000003,21.622430959722184,1.5245315553107317,1.0237696325826526,0.21590812650998059,1,0,27980.860660060775,1.5707605880800528,10.913723834472986,1.4790398738661878,1.0308621319747822,0.24531107854557016,1.0000000014420061,5.3702999948373292E-5,1.0000000014420061,5.3702999948373292E-5,1.0929894137010148,0.55677487295239658,-1.4660074168503021,-126.18687227711526,53.813127722884744,null,53703,2884012209,null,-2.0253988242406193,-19.310499308908909,null,0.55939140739031656,-106.87944992345413,null,0,0]
[54015.75,54.015749999999997,21.748084888200481,1.5247990485454632,1.024044032916648,0.21712647008062674,1,0,28143.81271414135,1.5707607950064226,10.976749974860216,1.4795681904360176,1.0312171844368634,0.24668259607318538,1.0000000014588506,5.4015749947466063E-5,1.0000000014588506,5.4015749947466063E-5,1.0940570197391986,0.5597918085390573,-1.5259018207755191,-126.35355603520287,53.646443964797129,null,54015.75,2917701248.0625,null,-2.0288109522516877,-19.358823021134281,null,0.50290913147616867,-106.99782788857138,null,0,0]
[54328.5,54.328499999999998,21.873740354932956,1.5250634685259854,1.0243199524860109,0.21834415909109775,1,0,28306.764768223115,1.5707609995503882,{"$f":"SQRT(1+(A471/Zero2)^2)","v":11.03977914407718},{"$f":"ATAN(A471/Zero2)","v":1.4800904745378061},1.0315741753432648,0.24805316691117285,1.0000000014757928,5.4328499946548257E-5,1.0000000014757928,5.4328499946548257E-5,1.0951304285030079,0.56280521700516961,-1.5855404553693764,-126.52019038034602,53.479809619653977,null,54328.5,2951585912.25,null,-2.0322311620278199,-19.407437990496923,null,0.44669070665843996,-107.11586518360687,null,0,0]
[54641.25,54.641249999999999,21.999397333561156,1.5253248678767866,1.0245973900633711,0.21956119046057171,1,0,28469.716822306051,1.5707612017528583,11.1028112905411,1.4806068286255474,1.0319331026822076,0.24942278689558209,1.000000001492833,5.4641249945619819E-5,1.000000001492833,5.4641249945619819E-5,1.0962096342815584,0.56581508820488935,-1.6449266080220855,-126.68677181649545,53.313228183504549,null,54641.25,2985666201.5625,null,-2.0356595838931226,-19.456338110582454,null,0.39073297587103845,-107.23356441892578,null,0,0]
[54954,54.954000000000001,22.125055798325111,1.5255832980285124,1.0248763444159388,0.22077756111934604,1,0,28632.66887639014,1.5707614016538096,11.165846363831541,1.4811173528524955,1.0322939644338063,0.25079145188250734,1.000000001509971,5.4953999944680701E-5,1.000000001509971,5.4953999944680701E-5,1.0972946313598717,0.56882141212207715,-1.7040635053406783,-126.85329691891202,53.146703081087978,null,54954,3019942116,null,-2.0390963434565714,-19.505517407894327,null,0.33503283811589568,-107.35092814328549,null,0,0]
[55274,55.274000000000001,22.253628721067439,1.5258446981518965,1.0251633339690585,0.22202144196691334,1,0,28799.398396157598,1.5707616038473391,11.230345659806328,1.481633779747108,1.0326651915666951,0.25219085175240419,1.0000000015276074,5.5273999943708684E-5,1.0000000015276074,5.5273999943708684E-5,1.0984107685160107,0.57189374510746716,-1.7643165957244458,-127.02362050857406,52.976379491425945,null,55274,3055215076,null,-2.0426215281972397,-19.556119617695924,null,0.27830493247279686,-107.47066785779531,null,0,{"$f":"IF(AH474>0,W474,0)","v":0}]
[55594,55.594000000000001,22.382203146930863,1.5261030950700234,1.0254519088061824,0.22326462465020366,1,0,28966.127915926227,1.5707618037132096,11.294847916670168,1.4821443083881409,1.0330384395327308,0.25358924312252401,1.0000000015453463,5.5593999942725343E-5,1.0000000015453463,5.5593999942725343E-5,1.0995329564690866,0.57496234364122878,-1.8243153860302153,-127.19387808968983,52.806121910310168,null,55594,3090692836,null,-2.0461556932721696,-19.607001856388564,null,0.22184030724195591,-107.5900615348679,null,0,0]
[55914,55.914000000000001,22.510779050159321,1.5263585402087456,1.0257420675893338,0.22450710591740894,1,0,29132.857435695998,1.5707620012913857,11.359353083984265,1.4826490389885558,1.0334137061422619,0.25498662161948549,1.0000000015631876,5.5913999941730618E-5,1.0000000015631876,5.5913999941730618E-5,1.1006611890861857,0.57802719741379849,-1.8840631440669173,-127.36406621429791,52.635933785702093,null,55914,3126375396,null,-2.04969895889595,-19.658158133905989,null,0.16563581482903317,-107.70911171660791,null,0,0]
[56234,56.234000000000002,22.639356405581577,1.52661108382721,1.0260338089747094,0.22574888252905201,1,0,29299.586955466893,1.5707621966209213,11.423861112446792,1.483148069509763,1.033790989196983,0.25638298289206268,1.0000000015811312,5.6233999940724435E-5,1.0000000015811312,5.6233999940724435E-5,1.1017954602313214,0.58108829625623404,-1.9435630770640331,-127.53418150516141,52.465818494838587,null,56234,3162262756,null,-2.053251440765417,-19.70958259040356,null,0.10968836370138399,-107.82782088562327,null,0,0]
[56561.5,56.561500000000002,22.770948770747637,1.5268665933694656,1.0263340253156923,0.22701903029040182,1,0,29470.224198358563,1.570762394240008,11.489883960060341,1.4836529939481549,1.0341792004099752,0.25781101359910763,1.0000000015996016,5.6561499939682754E-5,1.0000000015996016,5.6561499939682754E-5,1.1029625619291077,0.58421724116773932,-2.0042042187527889,-127.70820500703942,52.291794992960575,null,56561.5,3199203282.25,null,-2.0568968428612324,-19.762484006439511,null,5.2692624108442755E-2,-107.94896173583311,null,0,0]
[56889,56.889000000000003,22.902542605434579,1.5271191667055519,1.0266358964461084,0.22828843315235012,1,0,29640.861441251371,1.5707625895837778,11.555909703531777,1.4841521486489859,1.034569519010097,0.25923796968988566,1.0000000016181791,5.6888999938628936E-5,1.0000000016181791,5.6888999938628936E-5,1.1041359755150504,0.58734223197141977,-2.064592391586118,-127.88214528286632,52.117854717133682,null,56889,3236358321,null,-2.0605521296260854,-19.815654302744168,null,-4.0402619600319019E-3,-108.06975047972304,null,0,0]
[57216.5,57.216500000000003,23.034137884456332,1.52736885412708,1.0269394209066705,0.22955708768261246,1,0,29811.498684145296,1.5707627826913015,11.621938293505861,1.4846456317015069,1.0349619426130512,0.26066384657237063,1.000000001636864,5.7216499937562915E-5,1.000000001636864,5.7216499937562915E-5,1.105315694403836,0.59046325822121615,-2.124730845663668,-128.05599893131401,51.944001068685992,null,57216.5,3273727872.25,null,-2.0642174113373151,-19.869087598352309,null,-6.051343432635297E-2,-108.1901895969304,null,0,0]
[57544,57.543999999999997,23.165734583198816,1.5276157047843604,1.0272445972318285,0.23082499046258537,1,0,29982.135927040319,1.5707629736007607,11.687969681740539,1.4851335389895333,1.0353564688253059,0.26208863967903295,1.0000000016556558,5.7543999936484628E-5,1.0000000016556558,5.7543999936484628E-5,1.1065017120083245,0.59358030962345276,-2.18462277064907,-128.22976262132499,51.770237378675006,null,57544,3311311936,null,-2.0678927939388307,-19.922778140013428,null,-0.11672997671023909,-108.31028150964795,null,0,0]
[57879,57.878999999999998,23.300346390582359,1.5278653236329176,1.0275584698345994,0.23212114786363688,1,0,30156.680893056193,1.5707631666469437,11.75551608513071,1.485626948678773,1.0357622028717803,0.26354493561054332,1.0000000016749893,5.7878999935368865E-5,1.0000000016749893,5.7878999935368865E-5,1.1077214001881019,0.59676462087977589,-2.2456344675261648,-128.40740915949439,51.592590840505608,null,57879,3349978641,null,-2.0716629021781152,-19.977958518641337,null,-0.17397156534805003,-108.43276686327559,null,0,0]
[58214,58.213999999999999,23.434959633121558,1.528112074814989,1.027874067704275,0.2334165114969558,1,0,30331.22585907318,1.5707633574713082,11.823065317736699,1.4861147204476173,1.0361701318374985,0.26500008797022651,1.0000000016944348,5.8213999934240111E-5,1.0000000016944348,5.8213999934240111E-5,1.1089476649310817,0.59994475184805918,-2.3063947783524235,-128.58495473905998,51.415045260940019,null,58214,3388869796,null,-2.075443790210393,-20.033396277173345,null,-0.23095098814202963,-108.55489387839528,null,0,0]
[58549,58.548999999999999,23.569574286226537,1.528356007435214,1.0281913892521712,0.23471107774832517,1,0,30505.770825091258,1.570763546111992,11.89061733134116,1.4865969501510552,1.036580253131139,0.26645409194935643,1.0000000017139927,5.8548999933098293E-5,1.0000000017139927,5.8548999933098293E-5,1.1101804991837096,0.60312069200263863,-2.3669069298121932,-128.76239601209272,51.237603987907278,null,58549,3427985401,null,-2.0792355582639614,-20.08908565018854,null,-0.28767137154823086,-108.67666497249887,null,0,0]
[58884,58.884,23.704190325865738,1.5285971694841305,1.0285104328828925,0.23600484301866681,1,0,30680.31579111041,1.5707637326062649,11.958172078814297,1.4870737314884832,1.0369925641515629,0.26790694276621679,1.0000000017336628,5.8883999931943336E-5,1.0000000017336628,5.8883999931943336E-5,1.1114198958921173,0.60629243098237873,-2.4271740884245423,-128.93972970039366,51.060270299606344,null,58884,3467325456,null,-2.0830383024187431,-20.145020997270201,null,-0.34413578600580197,-108.79808250780431,null,0,0]
[59227,59.226999999999997,23.842022488968301,1.5288412690028665,1.028838878053232,0.23732867053201853,1,0,30859.02899512514,1.57076392136826,12.027342858456416,1.4875563492180939,1.0374169874677079,0.26939328876418794,1.0000000017539188,5.9226999930747102E-5,1.0000000017539188,5.9226999930747102E-5,1.1126956821672886,0.60953554947143518,-2.4886298694408344,-129.12118340173959,50.878816598260414,null,59227,3507837529,null,-2.0869433269061441,-20.202541206156603,null,-0.40168654253468983,-108.92203565271612,null,0,0]
[59570,59.57,23.97985605635666,1.5290825624216284,1.0291691251308606,0.23865165076438566,1,0,31037.742199140961,1.570764107956498,12.096516407467092,1.4880334473891272,1.0378437007933274,0.27087841580744493,1.0000000017742925,5.9569999929536936E-5,1.0000000017742925,5.9569999929536936E-5,1.113978333106034,0.6127742422793091,-2.5498353479187501,-129.30251758007483,50.697482419925166,null,59570,3548584900,null,-2.0908600490964,-20.260307696946899,null,-0.45897529882235133,-109.04562299271336,null,0,0]
[59913,59.912999999999997,24.117691003954171,1.5293210978234772,1.0295011723817113,0.23997377990222396,1,0,31216.455403157848,1.5707642924083125,12.165692678606829,1.4885051199380586,1.0382727013049506,0.27236231885175388,1.0000000017947837,5.9912999928312749E-5,1.0000000017947837,5.9912999928312749E-5,1.1152678411386812,0.61600849881677255,-2.6107937357362476,-129.48372893309991,50.516271066900089,null,59913,3589567569,null,-2.0947885594754716,-20.318314800603254,null,-0.51600517626077491,-109.16884689453441,null,0,0]
[60256,60.256,24.255527308231219,1.529556922199784,1.0298350180645071,0.24129505414879587,1,0,31395.168607175779,1.5707644747601877,12.234871625702677,1.4889714586865876,1.0387039861686496,0.27384499288275371,1.0000000018153927,6.0255999927074462E-5,1.0000000018153927,6.0255999927074462E-5,1.1165641986970507,0.6192383086726333,-2.6715081846492845,-129.66481422803452,50.335185771965484,null,60256,3630785536,null,-2.0987289445425743,-20.37655697091845,null,-0.57277924010671022,-109.29170967160616,null,0,0]
[60607,60.606999999999999,24.396579833946092,1.5297954881570175,1.0301785102513381,0.24264625631141165,1,0,31578.050049189373,1.5707646592283873,12.305666799156381,1.4894432459253422,1.0391476920794283,0.27536097068699644,1.0000000018366042,6.0606999925792613E-5,1.0000000018366042,6.0606999925792613E-5,1.1178978751286546,0.62253883523449416,-2.7333894010839521,-129.84998928255033,50.150010717449675,null,60607,3673208449,null,-2.1027736131931798,-20.436395252645966,null,-0.63061578789077211,-109.417066555213,null,0,0]
[60958,60.957999999999998,24.537633732197587,1.5300313113481365,1.0305238820279445,0.24399655524892103,1,0,31760.931491204028,1.570764841572228,12.376464680309056,1.4899096356775885,1.0395937841059286,0.27687565095081917,1.0000000018579389,6.0957999924495844E-5,1.0000000018579389,6.0957999924495844E-5,1.1192387082946966,0.62583468377891172,-2.7950216580160339,-130.03502569636424,49.964974303635756,null,60958,3715877764,null,-2.10683088796157,-20.496468322264047,null,-0.68819077005446705,-109.54205001022741,null,0,0]
[61309,61.308999999999997,24.678688979451021,1.530264438776924,1.0308711315051751,0.24534594694760836,1,0,31943.812933219728,1.5707650218281961,12.447265222957942,1.4903707198420355,1.0400422591778127,0.27838902839819241,1.0000000018793966,6.1308999923184051E-5,1.0000000018793966,6.1308999923184051E-5,1.1205866900928236,0.62912584372326263,-2.8564081464591133,-130.2199202206121,49.780079779387904,null,61309,3758793481,null,-2.1109008494142638,-20.556770614160797,null,-0.74550729704484964,-109.6666623533971,null,0,0]
[61660,61.66,24.819745552706504,1.5304949163798145,1.0312202567861586,0.24669442741236533,1,0,32126.694375236453,1.5707652000319474,12.518068381943822,1.4908265882473888,1.0404931142136478,0.27990109778602945,1.0000000019009778,6.1659999921857147E-5,1.0000000019009778,6.1659999921857147E-5,1.1219418124243135,0.63241230467683418,-2.9175519974846327,-130.40466967564714,49.595330324352858,null,61660,3801955600,null,-2.1149835742946053,-20.617296683166689,null,-0.8025684231900253,-109.79090585024477,null,0,0]
[62019,62.018999999999998,24.964018438846214,1.5307279527197055,1.031579277774354,0.2480726957061212,1,0,32313.744055248902,1.5707653802107295,12.590487948600376,1.4912875429055426,1.0409567038728149,0.2814462717442151,1.0000000019231781,6.2018999920484278E-5,1.0000000019231781,6.2018999920484278E-5,1.1233351988066707,0.63576879923276142,-2.9798416470045823,-130.59347663461361,49.406523365386391,null,62019,3846356361,null,-2.1191726319475803,-20.679428196679918,null,-0.86066901505700066,-109.91760186488283,null,0,0]
[62378,62.378,25.108292665100553,1.530958310981678,1.0319402570090741,0.24945000236077089,1,0,32500.793735262392,1.5707655583155695,12.662910159874079,1.4917432250397633,1.0414227766650681,0.28299006634774898,1.0000000019455073,6.2377999919095429E-5,1.0000000019455073,6.2377999919095429E-5,1.1247360378025693,0.63912035678139478,-3.0418839122293022,-130.78212532253946,49.217874677460543,null,62378,3891014884,null,-2.1233751921524755,-20.741782653534003,null,-0.91850872007682849,-110.04391666513934,null,0,0]
[62737,62.737000000000002,25.252568208500293,1.5311860370430748,1.0323031924360202,0.25082634316244445,1,0,32687.843415276897,1.5707657343820705,12.735334970647381,1.4921937244124168,1.0418913292580425,0.28453247609402343,1.0000000019679656,6.2736999917690508E-5,1.0000000019679656,6.2736999917690508E-5,1.1261443207618111,0.64246696682248683,-3.1036819576827273,-130.97061255157882,49.029387448421176,null,62737,3935931169,null,-2.127591325411462,-20.804354597487947,null,-0.97609063227126602,-110.16985251940955,null,0,0]
[63096,63.095999999999997,25.396845046597935,1.5314111757398463,1.0326680819926568,0.25220171391781682,1,0,32874.893095292406,1.5707659084450254,12.80776233682165,1.4926391287639833,1.0423623583076502,0.28607349551665562,1.0000000019905526,6.3095999916269391E-5,1.0000000019905526,6.3095999916269391E-5,1.1275600390403242,0.64580861906186715,-3.165238888254212,-131.15893520272337,48.84106479727663,null,63096,3981105216,null,-2.1318210985677353,-20.867138690175366,null,-1.0334177896864747,-110.29541164705148,null,0,0]
[63463.25,63.463250000000002,25.544438755569878,1.5316388566881012,1.0330433767411538,0.25360768329145333,1,0,33066.241270741048,1.5707660844703468,12.88185671940596,1.4930895861580615,1.0428467708179257,0.28764848406045779,1.000000002013792,6.3463249914798815E-5,1.000000002013792,6.3463249914798815E-5,1.1290159758124831,0.64922192361689857,-3.2279641142809448,-131.3514121267591,48.648587873240899,null,63463.25,4027584100.5625,null,-2.1361622536928109,-20.931579664567192,null,-1.0918018605881332,-110.42346863857041,null,0,0]
[63830.5,63.830500000000001,25.692033773515888,1.5318639216951275,1.0334207120724817,0.25501262871083191,1,0,33257.589446190701,1.5707662584701383,12.955953685974233,1.493534891180109,1.0433337677964631,0.28922200618945892,1.0000000020371662,6.3830499913311096E-5,1.0000000020371662,6.3830499913311096E-5,1.1304796752874366,0.65263001874923365,-3.2904434042630806,-131.54371043246448,48.456289567535521,null,63830.5,4074332730.25,null,-2.1405178131198461,-20.996231712697664,null,-1.1499255911432353,-110.55113593802024,null,0,0]
[64197.75,64.197749999999999,25.839630078005527,1.5320864155647975,1.0338000857522123,0.25641654575386164,1,0,33448.937621641344,1.5707664304791613,13.030053192444058,1.4939751315537619,1.0438233456259021,0.29079405616961046,1.0000000020606754,6.4197749911806178E-5,1.0000000020606754,6.4197749911806178E-5,1.1319511282347419,0.65603289410122767,-3.3526798973874232,-131.7358269940907,48.264173005909299,null,64197.75,4121351105.0625,null,-2.1448878372890334,-21.061089481827562,null,-1.2077920600983891,-110.67841577239156,null,0,0]
[64565,64.564999999999998,25.987227647117752,1.5323063820841403,1.0341814955371349,0.25781943002113805,1,0,33640.285797092969,1.5707666005313869,13.104155195728618,1.4944103930263566,1.0443155006765141,0.29236462830669335,1.0000000020843196,6.456499991028394E-5,1.0000000020843196,6.456499991028394E-5,1.1334303254329843,0.65943053953628805,-3.4146766734731053,-131.92775875446443,48.072241245535565,null,64565,4168639225,null,-2.1492723831360121,-21.126147734688097,null,-1.2654042903370932,-110.8053103217797,null,0,0]
[64941,64.941000000000003,26.138343124130781,1.5325290157618618,1.0345740997883084,0.25925466448365214,1,0,33836.192982852474,1.570766772642612,13.180025276247591,1.4948509541928185,1.0448220479370904,0.29397108349138912,1.0000000021086666,6.4940999908707386E-5,1.0000000021086666,6.4940999908707386E-5,1.1349527791852341,0.66290370769474682,-3.4779053711001122,-132.12406884914293,47.87593115085707,null,64941,4217333481,null,-2.1537764946753972,-21.192958402615581,null,-1.3241288764247172,-110.93483129174373,null,0,0]
[65317,65.316999999999993,26.289459881816271,1.5327490899699203,1.0349688335371698,0.26068880711096337,1,0,34032.100168612968,1.5707669427723066,13.255897885648663,1.4952864721746317,1.0453312889508339,0.29557597762098331,1.0000000021331552,6.5316999907112468E-5,1.0000000021331552,6.5316999907112468E-5,1.1364833310784801,0.66637137295505766,-3.5408891416218102,-132.32017895951526,47.67982104048474,null,65317,4266310489,null,-2.1582959381358213,-21.259968468336744,null,-1.3825932034859871,-111.06395287960792,null,0,0]
[65693,65.692999999999998,26.440577898215803,1.5329666485718576,1.0353656943481027,0.26212185325585741,1,0,34228.007354374429,1.5707671109544947,13.331772980755382,1.4957170329119571,1.0458432197828251,0.29717930471445342,1.0000000021577851,6.5692999905499078E-5,1.0000000021577851,6.5692999905499078E-5,1.1380219712495012,0.66983352515088879,-3.6036311058718913,-132.51608601780862,47.483913982191382,null,65693,4315570249,null,-2.1628307639408111,-21.327172667105124,null,-1.4408003419310771,-111.19267728234594,null,0,0]
[66069,66.069000000000003,26.591697151869944,1.5331817344350835,1.0357646797761086,0.26355379829623732,1,0,34423.914540136851,1.5707672772224264,13.407650519367255,1.4961427204069693,1.0463578364850812,0.29878105883467737,1.0000000021825564,6.6068999903867121E-5,1.0000000021825564,6.6068999903867121E-5,1.1395686898474937,0.67329015435335537,-3.6661343253954692,-132.71178702485116,47.288212975148838,null,66069,4365112761,null,-2.1673810191463527,-21.394565847683719,null,-1.4987533062491156,-111.3210066520229,null,0,0]
[66453.75,66.453749999999999,26.746334402375222,1.5333993096009899,1.0361751469001508,0.26501792189148887,1,0,34624.380736207226,1.5707674454119267,13.485296311600909,1.4965733551770715,1.0468872051958034,0.30041845336370065,1.0000000022080504,6.6453749902177839E-5,1.0000000022080504,6.6453749902177839E-5,1.1411597549064181,0.67682149634033695,-3.7298480645034662,-132.91182588606085,47.088174113939147,null,66453.75,4416100889.0625,null,-2.1720531824430314,-21.46371772538367,null,-1.5577948820604346,-111.45191568008373,null,0,0]
[66838.5,66.838499999999996,26.900972904467356,1.5336143833434546,1.0365878334673568,0.26648088282636262,1,0,34824.84693227856,1.5707676116650906,13.562944575999285,1.4969990592314233,1.0474193778333347,0.30205418842032566,1.0000000022336926,6.6838499900468893E-5,1.0000000022336926,6.6838499900468893E-5,1.142759257931002,0.68034703500936744,-3.7933181196536907,-133.11164285366507,46.888357146334926,null,66838.5,4467385082.25,null,-2.1767415909837498,-21.533056920577756,null,-1.6165765286699423,-111.58241549704499,null,0,0]
[67223.25,67.223249999999993,27.055612636685719,1.5338269985340018,1.0370027368279719,0.26794267623047274,1,0,35025.313128350848,1.5707677760151657,13.640595270344447,1.4974199166204363,1.0479543501260014,0.30368825778614356,1.0000000022594826,6.7223249898740146E-5,1.0000000022594826,6.7223249898740146E-5,1.1443671884109696,0.6838667604849461,-3.8565475873454238,-133.31123492713192,46.68876507286808,null,67223.25,4518965340.5625,null,-2.1814462849450456,-21.602578263148509,null,-1.6751013024003787,-111.71250827249213,null,0,0]
[67608,67.608000000000004,27.210253578057358,1.5340371970704694,1.0374198543222577,0.26940329726116247,1,0,35225.779324424067,1.5707679384946429,13.718248353373021,1.4978360094983865,1.0484921177883979,0.30532065529098495,1.0000000022854207,6.7607999896991504E-5,1.0000000022854207,6.7607999896991504E-5,1.1459835358523358,0.68738066314557278,-3.9195395050076676,-133.51059917446662,46.48940082553338,null,67608,4570841664,null,-2.1861673012751108,-21.672276694339562,null,-1.7333722037325567,-111.84219613318687,null,0,0]
[68001.75,68.001750000000001,27.368513081914866,1.5342498531463258,1.0378490185935869,0.27089686601174723,1,0,35430.934788242645,1.5707681028711953,13.797720313856605,1.4982569863411519,1.0490453545431841,0.30698950016509835,1.0000000023121189,6.8001749895181245E-5,1.0000000023121189,6.8001749895181245E-5,1.1476463962547416,0.69097072386781633,-3.9837620765419928,-133.71438804154812,46.285611958451881,null,68001.75,4624238003.0625,null,-2.1910156855616285,-21.743783684089507,null,-1.7927463909803629,-111.97450057073154,null,0,0]
[68395.5,68.395499999999998,27.526773809216319,1.5344600639682724,1.0382804961272067,0.27238919672630535,1,0,35636.090252062168,1.5707682653551298,13.877194691585697,1.4986731414073982,1.0496015098499289,0.30865658112695177,1.0000000023389721,6.8395499893349884E-5,1.0000000023389721,6.8395499893349884E-5,1.149318049816715,0.69455466659478615,-4.0477421078993627,-133.9179322991088,46.082067700891201,null,68395.5,4677944420.25,null,-2.1958812331651427,-21.815465768117008,null,-1.851860874734218,-112.1063853044778,null,0,0]
[68789.25,68.789249999999996,27.685035738980375,1.5346678714525639,1.0387142840403591,0.27388028430482531,1,0,35841.245715882629,1.5707684259789469,13.956671445266265,1.4990845569250613,1.0501605790717179,0.3103218917202194,1.0000000023659803,6.8789249891497314E-5,1.0000000023659803,6.8789249891497314E-5,1.1509984853477555,0.6981324818293636,-4.1114826715084867,-134.12122901746562,45.878770982534377,null,68789.25,4731960915.5625,null,-2.2007639738664366,-21.88731786705031,null,-1.9107186976420514,-112.23785248411448,null,0,0]
[69183,69.183000000000007,27.843298850702556,1.534873316563278,1.0391503794396764,0.27537012367790009,1,0,36046.401179703993,1.5707685847744064,14.036150534538328,1.4994913132661303,1.050722557557237,0.31198542554155789,1.0000000023931437,6.9182999889623426E-5,1.0000000023931437,6.9182999889623426E-5,1.1526876916780866,0.70170416034570338,-4.1749867809291299,-134.32427533550049,45.675724664499512,null,69183,4786287489,null,-2.2056639343506133,-21.959335010848758,null,-1.9693228465785164,-112.36890421856397,null,0,0]
[69586,69.585999999999999,28.005281092515464,1.535081183512419,1.0395991060234784,0.2768936646594885,1,0,36256.376168708128,1.5707687454394001,14.117499128991909,1.4999028824948142,1.0513007457912817,0.31368619270573411,1.0000000024211055,6.958599988768329E-5,1.0000000024211055,6.958599988768329E-5,1.1544256516019924,0.7053533809571404,-4.2397409659804151,-134.53182942189864,45.468170578101365,null,69586,4842211396,null,-2.2106968610516913,-22.033209817019916,null,-2.0290441049287233,-112.50260658899006,null,0,0]
[69989,69.989000000000004,28.16726453048167,1.535286659680646,1.0400502436154324,0.27841588745378987,1,0,36466.351157713187,1.5707689042541604,14.198850087396305,1.5003097356984132,1.0518819716790451,0.31538508523433395,1.0000000024492299,6.9988999885720561E-5,1.0000000024492299,6.9988999885720561E-5,1.1561727756470728,0.70899615444167319,-4.3042536616141627,-134.73911535366321,45.260884646336791,null,69989,4898460121,null,-2.2157478731627251,-22.107247316807484,null,-2.0885057884514384,-112.63587811116606,null,0,0]
[70392,70.391999999999996,28.329249144082773,1.5354897860613992,1.0405037890794711,0.27993678672553785,1,0,36676.326146719162,1.5707690612504654,14.280203369350907,1.5007119533416275,1.0524662301878815,0.31708209643450869,1.0000000024775169,7.0391999883735092E-5,1.0000000024775169,7.0391999883735092E-5,1.1579290519096979,0.71263247177817224,-4.3685279162069692,-134.94613027642183,45.053869723578174,null,70392,4955033664,null,-2.2208169898745425,-22.181442518272501,null,-2.1477109263324277,-112.76872092265877,null,0,0]
[70795,70.795000000000002,28.49123491326684,1.5356906027166379,1.0409597392682701,0.28145635717323136,1,0,36886.301135726026,1.5707692164593701,14.361558935369379,1.5011096140719662,1.0530535162700858,0.31877721967156747,1.0000000025059659,7.0794999881726759E-5,1.0000000025059659,7.0794999881726759E-5,1.1596944685120145,0.71626232423471559,-4.4325667194578848,-135.15287140447634,44.847128595523657,null,70795,5011932025,null,-2.2259042274094156,-22.25579053688416,null,-2.206662492048471,-112.90113712230068,null,0,0]
[71207.25,71.207250000000002,28.656939893338144,1.5358936796509601,1.0414286396730164,0.28300942568245446,1,0,37101.095649915711,1.5707693734129924,14.444784166851106,1.5015117673931095,1.0536574095734301,0.32050929050605892,1.0000000025352362,7.1207249879648533E-5,1.0000000025352362,7.1207249879648533E-5,1.1615098515497244,0.71996879419618809,-4.4978348332250553,-135.36407170399255,44.635928296007449,null,71207.25,5070472452.5625,null,-2.2311269949501549,-22.331998190366757,null,-2.2667078382748977,-113.0361533885193,null,0,0]
[71619.5,71.619500000000002,28.822646041639683,1.5360944215478691,1.0419000497618338,0.28456109255263412,1,0,37315.890164106313,1.5707695285597287,14.528011707683099,1.5019093130955306,1.0542644602952158,0.32223937185593721,1.0000000025646762,7.1619499877546101E-5,1.0000000025646762,7.1619499877546101E-5,1.1633347742780429,0.72366848152960017,-4.5628627098529231,-135.57497981226706,44.42502018773294,null,71619.5,5129352780.25,null,-2.2363687499591034,-22.408355748357248,null,-2.3264939598938201,-113.17072755898836,null,0,0]
[72031.75,72.031750000000002,28.988353338137596,1.536292868434652,1.042373966129734,0.28611135221871276,1,0,37530.684678297788,1.5707696819306025,14.611241518402275,1.5023023297914266,1.0548746629844263,0.32396745680795336,1.0000000025942863,7.203174987541933E-5,1.0000000025942863,7.203174987541933E-5,1.1651692240708458,0.72736137781295684,-4.6276533680239265,-135.78559296053456,44.214407039465442,null,72031.75,5188573008.0625,null,-2.2416295007873592,-22.484858312385999,null,-2.386023867236569,-113.30486176341202,null,0,0]
[72444,72.444000000000003,29.154061763253349,1.5364890594292862,1.0428503853598319,0.28766019915277713,1,0,37745.479192490151,1.570769833555931,14.694473560438563,1.502690894317573,1.0554880121743797,0.32569353851249816,1.0000000026240665,7.2443999873268082E-5,1.0000000026240665,7.2443999873268082E-5,1.1670131883334411,0.73104747493124744,-4.6922097680711001,-135.99590844872043,44.004091551279572,null,72444,5248133136,null,-2.2469092529466876,-22.561501089313445,null,-2.4453005151244147,-113.43855809485551,null,0,0]
[72865.75,72.865750000000006,29.323589965912809,1.5366874768976597,1.0433403697892218,0.28924327046703097,1,0,37965.223489302742,1.570769986899903,14.779625893790312,1.5030838840962017,1.0561187459308667,0.32745731640824388,1.0000000026547087,7.2865749871041768E-5,1.0000000026547087,7.2865749871041768E-5,1.1689094781823539,0.73481147132813607,-4.7580144326424918,-136.21075973033962,43.789240269660382,null,72865.75,5309417523.0625,null,-2.2523303391894709,-22.640050249083096,null,-2.5056840934530222,-113.57488438119998,null,0,0]
[73287.5,73.287499999999994,29.493119309755333,1.5368836133275248,1.0438329664907635,0.29082485160292321,1,0,38184.967786116213,1.5707701384789678,14.864780483570213,1.5034723713607518,1.056752761252407,0.32921898336673122,1.0000000026855287,7.3287499868789541E-5,1.0000000026855287,7.3287499868789541E-5,1.170815699498212,0.73856833537641398,-4.8235800051065487,-136.42529397167291,43.574706028327086,null,73287.5,5371057656.25,null,-2.257771315571433,-22.718736334989352,null,-2.565808689535118,-113.71075670112188,null,0,0]
[73709.25,73.709249999999997,29.662649775214483,1.5370775078140084,1.0443281717679274,0.2924049367624369,1,0,38404.712082930557,1.5707702883234207,14.949937291220539,1.5038564329336825,1.0573900522360817,0.3309785322604421,1.0000000027165268,7.3709249866511239E-5,1.0000000027165268,7.3709249866511239E-5,1.1727318389025858,0.74231805936815776,-4.8889094745417081,-136.63950849503283,43.360491504967172,null,73709.25,5433053535.5625,null,-2.2632321793723071,-22.797554538788614,null,-2.6256772951694001,-113.84617718517747,null,0,0]
[74131,74.131,{"$f":"SQRT(1+(A525/pole1)^2)","v":29.832181343168479},{"$f":"ATAN(A525/pole1)","v":1.5372691985642344},{"$f":"SQRT(1+(A525/Zero1)^2)","v":1.0448259819116352},{"$f":"ATAN(A525/Zero1)","v":0.29398352018839807},{"$f":"IF(VIN_nom>Vout, 1, SQRT(1+(A525/z_RHP)^2))","v":1},{"$f":"IF(VIN_nom>Vout, 0, -ATAN(A525/z_RHP))","v":0},{"$f":"SQRT(1+(A525/Pole2)^2)","v":38624.456379745752},{"$f":"ATAN(A525/Pole2)","v":1.5707704364628676},15.035096279056111,1.50423614390225,{"$f":"SQRT(1+(A525/pole4)^2)","v":1.0580306129627335},{"$f":"ATAN(A525/pole4)","v":0.33273595603144679},{"$f":"SQRT(1+(A525/Zero3)^2)","v":1.0000000027477025},{"$f":"ATAN(A525/Zero3)","v":7.4130999864206713E-5},{"$f":"SQRT(1+(A525/pole5)^2)","v":1.0000000027477025},{"$f":"ATAN(A525/pole5)","v":7.4130999864206713E-5},{"$f":"SQRT((1-(Z525/pterm2))^2+(A525/pterm1)^2)","v":1.1746578830548451},{"$f":"IF((ATAN((A525/pterm1)/(1-A525^2/pterm2))>0),ATAN((A525/pterm1)/(1-A525^2/pterm2)),PI()+ATAN((A525/pterm1)/(1-A525^2/pterm2)))","v":0.74606063592064875},{"$f":"20*LOG10(((E525*K525*G525*O525)/(C525*I525*S525*M525*Q525))*Adc)","v":-4.9540057719972577},{"$f":"((F525+L525+H525+R525)-(D525+J525+T525+N525))*radconv","v":-136.85340069151331},{"$f":"IF(V525>0,V525,V525+180)","v":43.146599308486685},null,{"$f":"IF(U525<0,A525,1000000000)","v":74131},{"$f":"A525^2","v":5495405161},null,{"$f":"20*LOG10((K525/(I525*M525))*AEA*Afb)","v":-2.2687129251568057},-22.876500155604706,null,{"$f":"20*LOG10((E525*G525/(C525*S525))*Am)","v":-2.6852928468404489},{"$f":"(F525+H525-(D525+T525))*radconv","v":-113.98114792933683},null,{"$f":"SUM((U526<0)*(U525>0))*A525","v":0},0]
[74562.75,{"$f":"A526/1000","v":74.562749999999994},30.005733750711087,1.537463190691275,1.0453382898550501,0.29559797144409933,1,0,38849.410974055958,1.5707705863788892,15.122276668467762,1.5046204281560425,1.0586897426087225,0.33453284100333786,1.0000000027798017,7.4562749861820216E-5,1.0000000027798017,7.4562749861820216E-5,1.1766398410360246,0.74988454066779009,-5.0204070202187161,-137.07202789337816,42.927972106621837,null,74562.75,5559603687.5625,null,-2.2743442096865518,{"$f":"(L526-(J526+N526))*radconv","v":-22.957444804536713},null,-2.7460628105321638,-114.11885521972235,null,0,0]
[74994.5,74.994500000000002,30.179287274470347,1.5376549516251752,1.0458533197499986,0.29721083682894206,1,0,39074.365568367015,1.5707707345687514,15.209459265451144,1.5050003069308378,1.0593522862873355,0.3363274841360252,1.0000000028120875,7.4994499859405936E-5,1.0000000028120875,7.4994499859405936E-5,1.1786321508629582,0.75370094038991564,-5.0865699438501801,-137.29031198326777,42.70968801673223,null,74994.5,5624175030.25,null,-2.2799963103538783,-23.038513321995758,null,-2.8065736334963014,-114.25609552960557,null,0,0]
[75426.25,75.426249999999996,30.352841895299132,1.5378445196249508,1.0463710675772007,0.2988221102996616,1,0,39299.320162678923,1.5707708810620959,15.296644032260362,1.5053758554444647,1.0600182375969487,0.33811987808386107,1.0000000028445595,7.5426249856963684E-5,1.0000000028445595,7.5426249856963684E-5,1.1806347983517946,0.75750982820706958,-5.1524975073608745,-137.50825037648306,42.491749623516938,null,75426.25,5689119189.0625,null,-2.2856692130677412,-23.119700979141452,null,-2.8668282942931307,-114.39287100312785,null,0,0]
[75858,75.858000000000004,30.526397594485619,1.5380319320801803,1.0468915293041361,0.30043178585798019,1,0,39524.274756991676,1.5707710258878906,15.38383093200426,1.5057471472145336,1.0606875901191328,0.3399100155774053,1.000000002877218,7.5857999854493337E-5,1.000000002877218,7.5857999854493337E-5,1.1826477693637265,0.76131119758384758,-5.2181926173774071,-137.7258405574166,42.274159442583397,null,75858,5754436164,null,-2.2913629011364876,-23.201003148876481,null,-2.9268297162409196,-114.52918375177907,null,0,0]
[76299.75,76.299750000000003,30.703974210032008,1.5382214923985202,1.0474268504275395,0.30207708393496796,1,0,39754.439648799482,1.5707711723716689,15.473039385648669,1.5061227078492931,1.0613759594635739,0.34173927247710267,1.0000000029108258,7.6299749851936466E-5,1.0000000029108258,7.6299749851936466E-5,1.184718034164812,0.76519282445092041,-5.2851717086640431,-137.94810750831672,42.051892491683276,null,76299.75,5821651850.0625,null,-2.2972099568729676,-23.284302202548794,null,-2.9879617517910755,-114.66817695941738,null,0,0]
[76741.5,76.741500000000002,30.881551916179419,1.5384088726720471,1.0479650040402411,0.30372069666225082,1,0,39984.604540608139,1.570771317169027,15.562249996679274,1.5064939627326162,1.0620678757531345,0.34356615203361135,1.0000000029446288,7.6741499849349834E-5,1.0000000029446288,7.6741499849349834E-5,1.1867990764472864,0.76906656781568972,-5.3519134304232399,-138.17000481689391,41.829995183106092,null,76741.5,5889257822.25,null,-2.303078728641768,-23.367711649250253,null,-3.0488347017814696,-114.80669013170356,null,0,0]
[77183.25,77.183250000000001,31.059130694221608,1.5385941102803276,1.0485059857808514,0.3053626177614267,1,0,40214.769432417619,1.5707714603089211,15.651462728205898,1.5068609853891266,1.0627633320600574,0.34539064670783121,1.0000000029786269,7.7183249846733251E-5,1.0000000029786269,7.7183249846733251E-5,1.1888908812189229,0.77293242177691812,-5.4184207168547074,-138.39153000349918,41.608469996500816,null,77183.25,5957254080.5625,null,-2.308969190671764,-23.451226846030661,null,-3.1094515261829425,-114.94472543193892,null,0,0]
[77625,77.625,31.236710525877612,1.5387772417535175,1.0490497912740813,0.30700284100349401,1,0,40444.934324227906,1.5707716018196478,15.74067754417382,1.507223847681181,1.0634623214393077,0.34721274904384208,1.0000000030128202,7.7624999844086554E-5,1.0000000030128202,7.7624999844086554E-5,1.1909934335405272,0.77679038079669183,-5.4846964446456763,-138.61268065777159,41.387319342228409,null,77625,6025640625,null,-2.3148813147090328,-23.5348432499088,null,-3.1698151299366426,-115.08228499274362,null,0,0]
[78077,78.076999999999998,31.41841184434961,1.5389624796896979,1.049609132992763,0.30867935876983627,1,0,40680.439770970683,1.5707717449564078,15.831964547407667,1.5075908965069253,1.0641811793164779,0.34907464599177035,1.000000003048009,7.8076999841347075E-5,1.000000003048009,7.8076999841347075E-5,1.1931558807222007,0.78072967944507299,-5.5522732407789945,-138.83857259633655,41.161427403663453,null,78077,6096017929,null,-2.320953008553277,-23.620499939553113,null,-3.2313202322257153,-115.22254613935648,null,0,0]
[78529,78.528999999999996,31.600114228486706,1.5391455873755842,1.0501714217127949,0.31035408593792202,1,0,40915.945217714281,1.5707718864454245,{"$f":"SQRT(1+(A535/Zero2)^2)","v":15.923253659144009},{"$f":"ATAN(A535/Zero2)","v":1.5079537367486078},1.0649037213600909,0.35093402276707236,1.0000000030834018,7.8528999838575693E-5,1.0000000030834018,7.8528999838575693E-5,1.195329548524497,0.78466070194501591,-5.6196135226856399,-139.06406753033724,40.93593246966276,null,78529,6166803841,null,-2.3270473138754029,-23.70625327363814,null,-3.292566208810237,-115.36231363696437,null,0,0]
[78981,78.980999999999995,31.781817660011104,1.5393266013360776,1.0507366527030229,0.3120270159957147,1,0,41151.45066445868,1.5707720263149876,16.014544843325005,1.5083124402831776,1.065629940076086,0.35279087165243234,1.0000000031189991,7.8980999835772219E-5,1.0000000031189991,7.8980999835772219E-5,1.1975144211221169,0.78858344352145915,-5.6867201939019711,-139.28916309322312,40.710836906776876,null,78981,6237998361,null,-2.3331641928779372,-23.792098693369308,null,-3.3535560010240357,-115.50158967781131,null,0,0]
[79433,79.433000000000007,31.963522121060514,1.5395055572660956,1.0513048212177381,0.31369814248538236,1,0,41386.956111203886,1.5707721645927426,16.10583806470953,1.5086670773622095,1.0663598279527351,0.35464518502123049,1.0000000031548006,7.9432999832936476E-5,1.0000000031548006,7.9432999832936476E-5,1.1997104827516782,0.79249789978148444,-5.7535961007919028,-139.51385698796534,40.48614301203466,null,79433,6309601489,null,-2.3393036053962315,-23.8780317382387,null,-3.4142924953956735,-115.64037642537633,null,0,0]
[79895.5,79.895499999999998,32.149448640287758,1.539686576448428,1.0518892240473638,0.31540621581147754,1,0,41627.93237031898,1.5707723044631796,16.199254108517309,1.5090258150673475,1.0671104613384914,0.35653994184203835,1.0000000031916454,7.9895499830001261E-5,1.0000000031916454,7.9895499830001261E-5,1.2019691246441446,0.79649470876620154,-5.8217895839093945,-139.74335244431347,40.256647555686527,null,79895.5,6383290920.25,null,-2.3456089174949915,-23.966047164904296,null,-3.4761806664143995,-115.78188295435672,null,0,{"$f":"IF(AH538>0,W538,0)","v":0}]
[80358,80.358000000000004,32.335376200871536,1.5398655139255164,1.0524766923657165,0.31711238729612834,1,0,41868.908629434874,1.5707724427235694,16.292672213145273,1.5093804389932599,1.0678649203672423,0.35843202811204006,1.000000003228704,8.0357999827031866E-5,1.000000003228704,8.0357999827031866E-5,1.2042394482614553,0.80048283492823047,-5.889747308922761,-139.97242270477852,40.027577295221477,null,80358,6457408164,null,-2.3519377298569482,-24.054145190218382,null,-3.5378095790658159,-115.9228816888056,null,0,0]
[80820.5,80.820499999999996,32.521304784951226,1.5400424053899526,1.0530672210424177,0.31881665019717798,1,0,42109.884888551569,1.5707725794015532,16.386092343346842,1.5097310194102205,1.068623196936157,0.36032143595463068,1.0000000032659766,8.0820499824028088E-5,1.0000000032659766,8.0820499824028088E-5,1.2065214369231205,0.8044622747770509,-5.9574721481970991,-140.20106552479794,39.79893447520206,null,80820.5,6531953220.25,null,-2.3582899922783511,-24.142321338278347,null,-3.5991821559187489,-116.06337486006295,null,0,0]
[81283,81.283000000000001,32.707234375072225,1.540217285723245,1.0536608049318956,0.32051899783189314,1,0,42350.861147669028,1.5707727145241424,16.479514464673915,1.5100776249990862,1.0693852829244455,0.36220815759198172,1.0000000033034631,8.1282999820989738E-5,1.0000000033034631,8.1282999820989738E-5,1.2088150740204031,0.80843302522297944,-6.0249669172801017,-140.42927872958916,39.570721270410843,null,81283,6606926089,null,-2.3646656523025071,-24.230571229871838,null,-3.6603012649775946,-116.20336467255856,null,0,0]
[81756.25,81.756249999999994,32.897486595477169,1.5403941846104034,1.0542713428103756,0.32225892407878265,1,0,42597.438476593801,1.5707728512049115,16.575110045054352,1.5104282423664992,1.0701690170362987,0.36413594416421852,1.0000000033420422,8.1756249817844777E-5,1.0000000033420422,8.1756249817844777E-5,1.2111740631366936,0.81248707127514996,-6.0937952088828453,-140.66234944263866,39.337650557361343,null,81756.25,6684084414.0625,null,-2.3712136660194201,-24.320944200220715,null,-3.7225815428634261,-116.34608953048664,null,0,0]
[82229.5,82.229500000000002,33.087739833511513,1.5405690491793165,1.0548850686300915,0.32399683102446986,1,0,42844.015805519361,1.5707729863124211,16.67070763968616,1.5107748385698538,1.0709567224530154,0.36606090204720643,1.0000000033808454,8.2229499814663183E-5,1.0000000033808454,8.2229499814663183E-5,1.2135452135267222,0.81653201401058595,-6.1623883989811485,-140.89496594727851,39.105034052721493,null,82229.5,6761690670.25,null,-2.3777860596405849,-24.411385404202317,null,-3.7846023393405659,-116.48829194637243,null,0,0]
[82702.75,82.702749999999995,33.277994071721629,1.5407419143105132,1.0555019768301195,0.32573271170245982,1,0,43090.593134445699,1.570773119873679,16.76630721411496,1.5111174823098157,1.0717483904181977,0.3679830232280209,1.0000000034198724,8.2702749811444754E-5,1.0000000034198724,8.2702749811444754E-5,1.2159285076357527,0.82056785139246813,-6.2307493281717763,-141.12712613064809,38.872873869351906,null,82702.75,6839744857.5625,null,-2.3843827701449802,-24.501890447999095,null,-3.8463665580267969,-116.6299742011727,null,0,0]
[83176,83.176000000000002,33.468249293050661,1.5409128140918731,1.0561220618337279,0.32746655921133844,1,0,43337.170463372786,1.5707732519150788,16.861908734667026,1.5114562407327696,1.0725440121573171,0.36990229980117811,1.0000000034591234,8.3175999808189299E-5,1.0000000034591234,8.3175999808189299E-5,1.2183239279916456,0.82459458180318845,-6.2988807806090419,-141.3588279499356,38.641172050064398,null,83176,6918246976,null,-2.3910037323723889,-24.592455032967973,null,-3.9078770482366525,-116.7711385507189,null,0,0]
[83660.5,83.660499999999999,33.663028222748778,1.5410857752659903,1.0567601725076567,0.3292395100010293,1,0,43589.609376981964,1.5707733855477879,16.959784856270403,1.511799095618223,1.0733626339429372,0.37186424603011331,1.0000000034995395,8.3660499804817849E-5,1.0000000034995395,8.3660499804817849E-5,1.2207888356903844,0.82870759927494797,-6.3683969647158314,-141.59556083757735,38.404439162422648,null,83660.5,6999079260.25,null,-2.3978071398609706,-24.685229790291899,null,-3.9705898248548626,-116.91512444084168,null,0,0]
[84145,84.144999999999996,33.857808147908685,1.5412567463952327,1.0574016009381626,0.33101031537857373,1,0,43842.048290591898,1.5707735176416049,17.057662948608872,1.5121380158913331,1.0741853810448605,0.37382319437648703,1.0000000035401904,8.414499980140711E-5,1.0000000035401904,8.414499980140711E-5,1.2232664162221933,0.8328110695442017,-6.4376783624449549,-141.8318091951887,38.168190804811303,null,84145,7080381025,null,-2.4046358210339083,-24.778058130106892,null,-4.0330425414110485,-117.05857221844303,null,0,0]
[84629.5,84.629499999999993,34.052589051448322,1.5414257616187044,1.0580463410911904,0.33277896815038438,1,0,44094.487204202604,1.5707736482229595,17.155542977951335,1.512473068819723,1.0750122439913101,0.37577913670593538,1.0000000035810761,8.4629499797956879E-5,1.0000000035810761,8.4629499797956879E-5,1.2257566511140949,0.83690499220726766,-6.5067277862708739,-142.06757104912791,37.932428950872094,null,84629.5,7162152270.25,null,-2.4114896994938362,-24.870935733711665,null,-4.095238086777039,-117.20148422858249,null,0,0]
[85114,85.114000000000004,34.247370916674171,1.5415928542992985,1.0586943869162675,0.33454546119422107,1,0,44346.926117814044,1.5707737773176809,17.253424911331454,1.5128043201480461,1.0758432132923179,0.37773206500103979,1.0000000036221965,8.5113999794466912E-5,1.0000000036221965,8.5113999794466912E-5,1.228259521987809,0.84098936729840867,-6.575547992510363,-142.30284449620987,37.697155503790128,null,85114,7244392996,null,-2.4183686968142033,-24.963858376330688,null,-4.1571792956961611,-117.34386279285046,null,0,0]
[85609.5,85.609499999999997,34.446576051673425,1.541761786088202,1.0593605586347434,0.33634981919190954,1,0,44605.096358670256,1.570773907832004,17.353531074143767,1.51313922706436,1.0766972861186979,0.37972620653613132,1.0000000036644932,8.5609499790856379E-5,1.0000000036644932,8.5609499790856379E-5,1.2308322681007686,0.8451565986063484,-6.6456964124387516,-142.54295247195478,37.457047528045223,null,85609.5,7328986490.25,null,-2.425429770635422,-25.058932995237161,null,-4.2202666418033292,-117.48892453974747,null,0,0]
[86105,86.105000000000004,34.645782158402859,1.5419287752358888,1.06003017498011,0.33815190344065782,1,0,44863.266599527225,1.5707740368442114,17.453639161046322,1.5134702921950829,1.077555633742878,0.38171717903460445,1.0000000037070356,8.6104999787203805E-5,1.0000000037070356,8.6104999787203805E-5,1.2334181919051779,0.84931384533840559,-6.7156107457225103,-142.78254580432784,37.217454195672161,null,86105,7414071025,null,-2.4325169447534698,-25.154046073755595,null,-4.2830938009690396,-117.6334331836607,null,0,0]
[86600.5,86.600499999999997,34.84498922019656,1.5420938550509129,1.0607032294286427,0.33995170655323526,1,0,45121.436840384929,1.5707741643800865,17.553749139120157,1.5137975811967459,1.0784182459575136,0.38370497429804895,1.0000000037498233,8.6600499783508948E-5,1.0000000037498233,8.6600499783508948E-5,1.2360172740556534,0.85346110891544169,-6.7852937672825515,-143.02162267633602,36.978377323663977,null,86600.5,7499646600.25,null,-2.4396301291656677,-25.249193381786821,null,-4.3456636381168847,-117.77739113769617,null,0,0]
[87096,87.096000000000004,35.044197220767479,1.5422570580848833,1.0613797154397118,0.34174922122021484,1,0,45379.607081243361,1.5707742904648268,17.653860976192412,1.5141211582398533,1.0792851125372582,0.38568958425463346,1.0000000037928565,8.7095999779771563E-5,1.0000000037928565,8.7095999779771563E-5,1.2386294953143306,0.85759839121241299,-6.8547481964266339,-143.26018134153819,36.739818658461814,null,87096,7585713216,null,-2.4467692319598058,-25.344370781593611,null,-4.4079789644668281,-117.92080079315014,null,0,0]
[87603.25,87.603250000000003,35.248130080295972,1.5424222203677291,1.062075790990564,0.34358698306983315,1,0,45643.899421658709,1.5707744180620156,17.756348700200512,1.5144486288443786,1.0801769316845156,0.3877179483032272,1.0000000038371646,8.7603249775901264E-5,1.0000000038371646,8.7603249775901264E-5,1.2413172514659392,0.86182344593135052,-6.9256156220244325,-143.50385851267518,36.49614148732482,null,87603.25,7674329410.5625,null,-2.4541043770022286,-25.44183210823196,null,-4.471511245022203,-118.0670457009327,null,0,0]
[88110.5,88.110500000000002,35.452063890281373,1.5425854825019392,1.0627754488570866,0.34542233140066775,1,0,45908.191762074792,1.5707745441900565,17.85883830649119,1.5147723408588167,1.0810731876183617,0.38974295747056603,1.00000000388173,8.8110499771985889E-5,1.00000000388173,8.8110499771985889E-5,1.2440187368094817,0.86603804578426524,-6.9962490797382317,-143.74698912469213,36.253010875307865,null,88110.5,7763460210.25,null,-2.4614664834735289,-25.539316481506606,null,-4.5347825962647006,-118.21272100295897,null,0,0]
[88617.75,88.617750000000001,35.65599863441534,1.5427468770824764,1.0634786819689117,0.34725525862373174,1,0,46172.484102491595,1.5707746688741779,17.961329762842837,1.5150923585568614,1.0819738693131251,0.39176460350665399,1.0000000039265529,8.861774976802514E-5,1.0000000039265529,8.861774976802514E-5,1.2467339310618113,0.8702421942204176,-7.0666513146563474,-143.98957152373197,36.010428476268032,null,88617.75,7853105615.0625,null,-2.468855447007857,-25.636819747561695,null,-4.5977958676484914,-118.35782919922769,null,0,0]
[89125,89.125,35.859934296760393,1.5429064359632272,1.0641854832382776,0.34908575723511859,1,0,46436.776442909111,1.5707747921390338,18.063823037764532,1.5154087447565296,1.0828789657254607,0.39378287829883668,1.0000000039716328,8.9124999764018814E-5,1.0000000039716328,8.9124999764018814E-5,1.2494628140617097,0.87443589516010611,-7.1368250166055027,-144.2316041268312,35.768395873168799,null,89125,7943265625,null,-2.4762711614439805,-25.734337843781667,null,-4.6605538551615222,-118.5023727693909,null,0,0]
[89644,89.644000000000005,36.068594883429519,1.5430678233776807,1.0649123426214118,0.35095613635076217,1,0,46707.190882883588,1.5707749168153802,18.168692329377919,1.5157287651464577,1.0838095856602337,0.39584440704685325,1.0000000040180232,8.9643999759872201E-5,1.0000000040180232,8.9643999759872201E-5,1.2522690563879377,0.87871593075841603,-7.2083904446703659,-144.47867257718565,35.521327422814352,null,89644,8036046736,null,-2.4838862294147375,-25.834126066229373,null,-4.7245042152556316,-118.64968273380705,null,0,0]
[90163,90.162999999999997,36.277256398730565,1.5432273542422652,1.0656429223169208,0.35282395741742878,1,0,46977.605322858784,1.570775040056392,18.273563460345695,1.5160451124042011,1.0847448037635363,0.39790238981412274,1.0000000040646833,9.0162999755677301E-5,1.0000000040646833,9.0162999755677301E-5,1.2550895866759586,0.88298503902353087,-7.2797221553036202,-144.72516233340639,35.274837666593612,null,90163,8129366569,null,-2.4915290716584999,-25.933921491679207,null,-4.7881930836451216,-118.79640680108736,null,0,0]
[90682,90.682000000000002,36.485918826731123,1.543385060401534,1.0663772146783976,0.35468921267339942,1,0,47248.019762834701,1.5707751618867143,18.378436399180657,1.5163578493459176,1.0856846081526621,0.39995681835451802,1.0000000041116126,9.0681999751433828E-5,1.0000000041116126,9.0681999751433828E-5,1.2579243837327794,0.88724322564036373,-7.3508228587840083,-144.97107192033027,35.028928079669726,null,90682,8223225124,null,-2.4991995690755653,-26.033720049974228,null,-4.8516232897084413,-118.94254756622557,null,0,0]
[91201,91.200999999999993,36.69458215186107,1.5435409729760725,1.0671152120416776,0.3565518944496795,1,0,47518.434202811288,1.5707752823304304,18.483311115109696,1.5166670373649451,1.0866289869278414,0.40200768457037883,1.0000000041588111,9.1200999747141498E-5,1.0000000041588111,9.1200999747141498E-5,1.2607734265027173,0.89149049677956793,-7.421695210628565,-145.2163999338278,34.783600066172198,null,91201,8317622401,null,-2.5068976008919797,-26.13351776095336,null,-4.9147976097365866,-119.08810760525331,null,0,0]
[91732,91.731999999999999,36.9080709751575,1.5436986659148302,1.0678740994056901,0.35845497269039989,1,0,47795.100999782277,1.5707754041484505,18.59061248779814,1.5169797638629607,1.0875999228805646,0.40410227454261671,1.0000000042073798,9.1731999742699087E-5,1.0000000042073798,9.1731999742699087E-5,1.2637030648712817,0.89582468068991017,-7.4939726106843176,-145.46679698072467,34.533203019275334,null,91732,8414759824,null,-2.5148019909499246,-26.235617997469895,null,-4.9791706197343917,-119.23643483969229,null,0,0]
[92263,92.263000000000005,37.121560705692623,1.5438545450423633,1.0686368487954039,0.3603553411262993,1,0,48071.767796753957,1.5707755245642756,18.697915657741394,1.5172889010555985,1.0885756219440559,0.40619311887876891,1.0000000042562305,9.2262999738204932E-5,1.0000000042562305,9.2262999738204932E-5,1.2666475711828253,0.90014745311740108,-7.5660164314557941,-145.71658249703731,34.283417502962692,null,92263,8512461169,null,-2.5227349425474381,-26.337709196556801,null,-5.0432814889083568,-119.38415958097674,null,0,0]
[92794,92.793999999999997,37.335051327903088,1.5440086414664307,1.0694034519470779,0.36225299184440674,1,0,48348.434593726328,1.5707756436019769,18.805220594173893,1.5175945103263346,1.0895560713221977,0.40828020938531884,1.0000000043053632,9.2793999733658763E-5,1.0000000043053632,9.2793999733658763E-5,1.2696069233387071,0.90445882219966867,-7.6378293477362869,-145.9657551996518,34.034244800348205,null,92794,8610726436,null,-2.5306963213316154,-26.439787373125213,null,-5.1071330264046715,-119.53128453108158,null,0,0]
[93325,93.325000000000003,37.548542826579443,1.5441609855876515,1.070173900578957,0.36414791703266064,1,0,48625.101390699383,1.5707757612850783,18.912527267027777,1.5178966516681955,1.0905412582027012,0.41036353802895481,1.0000000043547776,9.332499972906024E-5,1.0000000043547776,9.332499972906024E-5,1.27258109939419,0.90875879657317016,-7.709413980094606,-146.2143138765519,33.785686123448102,null,93325,8709555625,null,-2.5386859914005173,-26.541848630900873,null,-5.1707279886940878,-119.67781237426468,null,0,0]
[93868.5,93.868499999999997,37.767060911813132,1.5443151323088291,1.0709664596189929,0.36608461911436446,1,0,48908.281059541601,1.5707758803596834,19.022361759048895,1.5182023754173424,1.0915545295757894,0.41249200529258812,1.0000000044056476,9.3868499724298972E-5,1.0000000044056476,9.3868499724298972E-5,1.2756406177184114,0.91314820375627204,-7.7824500213296988,-146.46808667682279,33.531913323177207,null,93868.5,8811295292.25,null,-2.5468928969252609,-26.646290964007463,null,-5.2355571244044388,-119.82717398168492,null,0,0]
[94412,94.412000000000006,37.985579884113179,1.54446750551937,1.0717630297061926,0.36801844959717667,1,0,49191.460728384503,1.5707759980633391,19.132198008619273,1.5185045889286837,1.0925727369124358,0.4146165149776585,1.0000000044568129,9.4411999719482261E-5,1.0000000044568129,9.4411999719482261E-5,1.2787156200564673,0.91752569331578737,-7.8552522915357317,-146.72121385409514,33.27878614590486,null,94412,8913625744,null,-2.5551291486025605,-26.750707587826994,null,-5.3001231429331694,-119.97591567539365,null,0,0]
[94955.5,94.955500000000001,38.204099728258093,1.5446181356445199,1.072563601903799,0.36994940043138641,1,0,49474.640397228082,1.570776114419586,19.242035985641905,1.5188033522582767,1.0935958664255525,0.41673705898715574,1.0000000045082735,9.4955499714609754E-5,1.0000000045082735,9.4955499714609754E-5,1.2818060833828615,0.92189127608170995,-7.9278234330005146,-146.97369432980017,33.026305670199832,null,94955.5,9016546980.25,null,-2.5633945960879756,-26.855094598825122,null,-5.3644288369125359,-120.12404028035645,null,0,0]
[95499,95.498999999999995,38.422620429372628,1.5447670524176971,1.0733681672568836,0.37187746367713337,1,0,49757.820066072323,1.5707762294514289,19.3518756607026,1.5190987241011817,1.0946239043130725,0.41885362939692794,1.0000000045600295,9.5498999709681167E-5,1.0000000045600295,9.5498999709681167E-5,1.2849119848441437,0.92624496339496065,-8.0001660342665151,-147.22552709656298,32.774472903437015,null,95499,9120059001,null,-2.5716890876157237,-26.959448181320226,null,-5.4284769466507923,-120.27155060488008,null,0,0]
[96611.5,96.611500000000007,38.869917024365805,1.5450666514799876,1.0750274611354445,0.37581501381485677,1,0,50337.465662374649,1.5707764608762036,19.576713657160866,1.5196929900103466,1.0967434618160954,0.42317365204899893,1.0000000046668909,9.6611499699416435E-5,1.0000000046668909,9.6611499699416435E-5,1.2913175578332827,0.93511956048862266,-8.1475433494811966,-147.73898446776789,32.261015532232108,null,96611.5,9333781932.25,null,-2.5887571579171844,-27.172931578087958,null,-5.5587861915640122,-120.57158832087147,null,0,0]
[97724,97.724000000000004,39.31721702892213,1.5453594336734771,1.0767033710406673,0.37974036690738922,1,0,50917.111258679608,1.5707766870318514,19.801558410171971,1.5202737604585581,1.0988834082177943,0.42747692927837572,1.00000000477499,9.7723999688912583E-5,1.00000000477499,9.7723999688912583E-5,1.2977875275746562,0.943944475251143,-8.2939947715814739,-148.24971700148899,31.750282998511011,null,97724,9549980176,null,-2.6059449463552156,-27.386228463865425,null,-5.6880498252262583,-120.86908771036929,null,0,0]
[98862,98.861999999999995,39.774773160445989,1.5456521135105423,1.0784348059791165,0.38374300825503566,1,0,51510.043113599146,1.5707769131050682,20.031563661517136,1.5208543533164358,1.101093376401834,0.4318614539972932,1.0000000048868474,9.8861999677917663E-5,1.0000000048868474,9.8861999677917663E-5,1.3044722282888943,0.95292038667180889,-8.4428661840894073,-148.76933069869557,31.230669301304431,null,98862,9773695044,null,-2.6236491599074792,-27.6041906583486,null,-5.8192170241819277,-121.1708044156892,null,0,0]
[100000,100,40.232332621637532,1.5459381361176505,1.0801834631196801,0.38773275398359974,1,0,52102.974968521245,1.5707771340328582,20.261575511958316,1.5214217644415982,1.1033244270336029,0.4362283303434184,1.000000005,9.9999999666666668E-5,1.000000005,9.9999999666666668E-5,1.3112239146048017,0.9618445669254897,-8.5908107360989483,-149.28608163729288,30.713918362707119,null,100000,10000000000,null,-2.6414757642000364,-27.821896638395206,null,-5.9493349718989101,-121.46991457683646,null,0,0]
[101165,101.16500000000001,40.700751394874246,1.5462242831912296,1.0819913613916179,0.39180373457468726,1,0,52709.974626682204,1.5707773550536439,20.497051189423338,1.5219894462481627,1.1056301166258309,0.44068047126371712,1.0000000051171785,1.0116499965488042E-4,1.0000000051171785,1.0116499965488042E-4,1.3182049743277573,0.97092704188904089,-8.741326110682758,-149.81212316100968,30.18787683899032,null,101165,10234357225,null,-2.6598505512276285,-28.044472415115859,null,-6.0814755594551295,-121.77344707341511,null,0,0]
[102330,102.33,41.169173424858727,1.5465039187359382,1.0838171313835196,0.39586106648477787,1,0,53316.974284845681,1.570777571041903,20.732533322274627,1.5225442326596414,1.1079576300649046,0.44511399431661169,1.0000000052357143,1.0232999964281957E-4,1.0000000052357143,1.0232999964281957E-4,1.3252558244347263,0.97995561090684868,-8.8909115592006636,-150.33515686838106,29.664843131618937,null,102330,10471428900,null,-2.6783504408093646,-28.266720029981336,null,-6.2125611183913021,-122.07429991550356,null,0,0]
[103520,103.52,41.647650677801657,1.5467830608279884,1.0857004383380917,0.39999130750903233,1,0,53936.999686749099,1.5707777866460959,20.973075158348419,1.5230980622091463,1.1103574787901302,0.4496233770141993,1.0000000053581952,1.0351999963021309E-4,1.0000000053581952,1.0351999963021309E-4,1.3325298226184832,0.98912244848113873,-9.0427674048286484,-150.86630693043236,29.133693069567641,null,103520,10716390400,null,-2.6973747916478992,-28.493368884475455,null,-6.3453926131807492,-122.37886930503767,null,0,0]
[104710,104.71,42.126131102222935,1.5470558617923875,1.0876022018121783,0.4041071743976235,1,0,54557.025088654947,1.5707779973497256,21.213623281544873,1.5236393318174193,1.1127798084610891,0.45411321838465696,1.0000000054820919,1.0470999961731343E-4,1.0000000054820919,1.0470999961731343E-4,1.3398762153613806,0.99823340737455235,-9.1936936870706987,-151.3943153526283,28.605684647371703,null,104710,10964184100,null,-2.7165262281840583,-28.71961745424041,null,-6.4771674588866421,-122.6806973394456,null,0,0]
[105930,105.93,42.616677238939246,1.5473291807107219,1.0895709680454522,0.40831181358748775,1,0,55192.681383048279,1.5707782084506705,21.460241948686463,1.524181649807222,1.1152863901219394,0.45869590698258961,1.0000000056105824,1.0592999960378067E-4,1.0000000056105824,1.0592999960378067E-4,1.347482748952346,1.0075162516881442,-9.3474800554182469,-151.93237347267356,28.067626527326439,null,105930,11221164900,null,-2.736290562499486,-28.951125733212699,null,-6.6111894929187613,-122.98731708136893,null,0,0]
[107150,107.15,43.107226486802169,1.5475962790494089,1.0915589271106991,0.41250121154818137,1,0,55828.337677444018,1.5707784147444639,21.706866784055769,1.5247116447449345,1.1178162886215368,0.46325794748215116,1.0000000057405611,1.0714999958993258E-4,1.0000000057405611,1.0714999958993258E-4,1.3551649354254913,1.0167407937919197,-9.5003297021323956,-152.46713070185686,27.53286929814314,null,107150,11481122500,null,-2.7561847104288706,-29.18215674673878,null,-6.7441449917035268,-123.29111319787638,null,0,0]
[108400,108.4,43.609841538145744,1.5478637129421329,1.0936155675283354,0.41677775305743126,1,0,56479.624864327299,1.5707786212948609,21.959562344847438,1.5252423248879032,1.1204324165039676,0.46791070175224553,1.00000000587528,1.0839999957541311E-4,1.00000000587528,1.0839999957541311E-4,1.3631142696275029,1.0261319393523851,-9.6559864367303856,-153.01161642691281,26.988383573087191,null,108400,11750560000,null,-2.7767006915799435,-29.418346031799061,null,-6.879285745150443,-123.59948125759576,null,0,0]
[109650,109.65,44.112459637427953,1.5481250525607453,1.0956921335729803,0.4210381623561732,1,0,57130.912051212938,1.5707788231359465,22.21226394921138,1.5257609304280852,1.1230726863366822,0.47254167924648455,1.0000000060115612,1.0964999956055487E-4,1.0000000060115612,1.0964999956055487E-4,1.3711425711964498,1.035462378248724,-9.8106997285046393,-153.55264288431999,26.447357115680006,null,109650,12023122500,null,-2.7973488579386863,-29.653979153466082,null,-7.0133508705659544,-123.90494621305957,null,0,0]
[110925,110.925,44.62513313187678,1.5483855541688243,1.0978306410535745,0.42536709545412621,1,0,57795.224981838641,1.5707790243274287,22.470025600291496,1.5262778910185706,1.1257904564415664,0.4772427955135608,1.0000000061521777,1.1092499954504645E-4,1.0000000061521777,1.1092499954504645E-4,1.3794125614724755,1.0449171606409748,-9.9675550345368187,-154.10093099502842,25.899069004971579,null,110925,12304355625,null,-2.8185440047275883,-29.893725142257196,null,-7.1490110298092313,-124.2135613870949,null,0,0]
[112200,112.2,45.1378095858447,1.5486401382253276,1.0999896412921726,0.42967911590287311,1,0,58459.537912466621,1.5707792209463771,22.727793120235606,1.5267831255128972,1.1285329869157998,0.48192116570594745,1.0000000062944199,1.1219999952917739E-4,1.0000000062944199,1.1219999952917739E-4,1.3877642495595293,1.0543093490589697,-10.123467859602904,-154.64563104762738,25.354368952372624,null,112200,12588840000,null,-2.8398722933197784,-30.132839470800555,null,-7.2835955662831218,-124.51922016326854,null,0,0]
[113510,113.51,45.664562488823094,1.5488957568753083,1.1022291259217911,0.43409182655771672,1,0,59142.08688432983,1.5707794183621251,22.992642516581363,1.5272904300950634,1.1313764025111974,0.48670422993654261,1.0000000064422601,1.1350999951249271E-4,1.0000000064422601,1.1350999951249271E-4,1.3964300566056951,1.0638944803983124,-10.282698490149096,-155.20155402884558,24.798445971154422,null,113510,12884520100,null,-2.8619224039595839,-30.377833764236986,null,-7.4207760861895133,-124.83022390852061,null,0,0]
[114820,114.82,46.191318307512709,1.5491455455015375,1.1044899858945934,0.43848655710686285,1,0,59824.635856195287,1.5707796112731767,23.25749769549558,1.5277861804858024,1.1342455712834532,0.49146320426505402,1.0000000065918162,1.1481999949541845E-4,1.0000000065918162,1.1481999949541845E-4,1.4051816342372543,1.0734141800145733,-10.440973065119064,-155.75370569548303,24.246294304516965,null,114820,13183632400,null,-2.884108309509787,-30.622109556258692,null,-7.5568647556092756,-125.1381748406066,null,0,0]
[116155,116.155,46.728129615778819,1.5493943072110488,1.106815847550054,0.44294659736277819,1,0,60520.210571800875,1.5707798033890692,23.527413109517685,1.5282799084705923,1.1371957884334618,0.49628818131055119,1.000000006745992,1.1615499947761287E-4,1.000000006745992,1.1615499947761287E-4,1.4141882284433018,1.0830485882359269,-10.60130372228798,-156.31252494701204,23.687475052987963,null,116155,13491984025,null,-2.9068548184451135,-30.870282855170618,null,-7.6944489038428632,-125.4488972830884,null,0,0]
[117490,117.49,47.264943750009323,1.549637418286399,1.1091636333501891,0.44738784436537221,1,0,61215.785287408646,1.570779991139063,23.797334128652974,1.5287624363615504,1.1401723425959382,0.50108807727430671,1.0000000069019499,1.1748999945939327E-4,1.0000000069019499,1.1748999945939327E-4,1.4232834188036099,1.0926157637044389,-10.76067952936727,-156.86744948999311,23.132550510006894,null,117490,13803900100,null,-2.9297372949126146,-31.117660581911348,null,-7.8309422344546542,-125.75652058919343,null,0,0]
[118860,118.86,47.815834501289658,1.5498812278314331,1.1115956197529779,0.45192593153573002,1,0,61929.596044251775,1.5707801794265313,24.074337358554292,1.5292463652618686,1.1432540997942708,0.50598771162675804,1.0000000070638497,1.1885999944026054E-4,1.0000000070638497,1.1885999944026054E-4,1.4327089266179949,1.1023642576287895,-10.923259930463452,-157.43288664396542,22.567113356034582,null,118860,14127699600,null,-2.9533583723695829,-31.370672656257867,null,-7.969901558093869,-126.06902416403625,null,0,0]
[120230,120.23,{"$f":"SQRT(1+(A589/pole1)^2)","v":48.366728030143712},{"$f":"ATAN(A589/pole1)","v":1.5501194834442467},{"$f":"SQRT(1+(A589/Zero1)^2)","v":1.1140503983939729},{"$f":"ATAN(A589/Zero1)","v":0.45644411232032706},{"$f":"IF(VIN_nom>Vout, 1, SQRT(1+(A589/z_RHP)^2))","v":1},{"$f":"IF(VIN_nom>Vout, 0, -ATAN(A589/z_RHP))","v":0},{"$f":"SQRT(1+(A589/Pole2)^2)","v":62643.406801097044},{"$f":"ATAN(A589/Pole2)","v":1.5707803634229935},24.351346098090701,1.5297192844043579,{"$f":"SQRT(1+(A589/pole4)^2)","v":1.146363154481276},{"$f":"ATAN(A589/pole4)","v":0.51086088581671152},{"$f":"SQRT(1+(A589/Zero3)^2)","v":1.0000000072276265},{"$f":"ATAN(A589/Zero3)","v":1.2022999942068166E-4},{"$f":"SQRT(1+(A589/pole5)^2)","v":1.0000000072276265},{"$f":"ATAN(A589/pole5)","v":1.2022999942068166E-4},{"$f":"SQRT((1-(Z589/pterm2))^2+(A589/pterm1)^2)","v":1.4422272473181215},{"$f":"IF((ATAN((A589/pterm1)/(1-A589^2/pterm2))>0),ATAN((A589/pterm1)/(1-A589^2/pterm2)),PI()+ATAN((A589/pterm1)/(1-A589^2/pterm2)))","v":1.1120427555847179},{"$f":"20*LOG10(((E589*K589*G589*O589)/(C589*I589*S589*M589*Q589))*Adc)","v":-11.08487249841895},{"$f":"((F589+L589+H589+R589)-(D589+J589+T589+N589))*radconv","v":-157.99425017053738},{"$f":"IF(V589>0,V589,V589+180)","v":22.005749829462616},null,{"$f":"IF(U589<0,A589,1000000000)","v":120230},{"$f":"A589^2","v":14455252900},null,{"$f":"20*LOG10((K589/(I589*M589))*AEA*Afb)","v":-2.9771172011680713},-31.622799241767545,null,{"$f":"20*LOG10((E589*G589/(C589*S589))*Am)","v":-8.1077552972508773},{"$f":"(F589+H589-(D589+T589))*radconv","v":-126.37833960031537},null,{"$f":"SUM((U590<0)*(U589>0))*A589","v":0},0]
[126030,{"$f":"A590/1000","v":126.03},50.699006693068796,1.5510707953179128,1.1246919316537505,0.47535050499594195,1,0,65665.379348347371,1.5707810980699588,25.52414073592691,1.5316077008472677,1.1598228984426489,0.53119843753983587,1.0000000079417803,1.2602999933273163E-4,1.0000000079417803,1.2602999933273163E-4,1.4835466513586337,1.1522517797210137,-11.758750572423981,-160.32607456765987,19.673925432340127,null,126030,15883560900,null,-3.0791650355870277,{"$f":"(L590-(J590+N590))*radconv","v":-32.679898922368203},null,-8.6795855368369548,-127.65339663235372,null,0,0]
[131830,131.83000000000001,53.031327202541732,1.5519384304295616,1.135727871319927,0.49389599232090564,1,0,68687.35189563001,1.5707817680737866,26.697018398486211,1.5333301957379093,1.1737512473890472,0.55106137345520767,1.0000000086895744,1.3182999923630226E-4,1.0000000086895744,1.3182999923630226E-4,1.5265087182730548,1.1912470598574914,-12.416820502995998,-162.58655000241333,17.413449997586667,null,131830,17379148900,null,-3.1834265082629072,-33.719308021170484,null,-9.2333939947330883,-128.87479528382093,null,0,0]
[144540,144.54,58.142447836954396,1.5535963404597055,1.1612354269313552,0.53326517585704436,1,0,75309.640012269243,1.5707830482823468,29.267479794608825,1.5366220596458502,1.2058320196287582,0.59293728213407437,1.0000000104459057,1.4453999899343253E-4,1.0000000104459057,1.4453999899343253E-4,1.6263298795601364,1.2726268569815797,-13.80854353642964,-167.29862015180333,12.701379848196666,null,144540,20891811600,null,-3.4186660481042956,-35.930084296161922,null,-10.389877488325345,-131.37681738756399,null,0,0]
[158490,158.49,63.752367412870477,1.5551099914955855,1.1912082089912346,0.5744637647422306,1,0,82578.005018454889,1.5707842170327415,32.089021644112542,1.5396279745629378,1.2433422232074676,0.63632708031291807,1.0000000125595401,1.5848999867295902E-4,1.0000000125595401,1.5848999867295902E-4,1.7447460679162983,1.3558769575729415,-15.264658087409497,-172.10781387582566,7.8921861241743443,null,158490,25119080100,null,-3.6855967764000748,-38.243977334518497,null,-11.579061311009424,-133.8729173493366,null,0,0]
[173780,173.78,69.901300544448446,1.5564899533071475,1.226261120223664,0.6172262012110229,1,0,90544.549889141766,1.5707852825078441,35.181870386554465,1.5423687676743303,1.2869769816731544,0.68088699907567174,1.0000000150997441,1.7377999825064433E-4,1.0000000150997441,1.7377999825064433E-4,1.8850569351148176,1.4404019133607444,-16.784687653248223,-176.97494036542415,3.0250596345758538,null,173780,30199488400,null,-3.9859083050182633,-40.640097787233287,null,-12.798779348229958,-136.34479943866572,null,0,0]
[190550,190.55,76.645548763405571,1.5577488845190841,1.2671328983500596,0.66131841365209465,1,0,99282.218789267485,1.5707862544978406,38.574345126098713,1.5448694565062493,1.3375691229862736,0.72631776810363369,1.0000000181546511,1.9054999769375417E-4,1.0000000181546511,1.9054999769375417E-4,2.0515012227392098,1.5257515199102611,-18.370382862863323,-181.86975362240571,-1.8697536224057103,null,190550,36309302500,null,-4.321407867062506,-43.099865890359951,null,-14.048974995800819,-138.78080544271234,null,0,0]
[208930,208.93,84.037393043237302,1.5588965811598425,1.314570277652251,0.70639799348480237,1,0,108858.74558627482,1.5707871405784413,42.292744111269108,1.5471494052426118,1.3959443523935473,0.77222365133701998,1.0000000218258722,2.0892999695994706E-4,1.0000000218258722,2.0892999695994706E-4,2.2489508376202578,1.6113420813417745,-20.020554713928327,-186.75519966749562,-6.7551996674956172,null,208930,43651744900,null,-4.6929362570273874,-45.599498585888554,null,-15.327618456900938,-141.16767188866024,null,0,0]
[229090,229.09,92.145201900359496,1.5599436767420669,1.3694466837902666,0.75214959880042942,1,0,119362.70533758988,1.5707879489686971,46.371459503738187,1.5492296662875418,1.4630683260947068,0.81825628664548267,1.0000000262411137,2.2908999599228225E-4,1.0000000262411137,2.2908999599228225E-4,2.4835912641513986,1.696711269051786,-21.735673235822397,-191.60229087572264,-11.602290875722645,null,229090,52482228100,null,-5.1012748544353146,-48.117830450995882,null,-16.634398381387076,-143.49758631464084,null,0,0]
[251190,251.19,101.03332304340627,1.5608984406511139,1.4326286899233578,0.79817102148271102,1,0,130877.46280314372,1.5707886860599787,50.842862119253851,1.5511266141910431,1.539883614433837,0.86400152376267725,1.0000000315482076,2.5118999471693726E-4,1.0000000315482076,2.5118999471693726E-4,2.7625959786411007,1.7812876332189778,-23.513291745493312,-196.3771281564367,-16.377128156436697,null,251190,63096416100,null,-5.5460804095419682,-50.630194596899834,null,-17.967211335951344,-145.76132568610652,null,0,0]
[275420,275.42,110.77817014585328,1.5617691549211317,1.5050757661142276,0.84408101216130083,1,0,143502.01363535514,1.5707893582515662,{"$f":"SQRT(1+(A599/Zero2)^2)","v":55.745393821285099},{"$f":"ATAN(A599/Zero2)","v":1.5528566626889888},1.6274344135513945,0.90908981916613862,1.0000000379280876,2.7541999303589765E-4,1.0000000379280876,2.7541999303589765E-4,3.0948155182933763,1.8645763235089283,-25.351530734694748,-201.05155293790204,-21.051552937902045,null,275420,75856176400,null,-6.0266749717013059,-53.114477668251766,null,-19.32485576299344,-147.9528556728628,null,0,0]
[302000,302,121.46822308908351,1.5625636279796884,1.5878441681034983,0.88952028994830368,1,0,157350.98437913071,1.5707899715756779,61.123568005190975,1.5544352953969947,1.7268726144312017,0.95319469714804994,1.0000000456019988,3.0199999081879784E-4,1.0000000456019988,3.0199999081879784E-4,3.491142970549745,1.9461386398650122,-27.24873895550575,-205.60185714141394,-25.601857141413944,null,302000,91204000000,null,-6.5420462976000051,-55.551087184652019,null,-20.706692657905744,-150.06807328166857,null,0,0]
[331130,331.13,133.18391868710094,1.5632878422410326,1.6819253332859421,0.93408210400569835,1,0,172528.58098438598,1.5707905306537917,67.017852501261657,1.5558743757861626,1.8392669219758324,0.99596304389928636,1.000000054823537,3.3112998789752197E-4,1.000000054823537,3.3112998789752197E-4,3.9641005912392533,2.0254507970952451,-29.199969822835957,-210.00075510735851,-30.000755107358515,null,331130,109647076900,null,-7.0899309894440545,-57.91911175309275,null,-22.110038833391901,-152.10061570506417,null,0,0]
[363080,363.08,146.03384730325314,1.5639485457231765,1.7885265470915914,0.977472965418405,1,0,189175.48148350744,1.5707910406976067,73.482880195285972,1.5571872947913241,1.9659423704198629,1.0371664242067031,1.0000000659135411,3.630799840454084E-4,1.0000000659135411,3.630799840454084E-4,4.5296300495497945,2.1021775480230716,-31.20327548080088,-214.23237010763344,-34.232370107633443,null,363080,131827086400,null,-7.6686141297661869,-60.204696054511508,null,-23.5346613510347,-154.04847700385719,null,0,{"$f":"IF(AH602>0,W602,0)","v":0}]
[398110,398.11,160.12257801856441,1.5645510707358115,1.9088166498096515,1.0193910035821196,1,0,207427.15361138625,1.5707915058253052,80.571261689825917,1.5583846349024799,2.1081780718834562,1.0765784843264903,1.0000000792457828,3.9810997896764209E-4,1.0000000792457828,3.9810997896764209E-4,5.2063424614272895,2.1759447487628196,-33.254145404818438,-218.27927659992289,-38.279276599922895,null,398110,158491572100,null,-8.275479623478919,-62.39426487863625,null,-24.978665781339519,-155.90782174288952,null,0,0]
[436520,436.52,175.57076795657605,1.5651005870167554,2.0440887781101553,1.0596062404501161,1,0,227439.90629289718,1.5707919300291033,88.34370250108887,1.5594766590900055,2.2674032734135494,1.1140468286406362,1.0000000952748507,4.3651997227374997E-4,1.0000000952748507,4.3651997227374997E-4,6.0169308544162323,2.246477174661202,-35.348815201564221,-222.12984173818782,-42.129841738187821,null,436520,190549710400,null,-8.9080217283097944,-64.478498803577253,null,-26.440793473254427,-157.67635368672364,null,0,0]
[478630,478.63,192.50711850845352,1.5656016903308694,2.1956960921947557,1.0979339457780242,1,0,249380.46904790701,1.570792316857776,96.864956091354003,1.5604724924159239,2.4451219651459017,1.1494629807336536,1.0000001145433319,4.7862996345075299E-4,1.0000001145433319,4.7862996345075299E-4,6.988518002692774,2.3135502755606585,-37.482987511420703,-225.77529112776617,-45.775291127766167,null,478630,229086676900,null,-9.563550492059754,-66.450659964330825,null,-27.919437019360949,-159.35205464032092,null,0,0]
[524810,524.80999999999995,211.08044111571942,1.5660587787044578,2.3651630853323753,1.13425925725651,1,0,273441.62288376212,1.570792669707181,106.20989456030897,1.5613808690408568,2.6430436460376741,1.1827813746157056,1.0000001377127585,5.2480995181798282E-4,1.0000001377127585,5.2480995181798282E-4,8.1542036590633131,2.3770353429482052,-39.653317592743093,-229.21195125368831,-49.211951253688312,null,524810,275425536100,null,-10.239704524457395,-68.307637386013539,null,-29.413613068285699,-160.9343832629948,null,0,0]
[575440,575.44000000000005,231.44356953244858,1.5664756057073961,2.5540450767749086,1.1684963082843478,1,0,299821.35910530487,1.5707929914754819,116.4554143358247,1.5622092439574491,2.8629183980408315,1.2139788685890704,1.000000165565583,5.7543993648463459E-4,1.000000165565583,5.7543993648463459E-4,9.5531492975214061,2.4368318480229232,-41.85536846348004,-232.43742242998502,-52.43742242998502,null,575440,331131193600,null,-10.933861982646091,-70.047678173450819,null,-30.921506480833955,-162.42271453629576,null,0,0]
[630960,630.96,253.77346951974829,1.5668557943591652,2.7641159086838707,1.2006205268604342,1,0,328748.93080235319,1.5707932849599087,127.69055410503441,1.5629648138910555,3.106755317315578,1.2430826476666657,1.000000199055241,6.3095991626941511E-4,1.000000199055241,6.3095991626941511E-4,11.233082571438743,2.4929284973474086,-44.08589980160427,-235.45379324075316,-55.453793240753157,null,630960,398110521600,null,-11.643877476720366,-71.671927731430557,null,-32.442022324883901,-163.81801684960814,null,0,0]
[691830,691.83,278.25515105556167,1.567202495202511,2.9972239003721985,1.230631928867846,1,0,360464.01165971695,1.5707935525928469,140.00840040091188,1.5636538374891644,3.3766535646942111,1.2701357675736116,1.0000002393143459,6.9182988962345599E-4,1.0000002393143459,6.9182988962345599E-4,13.250695550903677,2.5453436108059648,-46.341009380817937,-238.26437504145997,-58.264375041459971,null,691830,478628748900,null,-12.367511389456551,-73.182494516567246,null,-33.973497991361384,-165.12151945775443,null,0,0]
[758580,758.58,305.1017781161915,1.5675187261312067,3.2554857414639842,1.2585744782146147,1,0,395242.74744467722,1.5707937967041954,153.51620570626773,1.5642823104569958,3.6750260384483484,1.2952144378028958,1.0000002877217669,7.5857985449337743E-4,1.0000002877217669,7.5857985449337743E-4,15.674998054541526,2.5941629169763694,-48.617999663627351,-240.87572640454877,-60.875726404548772,null,758580,575443616400,null,-13.103026964474886,-74.58340161606155,null,-35.514972699152466,-166.33578821262296,null,0,0]
[831760,831.76,334.53455886377213,1.567807094553392,3.5410988335815312,1.2845031605724126,1,0,433371.70451950718,1.5707940193069145,168.32527028828443,1.5648554132248749,4.0043808262266349,1.3183985331085009,1.000000345912289,8.3175980818937605E-4,1.000000345912289,8.3175980818937605E-4,18.587792530162428,2.6394852635782939,-50.913416123817768,-243.29475810604924,-63.294758106049244,null,831760,691824697600,null,-13.848557018741893,-75.878928814751717,null,-37.064859105075875,-167.46348561792985,null,0,0]
[912010,912.01,366.81089941544559,1.568070123074417,3.8566160785169532,1.308504501587703,1,0,475184.34192394285,1.5707942223484497,184.56510769317632,1.5653781580777744,4.3676372929975198,1.3397905070956306,1.0000004158810336,9.1200974714163261E-4,1.0000004158810336,9.1200974714163261E-4,22.088895686524687,2.6814609063642192,-53.225247188889277,-245.53081256560023,-65.530812565600229,null,912010,831762240100,null,-14.602806653629841,-77.074659200623941,null,-38.622440535259429,-168.50840767442202,null,0,0]
[1000000,1000,402.20027202602432,1.5683100007035036,4.2047153767790872,1.3306670187407508,1,0,521029.74959020829,1.5707944075186926,202.37130286352087,1.5658548946081832,4.7678589669685936,1.3594895930819666,1.0000004999998751,9.9999966666686679E-4,1.0000004999998751,9.9999966666686679E-4,26.296953886523674,2.7202415977815608,-55.550832799853545,-247.59303644685505,-67.593036446855052,null,1000000,1000000000000,null,-15.364364802003422,-78.176029307506084,null,-40.186467997850116,-169.47430289982896,null,0,0]
[]
[]
["Pole/Zero Locations for Chart"]
[{"$f":"Q4*1000","v":46241.5},null,{"$f":"SQRT(1+(A617/pole1)^2)","v":18.625151187605837},{"$f":"ATAN(A617/pole1)","v":1.5170796581202806},{"$f":"SQRT(1+(A617/Zero1)^2)","v":1.0176765993604668},{"$f":"ATAN(A617/Zero1)","v":0.18665520283266734},{"$f":"IF(VIN_nom>Vout, 1, SQRT(1+(A617/z_RHP)^2))","v":1},{"$f":"IF(VIN_nom>Vout, 0, -ATAN(A617/z_RHP))","v":0},{"$f":"SQRT(1+(A617/Pole2)^2)","v":24093.197186383983},{"$f":"ATAN(A617/Pole2)","v":1.5707548213030122},{"$f":"SQRT(1+(A617/Zero2)^2)","v":9.4111178195283287},{"$f":"ATAN(A617/Zero2)","v":1.4643380490540931},{"$f":"SQRT(1+(A617/pole4)^2)","v":1.0229711851001109},{"$f":"ATAN(A617/pole4)","v":0.21232007122528468},{"$f":"SQRT(1+(A617/Zero3)^2)","v":1.0000000010691381},{"$f":"ATAN(A617/Zero3)","v":4.6241499967040966E-5},{"$f":"SQRT(1+(A617/pole5)^2)","v":1.0000000010691381},{"$f":"ATAN(A617/pole5)","v":4.6241499967040966E-5},{"$f":"SQRT((1-(A617^2/(pole3^2)))^2+(A617/(Q*pole3))^2)","v":1.0692481406946717},{"$f":"ATAN((A617/(Q*pole3))/(1-A617^2/pole3^2))","v":0.48378283337086858},{"$f":"20*LOG10(((E617*K617*G617*O617)/(C617*I617*S617*M617*Q617))*Adc)","v":4.8428166002952536E-2},{"$f":"((F617+L617+H617+R617)-(D617+J617+T617+N617))*radconv","v":-122.20604740525137},{"$f":"IF(V617>0,V617,V617+180)","v":57.793952594748632},"crossover",null,null,null,{"$f":"20*LOG10((K617/(I617*M617))*AEA*Afb)","v":-1.9459574274031568},{"$f":"(L617-(J617+N617))*radconv","v":-18.262275927261499},null,{"$f":"20*LOG10((E617*G617/(C617*S617))*Am)","v":1.9943855934061114},{"$f":"(F617+H617-(D617+T617))*radconv","v":-103.94642092077937}]
[{"$f":"A617","v":46241.5},null,null,null,null,null,null,null,null,null,null,null,null,null,null,null,null,null,null,null,null,-180]
[{"$f":"A618","v":46241.5}]
[1000000]
[]
[{"$f":"pole1","v":2486.3312147436159},null,1.4142135623730951,0.78539816339744828,1.0000515541016373,1.0154002844218612E-2,{"$f":"IF(VIN_nom>Vout, 1, SQRT(1+(A622/z_RHP)^2))","v":1},{"$f":"IF(VIN_nom>Vout, 0, -ATAN(A622/z_RHP))","v":0},1295.4529161792539,1.5700243959228259,1.1194489288176348,0.46616917587745083,1.0000671711300231,1.1590286473710007E-2,{"$f":"SQRT(1+(A622/Zero3)^2)","v":1.0000000000030909},{"$f":"ATAN(A622/Zero3)","v":2.4863312147384926E-6},{"$f":"SQRT(1+(A622/pole5)^2)","v":1.0000000000030909},{"$f":"ATAN(A622/pole5)","v":2.4863312147384926E-6},{"$f":"SQRT((1-(A622^2/(pole3^2)))^2+(A622/(Q*pole3))^2)","v":1.0002029914336084},{"$f":"ATAN((A622/(Q*pole3))/(1-A622^2/pole3^2))","v":2.6738969423551247E-2},{"$f":"20*LOG10(((E622*K622*G622*O622)/(C622*I622*S622*M622*Q622))*Adc)","v":29.961585578856639},{"$f":"((F622+L622+H622+R622)-(D622+J622+T622+N622))*radconv","v":-109.86042605798598},70.139573942014025,"p1",null,null,null,{"$f":"20*LOG10((K622/(I622*M622))*AEA*Afb)","v":5.1474447001636525},{"$f":"(L622-(J622+N622))*radconv","v":-63.910319873404113},null,{"$f":"20*LOG10((E622*G622/(C622*S622))*Am)","v":24.814140878692982},{"$f":"(F622+H622-(D622+T622))*radconv","v":-45.950248640867095}]
[{"$f":"Zero1","v":244853.75888270215},null,98.485021080959982,1.5606423239506779,1.4142135623730951,0.78539816339744828,1,0,127576.09268055978,1.570788488335676,49.560858864238305,1.5506177445694866,1.5175424920900389,0.85136088156290968,1.0000000299766811,2.4485375398943351E-4,1.0000000299766811,2.4485375398943351E-4,2.6803012844060827,-1.38359362881412,-23.01407152758258,-15.065197773670416,164.93480222632959,"z1",null,null,null,{"$f":"20*LOG10((K623/(I623*M623))*AEA*Afb)","v":-5.4190515864316291},{"$f":"(L623-(J623+N623))*radconv","v":-49.935083900593476},null,-17.595019941150952,34.855857040205464]
[{"$f":"Pole2","v":1.9192762040715436},null,1.0000002979387097,7.719308720707793E-4,1.0000000000307208,7.8384592206798442E-6,1,0,1.4142135623730951,0.78539816339744828,1.0000000754279312,3.8840166444576764E-4,1.0000000000400271,8.9473023701498035E-6,1,1.9192762040715435E-9,1,1.9192762040715435E-9,1.0000000001209632,2.0642369964293098E-5,91.23182922447117,-45.023220799107712,134.97677920089228,"p2",null,null,{"$f":"Pole2","v":1.9192762040715436},{"$f":"20*LOG10((K624/(I624*M624))*AEA*Afb)","v":63.406075777218696},{"$f":"(L624-(J624+N624))*radconv","v":-44.97825891793039},null,27.825753447252474,-4.4961991143756541E-2]
[{"$f":"Zero2","v":4941.4724066615854},null,2.2248548220835604,1.1046271509174457,1.0002036221359565,2.0178582225409931E-2,1,0,2574.6543248459025,1.5704079251304508,1.4142135623730951,0.78539816339744828,1.0002652982710989,2.3032135451591232E-2,1.0000000000122091,4.9414724066213648E-6,1.0000000000122091,4.9414724066213648E-6,1.0008017110611707,5.3129380185975732E-2,22.084522583274744,-111.47552271814607,68.524477281853933,"z2",null,null,{"$f":"Zero2","v":4941.4724066615854},{"$f":"20*LOG10((K625/(I625*M625))*AEA*Afb)","v":1.2099924184840747},{"$f":"(L625-(J625+N625))*radconv","v":-46.297390431323699},null,20.87453016479067,-65.178415412336179]
[{"$f":"pole3","v":200000},null,80.446021360365094,1.5583653110830082,1.2911952818953838,0.68490967821558046,1,0,104205.94992264791,1.5707867304138765,40.486118224734213,1.5460939904881081,1.3672231585063621,0.7504097660049589,1.0000000199999999,1.999999973333334E-4,1.0000000199999999,1.999999973333334E-4,2.1510577707922871,{"$error":"#DIV/0!"},-19.229678841066537,{"$error":"#DIV/0!"},{"$error":"#DIV/0!"},"p3",null,null,null,{"$f":"20*LOG10((K626/(I626*M626))*AEA*Afb)","v":-4.5121405996369086},{"$f":"(L626-(J626+N626))*radconv","v":-44.410102330590469},null,-14.717538241429629,{"$error":"#DIV/0!"}]
[{"$f":"Fp2_u","v":214508.92398847072},null,{"$f":"SQRT(1+(A627/pole1)^2)","v":86.281076118579875},{"$f":"ATAN(A627/pole1)","v":1.5592060403211867},{"$f":"SQRT(1+(A627/Zero1)^2)","v":1.3294727782429547},{"$f":"ATAN(A627/Zero1)","v":0.71943544523198688},1,0,{"$f":"SQRT(1+(A627/Pole2)^2)","v":111765.53095484572},{"$f":"ATAN(A627/Pole2)","v":1.5707873794925264},{"$f":"SQRT(1+(A627/Zero2)^2)","v":43.421437008508747},{"$f":"ATAN(A627/Zero2)","v":1.5477641913433053},{"$f":"SQRT(1+(A627/pole4)^2)","v":1.4142135623730951},{"$f":"ATAN(A627/pole4)","v":0.78539816339744828},1.0000000230070389,2.1450892069832734E-4,1.0000000230070389,2.1450892069832734E-4,2.3119993988358001,-1.5057192604501608,-20.504719124254784,-8.1507931678226448,{"$f":"IF(V627>0,V627,V627+180)","v":171.84920683217734},"p4",null,null,null,null,null,null,-15.698720376045724,38.1560479411527]
[{"$f":"z_RHP","v":0},null,{"$f":"SQRT(1+(A628/pole1)^2)","v":1},{"$f":"ATAN(A628/pole1)","v":0},{"$f":"SQRT(1+(A628/Zero1)^2)","v":1},{"$f":"ATAN(A628/Zero1)","v":0},1,0,{"$f":"SQRT(1+(A628/Pole2)^2)","v":1},{"$f":"ATAN(A628/Pole2)","v":0},{"$f":"SQRT(1+(A628/Zero2)^2)","v":1},{"$f":"ATAN(A628/Zero2)","v":0},{"$f":"SQRT(1+(A628/pole4)^2)","v":1},{"$f":"ATAN(A628/pole4)","v":0},1,0,1,0,1,0,94.242131114946204,0,{"$f":"IF(V628>0,V628,V628+180)","v":180},"z_RHP",null,null,null,null,null,null,27.825756035898678,0]
[{"$f":"Fp2_u","v":214508.92398847072},null,null,null,null,null,null,null,null,null,null,null,null,null,null,null,null,null,null,null,-25]
[]
[null,null,null,"System","Plant"]
["p1","p-dom",{"$f":"pole1","v":2486.3312147436159},{"$f":"U622","v":29.961585578856639},{"$f":"AE622","v":24.814140878692982}]
["z1","ESR zero",{"$f":"Zero1","v":244853.75888270215},{"$f":"U623","v":-23.01407152758258},{"$f":"AE623","v":-17.595019941150952}]
["p2","EA pole",{"$f":"Pole2","v":1.9192762040715436},{"$f":"U624","v":91.23182922447117},{"$f":"AE624","v":27.825753447252474}]
["z2","EA zero",{"$f":"Zero2","v":4941.4724066615854},{"$f":"U625","v":22.084522583274744},{"$f":"AE625","v":20.87453016479067}]
["p3","p_sampling",{"$f":"pole3","v":200000},{"$f":"U626","v":-19.229678841066537},{"$f":"AE626","v":-14.717538241429629}]
[]
[]
[{"$f":"Q4*1000","v":46241.5}]
[{"$f":"Q4*1000","v":46241.5}]
[]
[]
[]
[]
[]
[]
[]
[]
[]
[]
[]
[]
[]
[]
[]
[]
[]
[]
[]
[]
[]
[]
[]
[]
[]
[]
[]
[]
[]
[]
[]
[]
[]
[]
[]
[]
[]
[]
[]
[]
[]
[]
[]
[]
[]
[]
[null,null,null,null,null,null,null,null,null,null,null,null,null,null,null,null,null,null,null,null,null,null,null,null,null,null,null,null,null,null,null,null,null,"phase margin",{"$f":"SUM(AI689:AI1306)","v":0}]

{"sheet":"Bode Plot Management","index":8,"n_rows":6,"n_cols":14,"rows_kept":6,"cut":false,"hidden":true,"merged":[]}
[null,null,null,null,null,null,null,null,null,"Single or dual output (MODE)",null,null,null,"3.3V or 5V fixed (FB1/2)"]
[{"$f":"CHOOSE(BODE_PLOT_TYPE, \"BODE_PLOT_Ch1\", \"BODE_PLOT_Ch2\")","v":"BODE_PLOT_Ch1"},null,null,null,null,null,null,null,null,"With/without dither (DITH)",null,null,null,"With/without VOUT connected to VCCX"]
[null,null,null,null,null,null,null,null,null,"FPWM or DEM (DEMB)"]
[null,null,null,null,null,null,null,null,null,"Shunt or inductor DCR current sensing"]
[]
[null,null,null,null,null,{"$f":"INDIRECT(A2)","v":0}]

{"sheet":"Efficiency Plot Management","index":9,"n_rows":3,"n_cols":1,"rows_kept":3,"cut":false,"hidden":true,"merged":[]}
[]
[{"$f":"\"EFF_Ch1\"","v":"EFF_Ch1"}]
[{"$f":"\"EFF_Ch2\"","v":"EFF_Ch2"}]

{"sheet":"Standard Value Calculator","index":10,"n_rows":159,"n_cols":16,"rows_kept":159,"cut":false,"hidden":true,"merged":[]}
[]
["Capacitors","Css","Cc1ea","Cc2ea","Cout","Cin","Cimon","Cdither","Cc3ea","Cc4ea"]
["Inputs",{"$f":"Css","v":{"$error":"#NAME?"}},{"$f":"Cc1ea","v":3.2474738421118735E-9},{"$f":"Cc2ea","v":6.1167356332827473E-11},{"$f":"Cout","v":1.2999999999999999E-4},{"$f":"Cin","v":2.5000000000000001E-5},{"$f":"'Variable Management'!B228*0.000000001","v":1.2380537362861228E-8},{"$f":"Cdither_init","v":{"$error":"#NAME?"}},{"$f":"Cc3ea","v":{"$error":"#NAME?"}},{"$f":"Cc4ea","v":{"$error":"#NAME?"}},null,null,"Resistors","inputs","Standard Result"]
["Standard Result",{"$f":"SUM(B6:B158)/1000000000000","v":{"$error":"#NAME?"}},{"$f":"IF(C3=\"OPEN\",\"OPEN\",SUM(C6:C158)/1000000000000)","v":3.3000000000000002E-9},{"$f":"SUM(D6:D158)/1000000000000","v":5.6E-11},{"$f":"SUM(E6:E158)/1000000000000","v":1.2E-4},{"$f":"SUM(F6:F158)/1000000000000","v":2.6999999999999999E-5},{"$f":"SUM(G6:G158)/1000000000000","v":1.2E-8},{"$f":"IF(H3=\"OPEN\",\"OPEN\",SUM(H6:H158)/1000000000000)","v":{"$error":"#NAME?"}},{"$error":"#NAME?"},{"$error":"#NAME?"},null,null,"Rt",{"$f":"Rfadj","v":54.9},{"$f":"IF(N4>(INT(0.5+100*POWER(10,IF(96*(LOG(N4)-INT(LOG(N4)))-ROUND(96*(LOG(N4)-INT(LOG(N4))),0)<0,ROUND(96*(LOG(N4)-INT(LOG(N4))),0)-1,ROUND(96*(LOG(N4)-INT(LOG(N4))),0))/96))*POWER(10,INT(LOG(N4))-2)+INT(0.5+100*POWER(10,(IF(96*(LOG(N4)-INT(LOG(N4)))-ROUND(96*(LOG(N4)-INT(LOG(N4))),0)<0,ROUND(96*(LOG(N4)-INT(LOG(N4))),0)-1,ROUND(96*(LOG(N4)-INT(LOG(N4))),0))+1)/96))*POWER(10,INT(LOG(N4))-2))/2,INT(0.5+100*POWER(10,(IF(96*(LOG(N4)-INT(LOG(N4)))-ROUND(96*(LOG(N4)-INT(LOG(N4))),0)<0,ROUND(96*(LOG(N4)-INT(LOG(N4))),0)-1,ROUND(96*(LOG(N4)-INT(LOG(N4))),0))+1)/96))*POWER(10,INT(LOG(N4))-2),INT(0.5+100*POWER(10,IF(96*(LOG(N4)-INT(LOG(N4)))-ROUND(96*(LOG(N4)-INT(LOG(N4))),0)<0,ROUND(96*(LOG(N4)-INT(LOG(N4))),0)-1,ROUND(96*(LOG(N4)-INT(LOG(N4))),0))/96))*POWER(10,INT(LOG(N4))-2))","v":54.900000000000006},"Ω"]
["(pF)"]
[0.47,{"$f":"IF(IF((B$3*10^12-$A7)*(B$3*10^12-$A6)*-1<0,0,1)*IF(ABS(B$3*10^12-$A7)>(B$3*10^12-$A6),$A6,$A7)=B7,0,IF((B$3*10^12-$A7)*(B$3*10^12-$A6)*-1<0,0,1)*IF(ABS(B$3*10^12-$A7)>(B$3*10^12-$A6),$A6,$A7))","v":{"$error":"#NAME?"}},0,0,0,0,0,{"$error":"#NAME?"},{"$error":"#NAME?"},{"$error":"#NAME?"}]
[0.56000000000000005,{"$f":"IF(IF((B$3*10^12-$A8)*(B$3*10^12-$A7)*-1<0,0,1)*IF(ABS(B$3*10^12-$A8)>(B$3*10^12-$A7),$A7,$A8)=B8,0,IF((B$3*10^12-$A8)*(B$3*10^12-$A7)*-1<0,0,1)*IF(ABS(B$3*10^12-$A8)>(B$3*10^12-$A7),$A7,$A8))","v":{"$error":"#NAME?"}},{"$f":"IF(IF((C$3*10^12-$A8)*(C$3*10^12-$A7)*-1<0,0,1)*IF(ABS(C$3*10^12-$A8)>(C$3*10^12-$A7),$A7,$A8)=C8,0,IF((C$3*10^12-$A8)*(C$3*10^12-$A7)*-1<0,0,1)*IF(ABS(C$3*10^12-$A8)>(C$3*10^12-$A7),$A7,$A8))","v":0},{"$f":"IF(IF((D$3*10^12-$A8)*(D$3*10^12-$A7)*-1<0,0,1)*IF(ABS(D$3*10^12-$A8)>(D$3*10^12-$A7),$A7,$A8)=D8,0,IF((D$3*10^12-$A8)*(D$3*10^12-$A7)*-1<0,0,1)*IF(ABS(D$3*10^12-$A8)>(D$3*10^12-$A7),$A7,$A8))","v":0},{"$f":"IF(IF((E$3*10^12-$A8)*(E$3*10^12-$A7)*-1<0,0,1)*IF(ABS(E$3*10^12-$A8)>(E$3*10^12-$A7),$A7,$A8)=E8,0,IF((E$3*10^12-$A8)*(E$3*10^12-$A7)*-1<0,0,1)*IF(ABS(E$3*10^12-$A8)>(E$3*10^12-$A7),$A7,$A8))","v":0},{"$f":"IF(IF((F$3*10^12-$A8)*(F$3*10^12-$A7)*-1<0,0,1)*IF(ABS(F$3*10^12-$A8)>(F$3*10^12-$A7),$A7,$A8)=F8,0,IF((F$3*10^12-$A8)*(F$3*10^12-$A7)*-1<0,0,1)*IF(ABS(F$3*10^12-$A8)>(F$3*10^12-$A7),$A7,$A8))","v":0},{"$f":"IF(IF((G$3*10^12-$A8)*(G$3*10^12-$A7)*-1<0,0,1)*IF(ABS(G$3*10^12-$A8)>(G$3*10^12-$A7),$A7,$A8)=G8,0,IF((G$3*10^12-$A8)*(G$3*10^12-$A7)*-1<0,0,1)*IF(ABS(G$3*10^12-$A8)>(G$3*10^12-$A7),$A7,$A8))","v":0},{"$error":"#NAME?"},{"$error":"#NAME?"},{"$error":"#NAME?"},null,null,"Renb",{"$f":"Renb","v":5882.3529411764703},5900,"Ω"]
[0.68,{"$error":"#NAME?"},0,0,0,0,0,{"$error":"#NAME?"},{"$error":"#NAME?"},{"$error":"#NAME?"},null,null,"Rc1ea",{"$f":"Rcea1","v":9801.7690679999996},{"$f":"IF(N8>(INT(0.5+100*POWER(10,IF(96*(LOG(N8)-INT(LOG(N8)))-ROUND(96*(LOG(N8)-INT(LOG(N8))),0)<0,ROUND(96*(LOG(N8)-INT(LOG(N8))),0)-1,ROUND(96*(LOG(N8)-INT(LOG(N8))),0))/96))*POWER(10,INT(LOG(N8))-2)+INT(0.5+100*POWER(10,(IF(96*(LOG(N8)-INT(LOG(N8)))-ROUND(96*(LOG(N8)-INT(LOG(N8))),0)<0,ROUND(96*(LOG(N8)-INT(LOG(N8))),0)-1,ROUND(96*(LOG(N8)-INT(LOG(N8))),0))+1)/96))*POWER(10,INT(LOG(N8))-2))/2,INT(0.5+100*POWER(10,(IF(96*(LOG(N8)-INT(LOG(N8)))-ROUND(96*(LOG(N8)-INT(LOG(N8))),0)<0,ROUND(96*(LOG(N8)-INT(LOG(N8))),0)-1,ROUND(96*(LOG(N8)-INT(LOG(N8))),0))+1)/96))*POWER(10,INT(LOG(N8))-2),INT(0.5+100*POWER(10,IF(96*(LOG(N8)-INT(LOG(N8)))-ROUND(96*(LOG(N8)-INT(LOG(N8))),0)<0,ROUND(96*(LOG(N8)-INT(LOG(N8))),0)-1,ROUND(96*(LOG(N8)-INT(LOG(N8))),0))/96))*POWER(10,INT(LOG(N8))-2))","v":9760},"Ω"]
[0.82,{"$error":"#NAME?"},0,0,0,0,0,{"$error":"#NAME?"},{"$error":"#NAME?"},{"$error":"#NAME?"}]
[1,{"$error":"#NAME?"},0,0,0,0,0,{"$error":"#NAME?"},{"$error":"#NAME?"},{"$error":"#NAME?"},null,null,"Rfb1",{"$f":"Rfb1_","v":100000},{"$f":"IF(N10>(INT(0.5+100*POWER(10,IF(96*(LOG(N10)-INT(LOG(N10)))-ROUND(96*(LOG(N10)-INT(LOG(N10))),0)<0,ROUND(96*(LOG(N10)-INT(LOG(N10))),0)-1,ROUND(96*(LOG(N10)-INT(LOG(N10))),0))/96))*POWER(10,INT(LOG(N10))-2)+INT(0.5+100*POWER(10,(IF(96*(LOG(N10)-INT(LOG(N10)))-ROUND(96*(LOG(N10)-INT(LOG(N10))),0)<0,ROUND(96*(LOG(N10)-INT(LOG(N10))),0)-1,ROUND(96*(LOG(N10)-INT(LOG(N10))),0))+1)/96))*POWER(10,INT(LOG(N10))-2))/2,INT(0.5+100*POWER(10,(IF(96*(LOG(N10)-INT(LOG(N10)))-ROUND(96*(LOG(N10)-INT(LOG(N10))),0)<0,ROUND(96*(LOG(N10)-INT(LOG(N10))),0)-1,ROUND(96*(LOG(N10)-INT(LOG(N10))),0))+1)/96))*POWER(10,INT(LOG(N10))-2),INT(0.5+100*POWER(10,IF(96*(LOG(N10)-INT(LOG(N10)))-ROUND(96*(LOG(N10)-INT(LOG(N10))),0)<0,ROUND(96*(LOG(N10)-INT(LOG(N10))),0)-1,ROUND(96*(LOG(N10)-INT(LOG(N10))),0))/96))*POWER(10,INT(LOG(N10))-2))","v":100000},"Ω"]
[1.2,{"$error":"#NAME?"},0,0,0,0,0,{"$error":"#NAME?"},{"$error":"#NAME?"},{"$error":"#NAME?"},null,null,"Rfb2",{"$f":"Rfb2_","v":9090.9090909090919},{"$f":"IF(N11=\"OPEN\",\"OPEN\",IF(N11>(INT(0.5+100*POWER(10,IF(96*(LOG(N11)-INT(LOG(N11)))-ROUND(96*(LOG(N11)-INT(LOG(N11))),0)<0,ROUND(96*(LOG(N11)-INT(LOG(N11))),0)-1,ROUND(96*(LOG(N11)-INT(LOG(N11))),0))/96))*POWER(10,INT(LOG(N11))-2)+INT(0.5+100*POWER(10,(IF(96*(LOG(N11)-INT(LOG(N11)))-ROUND(96*(LOG(N11)-INT(LOG(N11))),0)<0,ROUND(96*(LOG(N11)-INT(LOG(N11))),0)-1,ROUND(96*(LOG(N11)-INT(LOG(N11))),0))+1)/96))*POWER(10,INT(LOG(N11))-2))/2,INT(0.5+100*POWER(10,(IF(96*(LOG(N11)-INT(LOG(N11)))-ROUND(96*(LOG(N11)-INT(LOG(N11))),0)<0,ROUND(96*(LOG(N11)-INT(LOG(N11))),0)-1,ROUND(96*(LOG(N11)-INT(LOG(N11))),0))+1)/96))*POWER(10,INT(LOG(N11))-2),INT(0.5+100*POWER(10,IF(96*(LOG(N11)-INT(LOG(N11)))-ROUND(96*(LOG(N11)-INT(LOG(N11))),0)<0,ROUND(96*(LOG(N11)-INT(LOG(N11))),0)-1,ROUND(96*(LOG(N11)-INT(LOG(N11))),0))/96))*POWER(10,INT(LOG(N11))-2)))","v":9090},"Ω"]
[1.5,{"$error":"#NAME?"},0,0,0,0,0,{"$error":"#NAME?"},{"$error":"#NAME?"},{"$error":"#NAME?"},null,null,"Rt1",{"$f":"'Variable Management'!B25*1000","v":54476.700000000004},{"$f":"IF(N12>(INT(0.5+100*POWER(10,IF(96*(LOG(N12)-INT(LOG(N12)))-ROUND(96*(LOG(N12)-INT(LOG(N12))),0)<0,ROUND(96*(LOG(N12)-INT(LOG(N12))),0)-1,ROUND(96*(LOG(N12)-INT(LOG(N12))),0))/96))*POWER(10,INT(LOG(N12))-2)+INT(0.5+100*POWER(10,(IF(96*(LOG(N12)-INT(LOG(N12)))-ROUND(96*(LOG(N12)-INT(LOG(N12))),0)<0,ROUND(96*(LOG(N12)-INT(LOG(N12))),0)-1,ROUND(96*(LOG(N12)-INT(LOG(N12))),0))+1)/96))*POWER(10,INT(LOG(N12))-2))/2,INT(0.5+100*POWER(10,(IF(96*(LOG(N12)-INT(LOG(N12)))-ROUND(96*(LOG(N12)-INT(LOG(N12))),0)<0,ROUND(96*(LOG(N12)-INT(LOG(N12))),0)-1,ROUND(96*(LOG(N12)-INT(LOG(N12))),0))+1)/96))*POWER(10,INT(LOG(N12))-2),INT(0.5+100*POWER(10,IF(96*(LOG(N12)-INT(LOG(N12)))-ROUND(96*(LOG(N12)-INT(LOG(N12))),0)<0,ROUND(96*(LOG(N12)-INT(LOG(N12))),0)-1,ROUND(96*(LOG(N12)-INT(LOG(N12))),0))/96))*POWER(10,INT(LOG(N12))-2))","v":54900},"Ω"]
[1.8,{"$error":"#NAME?"},0,0,0,0,0,{"$error":"#NAME?"},{"$error":"#NAME?"},{"$error":"#NAME?"},null,null,"Rimon",{"$f":"'Variable Management'!B224","v":6.8965517241379315},{"$f":"IF(N13=\"OPEN\",\"OPEN\",IF(N13>(INT(0.5+100*POWER(10,IF(96*(LOG(N13)-INT(LOG(N13)))-ROUND(96*(LOG(N13)-INT(LOG(N13))),0)<0,ROUND(96*(LOG(N13)-INT(LOG(N13))),0)-1,ROUND(96*(LOG(N13)-INT(LOG(N13))),0))/96))*POWER(10,INT(LOG(N13))-2)+INT(0.5+100*POWER(10,(IF(96*(LOG(N13)-INT(LOG(N13)))-ROUND(96*(LOG(N13)-INT(LOG(N13))),0)<0,ROUND(96*(LOG(N13)-INT(LOG(N13))),0)-1,ROUND(96*(LOG(N13)-INT(LOG(N13))),0))+1)/96))*POWER(10,INT(LOG(N13))-2))/2,INT(0.5+100*POWER(10,(IF(96*(LOG(N13)-INT(LOG(N13)))-ROUND(96*(LOG(N13)-INT(LOG(N13))),0)<0,ROUND(96*(LOG(N13)-INT(LOG(N13))),0)-1,ROUND(96*(LOG(N13)-INT(LOG(N13))),0))+1)/96))*POWER(10,INT(LOG(N13))-2),INT(0.5+100*POWER(10,IF(96*(LOG(N13)-INT(LOG(N13)))-ROUND(96*(LOG(N13)-INT(LOG(N13))),0)<0,ROUND(96*(LOG(N13)-INT(LOG(N13))),0)-1,ROUND(96*(LOG(N13)-INT(LOG(N13))),0))/96))*POWER(10,INT(LOG(N13))-2)))","v":6.98},"Ω"]
[2.2000000000000002,{"$f":"IF(IF((B$3*10^12-$A15)*(B$3*10^12-$A14)*-1<0,0,1)*IF(ABS(B$3*10^12-$A15)>(B$3*10^12-$A14),$A14,$A15)=B15,0,IF((B$3*10^12-$A15)*(B$3*10^12-$A14)*-1<0,0,1)*IF(ABS(B$3*10^12-$A15)>(B$3*10^12-$A14),$A14,$A15))","v":{"$error":"#NAME?"}},0,0,0,0,0,{"$error":"#NAME?"},{"$error":"#NAME?"},{"$error":"#NAME?"}]
[2.7,{"$error":"#NAME?"},0,0,0,0,0,{"$error":"#NAME?"},{"$error":"#NAME?"},{"$error":"#NAME?"}]
[3.3,{"$error":"#NAME?"},0,0,0,0,0,{"$error":"#NAME?"},{"$error":"#NAME?"},{"$error":"#NAME?"},null,null,"Rs",{"$f":"Rs_ideal*1000","v":1.0942340996855457},{"$f":"IF(N16=0,0,IF(N16>(INT(0.5+100*POWER(10,IF(96*(LOG(N16)-INT(LOG(N16)))-ROUND(96*(LOG(N16)-INT(LOG(N16))),0)<0,ROUND(96*(LOG(N16)-INT(LOG(N16))),0)-1,ROUND(96*(LOG(N16)-INT(LOG(N16))),0))/96))*POWER(10,INT(LOG(N16))-2)+INT(0.5+100*POWER(10,(IF(96*(LOG(N16)-INT(LOG(N16)))-ROUND(96*(LOG(N16)-INT(LOG(N16))),0)<0,ROUND(96*(LOG(N16)-INT(LOG(N16))),0)-1,ROUND(96*(LOG(N16)-INT(LOG(N16))),0))+1)/96))*POWER(10,INT(LOG(N16))-2))/2,INT(0.5+100*POWER(10,(IF(96*(LOG(N16)-INT(LOG(N16)))-ROUND(96*(LOG(N16)-INT(LOG(N16))),0)<0,ROUND(96*(LOG(N16)-INT(LOG(N16))),0)-1,ROUND(96*(LOG(N16)-INT(LOG(N16))),0))+1)/96))*POWER(10,INT(LOG(N16))-2),INT(0.5+100*POWER(10,IF(96*(LOG(N16)-INT(LOG(N16)))-ROUND(96*(LOG(N16)-INT(LOG(N16))),0)<0,ROUND(96*(LOG(N16)-INT(LOG(N16))),0)-1,ROUND(96*(LOG(N16)-INT(LOG(N16))),0))/96))*POWER(10,INT(LOG(N16))-2)))","v":1.1000000000000001},"mΩ"]
[3.9,{"$error":"#NAME?"},0,0,0,0,0,{"$error":"#NAME?"},{"$error":"#NAME?"},{"$error":"#NAME?"},null,null,"Cres",{"$f":"Cres","v":{"$error":"#NAME?"}},{"$f":"G4*1000000000000","v":12000},"pF"]
[4.7,{"$error":"#NAME?"},0,0,0,0,0,{"$error":"#NAME?"},{"$error":"#NAME?"},{"$error":"#NAME?"}]
[5.6,{"$error":"#NAME?"},0,0,0,0,0,{"$error":"#NAME?"},{"$error":"#NAME?"},{"$error":"#NAME?"},null,null,"Rimon",{"$f":"'Variable Management'!B224","v":6.8965517241379315}]
[6.8,{"$error":"#NAME?"},0,0,0,0,0,{"$error":"#NAME?"},{"$error":"#NAME?"},{"$error":"#NAME?"}]
[8.1999999999999993,{"$error":"#NAME?"},0,0,0,0,0,{"$error":"#NAME?"},{"$error":"#NAME?"},{"$error":"#NAME?"}]
[10,{"$error":"#NAME?"},0,0,0,0,0,{"$error":"#NAME?"},{"$error":"#NAME?"},{"$error":"#NAME?"},null,null,"Cdither",{"$f":"Cdither_init","v":{"$error":"#NAME?"}},{"$f":"H4","v":{"$error":"#NAME?"}}]
[12,{"$error":"#NAME?"},0,0,0,0,0,{"$error":"#NAME?"},{"$error":"#NAME?"},{"$error":"#NAME?"}]
[15,{"$error":"#NAME?"},0,0,0,0,0,{"$error":"#NAME?"},{"$error":"#NAME?"},{"$error":"#NAME?"}]
[18,{"$error":"#NAME?"},0,0,0,0,0,{"$error":"#NAME?"},{"$error":"#NAME?"},{"$error":"#NAME?"}]
[22,{"$error":"#NAME?"},0,0,0,0,0,{"$error":"#NAME?"},{"$error":"#NAME?"},{"$error":"#NAME?"}]
[27,{"$error":"#NAME?"},0,0,0,0,0,{"$error":"#NAME?"},{"$error":"#NAME?"},{"$error":"#NAME?"}]
[33,{"$error":"#NAME?"},0,0,0,0,0,{"$error":"#NAME?"},{"$error":"#NAME?"},{"$error":"#NAME?"}]
[39,{"$error":"#NAME?"},0,0,0,0,0,{"$error":"#NAME?"},{"$error":"#NAME?"},{"$error":"#NAME?"}]
[47,{"$error":"#NAME?"},0,0,0,0,0,{"$error":"#NAME?"},{"$error":"#NAME?"},{"$error":"#NAME?"},null,null,"Rcomp",{"$f":"O8/1000&\"kΩ\"","v":"9.76kΩ"},{"$f":"O8/1000","v":9.76},"kΩ"]
[56,{"$error":"#NAME?"},0,56,0,0,0,{"$error":"#NAME?"},{"$error":"#NAME?"},{"$error":"#NAME?"},null,null,"Ccomp",{"$f":"C4*1000000000&\"nF\"","v":"3.3nF"},{"$f":"C4*1000000000","v":3.3000000000000003},"nF"]
[68,{"$error":"#NAME?"},0,0,0,0,0,{"$error":"#NAME?"},{"$error":"#NAME?"},{"$error":"#NAME?"},null,null,"Chf",{"$f":"D4*1000000000000&\"pF\"","v":"56pF"},{"$f":"D4*1000000000000","v":56},"pF"]
[82,{"$error":"#NAME?"},0,0,0,0,0,{"$error":"#NAME?"},{"$error":"#NAME?"},{"$error":"#NAME?"}]
[{"$f":"A22*10","v":100},{"$error":"#NAME?"},0,0,0,0,0,{"$error":"#NAME?"},{"$error":"#NAME?"},{"$error":"#NAME?"},null,null,"Rc2",{"$f":"O8/1000&\" kΩ\"","v":"9.76 kΩ"},{"$f":"O8/1000","v":9.76},"kΩ"]
[{"$f":"A23*10","v":120},{"$error":"#NAME?"},0,0,0,0,0,{"$error":"#NAME?"},{"$error":"#NAME?"},{"$error":"#NAME?"},null,null,"Cc3",{"$f":"I4*1000000000&\" nF\"","v":{"$error":"#NAME?"}},{"$f":"I4*1000000000","v":{"$error":"#NAME?"}},"nF"]
[150,{"$error":"#NAME?"},0,0,0,0,0,{"$error":"#NAME?"},{"$error":"#NAME?"},{"$error":"#NAME?"},null,null,"Cc4",{"$f":"J4*1000000000000&\" pF\"","v":{"$error":"#NAME?"}},{"$f":"J4*1000000000000","v":{"$error":"#NAME?"}},"pF"]
[180,{"$error":"#NAME?"},0,0,0,0,0,{"$error":"#NAME?"},{"$error":"#NAME?"},{"$error":"#NAME?"}]
[220,{"$error":"#NAME?"},0,0,0,0,0,{"$error":"#NAME?"},{"$error":"#NAME?"},{"$error":"#NAME?"}]
[270,{"$error":"#NAME?"},{"$f":"IF(IF((C$3*10^12-$A40)*(C$3*10^12-$A39)*-1<0,0,1)*IF(ABS(C$3*10^12-$A40)>(C$3*10^12-$A39),$A39,$A40)=C40,0,IF((C$3*10^12-$A40)*(C$3*10^12-$A39)*-1<0,0,1)*IF(ABS(C$3*10^12-$A40)>(C$3*10^12-$A39),$A39,$A40))","v":0},0,0,0,0,{"$error":"#NAME?"},{"$error":"#NAME?"},{"$error":"#NAME?"}]
[330,{"$error":"#NAME?"},0,0,0,0,0,{"$error":"#NAME?"},{"$error":"#NAME?"},{"$error":"#NAME?"}]
[390,{"$error":"#NAME?"},0,0,0,0,0,{"$error":"#NAME?"},{"$error":"#NAME?"},{"$error":"#NAME?"}]
[470,{"$error":"#NAME?"},0,0,0,0,0,{"$error":"#NAME?"},{"$error":"#NAME?"},{"$error":"#NAME?"}]
[560,{"$error":"#NAME?"},0,0,0,0,0,{"$error":"#NAME?"},{"$error":"#NAME?"},{"$error":"#NAME?"}]
[680,{"$error":"#NAME?"},0,0,0,0,0,{"$error":"#NAME?"},{"$error":"#NAME?"},{"$error":"#NAME?"}]
[{"$f":"A33*10","v":820},{"$error":"#NAME?"},0,0,0,0,0,{"$error":"#NAME?"},{"$error":"#NAME?"},{"$error":"#NAME?"}]
[1000,{"$error":"#NAME?"},0,0,0,0,0,{"$error":"#NAME?"},{"$error":"#NAME?"},{"$error":"#NAME?"}]
[1200,{"$error":"#NAME?"},0,0,0,0,0,{"$error":"#NAME?"},{"$error":"#NAME?"},{"$error":"#NAME?"}]
[1500,{"$error":"#NAME?"},0,0,0,0,0,{"$error":"#NAME?"},{"$error":"#NAME?"},{"$error":"#NAME?"}]
[1800,{"$error":"#NAME?"},0,0,0,0,0,{"$error":"#NAME?"},{"$error":"#NAME?"},{"$error":"#NAME?"}]
[2200,{"$error":"#NAME?"},0,0,0,0,0,{"$error":"#NAME?"},{"$error":"#NAME?"},{"$error":"#NAME?"}]
[2700,{"$error":"#NAME?"},3300,0,0,0,0,{"$error":"#NAME?"},{"$error":"#NAME?"},{"$error":"#NAME?"}]
[3300,{"$error":"#NAME?"},0,0,0,0,0,{"$error":"#NAME?"},{"$error":"#NAME?"},{"$error":"#NAME?"}]
[3900,{"$error":"#NAME?"},0,0,0,0,0,{"$error":"#NAME?"},{"$error":"#NAME?"},{"$error":"#NAME?"}]
[4700,{"$error":"#NAME?"},0,0,0,0,0,{"$error":"#NAME?"},{"$error":"#NAME?"},{"$error":"#NAME?"}]
[5600,{"$error":"#NAME?"},0,0,0,0,0,{"$error":"#NAME?"},{"$error":"#NAME?"},{"$error":"#NAME?"}]
[6800,{"$error":"#NAME?"},0,0,0,0,0,{"$error":"#NAME?"},{"$error":"#NAME?"},{"$error":"#NAME?"}]
[8200,{"$error":"#NAME?"},0,0,0,0,0,{"$error":"#NAME?"},{"$error":"#NAME?"},{"$error":"#NAME?"}]
[10000,{"$error":"#NAME?"},0,0,0,0,0,{"$error":"#NAME?"},{"$error":"#NAME?"},{"$error":"#NAME?"}]
[12000,{"$error":"#NAME?"},0,0,0,0,12000,{"$error":"#NAME?"},{"$error":"#NAME?"},{"$error":"#NAME?"}]
[15000,{"$error":"#NAME?"},0,0,0,0,0,{"$error":"#NAME?"},{"$error":"#NAME?"},{"$error":"#NAME?"}]
[18000,{"$error":"#NAME?"},0,0,0,0,0,{"$error":"#NAME?"},{"$error":"#NAME?"},{"$error":"#NAME?"}]
[22000,{"$error":"#NAME?"},0,0,0,0,0,{"$error":"#NAME?"},{"$error":"#NAME?"},{"$error":"#NAME?"}]
[27000,{"$error":"#NAME?"},0,0,0,0,0,{"$error":"#NAME?"},{"$error":"#NAME?"},{"$error":"#NAME?"}]
[33000,{"$error":"#NAME?"},0,0,0,0,0,{"$error":"#NAME?"},{"$error":"#NAME?"},{"$error":"#NAME?"}]
[39000,{"$error":"#NAME?"},0,0,0,0,0,{"$error":"#NAME?"},{"$error":"#NAME?"},{"$error":"#NAME?"}]
[47000,{"$error":"#NAME?"},0,0,0,0,0,{"$error":"#NAME?"},{"$error":"#NAME?"},{"$error":"#NAME?"}]
[56000,{"$error":"#NAME?"},0,0,0,0,0,{"$error":"#NAME?"},{"$error":"#NAME?"},{"$error":"#NAME?"}]
[68000,{"$error":"#NAME?"},0,0,0,0,0,{"$error":"#NAME?"},{"$error":"#NAME?"},{"$error":"#NAME?"}]
[82000,{"$error":"#NAME?"},0,0,0,0,0,{"$error":"#NAME?"},{"$error":"#NAME?"},{"$f":"IF(IF((J$3*10^12-$A70)*(J$3*10^12-$A69)*-1<0,0,1)*IF(ABS(J$3*10^12-$A70)>(J$3*10^12-$A69),$A69,$A70)=J70,0,IF((J$3*10^12-$A70)*(J$3*10^12-$A69)*-1<0,0,1)*IF(ABS(J$3*10^12-$A70)>(J$3*10^12-$A69),$A69,$A70))","v":{"$error":"#NAME?"}}]
[100000,{"$error":"#NAME?"},0,{"$f":"IF(IF((D$3*10^12-$A71)*(D$3*10^12-$A70)*-1<0,0,1)*IF(ABS(D$3*10^12-$A71)>(D$3*10^12-$A70),$A70,$A71)=D71,0,IF((D$3*10^12-$A71)*(D$3*10^12-$A70)*-1<0,0,1)*IF(ABS(D$3*10^12-$A71)>(D$3*10^12-$A70),$A70,$A71))","v":0},0,0,0,{"$error":"#NAME?"},{"$error":"#NAME?"},{"$error":"#NAME?"}]
[120000,{"$f":"IF(IF((B$3*10^12-$A72)*(B$3*10^12-$A71)*-1<0,0,1)*IF(ABS(B$3*10^12-$A72)>(B$3*10^12-$A71),$A71,$A72)=B72,0,IF((B$3*10^12-$A72)*(B$3*10^12-$A71)*-1<0,0,1)*IF(ABS(B$3*10^12-$A72)>(B$3*10^12-$A71),$A71,$A72))","v":{"$error":"#NAME?"}},{"$f":"IF(IF((C$3*10^12-$A72)*(C$3*10^12-$A71)*-1<0,0,1)*IF(ABS(C$3*10^12-$A72)>(C$3*10^12-$A71),$A71,$A72)=C72,0,IF((C$3*10^12-$A72)*(C$3*10^12-$A71)*-1<0,0,1)*IF(ABS(C$3*10^12-$A72)>(C$3*10^12-$A71),$A71,$A72))","v":0},0,0,{"$f":"IF(IF((F$3*10^12-$A72)*(F$3*10^12-$A71)*-1<0,0,1)*IF(ABS(F$3*10^12-$A72)>(F$3*10^12-$A71),$A71,$A72)=F72,0,IF((F$3*10^12-$A72)*(F$3*10^12-$A71)*-1<0,0,1)*IF(ABS(F$3*10^12-$A72)>(F$3*10^12-$A71),$A71,$A72))","v":0},{"$f":"IF(IF((G$3*10^12-$A72)*(G$3*10^12-$A71)*-1<0,0,1)*IF(ABS(G$3*10^12-$A72)>(G$3*10^12-$A71),$A71,$A72)=G72,0,IF((G$3*10^12-$A72)*(G$3*10^12-$A71)*-1<0,0,1)*IF(ABS(G$3*10^12-$A72)>(G$3*10^12-$A71),$A71,$A72))","v":0},{"$f":"IF(IF((H$3*10^12-$A72)*(H$3*10^12-$A71)*-1<0,0,1)*IF(ABS(H$3*10^12-$A72)>(H$3*10^12-$A71),$A71,$A72)=H72,0,IF((H$3*10^12-$A72)*(H$3*10^12-$A71)*-1<0,0,1)*IF(ABS(H$3*10^12-$A72)>(H$3*10^12-$A71),$A71,$A72))","v":{"$error":"#NAME?"}},{"$f":"IF(IF((I$3*10^12-$A72)*(I$3*10^12-$A71)*-1<0,0,1)*IF(ABS(I$3*10^12-$A72)>(I$3*10^12-$A71),$A71,$A72)=I72,0,IF((I$3*10^12-$A72)*(I$3*10^12-$A71)*-1<0,0,1)*IF(ABS(I$3*10^12-$A72)>(I$3*10^12-$A71),$A71,$A72))","v":{"$error":"#NAME?"}},{"$error":"#NAME?"}]
[150000,{"$error":"#NAME?"},0,0,0,0,0,{"$error":"#NAME?"},{"$error":"#NAME?"},{"$error":"#NAME?"}]
[180000,{"$error":"#NAME?"},0,0,0,0,0,{"$error":"#NAME?"},{"$error":"#NAME?"},{"$error":"#NAME?"}]
[220000,{"$error":"#NAME?"},0,0,0,0,0,{"$error":"#NAME?"},{"$error":"#NAME?"},{"$error":"#NAME?"}]
[270000,{"$error":"#NAME?"},0,0,0,0,0,{"$error":"#NAME?"},{"$error":"#NAME?"},{"$error":"#NAME?"}]
[330000,{"$error":"#NAME?"},0,0,0,0,0,{"$error":"#NAME?"},{"$error":"#NAME?"},{"$error":"#NAME?"}]
[390000,{"$error":"#NAME?"},0,0,0,0,0,{"$error":"#NAME?"},{"$error":"#NAME?"},{"$error":"#NAME?"}]
[470000,{"$error":"#NAME?"},0,0,0,0,0,{"$error":"#NAME?"},{"$error":"#NAME?"},{"$error":"#NAME?"}]
[560000,{"$error":"#NAME?"},0,0,0,0,0,{"$error":"#NAME?"},{"$error":"#NAME?"},{"$error":"#NAME?"}]
[680000,{"$error":"#NAME?"},0,0,0,0,0,{"$error":"#NAME?"},{"$error":"#NAME?"},{"$error":"#NAME?"}]
[820000,{"$error":"#NAME?"},0,0,0,0,0,{"$error":"#NAME?"},{"$error":"#NAME?"},{"$error":"#NAME?"}]
[1000000,{"$error":"#NAME?"},0,0,0,0,0,{"$error":"#NAME?"},{"$error":"#NAME?"},{"$error":"#NAME?"}]
[1200000,{"$error":"#NAME?"},0,0,0,0,0,{"$error":"#NAME?"},{"$error":"#NAME?"},{"$error":"#NAME?"}]
[1500000,{"$error":"#NAME?"},0,0,0,0,0,{"$error":"#NAME?"},{"$error":"#NAME?"},{"$error":"#NAME?"}]
[1800000,{"$error":"#NAME?"},0,0,0,0,0,{"$error":"#NAME?"},{"$error":"#NAME?"},{"$error":"#NAME?"}]
[2200000,{"$error":"#NAME?"},0,0,0,0,0,{"$error":"#NAME?"},{"$error":"#NAME?"},{"$error":"#NAME?"}]
[2700000,{"$error":"#NAME?"},0,0,0,0,0,{"$error":"#NAME?"},{"$error":"#NAME?"},{"$error":"#NAME?"}]
[3300000,{"$error":"#NAME?"},0,0,0,0,0,{"$error":"#NAME?"},{"$error":"#NAME?"},{"$error":"#NAME?"}]
[3900000,{"$error":"#NAME?"},0,0,0,0,0,{"$error":"#NAME?"},{"$error":"#NAME?"},{"$error":"#NAME?"}]
[4700000,{"$error":"#NAME?"},0,0,0,0,0,{"$error":"#NAME?"},{"$error":"#NAME?"},{"$error":"#NAME?"}]
[5600000,{"$error":"#NAME?"},0,0,0,0,0,{"$error":"#NAME?"},{"$error":"#NAME?"},{"$error":"#NAME?"}]
[6800000,{"$error":"#NAME?"},0,0,0,0,0,{"$error":"#NAME?"},{"$error":"#NAME?"},{"$error":"#NAME?"}]
[8200000,{"$error":"#NAME?"},0,0,0,0,0,{"$error":"#NAME?"},{"$error":"#NAME?"},{"$error":"#NAME?"}]
[10000000,{"$error":"#NAME?"},0,0,0,0,0,{"$error":"#NAME?"},{"$error":"#NAME?"},{"$error":"#NAME?"}]
[12000000,{"$error":"#NAME?"},0,0,0,0,0,{"$error":"#NAME?"},{"$error":"#NAME?"},{"$error":"#NAME?"}]
[15000000,{"$error":"#NAME?"},0,0,0,0,0,{"$error":"#NAME?"},{"$error":"#NAME?"},{"$error":"#NAME?"}]
[18000000,{"$error":"#NAME?"},0,0,0,0,0,{"$error":"#NAME?"},{"$error":"#NAME?"},{"$error":"#NAME?"}]
[22000000,{"$error":"#NAME?"},0,0,0,27000000,0,{"$error":"#NAME?"},{"$error":"#NAME?"},{"$error":"#NAME?"}]
[{"$f":"A87*10","v":27000000},{"$error":"#NAME?"},0,0,0,0,0,{"$error":"#NAME?"},{"$error":"#NAME?"},{"$error":"#NAME?"}]
[33000000,{"$error":"#NAME?"},0,0,0,0,0,{"$error":"#NAME?"},{"$error":"#NAME?"},{"$error":"#NAME?"}]
[39000000,{"$error":"#NAME?"},0,0,0,0,0,{"$error":"#NAME?"},{"$error":"#NAME?"},{"$error":"#NAME?"}]
[47000000,{"$error":"#NAME?"},0,0,0,0,0,{"$error":"#NAME?"},{"$error":"#NAME?"},{"$error":"#NAME?"}]
[56000000,{"$error":"#NAME?"},0,0,0,{"$f":"IF(IF((F$3*10^12-$A104)*(F$3*10^12-$A103)*-1<0,0,1)*IF(ABS(F$3*10^12-$A104)>(F$3*10^12-$A103),$A103,$A104)=F104,0,IF((F$3*10^12-$A104)*(F$3*10^12-$A103)*-1<0,0,1)*IF(ABS(F$3*10^12-$A104)>(F$3*10^12-$A103),$A103,$A104))","v":0},{"$f":"IF(IF((G$3*10^12-$A104)*(G$3*10^12-$A103)*-1<0,0,1)*IF(ABS(G$3*10^12-$A104)>(G$3*10^12-$A103),$A103,$A104)=G104,0,IF((G$3*10^12-$A104)*(G$3*10^12-$A103)*-1<0,0,1)*IF(ABS(G$3*10^12-$A104)>(G$3*10^12-$A103),$A103,$A104))","v":0},{"$f":"IF(IF((H$3*10^12-$A104)*(H$3*10^12-$A103)*-1<0,0,1)*IF(ABS(H$3*10^12-$A104)>(H$3*10^12-$A103),$A103,$A104)=H104,0,IF((H$3*10^12-$A104)*(H$3*10^12-$A103)*-1<0,0,1)*IF(ABS(H$3*10^12-$A104)>(H$3*10^12-$A103),$A103,$A104))","v":{"$error":"#NAME?"}},{"$f":"IF(IF((I$3*10^12-$A104)*(I$3*10^12-$A103)*-1<0,0,1)*IF(ABS(I$3*10^12-$A104)>(I$3*10^12-$A103),$A103,$A104)=I104,0,IF((I$3*10^12-$A104)*(I$3*10^12-$A103)*-1<0,0,1)*IF(ABS(I$3*10^12-$A104)>(I$3*10^12-$A103),$A103,$A104))","v":{"$error":"#NAME?"}},{"$error":"#NAME?"}]
[68000000,{"$error":"#NAME?"},0,0,0,0,0,{"$error":"#NAME?"},{"$error":"#NAME?"},{"$error":"#NAME?"}]
[82000000,{"$error":"#NAME?"},0,0,0,0,0,{"$error":"#NAME?"},{"$error":"#NAME?"},{"$error":"#NAME?"}]
[100000000,{"$error":"#NAME?"},0,0,0,0,0,{"$error":"#NAME?"},{"$error":"#NAME?"},{"$error":"#NAME?"}]
[120000000,{"$error":"#NAME?"},0,0,120000000,0,0,{"$error":"#NAME?"},{"$error":"#NAME?"},{"$error":"#NAME?"}]
[150000000,{"$error":"#NAME?"},0,0,0,0,0,{"$error":"#NAME?"},{"$error":"#NAME?"},{"$error":"#NAME?"}]
[180000000,{"$error":"#NAME?"},0,0,0,0,0,{"$error":"#NAME?"},{"$error":"#NAME?"},{"$error":"#NAME?"}]
[220000000,{"$error":"#NAME?"},0,0,0,0,0,{"$error":"#NAME?"},{"$error":"#NAME?"},{"$error":"#NAME?"}]
[270000000,{"$error":"#NAME?"},0,0,0,0,0,{"$error":"#NAME?"},{"$error":"#NAME?"},{"$error":"#NAME?"}]
[330000000,{"$error":"#NAME?"},0,0,0,0,0,{"$error":"#NAME?"},{"$error":"#NAME?"},{"$error":"#NAME?"}]
[390000000,{"$error":"#NAME?"},0,0,0,0,0,{"$error":"#NAME?"},{"$error":"#NAME?"},{"$error":"#NAME?"}]
[470000000,{"$error":"#NAME?"},0,0,0,0,0,{"$error":"#NAME?"},{"$error":"#NAME?"},{"$error":"#NAME?"}]
[560000000,{"$error":"#NAME?"},0,0,0,0,0,{"$error":"#NAME?"},{"$error":"#NAME?"},{"$error":"#NAME?"}]
[680000000,{"$error":"#NAME?"},0,0,0,0,0,{"$error":"#NAME?"},{"$error":"#NAME?"},{"$error":"#NAME?"}]
[820000000,{"$error":"#NAME?"},0,0,0,0,0,{"$error":"#NAME?"},{"$error":"#NAME?"},{"$error":"#NAME?"}]
[1000000000,{"$error":"#NAME?"},0,0,0,0,0,{"$error":"#NAME?"},{"$error":"#NAME?"},{"$error":"#NAME?"}]
[1200000000,{"$error":"#NAME?"},0,0,0,0,0,{"$error":"#NAME?"},{"$error":"#NAME?"},{"$error":"#NAME?"}]
[1500000000,{"$error":"#NAME?"},0,0,0,0,0,{"$error":"#NAME?"},{"$error":"#NAME?"},{"$error":"#NAME?"}]
[1800000000,{"$error":"#NAME?"},0,0,0,0,0,{"$error":"#NAME?"},{"$error":"#NAME?"},{"$error":"#NAME?"}]
[2200000000,{"$error":"#NAME?"},0,0,0,0,0,{"$error":"#NAME?"},{"$error":"#NAME?"},{"$error":"#NAME?"}]
[2700000000,{"$error":"#NAME?"},0,0,0,0,0,{"$error":"#NAME?"},{"$error":"#NAME?"},{"$error":"#NAME?"}]
[3300000000,{"$error":"#NAME?"},0,0,0,0,0,{"$error":"#NAME?"},{"$error":"#NAME?"},{"$error":"#NAME?"}]
[3900000000,{"$error":"#NAME?"},0,0,0,0,0,{"$error":"#NAME?"},{"$error":"#NAME?"},{"$error":"#NAME?"}]
[4700000000,{"$error":"#NAME?"},0,0,0,0,0,{"$error":"#NAME?"},{"$error":"#NAME?"},{"$error":"#NAME?"}]
[5600000000,{"$error":"#NAME?"},0,0,0,0,0,{"$error":"#NAME?"},{"$error":"#NAME?"},{"$error":"#NAME?"}]
[6800000000,{"$error":"#NAME?"},0,0,0,0,0,{"$error":"#NAME?"},{"$error":"#NAME?"},{"$error":"#NAME?"}]
[8200000000,{"$error":"#NAME?"},0,0,0,0,0,{"$error":"#NAME?"},{"$error":"#NAME?"},{"$error":"#NAME?"}]
[10000000000,{"$error":"#NAME?"},0,0,0,0,0,{"$error":"#NAME?"},{"$error":"#NAME?"},{"$error":"#NAME?"}]
[12000000000,{"$error":"#NAME?"},0,0,0,0,0,{"$error":"#NAME?"},{"$error":"#NAME?"},{"$error":"#NAME?"}]
[15000000000,{"$error":"#NAME?"},0,0,0,0,0,{"$error":"#NAME?"},{"$error":"#NAME?"},{"$error":"#NAME?"}]
[18000000000,{"$error":"#NAME?"},0,0,0,0,0,{"$error":"#NAME?"},{"$error":"#NAME?"},{"$f":"IF(IF((J$3*10^12-$A134)*(J$3*10^12-$A133)*-1<0,0,1)*IF(ABS(J$3*10^12-$A134)>(J$3*10^12-$A133),$A133,$A134)=J134,0,IF((J$3*10^12-$A134)*(J$3*10^12-$A133)*-1<0,0,1)*IF(ABS(J$3*10^12-$A134)>(J$3*10^12-$A133),$A133,$A134))","v":{"$error":"#NAME?"}}]
[22000000000,{"$error":"#NAME?"},0,0,{"$f":"IF(IF((E$3*10^12-$A135)*(E$3*10^12-$A134)*-1<0,0,1)*IF(ABS(E$3*10^12-$A135)>(E$3*10^12-$A134),$A134,$A135)=E135,0,IF((E$3*10^12-$A135)*(E$3*10^12-$A134)*-1<0,0,1)*IF(ABS(E$3*10^12-$A135)>(E$3*10^12-$A134),$A134,$A135))","v":0},0,0,{"$error":"#NAME?"},{"$error":"#NAME?"},{"$f":"IF(IF((J$3*10^12-$A135)*(J$3*10^12-$A134)*-1<0,0,1)*IF(ABS(J$3*10^12-$A135)>(J$3*10^12-$A134),$A134,$A135)=J135,0,IF((J$3*10^12-$A135)*(J$3*10^12-$A134)*-1<0,0,1)*IF(ABS(J$3*10^12-$A135)>(J$3*10^12-$A134),$A134,$A135))","v":{"$error":"#NAME?"}}]
[27000000000,{"$f":"IF(IF((B$3*10^12-$A136)*(B$3*10^12-$A135)*-1<0,0,1)*IF(ABS(B$3*10^12-$A136)>(B$3*10^12-$A135),$A135,$A136)=B136,0,IF((B$3*10^12-$A136)*(B$3*10^12-$A135)*-1<0,0,1)*IF(ABS(B$3*10^12-$A136)>(B$3*10^12-$A135),$A135,$A136))","v":{"$error":"#NAME?"}},{"$f":"IF(IF((C$3*10^12-$A136)*(C$3*10^12-$A135)*-1<0,0,1)*IF(ABS(C$3*10^12-$A136)>(C$3*10^12-$A135),$A135,$A136)=C136,0,IF((C$3*10^12-$A136)*(C$3*10^12-$A135)*-1<0,0,1)*IF(ABS(C$3*10^12-$A136)>(C$3*10^12-$A135),$A135,$A136))","v":0},0,0,0,0,{"$error":"#NAME?"},{"$error":"#NAME?"},{"$error":"#NAME?"}]
[33000000000,{"$error":"#NAME?"},0,0,0,0,0,{"$error":"#NAME?"},{"$error":"#NAME?"},{"$error":"#NAME?"}]
[39000000000,{"$error":"#NAME?"},0,0,0,0,0,{"$error":"#NAME?"},{"$error":"#NAME?"},{"$error":"#NAME?"}]
[47000000000,{"$error":"#NAME?"},0,0,0,0,0,{"$error":"#NAME?"},{"$error":"#NAME?"},{"$error":"#NAME?"}]
[56000000000,{"$error":"#NAME?"},0,0,0,0,0,{"$error":"#NAME?"},{"$error":"#NAME?"},{"$error":"#NAME?"}]
[68000000000,{"$error":"#NAME?"},0,0,0,0,0,{"$error":"#NAME?"},{"$error":"#NAME?"},{"$error":"#NAME?"}]
[82000000000,{"$error":"#NAME?"},0,0,0,0,0,{"$error":"#NAME?"},{"$error":"#NAME?"},{"$error":"#NAME?"}]
[100000000000,{"$error":"#NAME?"},0,0,0,0,0,{"$error":"#NAME?"},{"$error":"#NAME?"},{"$error":"#NAME?"}]
[120000000000,{"$error":"#NAME?"},0,0,0,0,0,{"$error":"#NAME?"},{"$error":"#NAME?"},{"$error":"#NAME?"}]
[150000000000,{"$error":"#NAME?"},0,0,0,0,0,{"$error":"#NAME?"},{"$error":"#NAME?"},{"$error":"#NAME?"}]
[180000000000,{"$error":"#NAME?"},0,0,0,0,0,{"$error":"#NAME?"},{"$error":"#NAME?"},{"$error":"#NAME?"}]
[220000000000,{"$error":"#NAME?"},0,0,0,0,0,{"$error":"#NAME?"},{"$error":"#NAME?"},{"$error":"#NAME?"}]
[270000000000,{"$error":"#NAME?"},0,0,0,0,0,{"$error":"#NAME?"},{"$error":"#NAME?"},{"$error":"#NAME?"}]
[330000000000,{"$error":"#NAME?"},0,0,0,0,0,{"$error":"#NAME?"},{"$error":"#NAME?"},{"$error":"#NAME?"}]
[390000000000,{"$error":"#NAME?"},0,0,0,0,0,{"$error":"#NAME?"},{"$error":"#NAME?"},{"$error":"#NAME?"}]
[470000000000,{"$error":"#NAME?"},0,0,0,0,0,{"$error":"#NAME?"},{"$error":"#NAME?"},{"$error":"#NAME?"}]
[560000000000,{"$error":"#NAME?"},0,0,0,0,0,{"$error":"#NAME?"},{"$error":"#NAME?"},{"$error":"#NAME?"}]
[680000000000,{"$error":"#NAME?"},0,0,0,0,0,{"$error":"#NAME?"},{"$error":"#NAME?"},{"$error":"#NAME?"}]
[820000000000,{"$error":"#NAME?"},0,0,0,0,0,{"$error":"#NAME?"},{"$error":"#NAME?"},{"$error":"#NAME?"}]
[1000000000000,{"$error":"#NAME?"},0,0,0,0,0,{"$error":"#NAME?"},{"$error":"#NAME?"},{"$error":"#NAME?"}]
[1200000000000,{"$error":"#NAME?"},0,0,0,0,0,{"$error":"#NAME?"},{"$error":"#NAME?"},{"$error":"#NAME?"}]
[1500000000000,{"$error":"#NAME?"},0,0,0,0,0,{"$error":"#NAME?"},{"$error":"#NAME?"},{"$error":"#NAME?"}]
[1800000000000,{"$error":"#NAME?"},0,0,0,0,0,{"$error":"#NAME?"},{"$error":"#NAME?"},{"$error":"#NAME?"}]
[2200000000000,{"$error":"#NAME?"},0,0,0,0,0,{"$error":"#NAME?"},{"$error":"#NAME?"},{"$error":"#NAME?"}]
[2700000000000,{"$error":"#NAME?"},2700000000000,2700000000000,2700000000000,2700000000000,2700000000000,{"$error":"#NAME?"},{"$error":"#NAME?"},{"$error":"#NAME?"}]

{"sheet":"Snubber","index":11,"n_rows":6,"n_cols":5,"rows_kept":6,"cut":false,"hidden":true,"merged":[]}
[null,null,"UNITS","STD UNITS"]
["Frequency of Ringing",85,"MHz",{"$f":"B2*1000000","v":85000000},"Hz"]
["SW capacitance",3000,"pF",{"$f":"B3*0.000000000001","v":3E-9},"F"]
["Lpar",{"$f":"1000000000*1/((D2*2*3.14159)^2*D3)","v":1.1686430773614742},"nH",{"$f":"B4/1000000000","v":1.1686430773614743E-9},"H"]
["Csnub",{"$f":"4*B3","v":12000},"pF",{"$f":"B5*0.000000000001","v":1.2E-8},"F"]
["Rsnub",{"$f":"SQRT(D4/D3)","v":0.62413755891936573},"Ω",{"$f":"B6","v":0.62413755891936573},"Ω"]

{"sheet":"Parallel Output Caps","index":12,"n_rows":17,"n_cols":5,"rows_kept":17,"cut":false,"hidden":true,"merged":[]}
[]
[]
[]
["Fsw",{"$f":"Fsw","v":400000}]
[]
["C1",20,"uF",{"$f":"B6/1000000","v":2.0000000000000002E-5},"F"]
["R1",0.5,"mOhms",{"$f":"B7/1000","v":5.0000000000000001E-4},"Ohms"]
[]
["C2",68,"uF",{"$f":"B9/1000000","v":6.7999999999999999E-5},"F"]
["R2",20,"mOhms",{"$f":"B10/1000","v":0.02},"Ohms"]
[]
[]
["I1 ",{"$f":"(D6/(D6+D9))*SQRT((D10*D9*B4)^2+1)/SQRT((((D7+D10)*D6*D9/(D9+D6))*B4)^2+1)","v":0.25667257397349275},"%"]
["I2 ",{"$f":"1-B13","v":0.74332742602650725},"%"]
[]
["I1 ",{"$f":"B13*(Iripple1/(2*SQRT(3)))","v":{"$error":"#NAME?"}},"A"]
["I2 ",{"$f":"B14*(Iripple1/(2*SQRT(3)))","v":{"$error":"#NAME?"}},"A"]