{"text_format":"1","workbook":"xlsx","n_sheets":11,"sheets":["Table of Contents","Input Sheet","Device Calculator","Schematic Checklist","Layout Checklist","Part Data","MSEL","Std. R and C Values","Extra","About","Help"],"not_rendered":{"charts":3,"images":4,"macros":1,"external_links":0,"defined_names":180,"comments":2,"pivot_tables":0},"unopened":[],"bounds":{"document_bytes":16777216,"sheet_cells":100000,"rows_first":2000,"rows_last":500,"rows_between":2000,"halvings":0,"cell_chars":16384,"cell_head_chars":4096},"cells_cut":0,"cells_raw":0,"read":"whole","date_system":"1900"}

{"sheet":"Table of Contents","index":0,"n_rows":18,"n_cols":6,"rows_kept":18,"cut":false,"hidden":false,"merged":[[7,5,7,18],[16,5,16,18],[17,5,17,18],[5,5,5,6],[3,1,3,18],[9,5,9,18],[11,5,11,18],[13,5,13,18],[15,1,15,3],[17,1,17,3],[11,1,11,3],[13,1,13,3],[5,1,5,3],[9,1,9,3],[7,1,7,3]]}
[]
[]
[]
[null,"Table of Contents"]
[]
[null,"Worksheets",null,null,null,"Description"]
[]
[null,"Input Sheet",null,null,null,"This sheet contains simplified input for checking component values using the macros"]
[]
[null,"Device Calculator",null,null,null,"This sheet is where all calculations are performed. It can be used independently to select or verify component values."]
[]
[null,"Schematic Checklist"]
[]
[null,"Layout Checklist"]
[]
{"$rows_left_out":4}
{"sheet":"Input Sheet","index":1,"n_rows":63,"n_cols":10,"rows_kept":63,"cut":false,"hidden":false,"merged":[]}
[null,null,null,null,null,null,null,null,"Table of Contents"]
[]
[]
[null,"Input Sheet",null,null,null,null,"*Selected*"]
[null,"Parameter","Units","Type","Default","Design Example","Design 1","end"]
[null,"Rail Name",null,"Req",null,"TPS54KB20EVM (U2)",null,null,null,"Macro Directions:"]
[null,{"$f":"'Device Calculator'!B9","v":"Part Number"},null,"Req",null,"TPS54KB20"]
[null,{"$f":"'Device Calculator'!B30","v":"Vin_min"},"V","Opt","Vin_typ*0.8",4.5,null,null,null,"Check/Calculate Selected Column"]
[null,{"$f":"'Device Calculator'!B31","v":"Vin_typ"},"V","Req",null,12,null,null,null,"Select any cell in the column corresponding to the design you want to check."]
[null,{"$f":"'Device Calculator'!B32","v":"Vin_max"},"V","Opt","Vin_typ*1.1",16,null,null,null,"Click on \"Check/Calculate Selected Column\" to send the input values to the Device Calculator worksheet"]
[null,{"$f":"'Device Calculator'!B33","v":"Vout"},"V","Req",null,3.3,null,null,null,"The calculated results from the Device Calculator are then pulled back to this sheet for component value verification."]
[null,{"$f":"'Device Calculator'!B34","v":"Iout"},"A","Opt","Iout_max_IC",25]
[null,{"$f":"'Device Calculator'!B69","v":"dVout_ripple_perc"},null,"Opt",0.01,0.01,null,null,null,"Insert New Design"]
[null,{"$f":"'Device Calculator'!B68","v":"dVout_trans_perc"},null,"Opt",0.04,0.03,null,null,null,"Click on “Insert New Design” to add another column for checking a different design."]
[null,{"$f":"'Device Calculator'!B67","v":"Iout_step"},"A","Opt","Iout*0.5",10,null,null,null,"To delete a design that is no longer needed, right-click on the column letter and select “delete.”"]
{"$rows_left_out":49}
{"sheet":"Device Calculator","index":2,"n_rows":161,"n_cols":13,"rows_kept":161,"cut":false,"hidden":false,"merged":[[154,1,154,7],[150,1,150,7],[32,9,33,11],[139,1,139,7],[121,1,121,7],[134,1,134,7],[40,1,40,7],[65,1,65,7],[64,1,64,7],[54,1,54,7],[110,1,110,7],[111,1,111,7],[34,1,34,7],[100,1,100,7],[101,9,101,10],[3,1,3,7],[39,1,39,7],[4,1,6,1],[4,2,6,2],[4,3,6,3],[4,4,6,4],[4,5,6,5],[4,6,6,6],[4,7,6,7],[7,1,7,7],[28,1,28,7]]}
[null,null,null,null,null,null,null,"Table of Contents"]
[]
[]
[null,"Device Calculator",null,null,null,null,null,null,null,"Key"]
[null,"Parameter","Input","Recommended","Selected Value","Calculated with \nSelected Value","Units","Description",null,"User Entered Value"]
[null,null,null,null,null,null,null,null,null,"Design Caution (Yellow)"]
[null,null,null,null,null,null,null,null,null,"Design Warning (Red)"]
[null,"Choose Device"]
[null,"Part Number","TPS54KB20",null,null,null,null,"IC part number (for differences, see table on the right)",null,"Part Number","IOUT,MAX","VREF","Fault Response"]
[null,"Vin_min_IC",{"$f":"'Part Data'!B2","v":4},null,null,null,"V","IC rated minimum input voltage",null,"TPS54KB20","25A","0.9V","Latch-off"]
[null,"Vin_max_IC",{"$f":"'Part Data'!C2","v":16},null,null,null,"V","IC rated maximum input voltage",null,"TPS54KB21","25A","0.5V","Latch-off"]
[null,"Iout_max_IC",{"$f":"'Part Data'!D2","v":25},null,null,null,"A","IC rated maximum output current",null,"TPS54KB22","25A","0.9V","Hiccup"]
[null,"Ven_R",{"$f":"'Part Data'!T2","v":1.2},null,null,null,"V","Typical EN voltage rising threshold",null,"TPS54KB23","25A","0.5V","Hiccup"]
[null,"Ven_F",{"$f":"'Part Data'!U2","v":1},null,null,null,"V","Typical EN voltage falling threshold",null,"TPS54KC23","30A","0.5V","Hiccup"]
[null,"Vvcc",{"$f":"'Part Data'!M2","v":3},null,null,null,"V","Typical internal LDO output voltage"]
{"$rows_left_out":147}
{"sheet":"Schematic Checklist","index":3,"n_rows":26,"n_cols":9,"rows_kept":26,"cut":false,"hidden":false,"merged":[[5,1,5,8],[8,1,8,8],[16,1,16,8]]}
[null,null,null,null,null,null,null,null,"Table of Contents"]
[]
[]
[null,"Schematic Checklist"]
[null,"Pin","Name","Purpose","Connection For Functional Use","Reasoning","Component Values from Design Calculations","Status","Comments"]
[null,"Control"]
[null,14,"FB divider","Output feedback input","Ensure that the feedback divider network gives the appropriate Vout based on the Vref chosen. The FB pin must be connected to the AGND pin.",null,{"$f":"CONCATENATE(\"Rfb_t = \",Rfb_t,\" kΩ\",\"\nRfb_b = \",Rfb_b,\" kΩ\")","v":"Rfb_t = 8.06 kΩ\nRfb_b = 3.01 kΩ"},"Open"]
[null,14,"FB Cff","Output feedback input","Add a capacitor in parallel with the top feedback resistor","Improves transient response and may be required for sufficient phase margin or minimizing output ripple",{"$f":"IF(FF_cap?=\"NO\",\"N/A\",CONCATENATE(\"Cff = \",ROUND(Cff,0),\" pF\"))","v":"N/A"},"Open"]
[null,"Configuration"]
[null,11,"MSEL","fsw, FCCM/Skip-mode, and RAMP","Connect a resistor from MSEL pin to AGND pin. 1% or better tolerance resistor is required. Use MSEL Pin Selection table to select the desired mode.",null,{"$f":"CONCATENATE(RMSEL,\" kΩ\")","v":"86.6 kΩ"},"Open"]
[null,11,"MSEL fsw setting","fsw selection","Selected fsw should be below the maximum limits calculated in the calculator tab","When exceeding fsw_max_ton, the fsw will decrease but the output will still be regulated. \nWhen exceeding fsw_max_toff, the output will become unregulated and UVP may trip.",{"$f":"CONCATENATE(\"fsw_max_ton = \",ROUND(fsw_max_ton,0),\" kHz\",\"\nfsw_max_toff = \",ROUND(fsw_max_toff,0),\" kHz\")","v":"fsw_max_ton = 6875 kHz\nfsw_max_toff = 1318 kHz"},"Open"]
[null,12,"ILIM","OCL detection threshold setting pin","Connect the resistor from the ILIM pin to the AGND pin. Use WEBENCH or calculator to calculate the RILIM resistor value. Recommend 1% or better resistors for RILIM.",null,{"$f":"CONCATENATE(\"Valley ILIM = \",ROUND(Ilim_valley,2),\" A\n\",\"RTRIP = \",ROUND(RILIM,2),\" kΩ\")","v":"Valley ILIM = 27.5 A\nRTRIP = 4.32 kΩ"},"Open"]
[null,15,"SS","Soft-start time","Connecting a capacitor from this pin to AGND pin programs soft-start time. A minimum 10-nF capacitor is required. ",null,{"$f":"CONCATENATE(\"CSS = \",ROUND(Css,0),\" nF\")","v":"CSS = 39 nF"},"Open"]
[null,10,"PGOOD","Open drain power good flag","Connect a 1k-100k resistor to pull-up this pin. Recommend pulling up to VCC but not required.","PGOOD pin is an open-drain output so a pull-up is required when used",{"$f":"CONCATENATE(\"Rpg = \",ROUND(Rpg,0),\"  kΩ\")","v":"Rpg = 10  kΩ"},"Open"]
[null,1,"EN","Enable pin","Floating this pin is not recommended. To start switching, this pin must be pulled high.\nThe recommended max voltage rating on the EN pin is 5.5V. Do not connect EN pin directly to VIN unless the max VIN for your application is below 5.5V. \nWhen using VIN or VDD to drive the EN pin, use a resistor divider and ensure that the voltage stays below 6V.",null,{"$f":"CONCATENATE(\"Ren_t = \",Ren_t,\" kΩ\",\"\nRen_b = \",Ren_b,\" kΩ\")","v":"Ren_t = 200 kΩ\nRen_b = 100 kΩ"},"Open"]
{"$rows_left_out":12}
{"sheet":"Layout Checklist","index":4,"n_rows":21,"n_cols":8,"rows_kept":21,"cut":false,"hidden":false,"merged":[[15,1,15,7],[5,1,5,7]]}
[null,null,null,null,null,null,null,"Table of Contents"]
[]
[]
[null,"Layout Checklist"]
[null,"Pin","Name","Purpose","Placement or Routing?","Remarks","Status","Comments"]
[null,"Power Stage"]
[null,"3, 9, 16 (VIN), \n4, 8 (PGND),\n6 (SW)","VIN, PGND, SW",null,"Placement and Routing","VIN, PGND, and SW traces must be as wide as possible to reduce trace impedance and improve heat dissipation.","Open"]
[null,"N/A","Cout and Lout","Output filter inductor and capacitors","Placement and Routing","Place the power components (including input and output capacitors, the inductor, and the IC) on the top side of the PCB. To shield and isolate the small signal traces from noisy power lines, insert at least one solid ground inner plane.","Open"]
[null,"3, 9 (VIN), \n4, 8 (PGND)","VIN-PGND caps","Conversion power input","Placement","Placement of the VIN decoupling capacitors are important for the power MOSFET robustness. A 1-μF/25-V/0402 ceramic high-frequency bypass capacitor on each VIN pin (pin 3 and 9) is required, connected to the adjacent PGND pins (pin 4 and 8 respectively). Place the remaining ceramic input capacitance next to these high frequency bypass capacitors. The remaining input capacitance can be placed on the other side of the board, but use as many vias as possible to minimize impedance between the capacitors and the pins of the IC.\n","Open"]
[null,"4, 8, 16","PGND",null,"Routing","Place eight vias below the PGND pins (pins 4, 8, and 16) and as many vias as possible near the PGND pins (pin 4 and 8). This action minimizes parasitic impedance and also lowers thermal resistance.","Open"]
[null,"3, 9","VIN",null,"Routing","Use vias near both VIN pins and provide a low impedance connection between them through an internal layer. A via can also be placed below each of the VIN pins.","Open"]
[null,7,"VCC cap","Internal 3-V LDO output","Placement","Place the VCC decoupling capacitor as close as possible to the device, with a short return to PGND pin 8. Ensure the VCC decoupling loop is small and use traces with a width of 12 mil or wider to route the connection.","Open"]
[null,5,"BOOT cap","Supply input for high-side FET gate driver","Placement","Place the BOOT capacitor as close as possible to the BOOT and SW pins. Use traces with a width of 12 mil or wider to route the connection.","Open"]
[null,6,"SW","Switching node","Routing","The PCB trace, which connects the SW pin and high-voltage side of the inductor, is defined as switch node. The switch node must be as short and wide as possible.","Open"]
[null,6,"SW snubber","Switching node","Placement and Routing","Optional If used, place the RC snubber on the opposite side of the board from the IC with multiple vias in the SW node to minimize routing impedance and with a very low impedance return to PGND pins.","Open"]
{"$rows_left_out":7}
{"sheet":"Part Data","index":5,"n_rows":581,"n_cols":29,"rows_kept":581,"cut":false,"hidden":true,"merged":[]}
["Selected Device"]
[{"$f":"VLOOKUP('Device Calculator'!$C$9,'Part Data'!$A$6:$AB$10,A4,FALSE)","v":"TPS54KB20"},{"$f":"VLOOKUP('Device Calculator'!$C$9,'Part Data'!$A$6:$AB$10,B4,FALSE)","v":4},{"$f":"VLOOKUP('Device Calculator'!$C$9,'Part Data'!$A$6:$AB$10,C4,FALSE)","v":16},{"$f":"VLOOKUP('Device Calculator'!$C$9,'Part Data'!$A$6:$AB$10,D4,FALSE)","v":25},{"$f":"VLOOKUP('Device Calculator'!$C$9,'Part Data'!$A$6:$AB$10,E4,FALSE)","v":800},{"$f":"VLOOKUP('Device Calculator'!$C$9,'Part Data'!$A$6:$AB$10,F4,FALSE)","v":1100},{"$f":"VLOOKUP('Device Calculator'!$C$9,'Part Data'!$A$6:$AB$10,G4,FALSE)","v":1400},{"$f":"VLOOKUP('Device Calculator'!$C$9,'Part Data'!$A$6:$AB$10,H4,FALSE)","v":27.5},{"$f":"VLOOKUP('Device Calculator'!$C$9,'Part Data'!$A$6:$AB$10,I4,FALSE)","v":30},{"$f":"VLOOKUP('Device Calculator'!$C$9,'Part Data'!$A$6:$AB$10,J4,FALSE)","v":0.9},{"$f":"VLOOKUP('Device Calculator'!$C$9,'Part Data'!$A$6:$AB$10,K4,FALSE)","v":"Latch Off"},{"$f":"VLOOKUP('Device Calculator'!$C$9,'Part Data'!$A$6:$AB$10,L4,FALSE)","v":"Latch Off"},{"$f":"VLOOKUP('Device Calculator'!$C$9,'Part Data'!$A$6:$AB$10,M4,FALSE)","v":3},{"$f":"VLOOKUP('Device Calculator'!$C$9,'Part Data'!$A$6:$AB$10,N4,FALSE)","v":4},{"$f":"VLOOKUP('Device Calculator'!$C$9,'Part Data'!$A$6:$AB$10,O4,FALSE)","v":150},{"$f":"VLOOKUP('Device Calculator'!$C$9,'Part Data'!$A$6:$AB$10,P4,FALSE)","v":5.8},{"$f":"VLOOKUP('Device Calculator'!$C$9,'Part Data'!$A$6:$AB$10,Q4,FALSE)","v":2.2999999999999998},{"$f":"VLOOKUP('Device Calculator'!$C$9,'Part Data'!$A$6:$AB$10,R4,FALSE)","v":120000},{"$f":"VLOOKUP('Device Calculator'!$C$9,'Part Data'!$A$6:$AB$10,S4,FALSE)","v":36},{"$f":"VLOOKUP('Device Calculator'!$C$9,'Part Data'!$A$6:$AB$10,T4,FALSE)","v":1.2},{"$f":"VLOOKUP('Device Calculator'!$C$9,'Part Data'!$A$6:$AB$10,U4,FALSE)","v":1},{"$f":"VLOOKUP('Device Calculator'!$C$9,'Part Data'!$A$6:$AB$10,V4,FALSE)","v":-7.5},{"$f":"VLOOKUP('Device Calculator'!$C$9,'Part Data'!$A$6:$AB$10,W4,FALSE)","v":0},{"$f":"VLOOKUP('Device Calculator'!$C$9,'Part Data'!$A$6:$AB$10,X4,FALSE)","v":20},{"$f":"VLOOKUP('Device Calculator'!$C$9,'Part Data'!$A$6:$AB$10,Y4,FALSE)","v":4.9345181134654821},{"$f":"VLOOKUP('Device Calculator'!$C$9,'Part Data'!$A$6:$AB$10,Z4,FALSE)","v":30.959293735224588},{"$f":"VLOOKUP('Device Calculator'!$C$9,'Part Data'!$A$6:$AB$10,AA4,FALSE)","v":0.12579249946271229},{"$f":"VLOOKUP('Device Calculator'!$C$9,'Part Data'!$A$6:$AB$10,AB4,FALSE)","v":0}]
[]
[1,2,3,4,5,6,7,8,9,10,11,12,13,14,15,16,17,18,19,20,21,22,{"$f":"V4+1","v":23},{"$f":"W4+1","v":24},{"$f":"X4+1","v":25},26,27,28,0]
["Part #","VIN_min","VIN_max","Io,rated","Fsw_1","Fsw_2","Fsw_3","OC clamp","tonmin","Vfb_reg","OC Fault","OV Fault","VCC LDO Voltage","VIN_min_bias","toffmin","R_HS","R_LS","K_OCL","I_ss","EN_rise","EN_fall","Ioc_neg_max","RILIM_min","RILIM_max","R_ILIM_calc","Ilim_min","ILIM_Tol","Rboot_rec",{"$f":"AC101/10","v":1E-3}]
["TPS54KB20",4,16,25,800,1100,1400,27.5,30,0.9,"Latch Off","Latch Off",3,4,150,5.8,2.2999999999999998,120000,36,1.2,1,-7.5,0,20,{"$f":"MAX(PartData[[#This Row],[RILIM_min]],MIN(PartData[[#This Row],[RILIM_max]],10^-3*R6/(Ilim_valley_input-(Vin_typ-Vout)*Vout/(2*Vin_typ*Lout*fsw_select*10^-3))))","v":4.9345181134654821},{"$f":"PartData[[#This Row],[K_OCL]]/(RILIM*10^3)+1/2*(Vin_typ-Vout)*Vout/Vin_typ*1/(Lout*fsw_select*10^-3)","v":30.959293735224588},{"$f":"(Z6-Ilim_valley)/Ilim_valley","v":0.12579249946271229},0,{"$f":"AC102/10","v":1.0200000000000001E-3}]
["TPS54KB21",4,16,25,800,1100,1400,27.5,30,0.5,"Latch Off","Latch Off",3,4,150,5.8,2.2999999999999998,120000,36,1.2,1,-7.5,0,20,{"$f":"MAX(PartData[[#This Row],[RILIM_min]],MIN(PartData[[#This Row],[RILIM_max]],10^-3*R7/(Ilim_valley_input-(Vin_typ-Vout)*Vout/(2*Vin_typ*Lout*fsw_select*10^-3))))","v":4.9345181134654821},{"$f":"PartData[[#This Row],[K_OCL]]/(RILIM*10^3)+1/2*(Vin_typ-Vout)*Vout/Vin_typ*1/(Lout*fsw_select*10^-3)","v":30.959293735224588},{"$f":"(Z7-Ilim_valley)/Ilim_valley","v":0.12579249946271229},null,1.0500000000000002E-3]
["TPS54KB22",4,16,25,800,1100,1400,27.5,30,0.9,"Hiccup ","Hiccup",3,4,150,5.8,2.2999999999999998,120000,36,1.2,1,-7.5,0,20,{"$f":"MAX(PartData[[#This Row],[RILIM_min]],MIN(PartData[[#This Row],[RILIM_max]],10^-3*R8/(Ilim_valley_input-(Vin_typ-Vout)*Vout/(2*Vin_typ*Lout*fsw_select*10^-3))))","v":4.9345181134654821},{"$f":"PartData[[#This Row],[K_OCL]]/(RILIM*10^3)+1/2*(Vin_typ-Vout)*Vout/Vin_typ*1/(Lout*fsw_select*10^-3)","v":30.959293735224588},{"$f":"(Z8-Ilim_valley)/Ilim_valley","v":0.12579249946271229},null,1.0700000000000002E-3]
["TPS54KB23",4,16,25,800,1100,1400,27.5,30,0.5,"Hiccup ","Hiccup",3,4,150,5.8,2.2999999999999998,120000,36,1.2,1,-7.5,0,20,{"$f":"MAX(PartData[[#This Row],[RILIM_min]],MIN(PartData[[#This Row],[RILIM_max]],10^-3*R9/(Ilim_valley_input-(Vin_typ-Vout)*Vout/(2*Vin_typ*Lout*fsw_select*10^-3))))","v":4.9345181134654821},{"$f":"PartData[[#This Row],[K_OCL]]/(RILIM*10^3)+1/2*(Vin_typ-Vout)*Vout/Vin_typ*1/(Lout*fsw_select*10^-3)","v":30.959293735224588},{"$f":"(Z9-Ilim_valley)/Ilim_valley","v":0.12579249946271229},null,1.1000000000000001E-3]
["TPS54KC23",4,16,30,800,1100,1400,30.6,30,0.5,"Hiccup ","Hiccup",3,4,150,5.8,2.2999999999999998,134000,36,1.2,1,-7.5,0,20,{"$f":"MAX(PartData[[#This Row],[RILIM_min]],MIN(PartData[[#This Row],[RILIM_max]],10^-3*R10/(Ilim_valley_input-(Vin_typ-Vout)*Vout/(2*Vin_typ*Lout*fsw_select*10^-3))))","v":5.5102118933697879},{"$f":"PartData[[#This Row],[K_OCL]]/(RILIM*10^3)+1/2*(Vin_typ-Vout)*Vout/Vin_typ*1/(Lout*fsw_select*10^-3)","v":34.200034475965325},{"$f":"(Z10-Ilim_valley)/Ilim_valley","v":0.24363761730782998},null,1.1299999999999999E-3]
[null,null,null,null,null,null,null,null,null,null,null,null,null,null,null,null,null,null,null,null,null,null,null,null,null,null,null,null,1.15E-3]
[null,null,null,null,null,null,null,null,null,null,null,null,null,null,null,null,null,null,null,null,null,null,null,null,null,null,null,null,1.1800000000000001E-3]
[null,null,null,null,null,null,null,null,null,null,null,null,null,null,null,null,null,null,null,null,null,null,null,null,null,null,null,null,1.2099999999999999E-3]
[null,null,null,null,null,null,null,null,null,null,null,null,null,null,null,null,null,null,null,null,null,"Extra step to round down",null,null,null,null,null,null,1.24E-3]
[null,null,"fsw_input","LL_mode_input","RAMP_input",null,null,null,null,null,null,null,null,null,null,null,null,null,"Rfb_t_NSV",{"$f":"'Device Calculator'!D125","v":8.0266666666666655},{"$f":"INDEX(NSV,MATCH(MIN(ABS(NSV-T15)),ABS(NSV-T15),0))","v":8.06},null,null,null,null,null,null,null,1.2699999999999999E-3]
{"$rows_left_out":567}
{"sheet":"MSEL","index":6,"n_rows":47,"n_cols":6,"rows_kept":47,"cut":false,"hidden":true,"merged":[]}
[null,"User Input:"]
[null,"fsw_input",{"$f":"fsw_input","v":800}]
[null,"LL_mode_input",{"$f":"LL_mode_input","v":"Skip-mode"}]
[null,"RAMP",{"$f":"RAMP_sel","v":"RAMP1"}]
[]
[null,"Recommended:"]
[null,"RMSEL_rec",{"$f":"IFERROR(INDEX(MSEL!$B$24:$B$47,A22),\"INVALID INPUTS\")","v":86.6}]
[]
[null,"User Selected:"]
[null,"RMSEL",{"$f":"RMSEL","v":86.6}]
[]
[null,"Calculated:"]
[null,"fsw_select",{"$f":"VLOOKUP(RMSEL,MSEL!$B$24:$F$47,C22,FALSE)","v":800}]
[null,"LL_mode_select",{"$f":"VLOOKUP(RMSEL,MSEL!$B$24:$F$47,D22,FALSE)","v":"Skip-mode"}]
[null,"RAMP_select",{"$f":"VLOOKUP(RMSEL,MSEL!$B$24:$F$47,E22,FALSE)","v":"RAMP1"}]
{"$rows_left_out":33}
{"sheet":"Std. R and C Values","index":7,"n_rows":99,"n_cols":17,"rows_kept":99,"cut":false,"hidden":true,"merged":[[2,4,2,5],[2,6,2,7],[9,4,9,5],[22,4,22,5],[47,4,47,5]]}
["Hide Sheet"]
[null,null,null,null,"Std. Resistors",null,null,null,null,"Capacitors"]
[null,"Enter resistor value",124,null,"E6",null,"E96",null,null,"Cap value",8,"pF"]
[null,null,null,null,100,150,100,102,null,null,{"$f":"IF(K3*10^12<10000,IF((10^(LOG(K3*10^12)-INT(LOG(K3*10^12))))-VLOOKUP((10^(LOG(K3*10^12)-INT(LOG(K3*10^12)))),c_s1:C_f1,1)<VLOOKUP((10^(LOG(K3*10^12)-INT(LOG(K3*10^12)))),c_s1:C_f1,2)-(10^(LOG(K3*10^12)-INT(LOG(K3*10^12)))),VLOOKUP((10^(LOG(K3*10^12)-INT(LOG(K3*10^12)))),c_s1:C_f1,1),VLOOKUP((10^(LOG(K3*10^12)-INT(LOG(K3*10^12)))),c_s1:C_f1,2))*10^INT(LOG(K3*10^12)),IF((10^(LOG(K3*10^12)-INT(LOG(K3*10^12))))-VLOOKUP((10^(LOG(K3*10^12)-INT(LOG(K3*10^12)))),C_s2:C_f2,1)<VLOOKUP((10^(LOG(K3*10^12)-INT(LOG(K3*10^12)))),C_s2:C_f2,2)-(10^(LOG(K3*10^12)-INT(LOG(K3*10^12)))),VLOOKUP((10^(LOG(K3*10^12)-INT(LOG(K3*10^12)))),C_s2:C_f2,1),VLOOKUP((10^(LOG(K3*10^12)-INT(LOG(K3*10^12)))),C_s2:C_f2,2))*10^INT(LOG(K3*10^12)))*10^-12","v":6.8},"pF"]
[null,"Closest E6 Value",{"$f":"(IF((10^(LOG(C3)-INT(LOG(C3)))*100)-VLOOKUP((10^(LOG(C3)-INT(LOG(C3)))*100),E6_s:E6_f,1)<VLOOKUP((10^(LOG(C3)-INT(LOG(C3)))*100),E6_s:E6_f,2)-(10^(LOG(C3)-INT(LOG(C3)))*100),VLOOKUP((10^(LOG(C3)-INT(LOG(C3)))*100),E6_s:E6_f,1),VLOOKUP((10^(LOG(C3)-INT(LOG(C3)))*100),E6_s:E6_f,2)))*10^INT(LOG(C3))/100","v":100},null,150,220,102,105]
[null,"Closest E12 Value",{"$f":"(IF((10^(LOG(C3)-INT(LOG(C3)))*100)-VLOOKUP((10^(LOG(C3)-INT(LOG(C3)))*100),E12_s:E12_f,1)<VLOOKUP((10^(LOG(C3)-INT(LOG(C3)))*100),E12_s:E12_f,2)-(10^(LOG(C3)-INT(LOG(C3)))*100),VLOOKUP((10^(LOG(C3)-INT(LOG(C3)))*100),E12_s:E12_f,1),VLOOKUP((10^(LOG(C3)-INT(LOG(C3)))*100),E12_s:E12_f,2)))*10^INT(LOG(C3))/100","v":120},null,220,330,105,107,null,"C values up to 10nF"]
[null,"Closest E24 Value",{"$f":"(IF((10^(LOG(C3)-INT(LOG(C3)))*100)-VLOOKUP((10^(LOG(C3)-INT(LOG(C3)))*100),E24_s:E24_f,1)<VLOOKUP((10^(LOG(C3)-INT(LOG(C3)))*100),E24_s:E24_f,2)-(10^(LOG(C3)-INT(LOG(C3)))*100),VLOOKUP((10^(LOG(C3)-INT(LOG(C3)))*100),E24_s:E24_f,1),VLOOKUP((10^(LOG(C3)-INT(LOG(C3)))*100),E24_s:E24_f,2)))*10^INT(LOG(C3))/100","v":120},null,330,470,107,110,null,1,1.2,{"$f":"IF((10^(LOG(K3)-INT(LOG(K3))))-VLOOKUP((10^(LOG(K3)-INT(LOG(K3)))),c_s1:C_f1,1)<VLOOKUP((10^(LOG(K3)-INT(LOG(K3)))),c_s1:C_f1,2)-(10^(LOG(K3)-INT(LOG(K3)))),VLOOKUP((10^(LOG(K3)-INT(LOG(K3)))),c_s1:C_f1,1),VLOOKUP((10^(LOG(K3)-INT(LOG(K3)))),c_s1:C_f1,2))","v":8.1999999999999993}]
[null,"Closest E48 Value",{"$f":"(IF((10^(LOG(C3)-INT(LOG(C3)))*100)-VLOOKUP((10^(LOG(C3)-INT(LOG(C3)))*100),E48_s:E48_f,1)<VLOOKUP((10^(LOG(C3)-INT(LOG(C3)))*100),E48_s:E48_f,2)-(10^(LOG(C3)-INT(LOG(C3)))*100),VLOOKUP((10^(LOG(C3)-INT(LOG(C3)))*100),E48_s:E48_f,1),VLOOKUP((10^(LOG(C3)-INT(LOG(C3)))*100),E48_s:E48_f,2)))*10^INT(LOG(C3))/100","v":127},null,470,680,110,113,null,1.2,1.5]
[null,"Closest E96 Value",{"$f":"(IF((10^(LOG(C3)-INT(LOG(C3)))*100)-VLOOKUP((10^(LOG(C3)-INT(LOG(C3)))*100),E96_s:E96_f,1)<VLOOKUP((10^(LOG(C3)-INT(LOG(C3)))*100),E96_s:E96_f,2)-(10^(LOG(C3)-INT(LOG(C3)))*100),VLOOKUP((10^(LOG(C3)-INT(LOG(C3)))*100),E96_s:E96_f,1),VLOOKUP((10^(LOG(C3)-INT(LOG(C3)))*100),E96_s:E96_f,2)))*10^INT(LOG(C3))/100","v":124},null,680,1000,113,115,null,1.5,1.8,null,null,null,null,"Notes:","If I use the value in column K it rounds up"]
[null,null,null,null,"E12",null,115,118,null,1.8,2.2000000000000002,null,null,null,null,null,"If I use the value in column J it rounds down"]
[null,null,null,null,100,120,118,121,null,2.2000000000000002,2.7]
[null,null,null,null,120,150,121,124,null,2.7,3.3]
[null,null,null,null,150,180,124,127,null,3.3,3.9]
[null,null,null,null,180,220,127,130,null,3.9,4.7]
[null,null,null,null,220,270,130,133,null,4.7,5.6]
{"$rows_left_out":85}
{"sheet":"Extra","index":8,"n_rows":6,"n_cols":2,"rows_kept":6,"cut":false,"hidden":true,"merged":[]}
[]
[]
[null,"Validation Options"]
[null,"Open"]
[null,"Complete"]
[null,"Not Applicable"]

{"sheet":"About","index":9,"n_rows":36,"n_cols":13,"rows_kept":36,"cut":false,"hidden":false,"merged":[[38,2,38,12],[1,5,1,12],[34,2,34,12],[35,2,35,12],[36,2,36,12],[37,2,37,12]]}
[]
[null,null,null,null,null,"© Copyright 2024 Texas Instruments Incorporated. All rights reserved."]
[]
[null,"About"]
[null,"Version Number","1.0.0",null,null,null,null,null,null,null,null,null,"Table of Contents"]
[]
[]
[]
[]
[]
[]
[]
[]
[]
[]
{"$rows_left_out":22}
{"sheet":"Help","index":10,"n_rows":21,"n_cols":11,"rows_kept":21,"cut":false,"hidden":false,"merged":[[7,1,7,10],[5,1,5,10],[1,4,1,10],[32,2,32,10],[33,2,33,10],[9,1,9,10],[14,1,14,10],[18,1,18,10]]}
[]
[null,null,null,null,"© Copyright 2024 Texas Instruments Incorporated. All rights reserved."]
[]
[null,"Help"]
[null,null,null,null,null,null,null,null,null,null,"Table of Contents"]
[null,"For any futher assistance on this tool, please post your question in the following forum - E2E Power Management Forum"]
[]
[null,"Getting Started with this tool?"]
[]
[null,"1. Reference the product datasheet, found at the URLs below, for information about the particular device."]
[]
[null,null,"TPS54KB2x:","https://www.ti.com/product/TPS54KB20"]
[null,null,"TPS54KC23:","https://www.ti.com/product/TPS54KC23"]
[]
[null,"2. Go to the Table of Contents for tool descriptions and links to specific worksheets."]
{"$rows_left_out":6}